{"text_format":"1","workbook":"xlsx","n_sheets":4,"sheets":["Imputatielijst","Personeel","Overzicht (2013)","MC"],"not_rendered":{"charts":0,"images":1,"macros":1,"external_links":0,"defined_names":2,"comments":0,"pivot_tables":56},"unopened":[],"bounds":{"document_bytes":16777216,"sheet_cells":100000,"rows_first":2000,"rows_last":500,"rows_between":2000,"halvings":0,"cell_chars":16384,"cell_head_chars":4096},"cells_cut":0,"cells_raw":0,"read":"whole","date_system":"1900"}

{"sheet":"Imputatielijst","index":0,"n_rows":6,"n_cols":2,"rows_kept":6,"cut":false,"hidden":false,"merged":[]}
["Imputatie met uitleg","Imputatie"]
["…","…"]
["3PT001 - Test 1","3PT001"]
["3PT002 - Test 2","3PT002"]
["3PT003 - Test 3","3PT003"]
["3PT004 - Test 4","3PT004"]

{"sheet":"Personeel","index":1,"n_rows":4,"n_cols":2,"rows_kept":4,"cut":false,"hidden":false,"merged":[[0,0,0,9],[1,0,1,1]]}
[]
["MC"]
["Invullen uren","Overzicht"]
[{"$f":"'Overzicht (2013)'!A3","v":"MC"},{"$f":"'Overzicht (2013)'!A3","v":"MC"}]

{"sheet":"Overzicht (2013)","index":2,"n_rows":281,"n_cols":12,"rows_kept":281,"cut":false,"hidden":false,"merged":[[3,8,4,8],[3,10,4,10],[3,11,4,11],[233,3,234,3],[233,4,233,5],[233,6,234,6],[233,7,233,8],[233,9,234,9],[233,10,234,10],[213,3,214,3],[213,4,214,4],[58,3,59,3],[58,4,59,4],[3,2,4,2],[3,3,3,5],[3,6,4,6],[198,3,199,3],[198,4,199,4],[158,3,159,3],[158,4,159,4],[203,3,204,3],[203,4,204,4],[208,3,209,3],[208,4,209,4],[163,3,164,3],[163,4,164,4],[43,3,44,3],[43,4,44,4],[48,3,49,3],[48,4,49,4],[38,3,39,3],[38,4,39,4],[193,3,194,3],[193,4,194,4],[153,3,154,3],[153,4,154,4],[8,3,9,3],[8,4,9,4],[18,3,19,3],[18,4,19,4],[23,3,24,3],[23,4,24,4],[13,3,14,3],[13,4,14,4],[33,3,34,3],[33,4,34,4],[148,3,149,3],[148,4,149,4],[53,3,54,3],[53,4,54,4],[63,3,64,3],[63,4,64,4],[28,3,29,3],[28,4,29,4],[103,3,104,3],[103,4,104,4],[68,3,69,3],[68,4,69,4],[73,3,74,3],[73,4,74,4],[78,3,79,3],[78,4,79,4],[83,3,84,3],[83,4,84,4],[88,3,89,3],[88,4,89,4],[93,3,94,3],[93,4,94,4],[98,3,99,3],[98,4,99,4],[123,3,124,3],[123,4,124,4],[128,3,129,3],[128,4,129,4],[133,3,134,3],[133,4,134,4],[138,3,139,3],[138,4,139,4],[143,3,144,3],[143,4,144,4],[238,3,239,3],[238,4,239,4],[243,3,244,3],[243,4,244,4],[168,3,169,3],[168,4,169,4],[173,3,174,3],[173,4,174,4],[218,3,219,3],[218,4,219,4],[223,3,224,3],[223,4,224,4],[178,3,179,3],[178,4,179,4],[228,3,229,3],[228,4,229,4],[183,3,184,3],[183,4,184,4],[188,3,189,3],[188,4,189,4],[273,3,274,3],[273,4,274,4],[278,3,279,3],[278,4,279,4],[248,3,249,3],[248,4,249,4],[253,3,254,3],[253,4,254,4],[258,3,259,3],[258,4,259,4],[263,3,264,3],[263,4,264,4],[268,3,269,3],[268,4,269,4],[108,3,109,3],[108,4,109,4],[113,3,114,3],[113,4,114,4],[118,3,119,3],[118,4,119,4]]}
["Naam","Draaitabel"]
[]
[{"$f":"MC!B9","v":"MC"},"Som vd uren","Kolomlabels"]
[null,null,"Imputatie","3PT002",null,null,"Totaal 3PT002","3PT003","Totaal 3PT003","3PT004","Totaal 3PT004","Algemeen totaal"]
[null,null,null,1,4,9,null,4,null,5]
[null,"Totaal",0,1,4,9,14,4,4,5,5,23]
[]
[{"$f":"#REF!","v":{"$error":"#REF!"}},"Som vd uren","Kolomlabels"]
[null,null,"Imputatie","Totaal Imputatie","Algemeen totaal"]
[null,null,"uren"]
[null,"Totaal",0,0,0]
[]
[{"$f":"#REF!","v":{"$error":"#REF!"}},"Som vd uren","Kolomlabels"]
[null,null,"Imputatie","Totaal Imputatie","Algemeen totaal"]
[null,null,"uren"]
[null,"Totaal",0,0,0]
[]
[{"$f":"#REF!","v":{"$error":"#REF!"}},"Som vd uren","Kolomlabels"]
[null,null,"Imputatie","Totaal Imputatie","Algemeen totaal"]
[null,null,"uren"]
[null,"Totaal",0,0,0]
[]
[{"$f":"#REF!","v":{"$error":"#REF!"}},"Som vd uren","Kolomlabels"]
[null,null,"Imputatie","Totaal Imputatie","Algemeen totaal"]
[null,null,"uren"]
[null,"Totaal",0,0,0]
[]
[{"$f":"#REF!","v":{"$error":"#REF!"}},"Som vd uren","Kolomlabels"]
[null,null,"Imputatie","Totaal Imputatie","Algemeen totaal"]
[null,null,"uren"]
[null,"Totaal",0,0,0]
[]
[{"$f":"#REF!","v":{"$error":"#REF!"}},"Som vd uren","Kolomlabels"]
[null,null,"Imputatie","Totaal Imputatie","Algemeen totaal"]
[null,null,"uren"]
[null,"Totaal",0,0,0]
[]
[{"$f":"#REF!","v":{"$error":"#REF!"}},"Som vd uren","Kolomlabels"]
[null,null,"Imputatie","Totaal Imputatie","Algemeen totaal"]
[null,null,"uren"]
[null,"Totaal",0,0,0]
[]
[{"$f":"#REF!","v":{"$error":"#REF!"}},"Som vd uren","Kolomlabels"]
[null,null,"Imputatie","Totaal Imputatie","Algemeen totaal"]
[null,null,"uren"]
[null,"Totaal",0,0,0]
[]
[{"$f":"#REF!","v":{"$error":"#REF!"}},"Som vd uren","Kolomlabels"]
[null,null,"Imputatie","Totaal Imputatie","Algemeen totaal"]
[null,null,"uren"]
[null,"Totaal",0,0,0]
[]
[{"$f":"#REF!","v":{"$error":"#REF!"}},"Som vd uren","Kolomlabels"]
[null,null,"Imputatie","Totaal Imputatie","Algemeen totaal"]
[null,null,"uren"]
[null,"Totaal",0,0,0]
[]
[{"$f":"#REF!","v":{"$error":"#REF!"}},"Som vd uren","Kolomlabels"]
[null,null,"Imputatie","Totaal Imputatie","Algemeen totaal"]
[null,null,"uren"]
[null,"Totaal",0,0,0]
[]
[{"$f":"#REF!","v":{"$error":"#REF!"}},"Som vd uren","Kolomlabels"]
[null,null,"Imputatie","Totaal Imputatie","Algemeen totaal"]
[null,null,"uren"]
[null,"Totaal",0,0,0]
[]
[{"$f":"#REF!","v":{"$error":"#REF!"}},"Som vd uren","Kolomlabels"]
[null,null,"Imputatie","Totaal Imputatie","Algemeen totaal"]
[null,null,"uren"]
[null,"Totaal",0,0,0]
[]
[{"$f":"#REF!","v":{"$error":"#REF!"}},"Som vd uren","Kolomlabels"]
[null,null,"Imputatie","Totaal Imputatie","Algemeen totaal"]
[null,null,"uren"]
[null,"Totaal",0,0,0]
[]
[{"$f":"#REF!","v":{"$error":"#REF!"}},"Som vd uren","Kolomlabels"]
[null,null,"Imputatie","Totaal Imputatie","Algemeen totaal"]
[null,null,"uren"]
[null,"Totaal",0,0,0]
[]
[{"$f":"#REF!","v":{"$error":"#REF!"}},"Som vd uren","Kolomlabels"]
[null,null,"Imputatie","Totaal Imputatie","Algemeen totaal"]
[null,null,"uren"]
[null,"Totaal",0,0,0]
[]
[{"$f":"#REF!","v":{"$error":"#REF!"}},"Som vd uren","Kolomlabels"]
[null,null,"Imputatie","Totaal Imputatie","Algemeen totaal"]
[null,null,"uren"]
[null,"Totaal",0,0,0]
[]
[{"$f":"#REF!","v":{"$error":"#REF!"}},"Som vd uren","Kolomlabels"]
[null,null,"Imputatie","Totaal Imputatie","Algemeen totaal"]
[null,null,"uren"]
[null,"Totaal",0,0,0]
[]
[{"$f":"#REF!","v":{"$error":"#REF!"}},"Som vd uren","Kolomlabels"]
[null,null,"Imputatie","Totaal Imputatie","Algemeen totaal"]
[null,null,"uren"]
[null,"Totaal",0,0,0]
[]
[{"$f":"#REF!","v":{"$error":"#REF!"}},"Som vd uren","Kolomlabels"]
[null,null,"Imputatie","Totaal Imputatie","Algemeen totaal"]
[null,null,"uren"]
[null,"Totaal",0,0,0]
[]
[{"$f":"#REF!","v":{"$error":"#REF!"}},"Som vd uren","Kolomlabels"]
[null,null,"Imputatie","Totaal Imputatie","Algemeen totaal"]
[null,null,"uren"]
[null,"Totaal",0,0,0]
[]
[{"$f":"#REF!","v":{"$error":"#REF!"}},"Som vd uren","Kolomlabels"]
[null,null,"Imputatie","Totaal Imputatie","Algemeen totaal"]
[null,null,"uren"]
[null,"Totaal",0,0,0]
[]
[{"$f":"#REF!","v":{"$error":"#REF!"}},"Som vd uren","Kolomlabels"]
[null,null,"Imputatie","Totaal Imputatie","Algemeen totaal"]
[null,null,"uren"]
[null,"Totaal",0,0,0]
[]
[{"$f":"#REF!","v":{"$error":"#REF!"}},"Som vd uren","Kolomlabels"]
[null,null,"Imputatie","Totaal Imputatie","Algemeen totaal"]
[null,null,"uren"]
[null,"Totaal",0,0,0]
[]
[{"$f":"#REF!","v":{"$error":"#REF!"}},"Som vd uren","Kolomlabels"]
[null,null,"Imputatie","Totaal Imputatie","Algemeen totaal"]
[null,null,"uren"]
[null,"Totaal",0,0,0]
[]
[{"$f":"#REF!","v":{"$error":"#REF!"}},"Som vd uren","Kolomlabels"]
[null,null,"Imputatie","Totaal Imputatie","Algemeen totaal"]
[null,null,"uren"]
[null,"Totaal",0,0,0]
[]
[{"$f":"#REF!","v":{"$error":"#REF!"}},"Som vd uren","Kolomlabels"]
[null,null,"Imputatie","Totaal Imputatie","Algemeen totaal"]
[null,null,"uren"]
[null,"Totaal",0,0,0]
[]
[{"$f":"#REF!","v":{"$error":"#REF!"}},"Som vd uren","Kolomlabels"]
[null,null,"Imputatie","Totaal Imputatie","Algemeen totaal"]
[null,null,"uren"]
[null,"Totaal",0,0,0]
[]
[{"$f":"#REF!","v":{"$error":"#REF!"}},"Som vd uren","Kolomlabels"]
[null,null,"Imputatie","Totaal Imputatie","Algemeen totaal"]
[null,null,"uren"]
[null,"Totaal",0,0,0]
[]
[{"$f":"#REF!","v":{"$error":"#REF!"}},"Som vd uren","Kolomlabels"]
[null,null,"Imputatie","Totaal Imputatie","Algemeen totaal"]
[null,null,"uren"]
[null,"Totaal",0,0,0]
[]
[{"$f":"#REF!","v":{"$error":"#REF!"}},"Som vd uren","Kolomlabels"]
[null,null,"Imputatie","Totaal Imputatie","Algemeen totaal"]
[null,null,"uren"]
[null,"Totaal",0,0,0]
[]
[{"$f":"#REF!","v":{"$error":"#REF!"}},"Som vd uren","Kolomlabels"]
[null,null,"Imputatie","Totaal Imputatie","Algemeen totaal"]
[null,null,"uren"]
[null,"Totaal",0,0,0]
[]
[{"$f":"#REF!","v":{"$error":"#REF!"}},"Som vd uren","Kolomlabels"]
[null,null,"Imputatie","Totaal Imputatie","Algemeen totaal"]
[null,null,"uren"]
[null,"Totaal",0,0,0]
[]
[{"$f":"#REF!","v":{"$error":"#REF!"}},"Som vd uren","Kolomlabels"]
[null,null,"Imputatie","Totaal Imputatie","Algemeen totaal"]
[null,null,"uren"]
[null,"Totaal",0,0,0]
[]
[{"$f":"#REF!","v":{"$error":"#REF!"}},"Som vd uren","Kolomlabels"]
[null,null,"Imputatie","Totaal Imputatie","Algemeen totaal"]
[null,null,"uren"]
[null,"Totaal",0,0,0]
[]
[{"$f":"#REF!","v":{"$error":"#REF!"}},"Som vd uren","Kolomlabels"]
[null,null,"Imputatie","Totaal Imputatie","Algemeen totaal"]
[null,null,"uren"]
[null,"Totaal",0,0,0]
[]
[{"$f":"#REF!","v":{"$error":"#REF!"}},"Som vd uren","Kolomlabels"]
[null,null,"Imputatie","Totaal Imputatie","Algemeen totaal"]
[null,null,"uren"]
[null,"Totaal",0,0,0]
[]
[{"$f":"#REF!","v":{"$error":"#REF!"}},"Som vd uren","Kolomlabels"]
[null,null,"Imputatie","Totaal Imputatie","Algemeen totaal"]
[null,null,"uren"]
[null,"Totaal",0,0,0]
[]
[{"$f":"#REF!","v":{"$error":"#REF!"}},"Som vd uren","Kolomlabels"]
[null,null,"Imputatie","Totaal Imputatie","Algemeen totaal"]
[null,null,"uren"]
[null,"Totaal",0,0,0]
[]
[{"$f":"#REF!","v":{"$error":"#REF!"}},"Som vd uren","Kolomlabels"]
[null,null,"Imputatie","Totaal Imputatie","Algemeen totaal"]
[null,null,"uren"]
[null,"Totaal",0,0,0]
[]
[{"$f":"#REF!","v":{"$error":"#REF!"}},"Som vd uren","Kolomlabels"]
[null,null,"Imputatie","Totaal Imputatie","Algemeen totaal"]
[null,null,"uren"]
[null,"Totaal",0,0,0]
[]
[{"$f":"#REF!","v":{"$error":"#REF!"}},"Som vd uren","Kolomlabels"]
[null,null,"Imputatie","Totaal Imputatie","Algemeen totaal"]
[null,null,"uren"]
[null,"Totaal",0,0,0]
[]
[{"$f":"#REF!","v":{"$error":"#REF!"}},"Som vd uren","Kolomlabels"]
[null,null,"Imputatie","Totaal Imputatie","Algemeen totaal"]
[null,null,"uren"]
[null,"Totaal",0,0,0]
[]
[{"$f":"#REF!","v":{"$error":"#REF!"}},"Som vd uren","Kolomlabels"]
[null,null,"Imputatie","Totaal Imputatie","Algemeen totaal"]
[null,null,"uren"]
[null,"Totaal",0,0,0]
[]
[{"$f":"#REF!","v":{"$error":"#REF!"}},"Som vd uren","Kolomlabels"]
[null,null,"Imputatie","Totaal Imputatie","Algemeen totaal"]
[null,null,"uren"]
[null,"Totaal",0,0,0]
[]
[{"$f":"#REF!","v":{"$error":"#REF!"}},"Som vd uren","Kolomlabels"]
[null,null,"Imputatie","Totaal Imputatie","o",null,"Totaal o","u",null,"Totaal u","Algemeen totaal"]
[null,null,"uren",null,21,9,null,1,7]
[null,"Totaal",0,0,21,9,30,1,7,8,38]
[]
[{"$f":"#REF!","v":{"$error":"#REF!"}},"Som vd uren","Kolomlabels"]
[null,null,"Imputatie","Totaal Imputatie","Algemeen totaal"]
[null,null,"uren"]
[null,"Totaal",0,0,0]
[]
[{"$f":"#REF!","v":{"$error":"#REF!"}},"Som vd uren","Kolomlabels"]
[null,null,"Imputatie","Totaal Imputatie","Algemeen totaal"]
[null,null,"uren"]
[null,"Totaal",0,0,0]
[]
[{"$f":"#REF!","v":{"$error":"#REF!"}},"Som vd uren","Kolomlabels"]
[null,null,"Imputatie","Totaal Imputatie","Algemeen totaal"]
[null,null,"uren"]
[null,"Totaal",0,0,0]
[]
[{"$f":"#REF!","v":{"$error":"#REF!"}},"Som vd uren","Kolomlabels"]
[null,null,"Imputatie","Totaal Imputatie","Algemeen totaal"]
[null,null,"uren"]
[null,"Totaal",0,0,0]
[]
[{"$f":"#REF!","v":{"$error":"#REF!"}},"Som vd uren","Kolomlabels"]
[null,null,"Imputatie","Totaal Imputatie","Algemeen totaal"]
[null,null,"uren"]
[null,"Totaal",0,0,0]
[]
[{"$f":"#REF!","v":{"$error":"#REF!"}},"Som vd uren","Kolomlabels"]
[null,null,"Imputatie","Totaal Imputatie","Algemeen totaal"]
[null,null,"uren"]
[null,"Totaal",0,0,0]
[]
[{"$f":"#REF!","v":{"$error":"#REF!"}},"Som vd uren","Kolomlabels"]
[null,null,"Imputatie","Totaal Imputatie","Algemeen totaal"]
[null,null,"uren"]
[null,"Totaal",0,0,0]
[]
[{"$f":"#REF!","v":{"$error":"#REF!"}},"Som vd uren","Kolomlabels"]
[null,null,"Imputatie","Totaal Imputatie","Algemeen totaal"]
[null,null,"uren"]
[null,"Totaal",0,0,0]
[]
[{"$f":"#REF!","v":{"$error":"#REF!"}},"Som vd uren","Kolomlabels"]
[null,null,"Imputatie","Totaal Imputatie","Algemeen totaal"]
[null,null,"uren"]
[null,"Totaal",0,0,0]

{"sheet":"MC","index":3,"n_rows":820,"n_cols":6,"rows_kept":820,"cut":false,"hidden":false,"merged":[]}
[]
[]
[]
[]
[]
[]
[]
[null,"Werkstaat ","januari"]
[null,"MC",2012]
[]
[]
["Datum","Plaats","Uitgevoerde werken","uren","Imputatie","Keuze Imputatie"]
["2012-01-01",null,null,null,{"$f":"VLOOKUP(F13,Imputatielijst!A2:B6,2,0)","v":"…"},"…"]
[]
[{"$f":"A13+1","v":"2012-01-02"},null,null,null,{"$f":"VLOOKUP(F15,Imputatielijst!A2:B6,2,0)","v":"…"},"…"]
[]
[{"$f":"A15+1","v":"2012-01-03"},null,null,4,{"$f":"VLOOKUP(F17,Imputatielijst!A2:B6,2,0)","v":"3PT002"},"3PT002 - Test 2"]
[]
[{"$f":"A17+1","v":"2012-01-04"},null,null,null,{"$f":"VLOOKUP(F19,Imputatielijst!A2:B6,2,0)","v":"…"},"…"]
[]
[{"$f":"A19+1","v":"2012-01-05"},null,null,null,{"$f":"VLOOKUP(F21,Imputatielijst!A2:B6,2,0)","v":"…"},"…"]
[]
[{"$f":"A21+1","v":"2012-01-06"},null,null,4,{"$f":"VLOOKUP(F23,Imputatielijst!A2:B6,2,0)","v":"3PT003"},"3PT003 - Test 3"]
[]
[{"$f":"A23+1","v":"2012-01-07"},null,null,null,{"$f":"VLOOKUP(F25,Imputatielijst!A2:B6,2,0)","v":"…"},"…"]
[]
[{"$f":"A25+1","v":"2012-01-08"},null,null,null,{"$f":"VLOOKUP(F27,Imputatielijst!A2:B6,2,0)","v":"…"},"…"]
[]
[{"$f":"A27+1","v":"2012-01-09"},null,null,1,{"$f":"VLOOKUP(F29,Imputatielijst!A2:B6,2,0)","v":"3PT002"},"3PT002 - Test 2"]
[]
[{"$f":"A29+1","v":"2012-01-10"},null,null,null,{"$f":"VLOOKUP(F31,Imputatielijst!A2:B6,2,0)","v":"…"},"…"]
[]
[{"$f":"A31+1","v":"2012-01-11"},null,null,null,{"$f":"VLOOKUP(F33,Imputatielijst!A2:B6,2,0)","v":"…"},"…"]
[]
[{"$f":"A33+1","v":"2012-01-12"},null,null,5,{"$f":"VLOOKUP(F35,Imputatielijst!A2:B6,2,0)","v":"3PT004"},"3PT004 - Test 4"]
[]
[{"$f":"A35+1","v":"2012-01-13"},null,null,9,{"$f":"VLOOKUP(F37,Imputatielijst!A2:B6,2,0)","v":"3PT002"},"3PT002 - Test 2"]
[]
[{"$f":"A37+1","v":"2012-01-14"},null,null,null,{"$f":"VLOOKUP(F39,Imputatielijst!A2:B6,2,0)","v":"…"},"…"]
[]
[{"$f":"A39+1","v":"2012-01-15"},null,null,null,{"$f":"VLOOKUP(F41,Imputatielijst!A2:B6,2,0)","v":"…"},"…"]
[]
[{"$f":"A41+1","v":"2012-01-16"},null,null,null,{"$f":"VLOOKUP(F43,Imputatielijst!A2:B6,2,0)","v":"…"},"…"]
[]
[{"$f":"A43+1","v":"2012-01-17"},null,null,null,{"$f":"VLOOKUP(F45,Imputatielijst!A2:B6,2,0)","v":"…"},"…"]
[]
[{"$f":"A45+1","v":"2012-01-18"},null,null,null,{"$f":"VLOOKUP(F47,Imputatielijst!A2:B6,2,0)","v":"…"},"…"]
[]
[{"$f":"A47+1","v":"2012-01-19"},null,null,null,{"$f":"VLOOKUP(F49,Imputatielijst!A2:B6,2,0)","v":"…"},"…"]
[]
[{"$f":"A49+1","v":"2012-01-20"},null,null,null,{"$f":"VLOOKUP(F51,Imputatielijst!A2:B6,2,0)","v":"…"},"…"]
[]
[{"$f":"A51+1","v":"2012-01-21"},null,null,null,{"$f":"VLOOKUP(F53,Imputatielijst!A2:B6,2,0)","v":"…"},"…"]
[]
[{"$f":"A53+1","v":"2012-01-22"},null,null,null,{"$f":"VLOOKUP(F55,Imputatielijst!A2:B6,2,0)","v":"…"},"…"]
[]
[{"$f":"A55+1","v":"2012-01-23"},null,null,null,{"$f":"VLOOKUP(F57,Imputatielijst!A2:B6,2,0)","v":"…"},"…"]
[]
[{"$f":"A57+1","v":"2012-01-24"},null,null,null,{"$f":"VLOOKUP(F59,Imputatielijst!A2:B6,2,0)","v":"…"},"…"]
[]
[{"$f":"A59+1","v":"2012-01-25"},null,null,null,{"$f":"VLOOKUP(F61,Imputatielijst!A2:B6,2,0)","v":"…"},"…"]
[]
[{"$f":"A61+1","v":"2012-01-26"},null,null,null,{"$f":"VLOOKUP(F63,Imputatielijst!A2:B6,2,0)","v":"…"},"…"]
[]
[{"$f":"A63+1","v":"2012-01-27"},null,null,null,{"$f":"VLOOKUP(F65,Imputatielijst!A2:B6,2,0)","v":"…"},"…"]
[]
[{"$f":"A65+1","v":"2012-01-28"},null,null,null,{"$f":"VLOOKUP(F67,Imputatielijst!A2:B6,2,0)","v":"…"},"…"]
[]
[{"$f":"A67+1","v":"2012-01-29"},null,null,null,{"$f":"VLOOKUP(F69,Imputatielijst!A2:B6,2,0)","v":"…"},"…"]
[]
[{"$f":"A69+1","v":"2012-01-30"},null,null,null,{"$f":"VLOOKUP(F71,Imputatielijst!A2:B6,2,0)","v":"…"},"…"]
[]
[{"$f":"A71+1","v":"2012-01-31"},null,null,null,{"$f":"VLOOKUP(F73,Imputatielijst!A2:B6,2,0)","v":"…"},"…"]
[]
[]
[]
[null,"Werkstaat ","februari"]
[null,{"$f":"B9","v":"MC"},{"$f":"C9","v":2012}]
[null,{"$f":"B10","v":0},"Opgemaakt door Coosemans Marc"]
[]
["Datum","Plaats","Uitgevoerde werken","uren","Imputatie"]
[{"$f":"A73+1","v":"2012-02-01"}]
[]
[{"$f":"A82+1","v":"2012-02-02"}]
[]
[{"$f":"A84+1","v":"2012-02-03"}]
[]
[{"$f":"A86+1","v":"2012-02-04"}]
[]
[{"$f":"A88+1","v":"2012-02-05"}]
[]
[{"$f":"A90+1","v":"2012-02-06"}]
[]
[{"$f":"A92+1","v":"2012-02-07"}]
[]
[{"$f":"A94+1","v":"2012-02-08"}]
[]
[{"$f":"A96+1","v":"2012-02-09"}]
[]
[{"$f":"A98+1","v":"2012-02-10"}]
[]
[{"$f":"A100+1","v":"2012-02-11"}]
[]
[{"$f":"A102+1","v":"2012-02-12"}]
[]
[{"$f":"A104+1","v":"2012-02-13"}]
[]
[{"$f":"A106+1","v":"2012-02-14"}]
[]
[{"$f":"A108+1","v":"2012-02-15"}]
[]
[{"$f":"A110+1","v":"2012-02-16"}]
[]
[{"$f":"A112+1","v":"2012-02-17"}]
[]
[{"$f":"A114+1","v":"2012-02-18"}]
[]
[{"$f":"A116+1","v":"2012-02-19"}]
[]
[{"$f":"A118+1","v":"2012-02-20"}]
[]
[{"$f":"A120+1","v":"2012-02-21"}]
[]
[{"$f":"A122+1","v":"2012-02-22"}]
[]
[{"$f":"A124+1","v":"2012-02-23"}]
[]
[{"$f":"A126+1","v":"2012-02-24"}]
[]
[{"$f":"A128+1","v":"2012-02-25"}]
[]
[{"$f":"A130+1","v":"2012-02-26"}]
[]
[{"$f":"A132+1","v":"2012-02-27"}]
[]
[{"$f":"A134+1","v":"2012-02-28"}]
[]
[{"$f":"A136+1","v":"2012-02-29"}]
[]
[]
[]
[null,"Werkstaat ","maart"]
[null,{"$f":"B9","v":"MC"},{"$f":"C9","v":2012}]
[null,{"$f":"B10","v":0},"Opgemaakt door Coosemans Marc"]
[]
["Datum","Plaats","Uitgevoerde werken","uren","Imputatie"]
[{"$f":"A138+1","v":"2012-03-01"}]
[]
[{"$f":"A147+1","v":"2012-03-02"}]
[]
[{"$f":"A149+1","v":"2012-03-03"}]
[]
[{"$f":"A151+1","v":"2012-03-04"}]
[]
[{"$f":"A153+1","v":"2012-03-05"}]
[]
[{"$f":"A155+1","v":"2012-03-06"}]
[]
[{"$f":"A157+1","v":"2012-03-07"}]
[]
[{"$f":"A159+1","v":"2012-03-08"}]
[]
[{"$f":"A161+1","v":"2012-03-09"}]
[]
[{"$f":"A163+1","v":"2012-03-10"}]
[]
[{"$f":"A165+1","v":"2012-03-11"}]
[]
[{"$f":"A167+1","v":"2012-03-12"}]
[]
[{"$f":"A169+1","v":"2012-03-13"}]
[]
[{"$f":"A171+1","v":"2012-03-14"}]
[]
[{"$f":"A173+1","v":"2012-03-15"}]
[]
[{"$f":"A175+1","v":"2012-03-16"}]
[]
[{"$f":"A177+1","v":"2012-03-17"}]
[]
[{"$f":"A179+1","v":"2012-03-18"}]
[]
[{"$f":"A181+1","v":"2012-03-19"}]
[]
[{"$f":"A183+1","v":"2012-03-20"}]
[]
[{"$f":"A185+1","v":"2012-03-21"}]
[]
[{"$f":"A187+1","v":"2012-03-22"}]
[]
[{"$f":"A189+1","v":"2012-03-23"}]
[]
[{"$f":"A191+1","v":"2012-03-24"}]
[]
[{"$f":"A193+1","v":"2012-03-25"}]
[]
[{"$f":"A195+1","v":"2012-03-26"}]
[]
[{"$f":"A197+1","v":"2012-03-27"}]
[]
[{"$f":"A199+1","v":"2012-03-28"}]
[]
[{"$f":"A201+1","v":"2012-03-29"}]
[]
[{"$f":"A203+1","v":"2012-03-30"}]
[]
[{"$f":"A205+1","v":"2012-03-31"}]
[]
[]
[]
[null,"Werkstaat ","april"]
[null,{"$f":"B9","v":"MC"},{"$f":"C9","v":2012}]
[null,{"$f":"B10","v":0},"Opgemaakt door Coosemans Marc"]
[]
["Datum","Plaats","Uitgevoerde werken","uren","Imputatie"]
[{"$f":"A207+1","v":"2012-04-01"}]
[]
[{"$f":"A216+1","v":"2012-04-02"}]
[]
[{"$f":"A218+1","v":"2012-04-03"}]
[]
[{"$f":"A220+1","v":"2012-04-04"}]
[]
[{"$f":"A222+1","v":"2012-04-05"}]
[]
[{"$f":"A224+1","v":"2012-04-06"}]
[]
[{"$f":"A226+1","v":"2012-04-07"}]
[]
[{"$f":"A228+1","v":"2012-04-08"}]
[]
[{"$f":"A230+1","v":"2012-04-09"}]
[]
[{"$f":"A232+1","v":"2012-04-10"}]
[]
[{"$f":"A234+1","v":"2012-04-11"}]
[]
[{"$f":"A236+1","v":"2012-04-12"}]
[]
[{"$f":"A238+1","v":"2012-04-13"}]
[]
[{"$f":"A240+1","v":"2012-04-14"}]
[]
[{"$f":"A242+1","v":"2012-04-15"}]
[]
[{"$f":"A244+1","v":"2012-04-16"}]
[]
[{"$f":"A246+1","v":"2012-04-17"}]
[]
[{"$f":"A248+1","v":"2012-04-18"}]
[]
[{"$f":"A250+1","v":"2012-04-19"}]
[]
[{"$f":"A252+1","v":"2012-04-20"}]
[]
[{"$f":"A254+1","v":"2012-04-21"}]
[]
[{"$f":"A256+1","v":"2012-04-22"}]
[]
[{"$f":"A258+1","v":"2012-04-23"}]
[]
[{"$f":"A260+1","v":"2012-04-24"}]
[]
[{"$f":"A262+1","v":"2012-04-25"}]
[]
[{"$f":"A264+1","v":"2012-04-26"}]
[]
[{"$f":"A266+1","v":"2012-04-27"}]
[]
[{"$f":"A268+1","v":"2012-04-28"}]
[]
[{"$f":"A270+1","v":"2012-04-29"}]
[]
[{"$f":"A272+1","v":"2012-04-30"}]
[]
[]
[]
[null,"Werkstaat ","mei"]
[null,{"$f":"B9","v":"MC"},{"$f":"C9","v":2012}]
[null,{"$f":"B10","v":0},"Opgemaakt door Coosemans Marc"]
[]
["Datum","Plaats","Uitgevoerde werken","uren","Imputatie"]
[{"$f":"A274+1","v":"2012-05-01"}]
[]
[{"$f":"A283+1","v":"2012-05-02"}]
[]
[{"$f":"A285+1","v":"2012-05-03"}]
[]
[{"$f":"A287+1","v":"2012-05-04"}]
[]
[{"$f":"A289+1","v":"2012-05-05"}]
[]
[{"$f":"A291+1","v":"2012-05-06"}]
[]
[{"$f":"A293+1","v":"2012-05-07"}]
[]
[{"$f":"A295+1","v":"2012-05-08"}]
[]
[{"$f":"A297+1","v":"2012-05-09"}]
[]
[{"$f":"A299+1","v":"2012-05-10"}]
[]
[{"$f":"A301+1","v":"2012-05-11"}]
[]
[{"$f":"A303+1","v":"2012-05-12"}]
[]
[{"$f":"A305+1","v":"2012-05-13"}]
[]
[{"$f":"A307+1","v":"2012-05-14"}]
[]
[{"$f":"A309+1","v":"2012-05-15"}]
[]
[{"$f":"A311+1","v":"2012-05-16"}]
[]
[{"$f":"A313+1","v":"2012-05-17"}]
[]
[{"$f":"A315+1","v":"2012-05-18"}]
[]
[{"$f":"A317+1","v":"2012-05-19"}]
[]
[{"$f":"A319+1","v":"2012-05-20"}]
[]
[{"$f":"A321+1","v":"2012-05-21"}]
[]
[{"$f":"A323+1","v":"2012-05-22"}]
[]
[{"$f":"A325+1","v":"2012-05-23"}]
[]
[{"$f":"A327+1","v":"2012-05-24"}]
[]
[{"$f":"A329+1","v":"2012-05-25"}]
[]
[{"$f":"A331+1","v":"2012-05-26"}]
[]
[{"$f":"A333+1","v":"2012-05-27"}]
[]
[{"$f":"A335+1","v":"2012-05-28"}]
[]
[{"$f":"A337+1","v":"2012-05-29"}]
[]
[{"$f":"A339+1","v":"2012-05-30"}]
[]
[{"$f":"A341+1","v":"2012-05-31"}]
[]
[]
[]
[null,"Werkstaat ","juni"]
[null,{"$f":"B9","v":"MC"},{"$f":"C9","v":2012}]
[null,{"$f":"B10","v":0},"Opgemaakt door Coosemans Marc"]
[]
["Datum","Plaats","Uitgevoerde werken","uren","Imputatie"]
[{"$f":"A343+1","v":"2012-06-01"}]
[]
[{"$f":"A352+1","v":"2012-06-02"}]
[]
[{"$f":"A354+1","v":"2012-06-03"}]
[]
[{"$f":"A356+1","v":"2012-06-04"}]
[]
[{"$f":"A358+1","v":"2012-06-05"}]
[]
[{"$f":"A360+1","v":"2012-06-06"}]
[]
[{"$f":"A362+1","v":"2012-06-07"}]
[]
[{"$f":"A364+1","v":"2012-06-08"}]
[]
[{"$f":"A366+1","v":"2012-06-09"}]
[]
[{"$f":"A368+1","v":"2012-06-10"}]
[]
[{"$f":"A370+1","v":"2012-06-11"}]
[]
[{"$f":"A372+1","v":"2012-06-12"}]
[]
[{"$f":"A374+1","v":"2012-06-13"}]
[]
[{"$f":"A376+1","v":"2012-06-14"}]
[]
[{"$f":"A378+1","v":"2012-06-15"}]
[]
[{"$f":"A380+1","v":"2012-06-16"}]
[]
[{"$f":"A382+1","v":"2012-06-17"}]
[]
[{"$f":"A384+1","v":"2012-06-18"}]
[]
[{"$f":"A386+1","v":"2012-06-19"}]
[]
[{"$f":"A388+1","v":"2012-06-20"}]
[]
[{"$f":"A390+1","v":"2012-06-21"}]
[]
[{"$f":"A392+1","v":"2012-06-22"}]
[]
[{"$f":"A394+1","v":"2012-06-23"}]
[]
[{"$f":"A396+1","v":"2012-06-24"}]
[]
[{"$f":"A398+1","v":"2012-06-25"}]
{"$rows_left_out":420}