{"text_format":"1","workbook":"xlsx","n_sheets":3,"sheets":["Plantons","Lijnmannen","Data"],"not_rendered":{"charts":0,"images":0,"macros":1,"external_links":0,"defined_names":6,"comments":0,"pivot_tables":0},"unopened":[],"bounds":{"document_bytes":16777216,"sheet_cells":100000,"rows_first":2000,"rows_last":500,"rows_between":2000,"halvings":0,"cell_chars":16384,"cell_head_chars":4096},"cells_cut":0,"cells_raw":0,"read":"whole","date_system":"1900"}

{"sheet":"Plantons","index":0,"n_rows":8,"n_cols":3,"rows_kept":8,"cut":false,"hidden":false,"merged":[]}
["Rangschikking"]
[]
["Pers. Nr.",null,"Dienst"]
[5638,null,{"$f":"IF(VLOOKUP(A4,Data!$C:$Q,9,)=0,IF(VLOOKUP(A4,Data!$C:$Q,10,)=0,\"TC\",VLOOKUP(A4,Data!$C:$Q,10,)),VLOOKUP(A4,Data!$C:$Q,9,))","v":"WV"}]
[5857,null,{"$f":"IF(VLOOKUP(A5,Data!$C:$Q,9,)=0,IF(VLOOKUP(A5,Data!$C:$Q,10,)=0,\"TC\",VLOOKUP(A5,Data!$C:$Q,10,)),VLOOKUP(A5,Data!$C:$Q,9,))","v":"T"}]
[7355,null,{"$f":"IF(VLOOKUP(A6,Data!$C:$Q,9,)=0,IF(VLOOKUP(A6,Data!$C:$Q,10,)=0,\"TC\",VLOOKUP(A6,Data!$C:$Q,10,)),VLOOKUP(A6,Data!$C:$Q,9,))","v":"X"}]
[7384,null,{"$f":"IF(VLOOKUP(A7,Data!$C:$Q,9,)=0,IF(VLOOKUP(A7,Data!$C:$Q,10,)=0,\"TC\",VLOOKUP(A7,Data!$C:$Q,10,)),VLOOKUP(A7,Data!$C:$Q,9,))","v":"WV"}]
[7426,null,{"$f":"IF(VLOOKUP(A8,Data!$C:$Q,9,)=0,IF(VLOOKUP(A8,Data!$C:$Q,10,)=0,\"TC\",VLOOKUP(A8,Data!$C:$Q,10,)),VLOOKUP(A8,Data!$C:$Q,9,))","v":190}]

{"sheet":"Lijnmannen","index":1,"n_rows":8,"n_cols":3,"rows_kept":8,"cut":false,"hidden":false,"merged":[]}
["Rangschikking"]
[]
["Pers. Nr."]
[2278,null,{"$f":"IF(VLOOKUP(A4,Data!$C:$Q,9,)=0,IF(VLOOKUP(A4,Data!$C:$Q,10,)=0,\"TC\",VLOOKUP(A4,Data!$C:$Q,10,)),VLOOKUP(A4,Data!$C:$Q,9,))","v":96}]
[4709,null,{"$f":"IF(VLOOKUP(A5,Data!$C:$Q,9,)=0,IF(VLOOKUP(A5,Data!$C:$Q,10,)=0,\"TC\",VLOOKUP(A5,Data!$C:$Q,10,)),VLOOKUP(A5,Data!$C:$Q,9,))","v":"CO02"}]
[9748,null,{"$f":"IF(VLOOKUP(A6,Data!$C:$Q,9,)=0,IF(VLOOKUP(A6,Data!$C:$Q,10,)=0,\"TC\",VLOOKUP(A6,Data!$C:$Q,10,)),VLOOKUP(A6,Data!$C:$Q,9,))","v":"LO"}]
[7384,null,{"$f":"IF(VLOOKUP(A7,Data!$C:$Q,9,)=0,IF(VLOOKUP(A7,Data!$C:$Q,10,)=0,\"TC\",VLOOKUP(A7,Data!$C:$Q,10,)),VLOOKUP(A7,Data!$C:$Q,9,))","v":"WV"}]
[5601,null,{"$f":"IF(VLOOKUP(A8,Data!$C:$Q,9,)=0,IF(VLOOKUP(A8,Data!$C:$Q,10,)=0,\"TC\",VLOOKUP(A8,Data!$C:$Q,10,)),VLOOKUP(A8,Data!$C:$Q,9,))","v":"OG"}]

{"sheet":"Data","index":2,"n_rows":209,"n_cols":16,"rows_kept":209,"cut":false,"hidden":false,"merged":[]}
["                                User: LEHSD                                        8:42:37  14-08-05  (PE192L)  Blz.    1","                                User: LEHSD                                        8:42:37  14-08-05  (PE192L)  Blz.    1",null,"User: LEHSD",null,null,null,null,null,null,null,null,"8:42:37  1","2005-08-04","(PE19","2L)  Blz.    1"]
["*----------------------------*  *--------------*","*----------------------------*  *--------------*","*----------","------------------*  *------------","-","-*"]
["Lijst man/dienst   Regio: 1   Stelplaats: 123   Datum:  6-08-2014","Lijst man/dienst   Regio: 1   Stelplaats: 123   Datum:  6-08-2014","Lijst man/d","ienst   Regio: 1   Stelplaats: 123",null,null,"Da","tu","m:  6-","2014-08-01"]
["*--------------*   *------*   *-------------*   *---------------*","*--------------*   *------*   *-------------*   *---------------*","*----------","----*   *------*   *-------------*",null,null,"*-","--","------","------*"]
["Personeels-  Naam                            Kwalificaties  Dienst  Volg  Var  Rust  Aanvangs  Begin  Eind   Aankomst","Personeels-  Naam                            Kwalificaties  Dienst  Volg  Var  Rust  Aanvangs  Begin  Eind   Aankomst","Personeels-","Naam","K","wa","li","fi","caties","Dienst","Volg  Var","Rust","Aanvangs","Begin","Eind","Aankomst"]
["nummer                                                      rol     Nr.        afwz  Plaats    uur    uur    Plaats","nummer                                                      rol     Nr.        afwz  Plaats    uur    uur    Plaats","nummer",null,null,null,null,null,null,"rol","Nr.","afwz","Plaats","uur","uur","Plaats"]
["*---------*  *----------------------------*  *-----------*  *----*  *--*  *-*  *--*  *------*  *---*  *--*   *------*","*---------*  *----------------------------*  *-----------*  *----*  *--*  *-*  *--*  *------*  *---*  *--*   *------*","*---------*","*----------------------------*","*","--","--","--","-----*","*----*","*--*  *-*","*--*","*------*","*---*","*--*","*------*"]
["    2278     Henckaers Guido                 L H G C B A     HS02    96              HAS123     7:00  15:00  HAS123","    2278     Henckaers Guido                 L H G C B A     HS02    96              HAS123     7:00  15:00  HAS123",2278,"Henckaers Guido","L","H","G","C","B A","HS02",96,null,"HAS123","07:00:00","15:00:00","HAS123"]
["    2314     Thoelen Tony                    G C A           HS08    56              HAS123    12:56  21:05  HAS123","    2314     Thoelen Tony                    G C A           HS08    56              HAS123    12:56  21:05  HAS123",2314,"Thoelen Tony","G","C","A",null,null,"HS08",56,null,"HAS123","12:56:00","21:05:00","HAS123"]
["    2460     Peeters Lucien                  L H G C B A                       X","    2460     Peeters Lucien                  L H G C B A                       X",2460,"Peeters Lucien","L","H","G","C","B A",null,null,"X"]
["    2761     Schuermans Robert               H G C A                           ZI","    2761     Schuermans Robert               H G C A                           ZI",2761,"Schuermans Robert","H","G","C","A",null,null,null,"ZI"]
["    3109     Aerts Guy                       P H G C A       HS12    61              HAS123    13:30  21:30  HAS123","    3109     Aerts Guy                       P H G C A       HS12    61              HAS123    13:30  21:30  HAS123",3109,"Aerts Guy","P","H","G","C","A","HS12",61,null,"HAS123","13:30:00","21:30:00","HAS123"]
["    3321     Cremers Yvon                    H G C B A       HS15   100              HAS123     5:27  13:30  HAS123","    3321     Cremers Yvon                    H G C B A       HS15   100              HAS123     5:27  13:30  HAS123",3321,"Cremers Yvon","H","G","C","B","A","HS15",100,null,"HAS123","05:27:00","13:30:00","HAS123"]
["    3486     Goffinghs Ludo                  H G C A         HS05    40              HAS123     5:57  12:52  HAS123","    3486     Goffinghs Ludo                  H G C A         HS05    40              HAS123     5:57  12:52  HAS123",3486,"Goffinghs Ludo","H","G","C","A",null,"HS05",40,null,"HAS123","05:57:00","12:52:00","HAS123"]
["    4315     BussΘ Christiaan                H G C A         HS02    19              HAS123     6:25  14:15  HAS123","    4315     BussΘ Christiaan                H G C A         HS02    19              HAS123     6:25  14:15  HAS123",4315,"BussΘ Christiaan","H","G","C","A",null,"HS02",19,null,"HAS123","06:25:00","14:15:00","HAS123"]
["    4529     Ramaekers Dirk                  H G C A                           ZI","    4529     Ramaekers Dirk                  H G C A                           ZI",4529,"Ramaekers Dirk","H","G","C","A",null,null,null,"ZI"]
["    4536     Vanaken Valere                  G C A           HS05    38              HAS123    11:25  20:19  HAS123","    4536     Vanaken Valere                  G C A           HS05    38              HAS123    11:25  20:19  HAS123",4536,"Vanaken Valere","G","C","A",null,null,"HS05",38,null,"HAS123","11:25:00","20:19:00","HAS123"]
["    4537     Nysten Marie-Gabrielle          H G C A         HS23    69              HAS123     7:27  17:25  HAS123","    4537     Nysten Marie-Gabrielle          H G C A         HS23    69              HAS123     7:27  17:25  HAS123",4537,"Nysten Marie-Gabrielle","H","G","C","A",null,"HS23",69,null,"HAS123","07:27:00","17:25:00","HAS123"]
["    4709     Bijnens Eddy                    L H G C A                         CO02","    4709     Bijnens Eddy                    L H G C A                         CO02",4709,"Bijnens Eddy","L","H","G","C","A",null,null,"CO02"]
["    4733     Doucet Jos                      H G C A         HS31   121              HAS123     6:05  14:46  HAS123","    4733     Doucet Jos                      H G C A         HS31   121              HAS123     6:05  14:46  HAS123",4733,"Doucet Jos","H","G","C","A",null,"HS31",121,null,"HAS123","06:05:00","14:46:00","HAS123"]
["    4803     Ferro Mario                     H G C A         HS04    34        AD    HAS123    13:10  20:59  HAS123","    4803     Ferro Mario                     H G C A         HS04    34        AD    HAS123    13:10  20:59  HAS123",4803,"Ferro Mario","H","G","C","A",null,"HS04",34,"AD","HAS123","13:10:00","20:59:00","HAS123"]
["    4901     Reners Patrick                  P H G C A                         T","    4901     Reners Patrick                  P H G C A                         T",4901,"Reners Patrick","P","H","G","C","A",null,null,"T"]
["    5483     Renaers Marc                    H G C A                           CO02","    5483     Renaers Marc                    H G C A                           CO02",5483,"Renaers Marc","H","G","C","A",null,null,null,"CO02"]
["    5536     Deferm Johny                    H G C A                           X","    5536     Deferm Johny                    H G C A                           X",5536,"Deferm Johny","H","G","C","A",null,null,null,"X"]
["    5601     Vanspauwen Linda                L H G C A                         OG","    5601     Vanspauwen Linda                L H G C A                         OG",5601,"Vanspauwen Linda","L","H","G","C","A",null,null,"OG"]
["    5638     Claes Johan                     P G C A                           WV","    5638     Claes Johan                     P G C A                           WV",5638,"Claes Johan","P","G","C","A",null,null,null,"WV"]
["    5857     Cevoli Guillaume                P G C A                           T","    5857     Cevoli Guillaume                P G C A                           T",5857,"Cevoli Guillaume","P","G","C","A",null,null,null,"T"]
["    7206     Zupancic Freddy                 H G C A         HS01     1        AD    HAS123     5:46  14:04  HAS123","    7206     Zupancic Freddy                 H G C A         HS01     1        AD    HAS123     5:46  14:04  HAS123",7206,"Zupancic Freddy","H","G","C","A",null,"HS01",1,"AD","HAS123","05:46:00","14:04:00","HAS123"]
["    7253     Diepvens Theo                   L H G C A                         X","    7253     Diepvens Theo                   L H G C A                         X",7253,"Diepvens Theo","L","H","G","C","A",null,null,"X"]
["    7355     Van Mol Danny                   P H G C A                         X","    7355     Van Mol Danny                   P H G C A                         X",7355,"Van Mol Danny","P","H","G","C","A",null,null,"X"]
["    7384     Thijs Ronny                     P L H G C A                       WV","    7384     Thijs Ronny                     P L H G C A                       WV",7384,"Thijs Ronny","P","L","H","G","C A",null,null,"WV"]
["    7426     Dupont Johan                    P H G C A       HS37   190              HAS123    23:00  31:00  HAS123","    7426     Dupont Johan                    P H G C A       HS37   190              HAS123    23:00  31:00  HAS123",7426,"Dupont Johan","P","H","G","C","A","HS37",190,null,"HAS123","23:00:00",1.2916666666666667,"HAS123"]
["    7886     Dupont Peter                    L H G C A       HS01     5              HAS123     5:38  12:49  HAS123","    7886     Dupont Peter                    L H G C A       HS01     5              HAS123     5:38  12:49  HAS123",7886,"Dupont Peter","L","H","G","C","A","HS01",5,null,"HAS123","05:38:00","12:49:00","HAS123"]
["    7901     Wouters Benny                   H G C A                           LO","    7901     Wouters Benny                   H G C A                           LO",7901,"Wouters Benny","H","G","C","A",null,null,null,"LO"]
["    8059     Rutten Steven                   L G B A         HS40   101              HAS123     9:15  17:16  HAS123","    8059     Rutten Steven                   L G B A         HS40   101              HAS123     9:15  17:16  HAS123",8059,"Rutten Steven","L","G","B","A",null,"HS40",101,null,"HAS123","09:15:00","17:16:00","HAS123"]
["    9019     Martens Vic                     L H G C A                         CO02","    9019     Martens Vic                     L H G C A                         CO02",9019,"Martens Vic","L","H","G","C","A",null,null,"CO02"]
["    9087     Vliegen Patrick                 G C A           HS15    94              HAS123    13:03  21:35  HAS123","    9087     Vliegen Patrick                 G C A           HS15    94              HAS123    13:03  21:35  HAS123",9087,"Vliegen Patrick","G","C","A",null,null,"HS15",94,null,"HAS123","13:03:00","21:35:00","HAS123"]
["    9213     Verding Gert                    H G C A                           AV","    9213     Verding Gert                    H G C A                           AV",9213,"Verding Gert","H","G","C","A",null,null,null,"AV"]
["    9294     Vanderheyden Steven             P L H G C A                       X","    9294     Vanderheyden Steven             P L H G C A                       X",9294,"Vanderheyden Steven","P","L","H","G","C A",null,null,"X"]
["    9362     Ferson Johan                    H G C A                           CO02","    9362     Ferson Johan                    H G C A                           CO02",9362,"Ferson Johan","H","G","C","A",null,null,null,"CO02"]
["    9366     Thuwis Bart                     P H G C A       HS03    28        AD    HAS123     6:02  13:47  HAS123","    9366     Thuwis Bart                     P H G C A       HS03    28        AD    HAS123     6:02  13:47  HAS123",9366,"Thuwis Bart","P","H","G","C","A","HS03",28,"AD","HAS123","06:02:00","13:47:00","HAS123"]
["    9377     Vanhex Anja                     G C A                             WV","    9377     Vanhex Anja                     G C A                             WV",9377,"Vanhex Anja","G","C","A",null,null,null,null,"WV"]
["    9748     DonnΘ Peter                     L H G C A                         LO","    9748     DonnΘ Peter                     L H G C A                         LO",9748,"DonnΘ Peter","L","H","G","C","A",null,null,"LO"]
["    9749     Houbrechts Bart                 H G C A                           WV","    9749     Houbrechts Bart                 H G C A                           WV",9749,"Houbrechts Bart","H","G","C","A",null,null,null,"WV"]
["    9766     Surkijn Dirik                   H G C A                           AO","    9766     Surkijn Dirik                   H G C A                           AO",9766,"Surkijn Dirik","H","G","C","A",null,null,null,"AO"]
["    9930     Baeyens Reginald                H G C A         HS04    33              HAS123    12:10  20:06  HAS123","    9930     Baeyens Reginald                H G C A         HS04    33              HAS123    12:10  20:06  HAS123",9930,"Baeyens Reginald","H","G","C","A",null,"HS04",33,null,"HAS123","12:10:00","20:06:00","HAS123"]
["   10066     Pauwels Alfred                  G C A                             CO02","   10066     Pauwels Alfred                  G C A                             CO02",10066,"Pauwels Alfred","G","C","A",null,null,null,null,"CO02"]
["   10175     Prys Steven                     P L H G C A                       OG","   10175     Prys Steven                     P L H G C A                       OG",10175,"Prys Steven","P","L","H","G","C A",null,null,"OG"]
["   10178     Cornelissen Joris               H G C A                           T","   10178     Cornelissen Joris               H G C A                           T",10178,"Cornelissen Joris","H","G","C","A",null,null,null,"T"]
["   10478     Cupers Gert                     H G C A                           T","   10478     Cupers Gert                     H G C A                           T",10478,"Cupers Gert","H","G","C","A",null,null,null,"T"]
["   10577     De Maeyer Johan                 H G C A                           TC","   10577     De Maeyer Johan                 H G C A                           TC",10577,"De Maeyer Johan","H","G","C","A",null,null,null,"TC"]
["   10736     Janssen Claire                  H G C A                           X","   10736     Janssen Claire                  H G C A                           X",10736,"Janssen Claire","H","G","C","A",null,null,null,"X"]
["   10849     Longhi Claudio                  H G C A                           TC","   10849     Longhi Claudio                  H G C A                           TC",10849,"Longhi Claudio","H","G","C","A",null,null,null,"TC"]
["   10862     Guidelli Armando                H G C A                           T","   10862     Guidelli Armando                H G C A                           T",10862,"Guidelli Armando","H","G","C","A",null,null,null,"T"]
["   10962     Huygen Rudi                     H G C A                           ZI","   10962     Huygen Rudi                     H G C A                           ZI",10962,"Huygen Rudi","H","G","C","A",null,null,null,"ZI"]
["   10984     Indeherberg Peter               H G C A                           WV","   10984     Indeherberg Peter               H G C A                           WV",10984,"Indeherberg Peter","H","G","C","A",null,null,null,"WV"]
["   11014     Reguib Hakim                    H G C A                           LO","   11014     Reguib Hakim                    H G C A                           LO",11014,"Reguib Hakim","H","G","C","A",null,null,null,"LO"]
["   11705     Pauly Danny                     L H G C A       HS01     3              HAS123     5:47  13:31  HAS123","   11705     Pauly Danny                     L H G C A       HS01     3              HAS123     5:47  13:31  HAS123",11705,"Pauly Danny","L","H","G","C","A","HS01",3,null,"HAS123","05:47:00","13:31:00","HAS123"]
["   11853     Kesters Carlo                   H G C A                           X","   11853     Kesters Carlo                   H G C A                           X",11853,"Kesters Carlo","H","G","C","A",null,null,null,"X"]
["   11854     Magne Kristel                   L H G C A                         T","   11854     Magne Kristel                   L H G C A                         T",11854,"Magne Kristel","L","H","G","C","A",null,null,"T"]
["   12083     Van Eylen Stefaan               P G C A         HS03    22              HAS123     6:18  14:44  HAS123","   12083     Van Eylen Stefaan               P G C A         HS03    22              HAS123     6:18  14:44  HAS123",12083,"Van Eylen Stefaan","P","G","C","A",null,"HS03",22,null,"HAS123","06:18:00","14:44:00","HAS123"]
["   12084     Vreven Guido                    H G C A                           WV","   12084     Vreven Guido                    H G C A                           WV",12084,"Vreven Guido","H","G","C","A",null,null,null,"WV"]
["   12086     Sneyers Koen                    P H G C A                         CV","   12086     Sneyers Koen                    P H G C A                         CV",12086,"Sneyers Koen","P","H","G","C","A",null,null,"CV"]
["   12109     Brouns Ronny                    G C A           HS02    17              HAS123    14:11  22:48  HAS123","   12109     Brouns Ronny                    G C A           HS02    17              HAS123    14:11  22:48  HAS123",12109,"Brouns Ronny","G","C","A",null,null,"HS02",17,null,"HAS123","14:11:00","22:48:00","HAS123"]
["   12160     Celis Bert                      H G C A                           TC","   12160     Celis Bert                      H G C A                           TC",12160,"Celis Bert","H","G","C","A",null,null,null,"TC"]
["   12166     Talloen Tom                     H G C A                           WV","   12166     Talloen Tom                     H G C A                           WV",12166,"Talloen Tom","H","G","C","A",null,null,null,"WV"]
["   12984     Grevendonk Patrick              H G C A         HS23    65              HAS123     7:17  17:15  HAS123","   12984     Grevendonk Patrick              H G C A         HS23    65              HAS123     7:17  17:15  HAS123",12984,"Grevendonk Patrick","H","G","C","A",null,"HS23",65,null,"HAS123","07:17:00","17:15:00","HAS123"]
["   12987     Schoofs David                   H G C A         HS06    42              HAS123    11:27  20:11  HAS123","   12987     Schoofs David                   H G C A         HS06    42              HAS123    11:27  20:11  HAS123",12987,"Schoofs David","H","G","C","A",null,"HS06",42,null,"HAS123","11:27:00","20:11:00","HAS123"]
["   13186     Pommee Serge                    P H G C A       HS05    37              HAS123    11:40  20:22  HAS123","   13186     Pommee Serge                    P H G C A       HS05    37              HAS123    11:40  20:22  HAS123",13186,"Pommee Serge","P","H","G","C","A","HS05",37,null,"HAS123","11:40:00","20:22:00","HAS123"]
["   13451     Smelten Guy                     H G C A                           LO","   13451     Smelten Guy                     H G C A                           LO",13451,"Smelten Guy","H","G","C","A",null,null,null,"LO"]
["   13931     Bastiaens Linda                 H G C A         HS02    13              HAS123     6:19  14:16  HAS123","   13931     Bastiaens Linda                 H G C A         HS02    13              HAS123     6:19  14:16  HAS123",13931,"Bastiaens Linda","H","G","C","A",null,"HS02",13,null,"HAS123","06:19:00","14:16:00","HAS123"]
["   14090     Vliegen Danny                   P H G C A       HS35    58              HAS123     5:30  13:30  HAS123","   14090     Vliegen Danny                   P H G C A       HS35    58              HAS123     5:30  13:30  HAS123",14090,"Vliegen Danny","P","H","G","C","A","HS35",58,null,"HAS123","05:30:00","13:30:00","HAS123"]
["   14103     Raymaekers Benny                H G C A         HS06    44              HAS123     6:21  13:56  HAS123","   14103     Raymaekers Benny                H G C A         HS06    44              HAS123     6:21  13:56  HAS123",14103,"Raymaekers Benny","H","G","C","A",null,"HS06",44,null,"HAS123","06:21:00","13:56:00","HAS123"]
["   14487     Raemaekers Lutgarde             H G C A                           ZI","   14487     Raemaekers Lutgarde             H G C A                           ZI",14487,"Raemaekers Lutgarde","H","G","C","A",null,null,null,"ZI"]
["   14490     Put Patrick                     H G C A         HS04    36              HAS123     6:15  15:21  HAS123","   14490     Put Patrick                     H G C A         HS04    36              HAS123     6:15  15:21  HAS123",14490,"Put Patrick","H","G","C","A",null,"HS04",36,null,"HAS123","06:15:00","15:21:00","HAS123"]
["   14494     Vanherle Bj÷rn                  P H G C A       HS35    91              HAS123     5:00  13:00  HAS123","   14494     Vanherle Bj÷rn                  P H G C A       HS35    91              HAS123     5:00  13:00  HAS123",14494,"Vanherle Bj÷rn","P","H","G","C","A","HS35",91,null,"HAS123","05:00:00","13:00:00","HAS123"]
["   14544     Hendrickx Constant              H G C A         HS06    45              HAS123     5:51  14:45  HAS123","   14544     Hendrickx Constant              H G C A         HS06    45              HAS123     5:51  14:45  HAS123",14544,"Hendrickx Constant","H","G","C","A",null,"HS06",45,null,"HAS123","05:51:00","14:45:00","HAS123"]
["   15024     Oktay Ercan                     G C A           HS01     2              HAS123    12:15  20:06  HAS123","   15024     Oktay Ercan                     G C A           HS01     2              HAS123    12:15  20:06  HAS123",15024,"Oktay Ercan","G","C","A",null,null,"HS01",2,null,"HAS123","12:15:00","20:06:00","HAS123"]
["   15057     Versluys Leonard                P H G C A                         X","   15057     Versluys Leonard                P H G C A                         X",15057,"Versluys Leonard","P","H","G","C","A",null,null,"X"]
["   15232     Loukili Karim                   H G C A                           CV","   15232     Loukili Karim                   H G C A                           CV",15232,"Loukili Karim","H","G","C","A",null,null,null,"CV"]
{"$rows_left_out":129}