{"text_format":"1","workbook":"xlsx","n_sheets":2,"sheets":["variabel data","eshop-template"],"not_rendered":{"charts":0,"images":0,"macros":1,"external_links":0,"defined_names":1,"comments":0,"pivot_tables":0},"unopened":[],"bounds":{"document_bytes":16777216,"sheet_cells":100000,"rows_first":2000,"rows_last":500,"rows_between":2000,"halvings":0,"cell_chars":16384,"cell_head_chars":4096},"cells_cut":0,"cells_raw":0,"read":"whole","date_system":"1900"}

{"sheet":"variabel data","index":0,"n_rows":2766,"n_cols":6,"rows_kept":2766,"cut":false,"hidden":false,"merged":[]}
["Postcode","Plaatsnaam"]
[612,"SINTERKLAAS","Andorra (Vorstendom)","Andorre (Principauté)","Andorra (Principality)","AD"]
[1000,"BRUSSEL","Verenigde Arabische Emiraten","Émirats arabes unis","United Arab Emirates","AE"]
[1005,"VERENIGDE VERGADERING VAN DE GEMEENSCHAPPELIJKE ","Afghanistan","Afghanistan","Afghanistan","AF"]
[1006,"RAAD VAN DE VLAAMSE GEMEENSCHAPSCOMMISSIE","Antigua en Barbuda","Antigua et Barbuda","Antigua and Barbuda","AG"]
[1007,"ASSEMBLÉE DE LA COMMISSION COMMUNAUTAIRE FRANÇAISE","Anguilla","Anguilla","Anguilla","AI"]
[1008,"KAMER VAN VOLKSVERTEGENWOORDIGERS","Albanië","Albanie","Albania","AL"]
[1009,"BELGISCHE SENAAT","Armenië (Republiek)","Arménie (République)","Armenia (Republic)","AM"]
[1011,"VLAAMS PARLEMENT","Angola","Angola","Angola","AO"]
[1012,"PARLEMENT DE LA COMMUNAUTÉ FRANÇAISE","Antarctica","Antarctique","Antarctica","AQ"]
[1020,"LAKEN","Argentinië","Argentine","Argentina","AR"]
[1030,"SCHAARBEEK","Amerikaans-Samoa","Samoa américaine","American Samoa","AS"]
[1031,"CHRISTELIJKE SOCIALE ORGANISATIES","Oostenrijk","Autriche","Austria","AT"]
[1033,"RTL-TVI","Australië","Australie","Australia","AU"]
[1035,"MINISTERIE VAN HET BRUSSELS HOOFDSTEDELIJK GEWEST","Aruba","Aruba","Aruba","AW"]
[1040,"ETTERBEEK","Åland","Åland","Åland Islands","AX"]
[1041,"INTERNATIONAL PRESS CENTER","Azerbeidzjan (Republiek)","Azerbaidjan (République)","Azerbaijan (Republic)","AZ"]
[1043,"VRT","Bosnië-Herzegovina (Republiek)","Bosnie-Herzégovine (République)","Bosnia-Herzegovina (Republic)","BA"]
[1044,"RTBF","Barbados","Barbade","Barbados","BB"]
[1045,"DIV -- OBSOLETE - USE 1212 INSTEAD","Bangladesh","Bangladesh","Bangladesh","BD"]
[1046,"EUROPEAN EXTERNAL ACTION SERVICE","België","Belgique","Belgium","BE"]
[1047,"EUROPEES PARLEMENT","Burkina Faso","Burkina Faso","Burkina Faso","BF"]
[1048,"EUROPESE UNIE - RAAD","Bulgarije","Bulgarie","Bulgaria","BG"]
[1049,"EUROPESE UNIE - COMMISSIE","Bahrein","Bahrein","Bahrain","BH"]
[1050,"ELSENE","Burundi","Burundi","Burundi","BI"]
[1060,"SINT-GILLIS","Benin (Republiek)","Bénin (République)","Benin (Republic)","BJ"]
[1070,"ANDERLECHT","Saint-Barthélemy","Saint-Barthélemy","Saint Barthélemy","BL"]
[1080,"SINT-JANS-MOLENBEEK","Bermuda","Bermudes","Bermuda","BM"]
[1081,"KOEKELBERG","Brunei","Brunei","Brunei","BN"]
[1082,"SINT-AGATHA-BERCHEM","Bolivië","Bolivie","Bolivia","BO"]
[1083,"GANSHOREN","Bonaire, Sint Eustatius en Saba","Bonaire, Saint-Eustache et Saba","Bonaire, Sint Eustatius and Saba","BQ"]
[1090,"JETTE","Brazilië","Brésil","Brazil","BR"]
[1099,"BRUSSEL X","Bahama's","Bahamas","Bahamas","BS"]
[1100,"POSTCHEQUE","Bhutan","Bhoutan","Bhutan","BT"]
[1101,"SCANNING","Bouvet Eiland","Île Bouvet","Bouvet Island","BV"]
[1105,"SOC","Botswana","Botswana","Botswana","BW"]
[1110,"NATO","Belarus","Bélarus","Belarus","BY"]
[1120,"NEDER-OVER-HEEMBEEK","Belize","Belize","Belize","BZ"]
[1130,"HAREN","Canada","Canada","Canada","CA"]
[1140,"EVERE","Cocos","Cocos","Cocos","CC"]
[1150,"SINT-PIETERS-WOLUWE","Congo (Democratische Republiek)","Congo (République démocratique)","Congo (Democratic Republic)","CD"]
[1160,"OUDERGEM","Centraal-Afrikaanse Republiek","Centrafricaine (République)","Central African Republic","CF"]
[1170,"WATERMAAL-BOSVOORDE","Congo (Volksrepubliek)","Congo (République populaire)","Congo (People's Republic)","CG"]
[1180,"UKKEL","Zwitserland","Suisse","Switzerland","CH"]
[1190,"VORST","Ivoorkust","Côte-d'Ivoire","Côte-d'Ivoire","CI"]
[1200,"SINT-LAMBRECHTS-WOLUWE","Cook","Cook","Cook","CK"]
[1201,"RTL-TVI -- OBSOLETE - USE 1033 INSTEAD","Chili","Chili","Chile","CL"]
[1210,"SINT-JOOST-TEN-NOODE","Kameroen","Cameroun","Cameroon","CM"]
[1212,"FOD MOBILITEIT","China (Volksrepubliek)","Chine (République populaire)","China ( People's Republic)","CN"]
[1300,"LIMAL","Colombia","Colombie","Colombia","CO"]
[1300,"WAVRE","Costa Rica","Costa Rica","Costa Rica","CR"]
[1301,"BIERGES","Cuba","Cuba","Cuba","CU"]
[1310,"LA HULPE","Kaapverdië (Republiek)","Cap-Vert (République)","Cape Verde (Republic)","CV"]
[1315,"GLIMES","Curaçao","Curaçao","Curaçao","CW"]
[1315,"INCOURT","Christmaseiland","Île Christmas","Christmas Island","CX"]
[1315,"OPPREBAIS","Cyprus","Chypre","Cyprus","CY"]
[1315,"PIÈTREBAIS","Tsjechië (Tsjechische Republiek)","Tchéquie (République tchèque)","Czechia (Czech Republic)","CZ"]
[1315,"ROUX-MIROIR","Duitsland (Bondsrepubliek)","Allemagne (République fédérale)","Germany (Federal Republic)","DE"]
[1320,"BEAUVECHAIN","Djibouti (Republiek)","Djibouti (République)","Djibouti (Republic)","DJ"]
[1320,"HAMME-MILLE","Denemarken","Danemark","Denmark","DK"]
[1320,"L'ECLUSE","Dominica (Republiek)","Dominique (République)","Dominica (Republic)","DM"]
[1320,"NODEBAIS","Dominicaanse Republiek","République Dominicaine","Dominican Republic","DO"]
[1320,"TOURINNES-LA-GROSSE","Algerije","Algérie","Algeria","DZ"]
[1325,"BONLEZ","Ecuador","Équateur","Ecuador","EC"]
[1325,"CHAUMONT-GISTOUX","Estland (Republiek)","Estonie (République)","Estonia (Republic)","EE"]
[1325,"CORROY-LE-GRAND","Egypte (Arabische Republiek)","Égypte (République arabe)","Egypt (Arab Republic)","EG"]
[1325,"DION-VALMONT","Westelijke Sahara","Sahara occidental","West Sahara","EH"]
[1325,"LONGUEVILLE","Eritrea","Érythrée","Eritrea","ER"]
[1330,"RIXENSART","Spanje","Espagne","Spain","ES"]
[1331,"ROSIÈRES","Ethiopië","Éthiopie","Ethiopia","ET"]
[1332,"GENVAL","Finland","Finlande","Finland","FI"]
[1340,"OTTIGNIES","Fiji","Fidji","Fiji","FJ"]
[1341,"CÉROUX-MOUSTY","Falkland","Falkland","Falkland","FK"]
[1342,"LIMELETTE","Micronesië (Federale Staten)","Micronésie (États fédérés)","Micronesia ( Federate States)","FM"]
[1348,"LOUVAIN-LA-NEUVE","Faeröer","Féroé","Faroe","FO"]
[1350,"ENINES","Frankrijk","France","France","FR"]
[1350,"FOLX-LES-CAVES","Gabon","Gabon","Gabon","GA"]
[1350,"JANDRAIN-JANDRENOUILLE","Verenigd Koninkrijk","Royaume-Uni","United Kingdom","GB"]
[1350,"JAUCHE","Grenada","Grenade","Grenada","GD"]
[1350,"MARILLES","Georgië (Republiek)","Géorgie (République)","Georgia (Republic)","GE"]
[1350,"NODUWEZ","Frans-Guyana","Guyane française","French Guiana","GF"]
[1350,"ORP-LE-GRAND","Guernsey","Guernesey","Guernsey","GG"]
[1357,"LINSMEAU","Ghana","Ghana","Ghana","GH"]
[1357,"NEERHEYLISSEM","Gibraltar","Gibraltar","Gibraltar","GI"]
[1357,"OPHEYLISSEM","Groenland","Groenland","Greenland","GL"]
[1360,"MALÈVES-SAINTE-MARIE-WASTINES","Gambia","Gambie","Gambia","GM"]
[1360,"ORBAIS","Guinea","Guinée","Guinea","GN"]
[1360,"PERWEZ","Guadeloupe","Guadeloupe","Guadeloupe","GP"]
[1360,"THOREMBAIS-LES-BÉGUINES","Equatoriaal-Guinea","Guinée équatoriale","Equatorial Guinea","GQ"]
[1360,"THOREMBAIS-SAINT-TROND","Griekenland","Grèce","Greece","GR"]
[1367,"AUTRE-EGLISE","Zuid-Georgia en de Zuidelijke Sandwicheilanden","Géorgie du Sud-et-les Îles Sandwich du Sud","South Georgia and the South Sandwich Islands","GS"]
[1367,"BOMAL","Guatemala","Guatemala","Guatemala","GT"]
[1367,"GEEST-GÉROMPONT-PETIT-ROSIÈRE","Guam","Guam","Guam","GU"]
[1367,"GÉROMPONT","Guinee-Bissau","Guinée-Bissau","Guinea-Bissau","GW"]
[1367,"GRAND-ROSIÈRE-HOTTOMONT","Guyana","Guyana","Guyana","GY"]
[1367,"HUPPAYE","Hongkong","Hongkong","Hongkong","HK"]
[1367,"MONT-SAINT-ANDRÉ","Heard en McDonald","Heard et McDonald","Heard and McDonald","HM"]
[1367,"RAMILLIES","Honduras","Honduras","Honduras","HN"]
[1370,"DONGELBERG","Kroatië (Republiek)","Croatie (République)","Croatia (Republic)","HR"]
[1370,"JAUCHELETTE","Haïti","Haïti","Haiti","HT"]
[1370,"JODOIGNE","Hongarije (Republiek)","Hongrie (République)","Hungary (Republic)","HU"]
[1370,"JODOIGNE-SOUVERAINE","Indonesië","Indonésie","Indonesia","ID"]
[1370,"LATHUY","Ierland","Irlande","Ireland","IE"]
[1370,"MÉLIN","Israël","Israël","Israel","IL"]
[1370,"PIÉTRAIN","Eiland Man","Île de Man","Isle of Man","IM"]
[1370,"SAINT-JEAN-GEEST","India","Inde","India","IN"]
[1370,"SAINT-REMY-GEEST","Brits Indische oceaan","Océan Indien Britannique","British indian Ocean","IO"]
[1370,"ZÉTRUD-LUMAY","Irak","Irak","Iraq","IQ"]
[1380,"COUTURE-SAINT-GERMAIN","Iran","Iran","Iran","IR"]
[1380,"LASNE-CHAPELLE-SAINT-LAMBERT","IJsland","Islande","Iceland","IS"]
[1380,"MARANSART","Italië","Italie","Italy","IT"]
[1380,"OHAIN","Jersey","Jersey","Jersey","JE"]
[1380,"PLANCENOIT","Jamaica","Jamaïque","Jamaica","JM"]
[1390,"ARCHENNES","Jordanië","Jordanie","Jordan","JO"]
[1390,"BIEZ","Japan","Japon","Japan","JP"]
[1390,"BOSSUT-GOTTECHAIN","Kenia","Kenya","Kenya","KE"]
[1390,"GREZ-DOICEAU","Kirgizstan (Republiek)","Kirghistan (République)","Kyrgyzstan (Republic)","KG"]
[1390,"NETHEN","Cambodja (Koninkrijk)","Cambodge (Royaume)","Cambodia ( Kingdom)","KH"]
[1400,"MONSTREUX","Kiribati (Republiek)","Kiribati (République)","Kiribati (Republic)","KI"]
[1400,"NIVELLES","Comoren (Unie)","Comores (Union)","Comoros (Union)","KM"]
[1401,"BAULERS","Sint-Kitts en Nevis (Federatie)","Saint-Kitts et Nevis (Fédération)","Saint Kitts and Nevis (Federation)","KN"]
[1402,"THINES","Noord-Korea (Democratische Volksrepubliek)","Corée du Nord (République populaire démocratique)","North Korea (Democratic People's Republic)","KP"]
[1404,"BORNIVAL","Zuid-Korea (Republiek)","Corée du Sud (République)","South Korea (Republic)","KR"]
[1410,"WATERLOO","Koeweit","Koweit","Kuwait","KW"]
[1414,"PROMO-CONTROL","Caymaneilanden","Caïmanes","Cayman","KY"]
[1420,"BRAINE-L'ALLEUD","Kazachstan (Republiek)","Kazakhstan (République)","Kazakstan (Republic)","KZ"]
[1421,"OPHAIN-BOIS-SEIGNEUR-ISAAC","Laos","Laos","Laos","LA"]
[1428,"LILLOIS-WITTERZÉE","Libanon","Liban","Lebanon","LB"]
[1430,"BIERGHES","Saint Lucia","Sainte-Lucie","Saint Lucia","LC"]
[1430,"QUENAST","Liechtenstein","Liechtenstein","Liechtenstein","LI"]
[1430,"REBECQ-ROGNON","Sri Lanka","Sri Lanka","Sri Lanka","LK"]
[1435,"CORBAIS","Liberia","Libéria","Liberia","LR"]
[1435,"HÉVILLERS","Lesotho","Lesotho","Lesotho","LS"]
[1435,"MONT-SAINT-GUIBERT","Litouwen (Republiek)","Lituanie (République)","Lithuania (Republic)","LT"]
[1440,"BRAINE-LE-CHÂTEAU","Luxemburg (Groot-Hertogdom)","Luxembourg (Grand-Duché)","Luxembourg (Grand Duchy)","LU"]
[1440,"WAUTHIER-BRAINE","Letland (Republiek)","Lettonie (République)","Latvia (Republic)","LV"]
[1450,"CHASTRE-VILLEROUX-BLANMONT","Libië","Libye","Libya","LY"]
[1450,"CORTIL-NOIRMONT","Marokko","Maroc","Morocco","MA"]
[1450,"GENTINNES","Monaco (Vorstendom)","Monaco (Principauté)","Monaco (Principality)","MC"]
[1450,"SAINT-GÉRY","Moldavië (Republiek)","Moldavie (République)","Moldova (Republic)","MD"]
[1457,"NIL-SAINT-VINCENT-SAINT-MARTIN","Montenegro (Republiek)","Monténégro (République)","Montenegro (Republic)","ME"]
[1457,"TOURINNES-SAINT-LAMBERT","Sint-Maarten (Frans deel)","Saint-Martin (partie française)","Saint Martin (French part)","MF"]
[1457,"WALHAIN-SAINT-PAUL","Madagaskar (Democratische Republiek)","Madagascar (République démocratique)","Madagascar (Democratic Republic)","MG"]
[1460,"ITTRE","Marshall (Republiek)","Marshall (République)","Marshall (Republic)","MH"]
[1460,"VIRGINAL-SAMME","Macedonië (Ex-Joegoslavische Republiek)","Macédoine (Ex-République yougoslave)","Macedonia (Ex-Yugoslavia Republic)","MK"]
[1461,"HAUT-ITTRE","Mali","Mali","Mali","ML"]
[1470,"BAISY-THY","Myanmar (Unie)","Myanmar (Union)","Myanmar (Union)","MM"]
[1470,"BOUSVAL","Mongolië (Volksrepubliek)","Mongolie (République pop.)","Mongolia (People's Republic)","MN"]
[1470,"GENAPPE","Macao","Macao","Macao","MO"]
[1471,"LOUPOIGNE","Noordelijke Marianen","Mariannes du Nord","Northern Mariana","MP"]
[1472,"VIEUX-GENAPPE","Martinique","Martinique","Martinique","MQ"]
[1473,"GLABAIS","Mauritanië (Islamitische Republiek)","Mauritanie (République islamique)","Mauritania (Islamic Republic)","MR"]
[1474,"WAYS","Montserrat","Montserrat","Montserrat","MS"]
[1476,"HOUTAIN-LE-VAL","Malta","Malte","Malta","MT"]
[1480,"CLABECQ","Mauritius","Maurice","Mauritius","MU"]
[1480,"OISQUERCQ","Maldiven","Maldives","Maldives","MV"]
[1480,"SAINTES","Malawi","Malawi","Malawi","MW"]
[1480,"TUBIZE","Mexico","Mexique","Mexico","MX"]
[1490,"COURT-SAINT-ETIENNE","Maleisië","Malaisie","Malaysia","MY"]
[1495,"MARBAIS","Mozambique","Mozambique","Mozambique","MZ"]
[1495,"MELLERY","Namibië","Namibie","Namibia","NA"]
[1495,"SART-DAMES-AVELINES","Nieuw-Caledonië","Nouvelle-Calédonie","New Caledonia","NC"]
[1495,"TILLY","Niger","Niger","Niger","NE"]
[1495,"VILLERS-LA-VILLE","Norfolk","Norfolk","Norfolk","NF"]
[1500,"HALLE","Nigeria (Federale Republiek)","Nigéria (République fédérale)","Nigeria (Federal Republic)","NG"]
[1501,"BUIZINGEN","Nicaragua","Nicaragua","Nicaragua","NI"]
[1502,"LEMBEEK","Nederland","Pays-Bas","Netherlands","NL"]
[1540,"HERFELINGEN","Noorwegen","Norvège","Norway","NO"]
[1540,"HERNE","Nepal","Népal","Nepal","NP"]
[1541,"SINT-PIETERS-KAPELLE","Nauru","Nauru","Nauru","NR"]
[1547,"BEVER","Niue","Niué","Niue","NU"]
[1560,"HOEILAART","Nieuw-Zeeland","Nouvelle-Zélande","New Zealand","NZ"]
[1570,"GALMAARDEN","Oman (Sultanaat)","Oman (Sultanat)","Oman (Sultanate)","OM"]
[1570,"TOLLEMBEEK","Panama","Panama","Panama","PA"]
[1570,"VOLLEZELE","Peru","Pérou","Peru","PE"]
[1600,"OUDENAKEN","Frans-Polynesië","Polynésie française","French Polynesia","PF"]
[1600,"SINT-LAUREINS-BERCHEM","Papoea-Nieuw-Guinea","Papouasie-Nouvelle-Guinée","Papua New Guinea","PG"]
[1600,"SINT-PIETERS-LEEUW","Filipijnen","Philippines","Philippines","PH"]
[1601,"RUISBROEK","Pakistan","Pakistan","Pakistan","PK"]
[1602,"VLEZENBEEK","Polen (Republiek)","Pologne (République)","Poland (Republic)","PL"]
[1620,"DROGENBOS","Saint-Pierre en Miquelon","Saint-Pierre et Miquelon","Saint-Pierre and Miquelon","PM"]
[1630,"LINKEBEEK","Pitcairn","Pitcairn","Pitcairn","PN"]
[1640,"SINT-GENESIUS-RODE","Puerto Rico","Porto Rico","Puerto Rico","PR"]
[1650,"BEERSEL","Palestina","Palestine","Palestina","PS"]
[1651,"LOT","Portugal","Portugal","Portugal","PT"]
[1652,"ALSEMBERG","Palau","Palau","Palau","PW"]
[1653,"DWORP","Paraguay","Paraguay","Paraguay","PY"]
[1654,"HUIZINGEN","Qatar","Qatar","Qatar","QA"]
[1670,"BOGAARDEN","Réunion","Réunion","Réunion","RE"]
[1670,"HEIKRUIS","Roemenië","Roumanie","Romania","RO"]
[1670,"PEPINGEN","Servië (Republiek)","Serbie (République)","Serbia (Republic)","RS"]
[1671,"ELINGEN","Rusland (Federatie)","Russie (Fédération)","Russia (Federation )","RU"]
[1673,"BEERT","Rwanda (Republiek)","Rwanda (République)","Rwanda (Republic)","RW"]
[1674,"BELLINGEN","Saudi-Arabië","Arabie Saoudite","Saudi Arabia","SA"]
[1700,"DILBEEK","Salomon","Salomon","Solomon","SB"]
[1700,"SINT-MARTENS-BODEGEM","Seychellen (Republiek)","Seychelles (République)","Seychelles (Republic)","SC"]
[1700,"SINT-ULRIKS-KAPELLE","Soedan","Soudan","Sudan","SD"]
[1701,"ITTERBEEK","Zweden","Suède","Sweden","SE"]
[1702,"GROOT-BIJGAARDEN","Singapore","Singapour","Singapore","SG"]
[1703,"SCHEPDAAL","Saint Helena","Sainte-Hélène","Saint Helena","SH"]
[1730,"ASSE","Slovenië (Republiek)","Slovénie (République)","Slovenia (Republic)","SI"]
[1730,"BEKKERZEEL","Spitsbergen en Jan Mayen","Svalbard et Île Jan Mayen","Svalbard and Jan Mayen","SJ"]
[1730,"KOBBEGEM","Slowakije (Slovaakse Republiek)","Slovaquie (République slovaque)","Slovakia (Slovak Republic)","SK"]
[1730,"MOLLEM","Sierra Leone","Sierra Leone","Sierra Leone","SL"]
[1731,"RELEGEM","San Marino (Republiek)","Saint-Marin (République)","San Marino (Republic)","SM"]
[1731,"ZELLIK","Senegal","Sénégal","Senegal","SN"]
[1733,"HIGHCO DATA","Somalië (Republiek)","Somalie (République)","Somalia (Republic)","SO"]
[1740,"TERNAT","Suriname","Suriname","Suriname","SR"]
[1741,"WAMBEEK","Zuid-Soedan","Sud-Soudan","South Sudan","SS"]
[1742,"SINT-KATHERINA-LOMBEEK","São Tomé en Principe (Democratische Republiek)","São Tomé et Principe (République démocratique)","São Tome and Principe (Democratic Republic)","ST"]
[1745,"MAZENZELE","El Salvador","El Salvador","El Salvador","SV"]
[1745,"OPWIJK","Sint Maarten (Nederlands deel)","Saint-Martin (partie néerlandaise)","Saint Martin (Dutch part)","SX"]
[1750,"GAASBEEK","Syrië (Arabische Republiek)","Syrie (République arabe)","Syria (Arab Republic)","SY"]
[1750,"SINT-KWINTENS-LENNIK","Ngwane (Koninkrijk Swaziland)","Ngwane (Royaume du Swaziland)","Ngwane (Swaziland Kingdom)","SZ"]
[1750,"SINT-MARTENS-LENNIK","Turks- en Caicoseilanden","Turks et Caicos","Turks and Caicos","TC"]
[1755,"GOOIK","Tsjaad","Tchad","Chad","TD"]
[1755,"KESTER","Franse Zuidelijke Gebieden","Terres australes françaises","French Southern Territories","TF"]
[1755,"LEERBEEK","Togo","Togo","Togo","TG"]
[1755,"OETINGEN","Thailand","Thaïlande","Thailand","TH"]
[1760,"ONZE-LIEVE-VROUW-LOMBEEK","Tadzjikistan (Republiek)","Tadjikistan (République)","Tajikistan (Republic)","TJ"]
[1760,"PAMEL","Tokelau","Tokelau","Tokelau","TK"]
[1760,"ROOSDAAL","Timor Leste","Timor Leste","Timor Leste","TL"]
[1760,"STRIJTEM","Turkmenistan (Republiek)","Turkménistan (République)","Turkmenistan (Republic)","TM"]
[1761,"BORCHTLOMBEEK","Tunesië","Tunisie","Tunisia","TN"]
[1770,"LIEDEKERKE","Tonga","Tonga","Tonga","TO"]
[1780,"WEMMEL","Turkije","Turquie","Turkey","TR"]
[1785,"BRUSSEGEM","Trinidad en Tobago","Trinidad et Tobago","Trinidad and Tobago","TT"]
[1785,"HAMME","Tuvalu","Tuvalu","Tuvalu","TV"]
[1785,"MERCHTEM","Taiwan","Taïwan","Taiwan","TW"]
[1790,"AFFLIGEM","Tanzania (Verenigde Republiek)","Tanzanie (République unie)","Tanzania (United Republic)","TZ"]
[1790,"ESSENE","Oekraïne (Republiek)","Ukraine (République)","Ukraine (Republic)","UA"]
[1790,"HEKELGEM","Uganda","Ouganda","Uganda","UG"]
[1790,"TERALFENE","Ver afgelegen eilandjes van de Verenigde Staten","Îles mineures éloignées des États-Unis","United States Minor outlying islands","UM"]
[1800,"PEUTIE","Verenigde Staten van Amerika","États-Unis d'Amérique","United States of America","US"]
[1800,"VILVOORDE","Uruguay","Uruguay","Uruguay","UY"]
[1804,"CARGOVIL","Oezbekistan (Republiek)","Ouzbékistan (République)","Uzbekistan (Republic)","UZ"]
[1818,"VTM","Heilige Stoel","Saint-Siège","Holy See","VA"]
[1820,"MELSBROEK","Saint Vincent en de Grenadines","Saint-Vincent et les Grenadines","Saint Vincent and the Grenadines","VC"]
[1820,"PERK","Venezuela","Venezuela","Venezuela","VE"]
[1820,"STEENOKKERZEEL","Britse Maagdeneilanden","Îles vierges britanniques","British Virgin Islands","VG"]
[1830,"MACHELEN","Amerikaanse Maagdeneilanden","Îles vierges américaines","American Virgin Islands","VI"]
[1831,"DIEGEM","Vietnam (Socialistische Republiek)","Vietnam (République socialiste)","Vietnam (Socialist Republic)","VN"]
[1840,"LONDERZEEL","Vanuatu (Republiek)","Vanuatu (République)","Vanuatu (Republic)","VU"]
[1840,"MALDEREN","Wallis en Futuna","Wallis et Futuna","Wallis and Futuna","WF"]
[1840,"STEENHUFFEL","Samoa","Samoa","Samoa","WS"]
[1850,"GRIMBERGEN","Jemen (Republiek)","Yémen (République)","Yemen (Republic)","YE"]
[1851,"HUMBEEK","Mayotte","Mayotte","Mayotte","YT"]
[1852,"BEIGEM","Zuid-Afrika (Republiek)","Afrique du Sud (République)","South Africa (Republic)","ZA"]
[1853,"STROMBEEK-BEVER","Zambia","Zambie","Zambia","ZM"]
[1860,"MEISE","Zimbabwe","Zimbabwe","Zimbabwe","ZW"]
[1861,"WOLVERTEM"]
[1880,"KAPELLE-OP-DEN-BOS"]
[1880,"NIEUWENRODE"]
[1880,"RAMSDONK"]
[1910,"BERG"]
[1910,"BUKEN"]
[1910,"KAMPENHOUT"]
[1910,"NEDEROKKERZEEL"]
[1930,"NOSSEGEM"]
[1930,"ZAVENTEM"]
[1931,"BRUCARGO"]
[1932,"SINT-STEVENS-WOLUWE"]
[1933,"STERREBEEK"]
[1934,"OFFICE EXCHANGE BRUSSELS AIRPORT REMAILING"]
[1935,"CORPORATE VILLAGE"]
[1950,"KRAAINEM"]
[1970,"WEZEMBEEK-OPPEM"]
[1980,"EPPEGEM"]
[1980,"ZEMST"]
[1981,"HOFSTADE"]
[1982,"ELEWIJT"]
[1982,"WEERDE"]
[2000,"ANTWERPEN"]
[2018,"ANTWERPEN"]
[2020,"ANTWERPEN"]
[2030,"ANTWERPEN"]
[2040,"ANTWERPEN"]
[2040,"BERENDRECHT"]
[2040,"LILLO"]
[2040,"ZANDVLIET"]
[2050,"ANTWERPEN"]
[2060,"ANTWERPEN"]
[2070,"BURCHT"]
[2070,"ZWIJNDRECHT"]
[2099,"ANTWERPEN X"]
[2100,"DEURNE"]
[2110,"WIJNEGEM"]
[2140,"BORGERHOUT"]
[2150,"BORSBEEK"]
[2160,"WOMMELGEM"]
[2170,"MERKSEM"]
[2180,"EKEREN"]
[2200,"HERENTALS"]
[2200,"MORKHOVEN"]
[2200,"NOORDERWIJK"]
[2220,"HALLAAR"]
[2220,"HEIST-OP-DEN-BERG"]
[2221,"BOOISCHOT"]
[2222,"ITEGEM"]
[2222,"WIEKEVORST"]
[2223,"SCHRIEK"]
[2230,"HERSELT"]
[2230,"RAMSEL"]
[2235,"HOUTVENNE"]
[2235,"HULSHOUT"]
[2235,"WESTMEERBEEK"]
[2240,"MASSENHOVEN"]
[2240,"VIERSEL"]
[2240,"ZANDHOVEN"]
[2242,"PULDERBOS"]
[2243,"PULLE"]
[2250,"OLEN"]
[2260,"OEVEL"]
[2260,"TONGERLO"]
[2260,"WESTERLO"]
[2260,"ZOERLE-PARWIJS"]
[2270,"HERENTHOUT"]
[2275,"GIERLE"]
[2275,"LILLE"]
[2275,"POEDERLEE"]
[2275,"WECHELDERZANDE"]
[2280,"GROBBENDONK"]
[2288,"BOUWEL"]
[2290,"VORSELAAR"]
[2300,"TURNHOUT"]
[2310,"RIJKEVORSEL"]
[2320,"HOOGSTRATEN"]
[2321,"MEER"]
[2322,"MINDERHOUT"]
[2323,"WORTEL"]
[2328,"MEERLE"]
[2330,"MERKSPLAS"]
[2340,"BEERSE"]
[2340,"VLIMMEREN"]
[2350,"VOSSELAAR"]
[2360,"OUD-TURNHOUT"]
[2370,"ARENDONK"]
[2380,"RAVELS"]
[2381,"WEELDE"]
[2382,"POPPEL"]
[2387,"BAARLE-HERTOG"]
[2390,"MALLE"]
[2390,"OOSTMALLE"]
[2390,"WESTMALLE"]
[2400,"MOL"]
[2430,"EINDHOUT"]
[2430,"VORST"]
[2431,"VARENDONK"]
[2431,"VEERLE"]
[2440,"GEEL"]
[2450,"MEERHOUT"]
[2460,"KASTERLEE"]
[2460,"LICHTAART"]
[2460,"TIELEN"]
[2470,"RETIE"]
[2480,"DESSEL"]
[2490,"BALEN"]
[2491,"OLMEN"]
[2500,"KONINGSHOOIKT"]
[2500,"LIER"]
[2520,"BROECHEM"]
[2520,"EMBLEM"]
[2520,"OELEGEM"]
[2520,"RANST"]
[2530,"BOECHOUT"]
[2531,"VREMDE"]
[2540,"HOVE"]
[2547,"LINT"]
[2550,"KONTICH"]
[2550,"WAARLOOS"]
[2560,"BEVEL"]
[2560,"KESSEL"]
[2560,"NIJLEN"]
[2570,"DUFFEL"]
[2580,"BEERZEL"]
[2580,"PUTTE"]
[2590,"BERLAAR"]
[2590,"GESTEL"]
[2600,"BERCHEM"]
[2610,"WILRIJK"]
[2620,"HEMIKSEM"]
[2627,"SCHELLE"]
[2630,"AARTSELAAR"]
[2640,"MORTSEL"]
[2650,"EDEGEM"]
[2660,"HOBOKEN"]
[2800,"MECHELEN"]
[2800,"WALEM"]
[2801,"HEFFEN"]
[2811,"HOMBEEK"]
[2811,"LEEST"]
[2812,"MUIZEN"]
[2820,"BONHEIDEN"]
[2820,"RIJMENAM"]
[2830,"BLAASVELD"]
[2830,"HEINDONK"]
[2830,"TISSELT"]
[2830,"WILLEBROEK"]
[2840,"REET"]
[2840,"RUMST"]
{"$rows_left_out":2367}
{"sheet":"eshop-template","index":1,"n_rows":9,"n_cols":30,"rows_kept":9,"cut":false,"hidden":false,"merged":[]}
[null,"OFL","datum:",{"$f":"TODAY()","v":"2014-09-02"},null,null,null,null,"DATABASE OUT OF FILAWEB (non abonnees)"]
[null,"PHILANEWS KLANTNUMMER","Active","Date start","Date end","FilaNr","PRSNr","new","Voornaam","Naam","Straat","Nr.","Bus","Geb-c/o","PC","Gemeente",null,"LandCode","land","Telefoon","GSM","Email","Taal Hard copy","Hard copy","copy e-mail","actiecode","intresse? Info?\nclub",null,null,"Y"]
[1,{"$f":"IF(D3=\"\",\"\",$B$1&\" \"&TEXT(D3,\"jj-mm\")&REPT(\"0\",4-LEN(A3))&A3)","v":"OFL 14-010001"},{"$f":"IF(D3=\"\",\"\",IF(E3<=$D$1,\"Y\",\"N\"))","v":"N"},"2014-01-01","2015-01-31",null,null,null,"KAREL","VERHELST","molenweide",null,null,null,2800,{"$f":"IF(O3=\"\",\"\",VLOOKUP(O3,'variabel data'!A:B,2,FALSE))","v":"MECHELEN"},null,{"$f":"IFERROR(VLOOKUP(S3,'variabel data'!C:F,4,FALSE),\"\")","v":"BE"},"België",null,null,null,null,null,null,null,null,null,null,"N"]
[{"$f":"A3+1","v":2},{"$f":"IF(D4=\"\",\"\",$B$1&\" \"&TEXT(D4,\"jj-mm\")&REPT(\"0\",4-LEN(A4))&A4)","v":"OFL 98-030002"},{"$f":"IF(D4=\"\",\"\",IF(E4<=$D$1,\"Y\",\"N\"))","v":"Y"},"1998-03-02",null,null,null,null,"ANN","VERHELST","molenweide",null,null,null,2800,{"$f":"IF(O4=\"\",\"\",VLOOKUP(O4,'variabel data'!A:B,2,FALSE))","v":"MECHELEN"},null,{"$f":"IFERROR(VLOOKUP(S4,'variabel data'!C:F,4,FALSE),\"\")","v":"BE"},"België"]
[{"$f":"A4+1","v":3},{"$f":"IF(D5=\"\",\"\",$B$1&\" \"&TEXT(D5,\"jj-mm\")&REPT(\"0\",4-LEN(A5))&A5)","v":""},{"$f":"IF(D5=\"\",\"\",IF(E5<=$D$1,\"Y\",\"N\"))","v":""},null,null,null,null,null,null,null,null,null,null,null,null,{"$f":"IF(O5=\"\",\"\",VLOOKUP(O5,'variabel data'!A:B,2,FALSE))","v":""},null,{"$f":"IFERROR(VLOOKUP(S5,'variabel data'!C:F,4,FALSE),\"\")","v":""}]
[4,null,null,null,null,null,null,null,null,null,null,null,null,null,null,{"$f":"IF(O6=\"\",\"\",VLOOKUP(O6,'variabel data'!A:B,2,FALSE))","v":""},null,{"$f":"IFERROR(VLOOKUP(S6,'variabel data'!C:F,4,FALSE),\"\")","v":""}]
[5,null,null,null,null,null,null,null,null,null,null,null,null,null,null,{"$f":"IF(O7=\"\",\"\",VLOOKUP(O7,'variabel data'!A:B,2,FALSE))","v":""},null,{"$f":"IFERROR(VLOOKUP(S7,'variabel data'!C:F,4,FALSE),\"\")","v":""}]
[6,null,null,null,null,null,null,null,null,null,null,null,null,null,null,{"$f":"IF(O8=\"\",\"\",VLOOKUP(O8,'variabel data'!A:B,2,FALSE))","v":""},null,{"$f":"IFERROR(VLOOKUP(S8,'variabel data'!C:F,4,FALSE),\"\")","v":""}]
[7,null,null,null,null,null,null,null,null,null,null,null,null,null,null,{"$f":"IF(O9=\"\",\"\",VLOOKUP(O9,'variabel data'!A:B,2,FALSE))","v":""},null,{"$f":"IFERROR(VLOOKUP(S9,'variabel data'!C:F,4,FALSE),\"\")","v":""}]