{"text_format":"1","workbook":"xlsx","n_sheets":3,"sheets":["Lotto","Weetjes","Results"],"not_rendered":{"charts":0,"images":0,"macros":1,"external_links":0,"defined_names":0,"comments":0,"pivot_tables":0},"unopened":[],"bounds":{"document_bytes":16777216,"sheet_cells":100000,"rows_first":2000,"rows_last":500,"rows_between":2000,"halvings":0,"cell_chars":16384,"cell_head_chars":4096},"cells_cut":0,"cells_raw":0,"read":"whole","date_system":"1900"}

{"sheet":"Lotto","index":0,"n_rows":67,"n_cols":17,"rows_kept":67,"cut":false,"hidden":false,"merged":[[1,4,1,10],[5,4,5,10],[2,4,2,9],[6,4,6,9],[5,12,5,13]]}
[]
[null,null,null,null,{"$f":"\"Lotto trekking van \"&Results!A5","v":"Lotto trekking van zaterdag 30 mei 2015"}]
[null,null,null,null,"Getallen",null,null,null,null,null,"Res.",null,null,null,null,"Totaal"]
[null,null,null,null,{"$f":"HLOOKUP(\"Number1\",Results!$A$1:$JC$2,2,0)","v":1},{"$f":"HLOOKUP(\"Number2\",Results!$A$1:$JC$2,2,0)","v":8},{"$f":"HLOOKUP(\"Number3\",Results!$A$1:$JC$2,2,0)","v":22},{"$f":"HLOOKUP(\"Number4\",Results!$A$1:$JC$2,2,0)","v":23},{"$f":"HLOOKUP(\"Number5\",Results!$A$1:$JC$2,2,0)","v":33},{"$f":"HLOOKUP(\"Number6\",Results!$A$1:$JC$2,2,0)","v":42},{"$f":"HLOOKUP(\"Number7\",Results!$A$1:$JC$2,2,0)","v":35},null,null,null,null,{"$f":"SUM(P8:P67)","v":0}]
[]
[null,null,null,null,"Mijn combinaties",null,null,null,null,null,null,null,"Aantal juiste"]
[null,null,"Spel",null,"Getallen",null,null,null,null,null,null,null,"Getallen","Res."]
[null,null,1,null,null,null,null,null,null,null,null,null,{"$f":"IF(E8<>\"\",SUM(COUNTIF(E8:J8,$E$4:$J$4)),\"\")","v":""},{"$f":"IF(E8=\"\",\"\",IF(K8=$K$4,\"X\",\"-\"))","v":""},null,{"$f":"IFERROR(HLOOKUP(Results!I5,Results!$A$1:$EF$2,2,0),\"\")","v":""},{"$f":"IFERROR(VLOOKUP(Results!I5,Results!$M$5:$N$12,2,0),\"\")","v":""}]
[null,null,2,null,null,null,null,null,null,null,null,null,{"$f":"IF(E9<>\"\",SUM(COUNTIF(E9:J9,$E$4:$J$4)),\"\")","v":""},{"$f":"IF(E9=\"\",\"\",IF(K9=$K$4,\"X\",\"-\"))","v":""},null,{"$f":"IFERROR(HLOOKUP(Results!I6,Results!$A$1:$EF$2,2,0),\"\")","v":""},{"$f":"IFERROR(VLOOKUP(Results!I6,Results!$M$5:$N$12,2,0),\"\")","v":""}]
[null,null,3,null,null,null,null,null,null,null,null,null,{"$f":"IF(E10<>\"\",SUM(COUNTIF(E10:J10,$E$4:$J$4)),\"\")","v":""},"",null,{"$f":"IFERROR(HLOOKUP(Results!I7,Results!$A$1:$EF$2,2,0),\"\")","v":""},{"$f":"IFERROR(VLOOKUP(Results!I7,Results!$M$5:$N$12,2,0),\"\")","v":""}]
[null,null,4,null,null,null,null,null,null,null,null,null,{"$f":"IF(E11<>\"\",SUM(COUNTIF(E11:J11,$E$4:$J$4)),\"\")","v":""},"",null,{"$f":"IFERROR(HLOOKUP(Results!I8,Results!$A$1:$EF$2,2,0),\"\")","v":""},{"$f":"IFERROR(VLOOKUP(Results!I8,Results!$M$5:$N$12,2,0),\"\")","v":""}]
[null,null,5,null,null,null,null,null,null,null,null,null,{"$f":"IF(E12<>\"\",SUM(COUNTIF(E12:J12,$E$4:$J$4)),\"\")","v":""},"",null,{"$f":"IFERROR(HLOOKUP(Results!I9,Results!$A$1:$EF$2,2,0),\"\")","v":""},{"$f":"IFERROR(VLOOKUP(Results!I9,Results!$M$5:$N$12,2,0),\"\")","v":""}]
[null,null,6,null,null,null,null,null,null,null,null,null,{"$f":"IF(E13<>\"\",SUM(COUNTIF(E13:J13,$E$4:$J$4)),\"\")","v":""},"",null,{"$f":"IFERROR(HLOOKUP(Results!I10,Results!$A$1:$EF$2,2,0),\"\")","v":""},{"$f":"IFERROR(VLOOKUP(Results!I10,Results!$M$5:$N$12,2,0),\"\")","v":""}]
[null,null,7,null,null,null,null,null,null,null,null,null,{"$f":"IF(E14<>\"\",SUM(COUNTIF(E14:J14,$E$4:$J$4)),\"\")","v":""},"",null,{"$f":"IFERROR(HLOOKUP(Results!I11,Results!$A$1:$EF$2,2,0),\"\")","v":""},{"$f":"IFERROR(VLOOKUP(Results!I11,Results!$M$5:$N$12,2,0),\"\")","v":""}]
[null,null,8,null,null,null,null,null,null,null,null,null,{"$f":"IF(E15<>\"\",SUM(COUNTIF(E15:J15,$E$4:$J$4)),\"\")","v":""},"",null,{"$f":"IFERROR(HLOOKUP(Results!I12,Results!$A$1:$EF$2,2,0),\"\")","v":""},{"$f":"IFERROR(VLOOKUP(Results!I12,Results!$M$5:$N$12,2,0),\"\")","v":""}]
[null,null,9,null,null,null,null,null,null,null,null,null,{"$f":"IF(E16<>\"\",SUM(COUNTIF(E16:J16,$E$4:$J$4)),\"\")","v":""},"",null,{"$f":"IFERROR(HLOOKUP(Results!I13,Results!$A$1:$EF$2,2,0),\"\")","v":""},{"$f":"IFERROR(VLOOKUP(Results!I13,Results!$M$5:$N$12,2,0),\"\")","v":""}]
[null,null,10,null,null,null,null,null,null,null,null,null,{"$f":"IF(E17<>\"\",SUM(COUNTIF(E17:J17,$E$4:$J$4)),\"\")","v":""},"",null,{"$f":"IFERROR(HLOOKUP(Results!I14,Results!$A$1:$EF$2,2,0),\"\")","v":""},{"$f":"IFERROR(VLOOKUP(Results!I14,Results!$M$5:$N$12,2,0),\"\")","v":""}]
[null,null,11,null,null,null,null,null,null,null,null,null,{"$f":"IF(E18<>\"\",SUM(COUNTIF(E18:J18,$E$4:$J$4)),\"\")","v":""},"",null,{"$f":"IFERROR(HLOOKUP(Results!I15,Results!$A$1:$EF$2,2,0),\"\")","v":""},{"$f":"IFERROR(VLOOKUP(Results!I15,Results!$M$5:$N$12,2,0),\"\")","v":""}]
[null,null,12,null,null,null,null,null,null,null,null,null,{"$f":"IF(E19<>\"\",SUM(COUNTIF(E19:J19,$E$4:$J$4)),\"\")","v":""},"",null,{"$f":"IFERROR(HLOOKUP(Results!I16,Results!$A$1:$EF$2,2,0),\"\")","v":""},{"$f":"IFERROR(VLOOKUP(Results!I16,Results!$M$5:$N$12,2,0),\"\")","v":""}]
[null,null,13,null,null,null,null,null,null,null,null,null,{"$f":"IF(E20<>\"\",SUM(COUNTIF(E20:J20,$E$4:$J$4)),\"\")","v":""},"",null,{"$f":"IFERROR(HLOOKUP(Results!I17,Results!$A$1:$EF$2,2,0),\"\")","v":""},{"$f":"IFERROR(VLOOKUP(Results!I17,Results!$M$5:$N$12,2,0),\"\")","v":""}]
[null,null,14,null,null,null,null,null,null,null,null,null,{"$f":"IF(E21<>\"\",SUM(COUNTIF(E21:J21,$E$4:$J$4)),\"\")","v":""},"",null,{"$f":"IFERROR(HLOOKUP(Results!I18,Results!$A$1:$EF$2,2,0),\"\")","v":""},{"$f":"IFERROR(VLOOKUP(Results!I18,Results!$M$5:$N$12,2,0),\"\")","v":""}]
[null,null,15,null,null,null,null,null,null,null,null,null,{"$f":"IF(E22<>\"\",SUM(COUNTIF(E22:J22,$E$4:$J$4)),\"\")","v":""},"",null,{"$f":"IFERROR(HLOOKUP(Results!I19,Results!$A$1:$EF$2,2,0),\"\")","v":""},{"$f":"IFERROR(VLOOKUP(Results!I19,Results!$M$5:$N$12,2,0),\"\")","v":""}]
[null,null,16,null,null,null,null,null,null,null,null,null,{"$f":"IF(E23<>\"\",SUM(COUNTIF(E23:J23,$E$4:$J$4)),\"\")","v":""},"",null,{"$f":"IFERROR(HLOOKUP(Results!I20,Results!$A$1:$EF$2,2,0),\"\")","v":""},{"$f":"IFERROR(VLOOKUP(Results!I20,Results!$M$5:$N$12,2,0),\"\")","v":""}]
[null,null,17,null,null,null,null,null,null,null,null,null,{"$f":"IF(E24<>\"\",SUM(COUNTIF(E24:J24,$E$4:$J$4)),\"\")","v":""},"",null,{"$f":"IFERROR(HLOOKUP(Results!I21,Results!$A$1:$EF$2,2,0),\"\")","v":""},{"$f":"IFERROR(VLOOKUP(Results!I21,Results!$M$5:$N$12,2,0),\"\")","v":""}]
[null,null,18,null,null,null,null,null,null,null,null,null,{"$f":"IF(E25<>\"\",SUM(COUNTIF(E25:J25,$E$4:$J$4)),\"\")","v":""},"",null,{"$f":"IFERROR(HLOOKUP(Results!I22,Results!$A$1:$EF$2,2,0),\"\")","v":""},{"$f":"IFERROR(VLOOKUP(Results!I22,Results!$M$5:$N$12,2,0),\"\")","v":""}]
[null,null,19,null,null,null,null,null,null,null,null,null,{"$f":"IF(E26<>\"\",SUM(COUNTIF(E26:J26,$E$4:$J$4)),\"\")","v":""},"",null,{"$f":"IFERROR(HLOOKUP(Results!I23,Results!$A$1:$EF$2,2,0),\"\")","v":""},{"$f":"IFERROR(VLOOKUP(Results!I23,Results!$M$5:$N$12,2,0),\"\")","v":""}]
[null,null,20,null,null,null,null,null,null,null,null,null,{"$f":"IF(E27<>\"\",SUM(COUNTIF(E27:J27,$E$4:$J$4)),\"\")","v":""},"",null,{"$f":"IFERROR(HLOOKUP(Results!I24,Results!$A$1:$EF$2,2,0),\"\")","v":""},{"$f":"IFERROR(VLOOKUP(Results!I24,Results!$M$5:$N$12,2,0),\"\")","v":""}]
[null,null,21,null,null,null,null,null,null,null,null,null,{"$f":"IF(E28<>\"\",SUM(COUNTIF(E28:J28,$E$4:$J$4)),\"\")","v":""},"",null,{"$f":"IFERROR(HLOOKUP(Results!I25,Results!$A$1:$EF$2,2,0),\"\")","v":""},{"$f":"IFERROR(VLOOKUP(Results!I25,Results!$M$5:$N$12,2,0),\"\")","v":""}]
[null,null,22,null,null,null,null,null,null,null,null,null,{"$f":"IF(E29<>\"\",SUM(COUNTIF(E29:J29,$E$4:$J$4)),\"\")","v":""},"",null,{"$f":"IFERROR(HLOOKUP(Results!I26,Results!$A$1:$EF$2,2,0),\"\")","v":""},{"$f":"IFERROR(VLOOKUP(Results!I26,Results!$M$5:$N$12,2,0),\"\")","v":""}]
[null,null,23,null,null,null,null,null,null,null,null,null,{"$f":"IF(E30<>\"\",SUM(COUNTIF(E30:J30,$E$4:$J$4)),\"\")","v":""},"",null,{"$f":"IFERROR(HLOOKUP(Results!I27,Results!$A$1:$EF$2,2,0),\"\")","v":""},{"$f":"IFERROR(VLOOKUP(Results!I27,Results!$M$5:$N$12,2,0),\"\")","v":""}]
[null,null,24,null,null,null,null,null,null,null,null,null,{"$f":"IF(E31<>\"\",SUM(COUNTIF(E31:J31,$E$4:$J$4)),\"\")","v":""},"",null,{"$f":"IFERROR(HLOOKUP(Results!I28,Results!$A$1:$EF$2,2,0),\"\")","v":""},{"$f":"IFERROR(VLOOKUP(Results!I28,Results!$M$5:$N$12,2,0),\"\")","v":""}]
[null,null,25,null,null,null,null,null,null,null,null,null,{"$f":"IF(E32<>\"\",SUM(COUNTIF(E32:J32,$E$4:$J$4)),\"\")","v":""},"",null,{"$f":"IFERROR(HLOOKUP(Results!I29,Results!$A$1:$EF$2,2,0),\"\")","v":""},{"$f":"IFERROR(VLOOKUP(Results!I29,Results!$M$5:$N$12,2,0),\"\")","v":""}]
[null,null,26,null,null,null,null,null,null,null,null,null,{"$f":"IF(E33<>\"\",SUM(COUNTIF(E33:J33,$E$4:$J$4)),\"\")","v":""},"",null,{"$f":"IFERROR(HLOOKUP(Results!I30,Results!$A$1:$EF$2,2,0),\"\")","v":""},{"$f":"IFERROR(VLOOKUP(Results!I30,Results!$M$5:$N$12,2,0),\"\")","v":""}]
[null,null,27,null,null,null,null,null,null,null,null,null,{"$f":"IF(E34<>\"\",SUM(COUNTIF(E34:J34,$E$4:$J$4)),\"\")","v":""},"",null,{"$f":"IFERROR(HLOOKUP(Results!I31,Results!$A$1:$EF$2,2,0),\"\")","v":""},{"$f":"IFERROR(VLOOKUP(Results!I31,Results!$M$5:$N$12,2,0),\"\")","v":""}]
[null,null,28,null,null,null,null,null,null,null,null,null,{"$f":"IF(E35<>\"\",SUM(COUNTIF(E35:J35,$E$4:$J$4)),\"\")","v":""},"",null,{"$f":"IFERROR(HLOOKUP(Results!I32,Results!$A$1:$EF$2,2,0),\"\")","v":""},{"$f":"IFERROR(VLOOKUP(Results!I32,Results!$M$5:$N$12,2,0),\"\")","v":""}]
[null,null,29,null,null,null,null,null,null,null,null,null,{"$f":"IF(E36<>\"\",SUM(COUNTIF(E36:J36,$E$4:$J$4)),\"\")","v":""},"",null,{"$f":"IFERROR(HLOOKUP(Results!I33,Results!$A$1:$EF$2,2,0),\"\")","v":""},{"$f":"IFERROR(VLOOKUP(Results!I33,Results!$M$5:$N$12,2,0),\"\")","v":""}]
[null,null,30,null,null,null,null,null,null,null,null,null,{"$f":"IF(E37<>\"\",SUM(COUNTIF(E37:J37,$E$4:$J$4)),\"\")","v":""},"",null,{"$f":"IFERROR(HLOOKUP(Results!I34,Results!$A$1:$EF$2,2,0),\"\")","v":""},{"$f":"IFERROR(VLOOKUP(Results!I34,Results!$M$5:$N$12,2,0),\"\")","v":""}]
[null,null,31,null,null,null,null,null,null,null,null,null,{"$f":"IF(E38<>\"\",SUM(COUNTIF(E38:J38,$E$4:$J$4)),\"\")","v":""},"",null,{"$f":"IFERROR(HLOOKUP(Results!I35,Results!$A$1:$EF$2,2,0),\"\")","v":""},{"$f":"IFERROR(VLOOKUP(Results!I35,Results!$M$5:$N$12,2,0),\"\")","v":""}]
[null,null,32,null,null,null,null,null,null,null,null,null,{"$f":"IF(E39<>\"\",SUM(COUNTIF(E39:J39,$E$4:$J$4)),\"\")","v":""},"",null,{"$f":"IFERROR(HLOOKUP(Results!I36,Results!$A$1:$EF$2,2,0),\"\")","v":""},{"$f":"IFERROR(VLOOKUP(Results!I36,Results!$M$5:$N$12,2,0),\"\")","v":""}]
[null,null,33,null,null,null,null,null,null,null,null,null,{"$f":"IF(E40<>\"\",SUM(COUNTIF(E40:J40,$E$4:$J$4)),\"\")","v":""},"",null,{"$f":"IFERROR(HLOOKUP(Results!I37,Results!$A$1:$EF$2,2,0),\"\")","v":""},{"$f":"IFERROR(VLOOKUP(Results!I37,Results!$M$5:$N$12,2,0),\"\")","v":""}]
{"$rows_left_out":28}
{"sheet":"Weetjes","index":1,"n_rows":12,"n_cols":11,"rows_kept":12,"cut":false,"hidden":false,"merged":[[3,4,3,5],[3,1,3,2],[3,10,4,10],[1,1,1,5]]}
[]
[null,{"$f":"Lotto!E2","v":"Lotto trekking van zaterdag 30 mei 2015"}]
[]
[null,"Prijzengeld",null,null,"Winnaars",null,null,"Aantal spelers",{"$f":"HLOOKUP(Results!S5,Results!$A$1:$JC$2,2,0)","v":757360},null,"Website Lotto"]
[null,"Rang 1",{"$f":"HLOOKUP(Results!M5,Results!$A$1:$JC$2,2,0)","v":0},null,"Rang 1",{"$f":"HLOOKUP(Results!O5,Results!$A$1:$EF$2,2,0)","v":0},null,"Totale inzet",{"$f":"HLOOKUP(Results!S6,Results!$A$1:$JC$2,2,0)","v":5000044}]
[null,"Rang 2",{"$f":"HLOOKUP(Results!M6,Results!$A$1:$JC$2,2,0)","v":92250.8},null,"Rang 2",{"$f":"HLOOKUP(Results!O6,Results!$A$1:$EF$2,2,0)","v":2}]
[null,"Rang 3",{"$f":"HLOOKUP(Results!M7,Results!$A$1:$JC$2,2,0)","v":777.7},null,"Rang 3",{"$f":"HLOOKUP(Results!O7,Results!$A$1:$EF$2,2,0)","v":225}]
[null,"Rang 4",{"$f":"HLOOKUP(Results!M8,Results!$A$1:$JC$2,2,0)","v":207.8},null,"Rang 4",{"$f":"HLOOKUP(Results!O8,Results!$A$1:$EF$2,2,0)","v":421}]
[null,"Rang 5",{"$f":"HLOOKUP(Results!M9,Results!$A$1:$JC$2,2,0)","v":18.8},null,"Rang 5",{"$f":"HLOOKUP(Results!O9,Results!$A$1:$EF$2,2,0)","v":8578}]
[null,"Rang 6",{"$f":"HLOOKUP(Results!M10,Results!$A$1:$JC$2,2,0)","v":9.4},null,"Rang 6",{"$f":"HLOOKUP(Results!O10,Results!$A$1:$EF$2,2,0)","v":9179}]
[null,"Rang 7",{"$f":"HLOOKUP(Results!M11,Results!$A$1:$JC$2,2,0)","v":5},null,"Rang 7",{"$f":"HLOOKUP(Results!O11,Results!$A$1:$EF$2,2,0)","v":127134}]
[null,"Rang 8",{"$f":"HLOOKUP(Results!M12,Results!$A$1:$JC$2,2,0)","v":3},null,"Rang 8",{"$f":"HLOOKUP(Results!O12,Results!$A$1:$EF$2,2,0)","v":73149}]

{"sheet":"Results","index":2,"n_rows":64,"n_cols":136,"rows_kept":64,"cut":false,"hidden":true,"merged":[]}
["X",{"$f":"A2","v":"{\"Succeeded\""},{"$f":"B2","v":true},"Message","null","Data","{\"DrawType\"","LottoDraw","Draw","{\"Id\"",4084,"DrawDate","2015-05-30T18:59:59","NextDraw","2015-06-03T18:59:59","Stats","null","Number1",1,"Number2",8,"Number3",22,"Number4",23,"Number5",33,"Number6",42,"Number7",35,"Rank1Winners",0,"Rank2Winners",2,"Rank3Winners",225,"Rank4Winners",421,"Rank5Winners",8578,"Rank6Winners",9179,"Rank7Winners",127134,"Rank8Winners",73149,"Rank1Gains",0,"Rank2Gains",92250.8,"Rank3Gains",777.7,"Rank4Gains",207.8,"Rank5Gains",18.8,"Rank6Gains",9.4,"Rank7Gains",5,"Rank8Gains",3,"TotalPlayers",757360,"TotalMoney",{"$f":"BN2","v":5000044},"EstimatedJackpot","2000000.0000","NextJackpot","1000000.0000","IsNewDraw",false,"RollDown",false,"Results","[1",8,22,23,33,42,"35]","GainDistribution","[{\"Title\"",6,"Winners",0,"Gains","0.0000}","{\"Title\"","5+","Winners",2,"Gains","92250.8000}","{\"Title\"",5,"Winners",225,"Gains","777.7000}","{\"Title\"","4+","Winners",421,"Gains","207.8000}","{\"Title\"",4,"Winners",8578,"Gains","18.8000}","{\"Title\"","3+","Winners",9179,"Gains","9.4000}","{\"Title\"",3,"Winners",127134,"Gains","5.0000}","{\"Title\"","2+","Winners",73149,{"$f":"DZ2","v":"Gains"},"3.0000}]}","VideoUrls","https://nlotstoragemedia01.blob.core.windows.net:443/asset-fed43a5d-1500-80c3-fdc5-f1e506f4f40c/20150530_NL_LOTTO.mp4?sv=2012-02-12&sr=c&si=a676c473-ffe2-4ce8-a13b-8293eb52cabe&sig=CrpYQ4Sy6GEWf6D9p%2FSOwD1TWs0IMPIWFOtCAC79V9U%3D&se=2015-10-17T18%3A40%3A48Z}","Exception","null}"]
["{\"Succeeded\"",true,"Message","null","Data","{\"DrawType\"","LottoDraw","Draw","{\"Id\"",4084,"DrawDate","2015-05-30T18:59:59","NextDraw","2015-06-03T18:59:59","Stats","null","Number1",1,"Number2",8,"Number3",22,"Number4",23,"Number5",33,"Number6",42,"Number7",35,"Rank1Winners",0,"Rank2Winners",2,"Rank3Winners",225,"Rank4Winners",421,"Rank5Winners",8578,"Rank6Winners",9179,"Rank7Winners",127134,"Rank8Winners",73149,"Rank1Gains",0,"Rank2Gains",92250.8,"Rank3Gains",777.7,"Rank4Gains",207.8,"Rank5Gains",18.8,"Rank6Gains",9.4,"Rank7Gains",5,"Rank8Gains",3,"TotalPlayers",757360,"TotalMoney",5000044,"EstimatedJackpot","2000000.0000","NextJackpot","1000000.0000","IsNewDraw",false,"RollDown",false,"Results","[1",8,22,23,33,42,"35]","GainDistribution","[{\"Title\"",6,"Winners",0,"Gains","0.0000}","{\"Title\"","5+","Winners",2,"Gains","92250.8000}","{\"Title\"",5,"Winners",225,"Gains","777.7000}","{\"Title\"","4+","Winners",421,"Gains","207.8000}","{\"Title\"",4,"Winners",8578,"Gains","18.8000}","{\"Title\"","3+","Winners",9179,"Gains","9.4000}","{\"Title\"",3,"Winners",127134,"Gains","5.0000}","{\"Title\"","2+","Winners",73149,"Gains","3.0000}]}","VideoUrls","https://nlotstoragemedia01.blob.core.windows.net:443/asset-fed43a5d-1500-80c3-fdc5-f1e506f4f40c/20150530_NL_LOTTO.mp4?sv=2012-02-12&sr=c&si=a676c473-ffe2-4ce8-a13b-8293eb52cabe&sig=CrpYQ4Sy6GEWf6D9p%2FSOwD1TWs0IMPIWFOtCAC79V9U%3D&se=2015-10-17T18%3A40%3A48Z}","Exception","null}"]
[]
[]
[{"$f":"TEXT(LEFT(HLOOKUP(\"DrawDate\",$A$1:$EF$2,2,0),10),\"dddd dd mmm jjjj\")","v":"zaterdag 30 mei 2015"},null,null,null,null,"Vandaag",null,{"$f":"Lotto!M8&Lotto!N8","v":""},{"$f":"IFERROR(VLOOKUP(H5,$L$5:$M$12,2,0),\"\")","v":""},null,null,"6-","Rank1Gains","Rang 1","Rank1Winners",null,null,null,"TotalPlayers"]
[null,null,null,null,null,{"$f":"TODAY()","v":"2015-06-03"},null,{"$f":"Lotto!M9&Lotto!N9","v":""},{"$f":"IFERROR(VLOOKUP(H6,$L$5:$M$12,2,0),\"\")","v":""},null,null,"5X","Rank2Gains","Rang 2","Rank2Winners",null,null,null,"TotalMoney"]
[null,null,null,null,null,null,null,{"$f":"Lotto!M10&Lotto!N10","v":""},"",null,null,"5-","Rank3Gains","Rang 3","Rank3Winners"]
[null,null,null,null,null,null,null,{"$f":"Lotto!M11&Lotto!N11","v":""},"",null,null,"4X","Rank4Gains","Rang 4","Rank4Winners"]
[null,null,null,null,null,null,null,{"$f":"Lotto!M12&Lotto!N12","v":""},"",null,null,"4-","Rank5Gains","Rang 5","Rank5Winners"]
[null,null,null,null,null,null,null,{"$f":"Lotto!M13&Lotto!N13","v":""},"",null,null,"3X","Rank6Gains","Rang 6","Rank6Winners"]
[null,null,null,null,null,null,null,{"$f":"Lotto!M14&Lotto!N14","v":""},"",null,null,"3-","Rank7Gains","Rang 7","Rank7Winners"]
[null,null,null,null,null,null,null,{"$f":"Lotto!M15&Lotto!N15","v":""},"",null,null,"2X","Rank8Gains","Rang 8","Rank8Winners"]
[null,null,null,null,null,null,null,{"$f":"Lotto!M16&Lotto!N16","v":""},""]
[null,null,null,null,null,null,null,{"$f":"Lotto!M17&Lotto!N17","v":""},""]
[null,null,null,null,null,null,null,{"$f":"Lotto!M18&Lotto!N18","v":""},""]
[null,null,null,null,null,null,null,{"$f":"Lotto!M19&Lotto!N19","v":""},""]
[null,null,null,null,null,null,null,{"$f":"Lotto!M20&Lotto!N20","v":""},""]
[null,null,null,null,null,null,null,{"$f":"Lotto!M21&Lotto!N21","v":""},""]
[null,null,null,null,null,null,null,{"$f":"Lotto!M22&Lotto!N22","v":""},""]
[null,null,null,null,null,null,null,{"$f":"Lotto!M23&Lotto!N23","v":""},""]
[null,null,null,null,null,null,null,{"$f":"Lotto!M24&Lotto!N24","v":""},""]
[null,null,null,null,null,null,null,{"$f":"Lotto!M25&Lotto!N25","v":""},""]
[null,null,null,null,null,null,null,{"$f":"Lotto!M26&Lotto!N26","v":""},""]
[null,null,null,null,null,null,null,{"$f":"Lotto!M27&Lotto!N27","v":""},""]
[null,null,null,null,null,null,null,{"$f":"Lotto!M28&Lotto!N28","v":""},""]
[null,null,null,null,null,null,null,{"$f":"Lotto!M29&Lotto!N29","v":""},""]
[null,null,null,null,null,null,null,{"$f":"Lotto!M30&Lotto!N30","v":""},""]
[null,null,null,null,null,null,null,{"$f":"Lotto!M31&Lotto!N31","v":""},""]
[null,null,null,null,null,null,null,{"$f":"Lotto!M32&Lotto!N32","v":""},""]
[null,null,null,null,null,null,null,{"$f":"Lotto!M33&Lotto!N33","v":""},""]
[null,null,null,null,null,null,null,{"$f":"Lotto!M34&Lotto!N34","v":""},""]
[null,null,null,null,null,null,null,{"$f":"Lotto!M35&Lotto!N35","v":""},""]
[null,null,null,null,null,null,null,{"$f":"Lotto!M36&Lotto!N36","v":""},""]
[null,null,null,null,null,null,null,{"$f":"Lotto!M37&Lotto!N37","v":""},""]
[null,null,null,null,null,null,null,{"$f":"Lotto!M38&Lotto!N38","v":""},""]
[null,null,null,null,null,null,null,{"$f":"Lotto!M39&Lotto!N39","v":""},""]
[null,null,null,null,null,null,null,{"$f":"Lotto!M40&Lotto!N40","v":""},""]
[null,null,null,null,null,null,null,{"$f":"Lotto!M41&Lotto!N41","v":""},""]
[null,null,null,null,null,null,null,{"$f":"Lotto!M42&Lotto!N42","v":""},""]
[null,null,null,null,null,null,null,{"$f":"Lotto!M43&Lotto!N43","v":""},""]
{"$rows_left_out":24}