{"text_format":"1","workbook":"xlsx","n_sheets":2,"sheets":["Euromillions","Results"],"not_rendered":{"charts":0,"images":6,"macros":1,"external_links":0,"defined_names":2,"comments":0,"pivot_tables":0},"unopened":[],"bounds":{"document_bytes":16777216,"sheet_cells":100000,"rows_first":2000,"rows_last":500,"rows_between":2000,"halvings":0,"cell_chars":16384,"cell_head_chars":4096},"cells_cut":0,"cells_raw":0,"read":"whole","date_system":"1900"}

{"sheet":"Euromillions","index":0,"n_rows":67,"n_cols":16,"rows_kept":67,"cut":false,"hidden":false,"merged":[[1,18,2,18],[5,12,5,13],[6,9,6,10],[6,4,6,8],[5,4,5,10],[1,4,1,10],[2,4,2,8],[2,9,2,10]]}
[]
[null,null,null,null,{"$f":"TEXT(LEFT(HLOOKUP(\"DrawDate\",Results,2,0),10),\"dddd d mmm jjjj\")","v":"dinsdag 2 jun 2015"}]
[null,null,null,null,{"$f":"Results!V7","v":"Getallen"},null,null,null,null,{"$f":"Results!V8","v":"Sterren"},null,null,null,null,null,{"$f":"Results!V12","v":"Totaal"}]
[null,null,null,null,{"$f":"HLOOKUP(\"Number1\",Results!$A$1:$JC$2,2,0)","v":7},{"$f":"HLOOKUP(\"Number2\",Results!$A$1:$JC$2,2,0)","v":23},{"$f":"HLOOKUP(\"Number3\",Results!$A$1:$JC$2,2,0)","v":29},{"$f":"HLOOKUP(\"Number4\",Results!$A$1:$JC$2,2,0)","v":37},{"$f":"HLOOKUP(\"Number5\",Results!$A$1:$JC$2,2,0)","v":41},{"$f":"HLOOKUP(\"Star1\",Results!$A$1:$JC$2,2,0)","v":1},{"$f":"HLOOKUP(\"Star2\",Results!$A$1:$JC$2,2,0)","v":8},null,null,null,null,{"$f":"SUM(P8:P67)","v":0}]
[]
[null,null,null,null,{"$f":"Results!V9","v":"Mijn combinaties"},null,null,null,null,null,null,null,{"$f":"Results!V10","v":"Juiste combinaties"}]
[null,null,{"$f":"Results!V11","v":"Spel"},null,{"$f":"Results!V7","v":"Getallen"},null,null,null,null,{"$f":"Results!V8","v":"Sterren"},null,null,{"$f":"Results!V7","v":"Getallen"},{"$f":"Results!V8","v":"Sterren"}]
[null,null,1,null,null,null,null,null,null,null,null,null,{"$f":"IF(E8<>\"\",SUM(COUNTIF(E8:I8,$E$4:$I$4)),\"\")","v":""},{"$f":"IF(E8<>\"\",SUM(COUNTIF(J8:K8,$J$4:$K$4)),\"\")","v":""},null,{"$f":"IFERROR(HLOOKUP(Results!I5,Results,2,0),\"\")","v":""}]
[null,null,2,null,null,null,null,null,null,null,null,null,{"$f":"IF(E9<>\"\",SUM(COUNTIF(E9:I9,$E$4:$I$4)),\"\")","v":""},{"$f":"IF(E9<>\"\",SUM(COUNTIF(J9:K9,$J$4:$K$4)),\"\")","v":""},null,{"$f":"IFERROR(HLOOKUP(Results!I6,Results,2,0),\"\")","v":""}]
[null,null,3,null,null,null,null,null,null,null,null,null,{"$f":"IF(E10<>\"\",SUM(COUNTIF(E10:I10,$E$4:$I$4)),\"\")","v":""},{"$f":"IF(E10<>\"\",SUM(COUNTIF(J10:K10,$J$4:$K$4)),\"\")","v":""},null,{"$f":"IFERROR(HLOOKUP(Results!I7,Results,2,0),\"\")","v":""}]
[null,null,4,null,null,null,null,null,null,null,null,null,{"$f":"IF(E11<>\"\",SUM(COUNTIF(E11:I11,$E$4:$I$4)),\"\")","v":""},{"$f":"IF(E11<>\"\",SUM(COUNTIF(J11:K11,$J$4:$K$4)),\"\")","v":""},null,{"$f":"IFERROR(HLOOKUP(Results!I8,Results,2,0),\"\")","v":""}]
[null,null,5,null,null,null,null,null,null,null,null,null,{"$f":"IF(E12<>\"\",SUM(COUNTIF(E12:I12,$E$4:$I$4)),\"\")","v":""},{"$f":"IF(E12<>\"\",SUM(COUNTIF(J12:K12,$J$4:$K$4)),\"\")","v":""},null,{"$f":"IFERROR(HLOOKUP(Results!I9,Results,2,0),\"\")","v":""}]
[null,null,6,null,null,null,null,null,null,null,null,null,{"$f":"IF(E13<>\"\",SUM(COUNTIF(E13:I13,$E$4:$I$4)),\"\")","v":""},{"$f":"IF(E13<>\"\",SUM(COUNTIF(J13:K13,$J$4:$K$4)),\"\")","v":""},null,{"$f":"IFERROR(HLOOKUP(Results!I10,Results,2,0),\"\")","v":""}]
[null,null,7,null,null,null,null,null,null,null,null,null,{"$f":"IF(E14<>\"\",SUM(COUNTIF(E14:I14,$E$4:$I$4)),\"\")","v":""},{"$f":"IF(E14<>\"\",SUM(COUNTIF(J14:K14,$J$4:$K$4)),\"\")","v":""},null,{"$f":"IFERROR(HLOOKUP(Results!I11,Results,2,0),\"\")","v":""}]
[null,null,8,null,null,null,null,null,null,null,null,null,{"$f":"IF(E15<>\"\",SUM(COUNTIF(E15:I15,$E$4:$I$4)),\"\")","v":""},{"$f":"IF(E15<>\"\",SUM(COUNTIF(J15:K15,$J$4:$K$4)),\"\")","v":""},null,{"$f":"IFERROR(HLOOKUP(Results!I12,Results,2,0),\"\")","v":""}]
[null,null,9,null,null,null,null,null,null,null,null,null,{"$f":"IF(E16<>\"\",SUM(COUNTIF(E16:I16,$E$4:$I$4)),\"\")","v":""},{"$f":"IF(E16<>\"\",SUM(COUNTIF(J16:K16,$J$4:$K$4)),\"\")","v":""},null,{"$f":"IFERROR(HLOOKUP(Results!I13,Results,2,0),\"\")","v":""}]
[null,null,10,null,null,null,null,null,null,null,null,null,{"$f":"IF(E17<>\"\",SUM(COUNTIF(E17:I17,$E$4:$I$4)),\"\")","v":""},{"$f":"IF(E17<>\"\",SUM(COUNTIF(J17:K17,$J$4:$K$4)),\"\")","v":""},null,{"$f":"IFERROR(HLOOKUP(Results!I14,Results,2,0),\"\")","v":""}]
[null,null,11,null,null,null,null,null,null,null,null,null,{"$f":"IF(E18<>\"\",SUM(COUNTIF(E18:I18,$E$4:$I$4)),\"\")","v":""},{"$f":"IF(E18<>\"\",SUM(COUNTIF(J18:K18,$J$4:$K$4)),\"\")","v":""},null,{"$f":"IFERROR(HLOOKUP(Results!I15,Results,2,0),\"\")","v":""}]
[null,null,12,null,null,null,null,null,null,null,null,null,{"$f":"IF(E19<>\"\",SUM(COUNTIF(E19:I19,$E$4:$I$4)),\"\")","v":""},{"$f":"IF(E19<>\"\",SUM(COUNTIF(J19:K19,$J$4:$K$4)),\"\")","v":""},null,{"$f":"IFERROR(HLOOKUP(Results!I16,Results,2,0),\"\")","v":""}]
[null,null,13,null,null,null,null,null,null,null,null,null,{"$f":"IF(E20<>\"\",SUM(COUNTIF(E20:I20,$E$4:$I$4)),\"\")","v":""},{"$f":"IF(E20<>\"\",SUM(COUNTIF(J20:K20,$J$4:$K$4)),\"\")","v":""},null,{"$f":"IFERROR(HLOOKUP(Results!I17,Results,2,0),\"\")","v":""}]
[null,null,14,null,null,null,null,null,null,null,null,null,{"$f":"IF(E21<>\"\",SUM(COUNTIF(E21:I21,$E$4:$I$4)),\"\")","v":""},{"$f":"IF(E21<>\"\",SUM(COUNTIF(J21:K21,$J$4:$K$4)),\"\")","v":""},null,{"$f":"IFERROR(HLOOKUP(Results!I18,Results,2,0),\"\")","v":""}]
[null,null,15,null,null,null,null,null,null,null,null,null,{"$f":"IF(E22<>\"\",SUM(COUNTIF(E22:I22,$E$4:$I$4)),\"\")","v":""},{"$f":"IF(E22<>\"\",SUM(COUNTIF(J22:K22,$J$4:$K$4)),\"\")","v":""},null,{"$f":"IFERROR(HLOOKUP(Results!I19,Results,2,0),\"\")","v":""}]
[null,null,16,null,null,null,null,null,null,null,null,null,{"$f":"IF(E23<>\"\",SUM(COUNTIF(E23:I23,$E$4:$I$4)),\"\")","v":""},{"$f":"IF(E23<>\"\",SUM(COUNTIF(J23:K23,$J$4:$K$4)),\"\")","v":""},null,{"$f":"IFERROR(HLOOKUP(Results!I20,Results,2,0),\"\")","v":""}]
[null,null,17,null,null,null,null,null,null,null,null,null,{"$f":"IF(E24<>\"\",SUM(COUNTIF(E24:I24,$E$4:$I$4)),\"\")","v":""},{"$f":"IF(E24<>\"\",SUM(COUNTIF(J24:K24,$J$4:$K$4)),\"\")","v":""},null,{"$f":"IFERROR(HLOOKUP(Results!I21,Results,2,0),\"\")","v":""}]
[null,null,18,null,null,null,null,null,null,null,null,null,{"$f":"IF(E25<>\"\",SUM(COUNTIF(E25:I25,$E$4:$I$4)),\"\")","v":""},{"$f":"IF(E25<>\"\",SUM(COUNTIF(J25:K25,$J$4:$K$4)),\"\")","v":""},null,{"$f":"IFERROR(HLOOKUP(Results!I22,Results,2,0),\"\")","v":""}]
[null,null,19,null,null,null,null,null,null,null,null,null,{"$f":"IF(E26<>\"\",SUM(COUNTIF(E26:I26,$E$4:$I$4)),\"\")","v":""},{"$f":"IF(E26<>\"\",SUM(COUNTIF(J26:K26,$J$4:$K$4)),\"\")","v":""},null,{"$f":"IFERROR(HLOOKUP(Results!I23,Results,2,0),\"\")","v":""}]
[null,null,20,null,null,null,null,null,null,null,null,null,{"$f":"IF(E27<>\"\",SUM(COUNTIF(E27:I27,$E$4:$I$4)),\"\")","v":""},{"$f":"IF(E27<>\"\",SUM(COUNTIF(J27:K27,$J$4:$K$4)),\"\")","v":""},null,{"$f":"IFERROR(HLOOKUP(Results!I24,Results,2,0),\"\")","v":""}]
[null,null,21,null,null,null,null,null,null,null,null,null,{"$f":"IF(E28<>\"\",SUM(COUNTIF(E28:I28,$E$4:$I$4)),\"\")","v":""},{"$f":"IF(E28<>\"\",SUM(COUNTIF(J28:K28,$J$4:$K$4)),\"\")","v":""},null,{"$f":"IFERROR(HLOOKUP(Results!I25,Results,2,0),\"\")","v":""}]
[null,null,22,null,null,null,null,null,null,null,null,null,{"$f":"IF(E29<>\"\",SUM(COUNTIF(E29:I29,$E$4:$I$4)),\"\")","v":""},{"$f":"IF(E29<>\"\",SUM(COUNTIF(J29:K29,$J$4:$K$4)),\"\")","v":""},null,{"$f":"IFERROR(HLOOKUP(Results!I26,Results,2,0),\"\")","v":""}]
[null,null,23,null,null,null,null,null,null,null,null,null,{"$f":"IF(E30<>\"\",SUM(COUNTIF(E30:I30,$E$4:$I$4)),\"\")","v":""},{"$f":"IF(E30<>\"\",SUM(COUNTIF(J30:K30,$J$4:$K$4)),\"\")","v":""},null,{"$f":"IFERROR(HLOOKUP(Results!I27,Results,2,0),\"\")","v":""}]
[null,null,24,null,null,null,null,null,null,null,null,null,{"$f":"IF(E31<>\"\",SUM(COUNTIF(E31:I31,$E$4:$I$4)),\"\")","v":""},{"$f":"IF(E31<>\"\",SUM(COUNTIF(J31:K31,$J$4:$K$4)),\"\")","v":""},null,{"$f":"IFERROR(HLOOKUP(Results!I28,Results,2,0),\"\")","v":""}]
[null,null,25,null,null,null,null,null,null,null,null,null,{"$f":"IF(E32<>\"\",SUM(COUNTIF(E32:I32,$E$4:$I$4)),\"\")","v":""},{"$f":"IF(E32<>\"\",SUM(COUNTIF(J32:K32,$J$4:$K$4)),\"\")","v":""},null,{"$f":"IFERROR(HLOOKUP(Results!I29,Results,2,0),\"\")","v":""}]
[null,null,26,null,null,null,null,null,null,null,null,null,{"$f":"IF(E33<>\"\",SUM(COUNTIF(E33:I33,$E$4:$I$4)),\"\")","v":""},{"$f":"IF(E33<>\"\",SUM(COUNTIF(J33:K33,$J$4:$K$4)),\"\")","v":""},null,{"$f":"IFERROR(HLOOKUP(Results!I30,Results,2,0),\"\")","v":""}]
[null,null,27,null,null,null,null,null,null,null,null,null,{"$f":"IF(E34<>\"\",SUM(COUNTIF(E34:I34,$E$4:$I$4)),\"\")","v":""},{"$f":"IF(E34<>\"\",SUM(COUNTIF(J34:K34,$J$4:$K$4)),\"\")","v":""},null,{"$f":"IFERROR(HLOOKUP(Results!I31,Results,2,0),\"\")","v":""}]
[null,null,28,null,null,null,null,null,null,null,null,null,{"$f":"IF(E35<>\"\",SUM(COUNTIF(E35:I35,$E$4:$I$4)),\"\")","v":""},{"$f":"IF(E35<>\"\",SUM(COUNTIF(J35:K35,$J$4:$K$4)),\"\")","v":""},null,{"$f":"IFERROR(HLOOKUP(Results!I32,Results,2,0),\"\")","v":""}]
[null,null,29,null,null,null,null,null,null,null,null,null,{"$f":"IF(E36<>\"\",SUM(COUNTIF(E36:I36,$E$4:$I$4)),\"\")","v":""},{"$f":"IF(E36<>\"\",SUM(COUNTIF(J36:K36,$J$4:$K$4)),\"\")","v":""},null,{"$f":"IFERROR(HLOOKUP(Results!I33,Results,2,0),\"\")","v":""}]
[null,null,30,null,null,null,null,null,null,null,null,null,{"$f":"IF(E37<>\"\",SUM(COUNTIF(E37:I37,$E$4:$I$4)),\"\")","v":""},{"$f":"IF(E37<>\"\",SUM(COUNTIF(J37:K37,$J$4:$K$4)),\"\")","v":""},null,{"$f":"IFERROR(HLOOKUP(Results!I34,Results,2,0),\"\")","v":""}]
[null,null,31,null,null,null,null,null,null,null,null,null,{"$f":"IF(E38<>\"\",SUM(COUNTIF(E38:I38,$E$4:$I$4)),\"\")","v":""},{"$f":"IF(E38<>\"\",SUM(COUNTIF(J38:K38,$J$4:$K$4)),\"\")","v":""},null,{"$f":"IFERROR(HLOOKUP(Results!I35,Results,2,0),\"\")","v":""}]
[null,null,32,null,null,null,null,null,null,null,null,null,{"$f":"IF(E39<>\"\",SUM(COUNTIF(E39:I39,$E$4:$I$4)),\"\")","v":""},{"$f":"IF(E39<>\"\",SUM(COUNTIF(J39:K39,$J$4:$K$4)),\"\")","v":""},null,{"$f":"IFERROR(HLOOKUP(Results!I36,Results,2,0),\"\")","v":""}]
[null,null,33,null,null,null,null,null,null,null,null,null,{"$f":"IF(E40<>\"\",SUM(COUNTIF(E40:I40,$E$4:$I$4)),\"\")","v":""},{"$f":"IF(E40<>\"\",SUM(COUNTIF(J40:K40,$J$4:$K$4)),\"\")","v":""},null,{"$f":"IFERROR(HLOOKUP(Results!I37,Results,2,0),\"\")","v":""}]
{"$rows_left_out":28}
{"sheet":"Results","index":1,"n_rows":64,"n_cols":263,"rows_kept":64,"cut":false,"hidden":true,"merged":[]}
["X",{"$f":"A2","v":"{\"Succeeded\""},{"$f":"B2","v":true},"Message","null","Data","{\"DrawType\"","EuroMillionsDraw","Draw","{\"Id\"",2798,"DrawDate","2015-06-02T19:59:59","NextDraw","2015-06-05T19:59:59","Stats","null","Number1",7,"Number2",23,"Number3",29,"Number4",37,"Number5",41,"Star1",1,"Star2",8,"Rank1WinnersBE",0,"Rank2WinnersBE",1,"Rank3WinnersBE",1,"Rank4WinnersBE",3,"Rank5WinnersBE",66,"Rank6WinnersBE",118,"Rank7WinnersBE",118,"Rank8WinnersBE",1620,"Rank9WinnersBE",2458,"Rank10WinnersBE",5153,"Rank11WinnersBE",8324,"Rank12WinnersBE",31636,"Rank13WinnersBE",66514,"Rank1WinnersEU",0,"Rank2WinnersEU",2,"Rank3WinnersEU",5,"Rank4WinnersEU",37,"Rank5WinnersEU",{"$f":"BN2","v":733},"Rank6WinnersEU",1638,"Rank7WinnersEU",1545,"Rank8WinnersEU",23447,"Rank9WinnersEU",31421,"Rank10WinnersEU",69388,"Rank11WinnersEU",124715,"Rank12WinnersEU",454533,"Rank13WinnersEU",972232,"Rank1Gains",0,"Rank2Gains",510830.8,"Rank3Gains",68110.7,"Rank4Gains",4602,"Rank5Gains",203.2,"Rank6Gains",90.9,"Rank7Gains",68.8,"Rank8Gains",20.8,"Rank9Gains",14.9,"Rank10Gains",11.3,"Rank11Gains",11,"Rank12Gains",8.1999999999999993,"Rank13Gains",3.9,"TotalPlayersBE",432328,"TotalMoneyBE",2741606,"EstimatedJackpot","0.0000","NextJackpot",100000000,"IsNewDraw",false,"RollDown",false,"Results","[7",23,29,37,41,1,"8]","EuroMillionsGainDistribution",{"$f":"DZ2","v":"[{\"Stars\""},2,"TotalWinners",0,"Title",5,"Winners",0,"Gains","0.0000}","{\"Stars\"",1,"TotalWinners",2,"Title",5,"Winners",1,"Gains","510830.8000}","{\"Stars\"",0,"TotalWinners",5,"Title",5,"Winners",1,"Gains","68110.7000}","{\"Stars\"",2,"TotalWinners",37,"Title",4,"Winners",3,"Gains","4602.0000}","{\"Stars\"",1,"TotalWinners",733,"Title",4,"Winners",66,"Gains","203.2000}","{\"Stars\"",0,"TotalWinners",1638,"Title",4,"Winners",118,"Gains","90.9000}","{\"Stars\"",2,"TotalWinners",1545,{"$f":"GL2","v":"Title"},3,"Winners",118,"Gains","68.8000}","{\"Stars\"",2,"TotalWinners",23447,"Title",2,"Winners",1620,"Gains","20.8000}","{\"Stars\"",1,"TotalWinners",31421,"Title",3,"Winners",2458,"Gains","14.9000}","{\"Stars\"",0,"TotalWinners",69388,"Title",3,"Winners",5153,"Gains","11.3000}","{\"Stars\"",2,"TotalWinners",124715,"Title",1,"Winners",8324,"Gains","11.0000}","{\"Stars\"",1,"TotalWinners",454533,"Title",2,"Winners",31636,"Gains","8.2000}","{\"Stars\"",0,"TotalWinners",972232,"Title",2,"Winners",66514,{"$f":"IX2","v":"Gains"},"3.9000}]}","VideoUrls","https://nlotstoragemedia01.blob.core.windows.net:443/asset-fed43a5d-1500-80c3-28a5-f1e509658ee5/20150602_NL_EUROMILLIONS.mp4?sv=2012-02-12&sr=c&si=7e0108b8-7848-45e4-8d6c-790a241056d0&sig=OLbJkVOllSkHuaWLraPcp2KnSkADhLtpxWeY8wpLQCc%3D&se=2015-10-20T20%3A29%3A40Z}","Exception"]
["{\"Succeeded\"",true,"Message","null","Data","{\"DrawType\"","EuroMillionsDraw","Draw","{\"Id\"",2798,"DrawDate","2015-06-02T19:59:59","NextDraw","2015-06-05T19:59:59","Stats","null","Number1",7,"Number2",23,"Number3",29,"Number4",37,"Number5",41,"Star1",1,"Star2",8,"Rank1WinnersBE",0,"Rank2WinnersBE",1,"Rank3WinnersBE",1,"Rank4WinnersBE",3,"Rank5WinnersBE",66,"Rank6WinnersBE",118,"Rank7WinnersBE",118,"Rank8WinnersBE",1620,"Rank9WinnersBE",2458,"Rank10WinnersBE",5153,"Rank11WinnersBE",8324,"Rank12WinnersBE",31636,"Rank13WinnersBE",66514,"Rank1WinnersEU",0,"Rank2WinnersEU",2,"Rank3WinnersEU",5,"Rank4WinnersEU",37,"Rank5WinnersEU",733,"Rank6WinnersEU",1638,"Rank7WinnersEU",1545,"Rank8WinnersEU",23447,"Rank9WinnersEU",31421,"Rank10WinnersEU",69388,"Rank11WinnersEU",124715,"Rank12WinnersEU",454533,"Rank13WinnersEU",972232,"Rank1Gains",0,"Rank2Gains",510830.8,"Rank3Gains",68110.7,"Rank4Gains",4602,"Rank5Gains",203.2,"Rank6Gains",90.9,"Rank7Gains",68.8,"Rank8Gains",20.8,"Rank9Gains",14.9,"Rank10Gains",11.3,"Rank11Gains",11,"Rank12Gains",8.1999999999999993,"Rank13Gains",3.9,"TotalPlayersBE",432328,"TotalMoneyBE",2741606,"EstimatedJackpot","0.0000","NextJackpot",100000000,"IsNewDraw",false,"RollDown",false,"Results","[7",23,29,37,41,1,"8]","EuroMillionsGainDistribution","[{\"Stars\"",2,"TotalWinners",0,"Title",5,"Winners",0,"Gains","0.0000}","{\"Stars\"",1,"TotalWinners",2,"Title",5,"Winners",1,"Gains","510830.8000}","{\"Stars\"",0,"TotalWinners",5,"Title",5,"Winners",1,"Gains","68110.7000}","{\"Stars\"",2,"TotalWinners",37,"Title",4,"Winners",3,"Gains","4602.0000}","{\"Stars\"",1,"TotalWinners",733,"Title",4,"Winners",66,"Gains","203.2000}","{\"Stars\"",0,"TotalWinners",1638,"Title",4,"Winners",118,"Gains","90.9000}","{\"Stars\"",2,"TotalWinners",1545,"Title",3,"Winners",118,"Gains","68.8000}","{\"Stars\"",2,"TotalWinners",23447,"Title",2,"Winners",1620,"Gains","20.8000}","{\"Stars\"",1,"TotalWinners",31421,"Title",3,"Winners",2458,"Gains","14.9000}","{\"Stars\"",0,"TotalWinners",69388,"Title",3,"Winners",5153,"Gains","11.3000}","{\"Stars\"",2,"TotalWinners",124715,"Title",1,"Winners",8324,"Gains","11.0000}","{\"Stars\"",1,"TotalWinners",454533,"Title",2,"Winners",31636,"Gains","8.2000}","{\"Stars\"",0,"TotalWinners",972232,"Title",2,"Winners",66514,"Gains","3.9000}]}","VideoUrls","https://nlotstoragemedia01.blob.core.windows.net:443/asset-fed43a5d-1500-80c3-28a5-f1e509658ee5/20150602_NL_EUROMILLIONS.mp4?sv=2012-02-12&sr=c&si=7e0108b8-7848-45e4-8d6c-790a241056d0&sig=OLbJkVOllSkHuaWLraPcp2KnSkADhLtpxWeY8wpLQCc%3D&se=2015-10-20T20%3A29%3A40Z}","Exception","null}"]
[]
[]
[{"$f":"IF(WEEKDAY(TODAY(),2)=1,TODAY()-3,IF(WEEKDAY(TODAY(),2)=2,TODAY()-4,IF(WEEKDAY(TODAY(),2)=3,TODAY()-1,IF(WEEKDAY(TODAY(),2)=4,TODAY()-2,IF(WEEKDAY(TODAY(),2)=5,TODAY()-3,IF(WEEKDAY(TODAY(),2)=6,TODAY()-1,TODAY()-2))))))","v":"2015-06-02"},null,null,null,null,null,null,{"$f":"Euromillions!M8&Euromillions!N8","v":""},{"$f":"IFERROR(VLOOKUP(H5,Omzetting,2,0),\"\")","v":""},null,null,"52","Rank1Gains"]
[null,null,null,null,null,null,null,{"$f":"Euromillions!M9&Euromillions!N9","v":""},"",null,null,"51","Rank2Gains",null,"NL","FR","DE","EN","ES","PT"]
[null,null,null,null,null,null,null,{"$f":"Euromillions!M10&Euromillions!N10","v":""},"",null,null,"50","Rank3Gains",null,"Getallen","numéros","Zahlen","Numbers","números","números",null,"Getallen"]
[null,null,null,null,null,null,null,{"$f":"Euromillions!M11&Euromillions!N11","v":""},"",null,null,"42","Rank4Gains",null,"Sterren","Étoiles ","Sterne","Stars","Estrellas","Estrelas",null,"Sterren"]
[null,null,null,null,null,null,null,{"$f":"Euromillions!M12&Euromillions!N12","v":""},"",null,null,"41","Rank5Gains",null,"Mijn combinaties","Mes combinaisons","Meine Kombinationen","My combinations","Mis combinaciones","Minhas combinações",null,"Mijn combinaties"]
[null,null,null,null,null,null,null,{"$f":"Euromillions!M13&Euromillions!N13","v":""},"",null,null,"40","Rank6Gains",null,"Juiste combinaties","Combinaisons exact","Richtigen Kombinationen","Right combinations","combinaciones exactas","combinações exatas",null,"Juiste combinaties"]
[null,null,null,null,null,null,null,{"$f":"Euromillions!M14&Euromillions!N14","v":""},"",null,null,"32","Rank7Gains",null,"Spel","Jeu","Spiel","Game","Juego ","Jogo",null,"Spel"]
[null,null,null,null,null,null,null,{"$f":"Euromillions!M15&Euromillions!N15","v":""},"",null,null,"22","Rank8Gains",null,"Totaal","Total","Gesamt","Total","Total","Total",null,"Totaal"]
[null,null,null,null,null,null,null,{"$f":"Euromillions!M16&Euromillions!N16","v":""},"",null,null,"31","Rank9Gains",null,"Laatste resultaten downloaden","Télécharger le dernier résultat","Neuesten ergebnis downloaden","Download latest results","Descargar último resultado","Baixar o mais recente resultado",null,"Laatste resultaten downloaden","Help"]
[null,null,null,null,null,null,null,{"$f":"Euromillions!M17&Euromillions!N17","v":""},"",null,null,"30","Rank10Gains"]
[null,null,null,null,null,null,null,{"$f":"Euromillions!M18&Euromillions!N18","v":""},"",null,null,"12","Rank11Gains"]
[null,null,null,null,null,null,null,{"$f":"Euromillions!M19&Euromillions!N19","v":""},"",null,null,"21","Rank12Gains"]
[null,null,null,null,null,null,null,{"$f":"Euromillions!M20&Euromillions!N20","v":""},"",null,null,"20","Rank13Gains"]
[null,null,null,null,null,null,null,{"$f":"Euromillions!M21&Euromillions!N21","v":""},""]
[null,null,null,null,null,null,null,{"$f":"Euromillions!M22&Euromillions!N22","v":""},""]
[null,null,null,null,null,null,null,{"$f":"Euromillions!M23&Euromillions!N23","v":""},""]
[null,null,null,null,null,null,null,{"$f":"Euromillions!M24&Euromillions!N24","v":""},""]
[null,null,null,null,null,null,null,{"$f":"Euromillions!M25&Euromillions!N25","v":""},""]
[null,null,null,null,null,null,null,{"$f":"Euromillions!M26&Euromillions!N26","v":""},""]
[null,null,null,null,null,null,null,{"$f":"Euromillions!M27&Euromillions!N27","v":""},""]
[null,null,null,null,null,null,null,{"$f":"Euromillions!M28&Euromillions!N28","v":""},""]
[null,null,null,null,null,null,null,{"$f":"Euromillions!M29&Euromillions!N29","v":""},""]
[null,null,null,null,null,null,null,{"$f":"Euromillions!M30&Euromillions!N30","v":""},""]
[null,null,null,null,null,null,null,{"$f":"Euromillions!M31&Euromillions!N31","v":""},""]
[null,null,null,null,null,null,null,{"$f":"Euromillions!M32&Euromillions!N32","v":""},""]
[null,null,null,null,null,null,null,{"$f":"Euromillions!M33&Euromillions!N33","v":""},""]
[null,null,null,null,null,null,null,{"$f":"Euromillions!M34&Euromillions!N34","v":""},""]
[null,null,null,null,null,null,null,{"$f":"Euromillions!M35&Euromillions!N35","v":""},""]
[null,null,null,null,null,null,null,{"$f":"Euromillions!M36&Euromillions!N36","v":""},""]
[null,null,null,null,null,null,null,{"$f":"Euromillions!M37&Euromillions!N37","v":""},""]
[null,null,null,null,null,null,null,{"$f":"Euromillions!M38&Euromillions!N38","v":""},""]
[null,null,null,null,null,null,null,{"$f":"Euromillions!M39&Euromillions!N39","v":""},""]
[null,null,null,null,null,null,null,{"$f":"Euromillions!M40&Euromillions!N40","v":""},{"$f":"IFERROR(VLOOKUP(H37,Omzetting,2,0),\"\")","v":""}]
[null,null,null,null,null,null,null,{"$f":"Euromillions!M41&Euromillions!N41","v":""},""]
[null,null,null,null,null,null,null,{"$f":"Euromillions!M42&Euromillions!N42","v":""},""]
[null,null,null,null,null,null,null,{"$f":"Euromillions!M43&Euromillions!N43","v":""},""]
{"$rows_left_out":24}