{"text_format":"1","workbook":"xlsx","n_sheets":6,"sheets":["data","1e kwartaal","2e kwartaal","3e kwartaal","4e kwartaal","Formuleblad"],"not_rendered":{"charts":0,"images":0,"macros":1,"external_links":0,"defined_names":28,"comments":0,"pivot_tables":0},"unopened":[],"bounds":{"document_bytes":16777216,"sheet_cells":100000,"rows_first":2000,"rows_last":500,"rows_between":2000,"halvings":0,"cell_chars":16384,"cell_head_chars":4096},"cells_cut":0,"cells_raw":0,"read":"whole","date_system":"1900"}

{"sheet":"data","index":0,"n_rows":81,"n_cols":27,"rows_kept":81,"cut":false,"hidden":false,"merged":[[49,3,49,4],[49,5,49,6],[49,7,49,8],[49,9,49,10],[36,7,36,9],[37,7,37,9],[38,7,38,9],[49,25,49,26],[49,11,49,12],[49,13,49,14],[49,15,49,16],[49,17,49,18],[49,19,49,20],[49,21,49,22],[49,23,49,24]]}
[{"$f":"A2-1","v":2015}]
[{"$f":"YEAR(NOW())","v":2016},null,"Het huidige jaar staat altijd in het midden."]
[{"$f":"A2+1","v":2017},null,{"$f":"\"Dus volgend jaar staat \" &A2+1 &\" in het midden.\"","v":"Dus volgend jaar staat 2017 in het midden."}]
[]
["Zijn er feestdagen die je niet nodig bebt, zet dan een spatie voor de formule in kolom A"]
[]
[{"$f":"DATE(jaar,1,1)","v":"2016-01-01"},"Nieuwjaarsdag"]
[" =DATUM(jaar;1;1+((1-(1>WEEKDAG(DATUM(jaar;1;1);2)))*7)+(1-WEEKDAG(DATUM(jaar;1;1);2)))","Driekoningen (N)"]
[" =DATUM(jaar;1;6)","Driekoningen (B)"]
[" =DATUM(jaar;2;14)","Sint-Valentijn"]
[" =AFRONDEN.BENEDEN(DAG(MINUUT(jaar/38)/2+56)&\"/5/\"&jaar;7)-81","Vastenavond (r.-k.)"]
[" =AFRONDEN.BENEDEN(DAG(MINUUT(jaar/38)/2+56)&\"/5/\"&jaar;7)-80","Aswoensdag (r.-k.)"]
[" =DATUM(jaar;3;12)","Biddag voor gewas en arbeid (pr.)"]
[" =DATUM(jaar;3;25)","Maria Boodschap (r.-k.)"]
[" =AFRONDEN.BENEDEN(DAG(MINUUT(jaar/38)/2+56)&\"/5/\"&jaar;7)-37","Witte Donderdag"]
[{"$f":"FLOOR(DAY(MINUTE(jaar/38)/2+56)&\"/5/\"&jaar,7)-36","v":"2016-03-25"},"Goede Vrijdag"]
[{"$f":"FLOOR(DAY(MINUTE(jaar/38)/2+56)&\"/5/\"&jaar,7)-34","v":"2016-03-27"},"1e Paasdag"]
[{"$f":"FLOOR(DAY(MINUTE(jaar/38)/2+56)&\"/5/\"&jaar,7)-33","v":"2016-03-28"},"2e paasdag"]
[{"$f":"IF(WEEKDAY(DATE(jaar,4,30))*1,DATE(jaar,4,27),DATE(jaar,4,30))","v":"2016-04-27"},"Koningsdag (N)"]
[" =DATUM(jaar;5;1)","Dag van de arbeid (B)"]
[{"$f":"DATE(jaar,5,5)","v":"2016-05-05"},"Bevreidingsdag (N)"]
[{"$f":"FLOOR(DAY(MINUTE(jaar/38)/2+56)&\"/5/\"&jaar,7)+5","v":"2016-05-05"},"Hemelvaartsdag"]
[" =DATUM(jaar;5;25)","Trinitatis (pr.)"]
[{"$f":"FLOOR(DAY(MINUTE(jaar/38)/2+56)&\"/5/\"&jaar,7)+15","v":"2016-05-15"},"1e Pinsterdag"]
[{"$f":"FLOOR(DAY(MINUTE(jaar/38)/2+56)&\"/5/\"&jaar,7)+16","v":"2016-05-16"},"2e Pinksterdag"]
[" =DATUM(jaar;6;1)","Sacramentsdag (r.-k.)"]
[" =DATUM(jaar;6;6)","H. Hartfeest (r.-k.)"]
[" =DATUM(jaar;7;11)","Ned.talige Cult. Gem. (B)"]
[" =DATUM(jaar;7;21)","Nationale feestdag (B)"]
[" =DATUM(jaar;8;15)","Maria-ten-hemelopneming (r.-k.)"]
[{"$f":"DATE(jaar,9,1)+IF(3<WEEKDAY(DATE(jaar,9,1)),7-WEEKDAY(DATE(jaar,9,1))+3,3-WEEKDAY(DATE(jaar,9,1)))+((3-1)*7)","v":"2016-09-20"},"Prinsjesdag (N)"]
[" =DATUM(jaar;9;27)","Franstalige Cult. Gem. (B)"]
[" =DATUM(jaar;12;26)-63-WEEKDAG(DATUM(jaar;12;26);2)","Missiezondag (r.-k.)"]
[" =DATUM(jaar;10;31)","Hervormingsdag (pr.)"]
[" =DATUM(jaar;11;1)","Allerheiligen (r.-k.)"]
[" =DATUM(jaar;11;2)","Allerzielen (r.-k.)"]
[" =F36=A38=DATUM(jaar;11;5)","Dankdag voor gewas en arbeid (pr.)"]
[" =DATUM(jaar;11;11)","Wapenstilstandsdag 1918 (B)"]
[" =DATUM(jaar;11;15)","Feest van de dynastie (B)"]
[" =DATUM(jaar;12;26)-28-WEEKDAG(DATUM(jaar;12;26);2)","1e Adventszondag"]
[" =DATUM(jaar;11;23)","Christus Koning (r.-k.)"]
[{"$f":"DATE(jaar,12,5)","v":"2016-12-05"},"Sinterklaas (N)"]
[" =DATUM(jaar;12;6)","Sinterklaas (B)"]
[" =DATUM(jaar;12;8)","Maria onbevlekte ontvangenis (r.-k.)",null,null,null,null,null,null,null,null,null,null,null,null,null," =ALS(ISFOUT(KLEINSTE($B$2:$AF$2;RIJ()-4));\"\";KLEINSTE($B$2:$AF$2;RIJ()-4))"]
[{"$f":"DATE(jaar,12,25)","v":"2016-12-25"},"1e Kerstdag"]
[{"$f":"DATE(jaar,12,26)","v":"2016-12-26"},"2e Kerstdag",null,null,null,null,null,null,null,null,null,null,null,null,null,{"$f":"SMALL(jan,1)","v":"2016-01-01"}]
[{"$f":"DATE(jaar,12,31)","v":"2016-12-31"},"Oudejaarsdag",null,null,null,null,null,null,null,null,null,null,null,null,null,{"$f":"SMALL(jan,2)","v":{"$error":"#NUM!"}}]
[]
[]
[null,null,null,"januari",null,"februari",null,"maart",null,"april",null,"mei",null,"juni",null,"juli",null,"augustus",null,"september",null,"oktober",null,"november",null,"december"]
[null,null,null,{"$f":"DATE(jaar,1,ROW()-50)","v":"2016-01-01"},{"$f":"IF(NOT(ISERROR(VLOOKUP(D51,feestdagen,1,0))),D51,\"\")","v":"2016-01-01"},{"$f":"DATE(jaar,2,ROW()-50)","v":"2016-02-01"},{"$f":"IF(NOT(ISERROR(VLOOKUP(F51,feestdagen,1,0))),F51,\"\")","v":""},{"$f":"DATE(jaar,3,ROW()-50)","v":"2016-03-01"},{"$f":"IF(NOT(ISERROR(VLOOKUP(H51,feestdagen,1,0))),H51,\"\")","v":""},{"$f":"DATE(jaar,4,ROW()-50)","v":"2016-04-01"},{"$f":"IF(NOT(ISERROR(VLOOKUP(J51,feestdagen,1,0))),J51,\"\")","v":""},{"$f":"DATE(jaar,5,ROW()-50)","v":"2016-05-01"},{"$f":"IF(NOT(ISERROR(VLOOKUP(L51,feestdagen,1,0))),L51,\"\")","v":""},{"$f":"DATE(jaar,6,ROW()-50)","v":"2016-06-01"},{"$f":"IF(NOT(ISERROR(VLOOKUP(N51,feestdagen,1,0))),N51,\"\")","v":""},{"$f":"DATE(jaar,7,ROW()-50)","v":"2016-07-01"},{"$f":"IF(NOT(ISERROR(VLOOKUP(P51,feestdagen,1,0))),P51,\"\")","v":""},{"$f":"DATE(jaar,8,ROW()-50)","v":"2016-08-01"},{"$f":"IF(NOT(ISERROR(VLOOKUP(R51,feestdagen,1,0))),R51,\"\")","v":""},{"$f":"DATE(jaar,9,ROW()-50)","v":"2016-09-01"},{"$f":"IF(NOT(ISERROR(VLOOKUP(T51,feestdagen,1,0))),T51,\"\")","v":""},{"$f":"DATE(jaar,10,ROW()-50)","v":"2016-10-01"},{"$f":"IF(NOT(ISERROR(VLOOKUP(V51,feestdagen,1,0))),V51,\"\")","v":""},{"$f":"DATE(jaar,11,ROW()-50)","v":"2016-11-01"},{"$f":"IF(NOT(ISERROR(VLOOKUP(X51,feestdagen,1,0))),X51,\"\")","v":""},{"$f":"DATE(jaar,12,ROW()-50)","v":"2016-12-01"},{"$f":"IF(NOT(ISERROR(VLOOKUP(Z51,feestdagen,1,0))),Z51,\"\")","v":""}]
[null,null,null,{"$f":"D51+1","v":"2016-01-02"},"",{"$f":"F51+1","v":"2016-02-02"},"",{"$f":"H51+1","v":"2016-03-02"},"",{"$f":"J51+1","v":"2016-04-02"},"","2016-05-02","","2016-06-02","","2016-07-02","","2016-08-02","","2016-09-02","","2016-10-02","","2016-11-02","","2016-12-02",""]
[null,null,null,{"$f":"D52+1","v":"2016-01-03"},"",{"$f":"F52+1","v":"2016-02-03"},"",{"$f":"H52+1","v":"2016-03-03"},"",{"$f":"J52+1","v":"2016-04-03"},"",{"$f":"L52+1","v":"2016-05-03"},"",{"$f":"N52+1","v":"2016-06-03"},"",{"$f":"P52+1","v":"2016-07-03"},"",{"$f":"R52+1","v":"2016-08-03"},"",{"$f":"T52+1","v":"2016-09-03"},"",{"$f":"V52+1","v":"2016-10-03"},"",{"$f":"X52+1","v":"2016-11-03"},"",{"$f":"Z52+1","v":"2016-12-03"},""]
[null,null,null,"2016-01-04","","2016-02-04","","2016-03-04","","2016-04-04","","2016-05-04","","2016-06-04","","2016-07-04","","2016-08-04","","2016-09-04","","2016-10-04","","2016-11-04","","2016-12-04",""]
[null,null,null,"2016-01-05","","2016-02-05","","2016-03-05","","2016-04-05","","2016-05-05","2016-05-05","2016-06-05","","2016-07-05","","2016-08-05","","2016-09-05","","2016-10-05","","2016-11-05","","2016-12-05","2016-12-05"]
[null,null,null,"2016-01-06","","2016-02-06","","2016-03-06","","2016-04-06","","2016-05-06","","2016-06-06","","2016-07-06","","2016-08-06","","2016-09-06","","2016-10-06","","2016-11-06","","2016-12-06",""]
[null,null,null,"2016-01-07","","2016-02-07","","2016-03-07","","2016-04-07","","2016-05-07","","2016-06-07","","2016-07-07","","2016-08-07","","2016-09-07","","2016-10-07","","2016-11-07","","2016-12-07",""]
[null,null,null,"2016-01-08","","2016-02-08","","2016-03-08","","2016-04-08","","2016-05-08","","2016-06-08","","2016-07-08","","2016-08-08","","2016-09-08","","2016-10-08","","2016-11-08","","2016-12-08",""]
[null,null,null,"2016-01-09","","2016-02-09","","2016-03-09","","2016-04-09","","2016-05-09","","2016-06-09","","2016-07-09","","2016-08-09","","2016-09-09","","2016-10-09","","2016-11-09","","2016-12-09",""]
[null,null,null,"2016-01-10","","2016-02-10","","2016-03-10","","2016-04-10","","2016-05-10","","2016-06-10","","2016-07-10","","2016-08-10","","2016-09-10","","2016-10-10","","2016-11-10","","2016-12-10",""]
[null,null,null,"2016-01-11","","2016-02-11","","2016-03-11","","2016-04-11","","2016-05-11","","2016-06-11","","2016-07-11","","2016-08-11","","2016-09-11","","2016-10-11","","2016-11-11","","2016-12-11",""]
[null,null,null,"2016-01-12","","2016-02-12","","2016-03-12","","2016-04-12","","2016-05-12","","2016-06-12","","2016-07-12","","2016-08-12","","2016-09-12","","2016-10-12","","2016-11-12","","2016-12-12",""]
[null,null,null,"2016-01-13","","2016-02-13","","2016-03-13","","2016-04-13","","2016-05-13","","2016-06-13","","2016-07-13","","2016-08-13","","2016-09-13","","2016-10-13","","2016-11-13","","2016-12-13",""]
[null,null,null,"2016-01-14","","2016-02-14","","2016-03-14","","2016-04-14","","2016-05-14","","2016-06-14","","2016-07-14","","2016-08-14","","2016-09-14","","2016-10-14","","2016-11-14","","2016-12-14",""]
[null,null,null,"2016-01-15","","2016-02-15","","2016-03-15","","2016-04-15","","2016-05-15","2016-05-15","2016-06-15","","2016-07-15","","2016-08-15","","2016-09-15","","2016-10-15","","2016-11-15","","2016-12-15",""]
[null,null,null,"2016-01-16","","2016-02-16","","2016-03-16","","2016-04-16","","2016-05-16","2016-05-16","2016-06-16","","2016-07-16","","2016-08-16","","2016-09-16","","2016-10-16","","2016-11-16","","2016-12-16",""]
[null,null,null,"2016-01-17","","2016-02-17","","2016-03-17","","2016-04-17","","2016-05-17","","2016-06-17","","2016-07-17","","2016-08-17","","2016-09-17","","2016-10-17","","2016-11-17","","2016-12-17",""]
[null,null,null,"2016-01-18","","2016-02-18","","2016-03-18","","2016-04-18","","2016-05-18","","2016-06-18","","2016-07-18","","2016-08-18","","2016-09-18","","2016-10-18","","2016-11-18","","2016-12-18",""]
[null,null,null,"2016-01-19","","2016-02-19","","2016-03-19","","2016-04-19","","2016-05-19","","2016-06-19","","2016-07-19","","2016-08-19","","2016-09-19","","2016-10-19","","2016-11-19","","2016-12-19",""]
[null,null,null,"2016-01-20","","2016-02-20","","2016-03-20","","2016-04-20","","2016-05-20","","2016-06-20","","2016-07-20","","2016-08-20","","2016-09-20","2016-09-20","2016-10-20","","2016-11-20","","2016-12-20",""]
[null,null,null,"2016-01-21","","2016-02-21","","2016-03-21","","2016-04-21","","2016-05-21","","2016-06-21","","2016-07-21","","2016-08-21","","2016-09-21","","2016-10-21","","2016-11-21","","2016-12-21",""]
[null,null,null,"2016-01-22","","2016-02-22","","2016-03-22","","2016-04-22","","2016-05-22","","2016-06-22","","2016-07-22","","2016-08-22","","2016-09-22","","2016-10-22","","2016-11-22","","2016-12-22",""]
[null,null,null,"2016-01-23","","2016-02-23","","2016-03-23","","2016-04-23","","2016-05-23","","2016-06-23","","2016-07-23","","2016-08-23","","2016-09-23","","2016-10-23","","2016-11-23","","2016-12-23",""]
[null,null,null,"2016-01-24","","2016-02-24","","2016-03-24","","2016-04-24","","2016-05-24","","2016-06-24","","2016-07-24","","2016-08-24","","2016-09-24","","2016-10-24","","2016-11-24","","2016-12-24",""]
[null,null,null,"2016-01-25","","2016-02-25","","2016-03-25","2016-03-25","2016-04-25","","2016-05-25","","2016-06-25","","2016-07-25","","2016-08-25","","2016-09-25","","2016-10-25","","2016-11-25","","2016-12-25","2016-12-25"]
[null,null,null,"2016-01-26","","2016-02-26","","2016-03-26","","2016-04-26","","2016-05-26","","2016-06-26","","2016-07-26","","2016-08-26","","2016-09-26","","2016-10-26","","2016-11-26","","2016-12-26","2016-12-26"]
[null,null,null,"2016-01-27","","2016-02-27","","2016-03-27","2016-03-27","2016-04-27","2016-04-27","2016-05-27","","2016-06-27","","2016-07-27","","2016-08-27","","2016-09-27","","2016-10-27","","2016-11-27","","2016-12-27",""]
[null,null,null,"2016-01-28","","2016-02-28","","2016-03-28","2016-03-28","2016-04-28","","2016-05-28","","2016-06-28","","2016-07-28","","2016-08-28","","2016-09-28","","2016-10-28","","2016-11-28","","2016-12-28",""]
[null,null,null,"2016-01-29","",{"$f":"IF(MONTH(F78+1)=MONTH(F78),F78+1,\"\")","v":"2016-02-29"},"","2016-03-29","","2016-04-29","","2016-05-29","","2016-06-29","","2016-07-29","","2016-08-29","","2016-09-29","","2016-10-29","","2016-11-29","","2016-12-29",""]
[null,null,null,"2016-01-30","",null,null,"2016-03-30","","2016-04-30","","2016-05-30","","2016-06-30","","2016-07-30","","2016-08-30","","2016-09-30","","2016-10-30","","2016-11-30","","2016-12-30",""]
[null,null,null,"2016-01-31","",null,null,"2016-03-31","",null,null,"2016-05-31","",null,null,"2016-07-31","","2016-08-31","",null,null,"2016-10-31","",null,null,"2016-12-31","2016-12-31"]

{"sheet":"1e kwartaal","index":1,"n_rows":114,"n_cols":378,"rows_kept":114,"cut":false,"hidden":false,"merged":[[9,364,9,370],[9,371,9,377],[9,329,9,335],[9,336,9,342],[9,343,9,349],[9,350,9,356],[9,357,9,363],[7,324,7,327],[9,280,9,286],[9,287,9,293],[9,294,9,300],[9,301,9,307],[9,308,9,314],[9,315,9,321],[9,322,9,328],[9,273,9,279],[2,293,2,296],[2,324,2,327],[2,354,2,357],[3,293,3,296],[3,324,3,327],[3,354,3,357],[4,293,4,296],[4,324,4,327],[4,354,4,357],[5,293,5,296],[5,324,5,327],[5,354,5,357],[6,293,6,296],[6,324,6,327],[6,354,6,357],[9,238,9,244],[9,245,9,251],[9,252,9,258],[9,259,9,265],[9,266,9,272],[5,263,5,265],[6,201,6,203],[6,232,6,234],[6,263,6,265],[7,232,7,234],[2,263,2,265],[3,201,3,203],[3,232,3,234],[3,263,3,265],[4,201,4,203],[4,232,4,234],[4,263,4,265],[9,168,9,174],[9,175,9,181],[9,182,9,188],[2,201,2,203],[2,232,2,234],[5,201,5,203],[5,232,5,234],[9,189,9,195],[9,196,9,202],[9,203,9,209],[9,210,9,216],[9,217,9,223],[9,224,9,230],[9,231,9,237],[9,133,9,139],[9,140,9,146],[9,147,9,153],[9,154,9,160],[9,161,9,167],[9,98,9,104],[9,105,9,111],[9,112,9,118],[9,119,9,125],[9,126,9,132],[5,171,5,173],[6,110,6,112],[6,113,6,117],[6,140,6,142],[6,143,6,147],[6,148,6,152],[6,171,6,173],[5,110,5,112],[5,113,5,117],[5,140,5,142],[5,143,5,147],[5,148,5,152],[3,110,3,112],[3,113,3,117],[3,140,3,142],[3,171,3,173],[4,110,4,112],[4,113,4,117],[4,140,4,142],[4,171,4,173],[2,110,2,112],[2,113,2,117],[2,140,2,142],[2,143,2,148],[2,171,2,173],[0,10,0,12],[0,41,0,43],[7,2,7,5],[9,35,9,41],[9,42,9,48],[9,7,9,13],[9,14,9,20],[9,21,9,27],[2,20,2,22],[3,20,3,22],[5,20,5,22],[6,20,6,22],[2,23,2,27],[3,23,3,27],[4,23,4,27],[5,23,5,27],[2,1,2,5],[9,91,9,97],[9,28,9,34],[9,49,9,55],[9,84,9,90],[9,56,9,62],[9,63,9,69],[9,70,9,76],[9,77,9,83],[4,20,4,22],[6,23,6,27],[7,79,7,81],[2,51,2,53],[3,51,3,53],[4,51,4,53],[5,51,5,53],[6,51,6,53],[2,79,2,81],[3,79,3,81],[4,79,4,81],[5,79,5,81],[6,79,6,81]]}
[null,"jaar:",2016,null,null,null,null,null,null,null,{"$f":"DATE(jaar,1,1)","v":"2016-01-01"},null,null,null,null,null,null,null,null,null,null,null,null,null,null,null,null,null,null,null,null,null,null,null,null,null,null,null,null,null,null,{"$f":"DATE(jaar,2,1)","v":"2016-02-01"},null,null,null,null,null,null,null,null,null,null,null,null,null,null,null,null,null,null,null,null,null,null,null,null,null,null,null,"Maart",null,null,null,null,null,null,null,null,null,null,null,null,null,null,null,null,null,null,null,null,null,null,null,null,null,null,null,null,null,null,"April",null,null,null,null,null,null,null,null,null,null,null,null,null,null,null,null,null,null,null,null,null,null,null,null,null,null,null,null,null,"Mei",null,null,null,null,null,null,null,null,null,null,null,null,null,null,null,null,null,null,null,null,null,null,null,null,null,null,null,null,null,null,"Juni",null,null,null,null,null,null,null,null,null,null,null,null,null,null,null,null,null,null,null,null,null,null,null,null,null,null,null,null,null,"Juli",null,null,null,null,null,null,null,null,null,null,null,null,null,null,null,null,null,null,null,null,null,null,null,null,null,null,null,null,null,null,"Augustus",null,null,null,null,null,null,null,null,null,null,null,null,null,null,null,null,null,null,null,null,null,null,null,null,null,null,null,null,null,null,"September",null,null,null,null,null,null,null,null,null,null,null,null,null,null,null,null,null,null,null,null,null,null,null,null,null,null,null,null,null,"Oktober",null,null,null,null,null,null,null,null,null,null,null,null,null,null,null,null,null,null,null,null,null,null,null,null,null,null,null,null,null,null,"November",null,null,null,null,null,null,null,null,null,null,null,null,null,null,null,null,null,null,null,null,null,null,null,null,null,null,null,null,null,"December"]
[null,null,null,null,null,null,null,null,null,null,"Week",null,"M","D","W","D","V","Z","Z",null,null,null,null,null,null,null,null,null,null,null,null,null,null,null,null,null,null,null,null,null,null,"Week",null,"M","D","W","D","V","Z","Z",null,null,null,null,null,null,null,null,null,null,null,null,null,null,null,null,null,null,null,"Week",null,"M","D","W","D","V","Z","Z",null,null,null,null,null,null,null,null,null,null,null,null,null,null,null,null,null,null,null,null,null,null,"Week",null,"M","D","W","D","V","Z","Z",null,null,null,null,null,null,null,null,null,null,null,null,null,null,null,null,null,null,null,null,null,"Week",null,"M","D","W","D","V","Z","Z",null,null,null,null,null,null,null,null,null,null,null,null,null,null,null,null,null,null,null,null,null,null,"Week",null,"M","D","W","D","V","Z","Z",null,null,null,null,null,null,null,null,null,null,null,null,null,null,null,null,null,null,null,null,null,"Week",null,"M","D","W","D","V","Z","Z",null,null,null,null,null,null,null,null,null,null,null,null,null,null,null,null,null,null,null,null,null,null,"Week",null,"M","D","W","D","V","Z","Z",null,null,null,null,null,null,null,null,null,null,null,null,null,null,null,null,null,null,null,null,null,null,"Week",null,"M","D","W","D","V","Z","Z",null,null,null,null,null,null,null,null,null,null,null,null,null,null,null,null,null,null,null,null,null,"Week",null,"M","D","W","D","V","Z","Z",null,null,null,null,null,null,null,null,null,null,null,null,null,null,null,null,null,null,null,null,null,null,"Week",null,"M","D","W","D","V","Z","Z",null,null,null,null,null,null,null,null,null,null,null,null,null,null,null,null,null,null,null,null,null,"Week",null,"M","D","W","D","V","Z","Z"]
[null,null,null,null,null,null,null,null,null,null,1,null,{"$f":"IF(WEEKDAY($K$1,2)=1,$K$1,\"\")","v":""},{"$f":"IF(M3<>\"\",M3+1,IF(WEEKDAY($K$1,2)=2,$K$1,\"\"))","v":""},{"$f":"IF(N3<>\"\",N3+1,IF(WEEKDAY($K$1,2)=3,$K$1,\"\"))","v":""},{"$f":"IF(O3<>\"\",O3+1,IF(WEEKDAY($K$1,2)=4,$K$1,\"\"))","v":""},{"$f":"IF(P3<>\"\",P3+1,IF(WEEKDAY($K$1,2)=5,$K$1,\"\"))","v":"2016-01-01"},{"$f":"IF(Q3<>\"\",Q3+1,IF(WEEKDAY($K$1,2)=6,$K$1,\"\"))","v":"2016-01-02"},{"$f":"IF(R3<>\"\",R3+1,IF(WEEKDAY(K14,2)=7,$K$1,\"\"))","v":"2016-01-03"},null,{"$f":"IFERROR(SMALL(jan,ROW()-2),\"\")","v":"2016-01-01"},null,null,{"$f":"IFERROR(VLOOKUP(U3,feestdagen,2,0),\"\")","v":"Nieuwjaarsdag"},null,null,null,null,null,null,null,null,null,null,null,null,null,null,null,null,null,5,null,{"$f":"IF(WEEKDAY($AP$1,2)=1,$AP$1,\"\")","v":"2016-02-01"},{"$f":"IF(AR3<>\"\",AR3+1,IF(WEEKDAY($AP$1,2)=2,$AP$1,\"\"))","v":"2016-02-02"},{"$f":"IF(AS3<>\"\",AS3+1,IF(WEEKDAY($AP$1,2)=3,$AP$1,\"\"))","v":"2016-02-03"},{"$f":"IF(AT3<>\"\",AT3+1,IF(WEEKDAY($AP$1,2)=4,$AP$1,\"\"))","v":"2016-02-04"},{"$f":"IF(AU3<>\"\",AU3+1,IF(WEEKDAY($AP$1,2)=5,$AP$1,\"\"))","v":"2016-02-05"},{"$f":"IF(AV3<>\"\",AV3+1,IF(WEEKDAY($AP$1,2)=6,$AP$1,\"\"))","v":"2016-02-06"},{"$f":"IF(AW3<>\"\",AW3+1,IF(WEEKDAY($AP$1,2)=7,$AP$1,\"\"))","v":"2016-02-07"},null,{"$f":"IFERROR(SMALL(feb,ROW()-2),\"\")","v":""},null,null,{"$f":"IFERROR(VLOOKUP(AZ3,feestdagen,2,0),\"\")","v":""},null,null,null,null,null,null,null,null,null,null,null,null,null,null,9,null,null,null,null,null,null,null,1,null,{"$f":"IFERROR(SMALL(mrt,ROW()-2),\"\")","v":"2016-03-25"},null,null,{"$f":"IFERROR(VLOOKUP(CB3,feestdagen,2,0),\"\")","v":"Goede Vrijdag"},null,null,null,null,null,null,null,null,null,null,null,null,null,null,null,null,null,14,null,null,null,1,2,3,4,5,null,{"$f":"IFERROR(SMALL(apr,ROW()-2),\"\")","v":"2016-04-27"},null,null,{"$f":"IFERROR(VLOOKUP(DG3,feestdagen,2,0),\"\")","v":"Koningsdag (N)"},null,null,null,null,null,null,null,null,null,null,null,null,null,null,null,null,18,null,null,null,null,null,1,2,3,null,{"$f":"IFERROR(SMALL(mei,ROW()-2),\"\")","v":"2016-05-05"},null,null,{"$f":"IFERROR(VLOOKUP(EK3,feestdagen,2,0),\"\")","v":"Bevreidingsdag (N)"},null,null,null,null,null,null,null,null,null,null,null,null,null,null,null,null,null,23,null,1,2,3,4,5,6,7,null,{"$f":"IFERROR(SMALL(jun,ROW()-2),\"\")","v":""},null,null,{"$f":"IFERROR(VLOOKUP(FP3,feestdagen,2,0),\"\")","v":""},null,null,null,null,null,null,null,null,null,null,null,null,null,null,null,null,27,null,null,null,1,2,3,4,5,null,{"$f":"IFERROR(SMALL(jul,ROW()-2),\"\")","v":""},null,null,{"$f":"IFERROR(VLOOKUP(GT3,feestdagen,2,0),\"\")","v":""},null,null,null,null,null,null,null,null,null,null,null,null,null,null,null,null,null,31,null,null,null,null,null,null,1,2,null,{"$f":"IFERROR(SMALL(aug,ROW()-2),\"\")","v":""},null,null,{"$f":"IFERROR(VLOOKUP(HY3,feestdagen,2,0),\"\")","v":""},null,null,null,null,null,null,null,null,null,null,null,null,null,null,null,null,null,36,null,null,1,2,3,4,5,6,null,{"$f":"IFERROR(SMALL(sep,ROW()-2),\"\")","v":"2016-09-20"},null,null,{"$f":"IFERROR(VLOOKUP(JD3,feestdagen,2,0),\"\")","v":"Prinsjesdag (N)"},null,null,null,null,null,null,null,null,null,null,null,null,null,null,null,null,40,null,null,null,null,1,2,3,4,null,{"$f":"IFERROR(SMALL(okt,ROW()-2),\"\")","v":""},null,null,null,{"$f":"IFERROR(VLOOKUP(KH3,feestdagen,2,0),\"\")","v":""},null,null,null,null,null,null,null,null,null,null,null,null,null,null,null,null,44,null,null,null,null,null,null,null,1,null,{"$f":"IFERROR(SMALL(okt,ROW()-2),\"\")","v":""},null,null,null,{"$f":"IFERROR(VLOOKUP(LM3,feestdagen,2,0),\"\")","v":""},null,null,null,null,null,null,null,null,null,null,null,null,null,null,null,49,null,null,1,2,3,4,5,6,null,{"$f":"IFERROR(SMALL(dec,ROW()-2),\"\")","v":"2016-12-05"},null,null,null,{"$f":"IFERROR(VLOOKUP(MQ3,feestdagen,2,0),\"\")","v":"Sinterklaas (N)"}]
[null,null,null,null,null,null,null,null,null,null,2,null,{"$f":"S3+1","v":"2016-01-04"},{"$f":"M4+1","v":"2016-01-05"},"2016-01-06","2016-01-07","2016-01-08","2016-01-09","2016-01-10",null,{"$f":"IFERROR(SMALL(jan,ROW()-2),\"\")","v":""},null,null,{"$f":"IFERROR(VLOOKUP(U4,feestdagen,2,0),\"\")","v":""},null,null,null,null,null,null,null,null,null,null,null,null,null,null,null,null,null,6,null,{"$f":"AX3+1","v":"2016-02-08"},{"$f":"AR4+1","v":"2016-02-09"},"2016-02-10","2016-02-11","2016-02-12","2016-02-13","2016-02-14",null,{"$f":"IFERROR(SMALL(feb,ROW()-2),\"\")","v":""},null,null,{"$f":"IFERROR(VLOOKUP(AZ4,feestdagen,2,0),\"\")","v":""},null,null,null,null,null,null,null,null,null,null,null,null,null,null,10,null,2,3,4,5,6,7,8,null,"2016-03-27",null,null,"1e Paasdag",null,null,null,null,null,null,null,null,null,null,null,null,null,null,null,null,null,15,null,6,7,8,9,10,11,12,null,{"$f":"IFERROR(SMALL(apr,ROW()-2),\"\")","v":""},null,null,{"$f":"IFERROR(VLOOKUP(DG4,feestdagen,2,0),\"\")","v":""},null,null,null,null,null,null,null,null,null,null,null,null,null,null,null,null,19,null,4,5,6,7,8,9,10,null,{"$f":"IFERROR(SMALL(mei,ROW()-2),\"\")","v":"2016-05-15"},null,null,{"$f":"IFERROR(VLOOKUP(EK4,feestdagen,2,0),\"\")","v":"1e Pinsterdag"},null,null,null,null,null,null,null,null,null,null,null,null,null,null,null,null,null,24,null,8,9,10,11,12,13,14,null,{"$f":"IFERROR(SMALL(jun,ROW()-2),\"\")","v":""},null,null,{"$f":"IFERROR(VLOOKUP(FP4,feestdagen,2,0),\"\")","v":""},null,null,null,null,null,null,null,null,null,null,null,null,null,null,null,null,28,null,6,7,8,9,10,11,12,null,{"$f":"IFERROR(SMALL(jul,ROW()-2),\"\")","v":""},null,null,{"$f":"IFERROR(VLOOKUP(GT4,feestdagen,2,0),\"\")","v":""},null,null,null,null,null,null,null,null,null,null,null,null,null,null,null,null,null,32,null,3,4,5,6,7,8,9,null,"",null,null,"",null,null,null,null,null,null,null,null,null,null,null,null,null,null,null,null,null,37,null,7,8,9,10,11,12,13,null,{"$f":"IFERROR(SMALL(sep,ROW()-2),\"\")","v":""},null,null,{"$f":"IFERROR(VLOOKUP(JD4,feestdagen,2,0),\"\")","v":""},null,null,null,null,null,null,null,null,null,null,null,null,null,null,null,null,41,null,5,6,7,8,9,10,11,null,{"$f":"IFERROR(SMALL(okt,ROW()-2),\"\")","v":""},null,null,null,{"$f":"IFERROR(VLOOKUP(KH4,feestdagen,2,0),\"\")","v":""},null,null,null,null,null,null,null,null,null,null,null,null,null,null,null,null,45,null,2,3,4,5,6,7,8,null,"",null,null,null,"",null,null,null,null,null,null,null,null,null,null,null,null,null,null,null,50,null,7,8,9,10,11,12,13,null,{"$f":"IFERROR(SMALL(dec,ROW()-2),\"\")","v":"2016-12-25"},null,null,null,{"$f":"IFERROR(VLOOKUP(MQ4,feestdagen,2,0),\"\")","v":"1e Kerstdag"}]
[null,null,null,null,null,null,null,null,null,null,3,null,{"$f":"S4+1","v":"2016-01-11"},"2016-01-12","2016-01-13","2016-01-14","2016-01-15","2016-01-16","2016-01-17",null,{"$f":"IFERROR(SMALL(jan,ROW()-2),\"\")","v":""},null,null,{"$f":"IFERROR(VLOOKUP(U5,feestdagen,2,0),\"\")","v":""},null,null,null,null,null,null,null,null,null,null,null,null,null,null,null,null,null,7,null,{"$f":"AX4+1","v":"2016-02-15"},{"$f":"AR5+1","v":"2016-02-16"},"2016-02-17","2016-02-18","2016-02-19","2016-02-20","2016-02-21",null,{"$f":"IFERROR(SMALL(feb,ROW()-2),\"\")","v":""},null,null,{"$f":"IFERROR(VLOOKUP(AZ5,feestdagen,2,0),\"\")","v":""},null,null,null,null,null,null,null,null,null,null,null,null,null,null,11,null,9,10,11,12,13,14,15,null,"2016-03-28",null,null,"2e paasdag",null,null,null,null,null,null,null,null,null,null,null,null,null,null,null,null,null,16,null,13,14,15,16,17,18,19,null,{"$f":"IFERROR(SMALL(apr,ROW()-2),\"\")","v":""},null,null,{"$f":"IFERROR(VLOOKUP(DG5,feestdagen,2,0),\"\")","v":""},null,null,null,null,null,null,null,null,null,null,null,null,null,null,null,null,20,null,11,12,13,14,15,16,17,null,{"$f":"IFERROR(SMALL(mei,ROW()-2),\"\")","v":"2016-05-16"},null,null,{"$f":"IFERROR(VLOOKUP(EK5,feestdagen,2,0),\"\")","v":"2e Pinksterdag"},null,null,null,null,null,null,null,null,null,null,null,null,null,null,null,null,null,25,null,15,16,17,18,19,20,21,null,{"$f":"IFERROR(SMALL(jun,ROW()-2),\"\")","v":""},null,null,{"$f":"IFERROR(VLOOKUP(FP5,feestdagen,2,0),\"\")","v":""},null,null,null,null,null,null,null,null,null,null,null,null,null,null,null,null,29,null,13,14,15,16,17,18,19,null,{"$f":"IFERROR(SMALL(jul,ROW()-2),\"\")","v":""},null,null,{"$f":"IFERROR(VLOOKUP(GT5,feestdagen,2,0),\"\")","v":""},null,null,null,null,null,null,null,null,null,null,null,null,null,null,null,null,null,33,null,10,11,12,13,14,15,16,null,"",null,null,"",null,null,null,null,null,null,null,null,null,null,null,null,null,null,null,null,null,38,null,14,15,16,17,18,19,20,null,{"$f":"IFERROR(SMALL(sep,ROW()-2),\"\")","v":""},null,null,{"$f":"IFERROR(VLOOKUP(JD5,feestdagen,2,0),\"\")","v":""},null,null,null,null,null,null,null,null,null,null,null,null,null,null,null,null,42,null,12,13,14,15,16,17,18,null,{"$f":"IFERROR(SMALL(okt,ROW()-2),\"\")","v":""},null,null,null,{"$f":"IFERROR(VLOOKUP(KH5,feestdagen,2,0),\"\")","v":""},null,null,null,null,null,null,null,null,null,null,null,null,null,null,null,null,46,null,9,10,11,12,13,14,15,null,"",null,null,null,"",null,null,null,null,null,null,null,null,null,null,null,null,null,null,null,51,null,14,15,16,17,18,19,20,null,{"$f":"IFERROR(SMALL(dec,ROW()-2),\"\")","v":"2016-12-26"},null,null,null,{"$f":"IFERROR(VLOOKUP(MQ5,feestdagen,2,0),\"\")","v":"2e Kerstdag"}]
[null,null,null,null,null,null,null,null,null,null,4,null,{"$f":"S5+1","v":"2016-01-18"},"2016-01-19","2016-01-20","2016-01-21","2016-01-22","2016-01-23","2016-01-24",null,{"$f":"IFERROR(SMALL(jan,ROW()-2),\"\")","v":""},null,null,{"$f":"IFERROR(VLOOKUP(U6,feestdagen,2,0),\"\")","v":""},null,null,null,null,null,null,null,null,null,null,null,null,null,null,null,null,null,8,null,{"$f":"AX5+1","v":"2016-02-22"},{"$f":"AR6+1","v":"2016-02-23"},"2016-02-24","2016-02-25","2016-02-26","2016-02-27","2016-02-28",null,{"$f":"IFERROR(SMALL(feb,ROW()-2),\"\")","v":""},null,null,{"$f":"IFERROR(VLOOKUP(AZ6,feestdagen,2,0),\"\")","v":""},null,null,null,null,null,null,null,null,null,null,null,null,null,null,12,null,16,17,18,19,20,21,22,null,"",null,null,"",null,null,null,null,null,null,null,null,null,null,null,null,null,null,null,null,null,17,null,20,21,22,23,24,25,26,null,{"$f":"IFERROR(SMALL(apr,ROW()-2),\"\")","v":""},null,null,{"$f":"IFERROR(VLOOKUP(DG6,feestdagen,2,0),\"\")","v":""},null,null,null,null,null,null,null,null,null,null,null,null,null,null,null,null,21,null,18,19,20,21,22,23,24,null,{"$f":"IFERROR(SMALL(mei,ROW()-2),\"\")","v":""},null,null,{"$f":"IFERROR(VLOOKUP(EK6,feestdagen,2,0),\"\")","v":""},null,null,null,null,{"$f":"IFERROR(VLOOKUP(EP6,feestdagen,2,0),\"\")","v":""},null,null,null,null,null,null,null,null,null,null,null,null,26,null,22,23,24,25,26,27,28,null,{"$f":"IFERROR(SMALL(jun,ROW()-2),\"\")","v":""},null,null,{"$f":"IFERROR(VLOOKUP(FP6,feestdagen,2,0),\"\")","v":""},null,null,null,null,null,null,null,null,null,null,null,null,null,null,null,null,30,null,20,21,22,23,24,25,26,null,{"$f":"IFERROR(SMALL(jul,ROW()-2),\"\")","v":""},null,null,{"$f":"IFERROR(VLOOKUP(GT6,feestdagen,2,0),\"\")","v":""},null,null,null,null,null,null,null,null,null,null,null,null,null,null,null,null,null,34,null,17,18,19,20,21,22,23,null,"",null,null,"",null,null,null,null,null,null,null,null,null,null,null,null,null,null,null,null,null,39,null,21,22,23,24,25,26,27,null,{"$f":"IFERROR(SMALL(sep,ROW()-2),\"\")","v":""},null,null,{"$f":"IFERROR(VLOOKUP(JD6,feestdagen,2,0),\"\")","v":""},null,null,null,null,null,null,null,null,null,null,null,null,null,null,null,null,43,null,19,20,21,22,23,24,25,null,{"$f":"IFERROR(SMALL(okt,ROW()-2),\"\")","v":""},null,null,null,{"$f":"IFERROR(VLOOKUP(KH6,feestdagen,2,0),\"\")","v":""},null,null,null,null,null,null,null,null,null,null,null,null,null,null,null,null,47,null,16,17,18,19,20,21,22,null,"",null,null,null,"",null,null,null,null,null,null,null,null,null,null,null,null,null,null,null,52,null,21,22,23,24,25,26,27,null,{"$f":"IFERROR(SMALL(dec,ROW()-2),\"\")","v":"2016-12-31"},null,null,null,{"$f":"IFERROR(VLOOKUP(MQ6,feestdagen,2,0),\"\")","v":"Oudejaarsdag"}]
[null,null,null,null,null,null,null,null,null,null,5,null,{"$f":"IF(MONTH(S6+1)=MONTH(S6),S6+1,\"\")","v":"2016-01-25"},{"$f":"IF(M7=\"\",\"\",IF(MONTH(M7+1)=MONTH(M7),M7+1,\"\"))","v":"2016-01-26"},"2016-01-27","2016-01-28","2016-01-29","2016-01-30","2016-01-31",null,{"$f":"IFERROR(SMALL(jan,ROW()-2),\"\")","v":""},null,null,{"$f":"IFERROR(VLOOKUP(U7,feestdagen,2,0),\"\")","v":""},null,null,null,null,null,null,null,null,null,null,null,null,null,null,null,null,null,9,null,{"$f":"IF(MONTH(AX6+1)=MONTH(AX6),AX6+1,\"\")","v":"2016-02-29"},{"$f":"IF(AR7=\"\",\"\",IF(MONTH(AR7+1)=MONTH(AR7),AR7+1,\"\"))","v":""},"","","","","",null,{"$f":"IFERROR(SMALL(feb,ROW()-2),\"\")","v":""},null,null,{"$f":"IFERROR(VLOOKUP(AZ7,feestdagen,2,0),\"\")","v":""},null,null,null,null,null,null,null,null,null,null,null,null,null,null,13,null,23,24,25,26,27,28,29,null,"",null,null,"",null,null,null,null,null,null,null,null,null,null,null,null,null,null,null,null,null,18,null,27,28,29,30,null,null,null,null,{"$f":"IFERROR(SMALL(apr,ROW()-2),\"\")","v":""},null,null,{"$f":"IFERROR(VLOOKUP(DG7,feestdagen,2,0),\"\")","v":""},null,null,null,null,null,null,null,null,null,null,null,null,null,null,null,null,22,null,25,26,27,28,29,30,31,null,{"$f":"IFERROR(SMALL(mei,ROW()-2),\"\")","v":""},null,null,{"$f":"IFERROR(VLOOKUP(EK7,feestdagen,2,0),\"\")","v":""},null,null,null,null,{"$f":"IFERROR(VLOOKUP(EP7,feestdagen,2,0),\"\")","v":""},null,null,null,null,null,null,null,null,null,null,null,null,27,null,29,30,null,null,null,null,null,null,{"$f":"IFERROR(SMALL(jun,ROW()-2),\"\")","v":""},null,null,{"$f":"IFERROR(VLOOKUP(FP7,feestdagen,2,0),\"\")","v":""},null,null,null,null,null,null,null,null,null,null,null,null,null,null,null,null,31,null,27,28,29,30,31,null,null,null,{"$f":"IFERROR(SMALL(jul,ROW()-2),\"\")","v":""},null,null,{"$f":"IFERROR(VLOOKUP(GT7,feestdagen,2,0),\"\")","v":""},null,null,null,null,null,null,null,null,null,null,null,null,null,null,null,null,null,35,null,24,25,26,27,28,29,30,null,"",null,null,"",null,null,null,null,null,null,null,null,null,null,null,null,null,null,null,null,null,40,null,28,29,30,null,null,null,null,null,{"$f":"IFERROR(SMALL(sep,ROW()-2),\"\")","v":""},null,null,{"$f":"IFERROR(VLOOKUP(JD7,feestdagen,2,0),\"\")","v":""},null,null,null,null,null,null,null,null,null,null,null,null,null,null,null,null,44,null,26,27,28,29,30,31,null,null,{"$f":"IFERROR(SMALL(okt,ROW()-2),\"\")","v":""},null,null,null,{"$f":"IFERROR(VLOOKUP(KH7,feestdagen,2,0),\"\")","v":""},null,null,null,null,null,null,null,null,null,null,null,null,null,null,null,null,48,null,23,24,25,26,27,28,29,null,"",null,null,null,"",null,null,null,null,null,null,null,null,null,null,null,null,null,null,null,53,null,28,29,30,31,null,null,null,null,{"$f":"IFERROR(SMALL(dec,ROW()-2),\"\")","v":""},null,null,null,{"$f":"IFERROR(VLOOKUP(MQ7,feestdagen,2,0),\"\")","v":""}]
[null,null,null,null,null,null,null,null,null,null,null,null,null,null,null,null,null,null,null,null,null,null,null,null,null,null,null,null,null,null,null,null,null,null,null,null,null,null,null,null,null,null,null,null,null,null,null,null,null,null,null,null,null,null,null,null,null,null,null,null,null,null,null,null,null,null,null,null,null,14,null,30,31,null,null,null,null,null,null,"",null,null,"",null,null,null,null,null,null,null,null,null,null,null,null,null,null,null,null,null,null,null,null,null,null,null,null,null,null,null,null,null,null,null,null,null,null,null,null,null,null,null,null,null,null,null,null,null,null,null,null,null,null,null,null,null,null,null,null,null,null,null,null,null,null,null,null,null,null,null,null,null,null,null,null,null,null,null,null,null,null,null,null,null,null,null,null,null,null,null,null,null,null,null,null,null,null,null,null,null,null,null,null,null,null,null,null,null,null,null,null,null,null,null,null,null,null,null,null,null,null,null,null,null,null,null,null,null,null,null,null,null,null,null,null,null,null,null,null,null,null,null,36,null,31,null,null,null,null,null,null,null,"",null,null,"",null,null,null,null,null,null,null,null,null,null,null,null,null,null,null,null,null,null,null,null,null,null,null,null,null,null,null,null,null,null,null,null,null,null,null,null,null,null,null,null,null,null,null,null,null,null,null,null,null,null,null,null,null,null,null,null,null,null,null,null,null,null,null,null,null,null,null,null,null,null,null,null,null,null,null,null,null,null,49,null,30,null,null,null,null,null,null,null,"",null,null,null,""]
[null,null,null,null,null,null,null,{"$f":"IF(ISERROR(MONTH(H12)),\"\",MONTH(H12))","v":""},{"$f":"IF(ISERROR(MONTH(I12)),\"\",MONTH(I12))","v":""},"","",1,1,1,1,1,1,1,1,1,1,1,1,1,1,1,1,1,1,1,1,1,1,1,1,1,1,1,1,1,1,1,2,2,2,2,2,2,2,2,2,2,2,2,2,2,2,2,2,2,2,2,2,2,2,2,2,2,2,2,2,3,{"$f":"IF(ISERROR(MONTH(BU12)),\"\",MONTH(BU12))","v":3},3,3,3,3,3,3,3,3,3,3,3,3,3,3,3,3,3,3,3,3,3,3,3,3,3,{"$f":"MONTH(CU12)","v":3},{"$f":"MONTH(CV12)","v":3},3,3,4,4,4,4,4,4,4,4,4,4,4,4,4,4,4,4,4,4,4,4,4,4,4,4,4,4,4,4,4,4,5,5,5,5,5,5,5,5,5,5,5,5,5,5,5,5,5,5,5,5,5,5,5,5,5,5,5,5,5,5,5,{"$f":"MONTH(FH12)","v":6},6,6,6,6,6,6,6,6,6,6,6,6,6,6,6,6,6,6,6,6,6,6,6,6,6,{"$f":"MONTH(GH12)","v":1},{"$f":"MONTH(GI12)","v":1},1,1,1,1,1,1,1,1,1,1,1,1,1,1,1,1,1,1,1,1,1,1,1,1,1,1,1,1,1,2,2,2,2,2,2,2,2,2,2,2,2,2,2,2,2,2,2,2,2,2,2,2,2,2,2,2,2,2,3,3,3,3,3,{"$f":"MONTH(IU12)","v":3},3,3,3,3,3,3,3,3,3,3,3,3,3,3,3,3,3,3,3,3,3,3,3,3,3,{"$f":"MONTH(JU12)","v":1},{"$f":"MONTH(JV12)","v":1},1,1,1,1,1,1,1,1,1,1,1,1,1,1,1,1,1,1,1,1,1,1,1,1,1,1,1,1,1,2,2,2,2,2,2,2,2,2,2,2,2,2,2,2,2,2,2,2,2,2,2,2,2,2,2,2,2,2,3,3,3,3,3,{"$f":"MONTH(MH12)","v":3},3,3,3,3,3,3,3,3,3,3,3,3,3,3,3,3,3,3,3,3,3,3,3,3,3,{"$f":"IF(ISERROR(MONTH(NH12)),\"\",MONTH(NH12))","v":""},{"$f":"IF(ISERROR(MONTH(NI12)),\"\",MONTH(NI12))","v":""},"","","","",""]
[null,null,null,null,null,null,null,"Week 1",null,null,null,null,null,null,"Week 2",null,null,null,null,null,null,"Week 3",null,null,null,null,null,null,"Week 4",null,null,null,null,null,null,"Week 5",null,null,null,null,null,null,"Week 6",null,null,null,null,null,null,"Week 7",null,null,null,null,null,null,"Week 8",null,null,null,null,null,null,"Week 9",null,null,null,null,null,null,"Week 10",null,null,null,null,null,null,"Week 11",null,null,null,null,null,null,"Week 12",null,null,null,null,null,null,"Week 13",null,null,null,null,null,null,"Week 14",null,null,null,null,null,null,"Week 15",null,null,null,null,null,null,"Week 16",null,null,null,null,null,null,"Week 17",null,null,null,null,null,null,"Week 18",null,null,null,null,null,null,"Week 19",null,null,null,null,null,null,"Week 20",null,null,null,null,null,null,"Week 21",null,null,null,null,null,null,"Week 22",null,null,null,null,null,null,"Week 23",null,null,null,null,null,null,"Week 24",null,null,null,null,null,null,"Week 25",null,null,null,null,null,null,"Week 26",null,null,null,null,null,null,"Week 27",null,null,null,null,null,null,"Week 28",null,null,null,null,null,null,"Week 29",null,null,null,null,null,null,"Week 30",null,null,null,null,null,null,"Week 31",null,null,null,null,null,null,"Week 32",null,null,null,null,null,null,"Week 33",null,null,null,null,null,null,"Week 34",null,null,null,null,null,null,"Week 35",null,null,null,null,null,null,"Week 36",null,null,null,null,null,null,"Week 37",null,null,null,null,null,null,"Week 38",null,null,null,null,null,null,"Week 39",null,null,null,null,null,null,"Week 40",null,null,null,null,null,null,"Week 41",null,null,null,null,null,null,"Week 42",null,null,null,null,null,null,"Week 43",null,null,null,null,null,null,"Week 44",null,null,null,null,null,null,"Week 45",null,null,null,null,null,null,"Week 46",null,null,null,null,null,null,"Week 47",null,null,null,null,null,null,"Week 48",null,null,null,null,null,null,"Week 49",null,null,null,null,null,null,"Week 50",null,null,null,null,null,null,"Week 51",null,null,null,null,null,null,"Week 52",null,null,null,null,null,null,"Week 53"]
[null,null,null,null,null,null,null,"M","D","W","D","V","Z","Z","M","D","W","D","V","Z","Z","M","D","W","D","V","Z","Z","M","D","W","D","V","Z","Z","M","D","W","D","V","Z","Z","M","D","W","D","V","Z","Z","M","D","W","D","V","Z","Z","M","D","W","D","V","Z","Z","M","D","W","D","V","Z","Z","M","D","W","D","V","Z","Z","M","D","W","D","V","Z","Z","M","D","W","D","V","Z","Z","M","D","W","D","V","Z","Z","M","D","W","D","V","Z","Z","M","D","W","D","V","Z","Z","M","D","W","D","V","Z","Z","M","D","W","D","V","Z","Z","M","D","W","D","V","Z","Z","M","D","W","D","V","Z","Z","M","D","W","D","V","Z","Z","M","D","W","D","V","Z","Z","M","D","W","D","V","Z","Z","M","D","W","D","V","Z","Z","M","D","W","D","V","Z","Z","M","D","W","D","V","Z","Z","M","D","W","D","V","Z","Z","M","D","W","D","V","Z","Z","M","D","W","D","V","Z","Z","M","D","W","D","V","Z","Z","M","D","W","D","V","Z","Z","M","D","W","D","V","Z","Z","M","D","W","D","V","Z","Z","M","D","W","D","V","Z","Z","M","D","W","D","V","Z","Z","M","D","W","D","V","Z","Z","M","D","W","D","V","Z","Z","M","D","W","D","V","Z","Z","M","D","W","D","V","Z","Z","M","D","W","D","V","Z","Z","M","D","W","D","V","Z","Z","M","D","W","D","V","Z","Z","M","D","W","D","V","Z","Z","M","D","W","D","V","Z","Z","M","D","W","D","V","Z","Z","M","D","W","D","V","Z","Z","M","D","W","D","V","Z","Z","M","D","W","D","V","Z","Z","M","D","W","D","V","Z","Z","M","D","W","D","V","Z","Z","M","D","W","D","V","Z","Z","M","D","W","D","V","Z","Z","M","D","W","D","V","Z","Z","M","D","W","D","V","Z","Z"]
["Locatie:","Naam:","van:","tot:","Verlof:","Goedgekeurd door CP:",{"$f":"DATE(jaar,1,1)","v":"2016-01-01"},{"$f":"IF(WEEKDAY($G12,2)=1,$G12,\"\")","v":""},{"$f":"IF(H12<>\"\",H12+1,IF(WEEKDAY($G12,2)=2,$G12,\"\"))","v":""},{"$f":"IF(I12<>\"\",I12+1,IF(WEEKDAY($G12,2)=3,$G12,\"\"))","v":""},{"$f":"IF(J12<>\"\",J12+1,IF(WEEKDAY($G12,2)=4,$G12,\"\"))","v":""},{"$f":"IF(K12<>\"\",K12+1,IF(WEEKDAY($G12,2)=5,$G12,\"\"))","v":"2016-01-01"},{"$f":"IF(L12<>\"\",L12+1,IF(WEEKDAY($G12,2)=6,$G12,\"\"))","v":"2016-01-02"},{"$f":"IF(M12<>\"\",M12+1,IF(WEEKDAY($G12,2)=4,$G12,\"\"))","v":"2016-01-03"},{"$f":"N12+1","v":"2016-01-04"},{"$f":"O12+1","v":"2016-01-05"},"2016-01-06","2016-01-07","2016-01-08","2016-01-09","2016-01-10","2016-01-11","2016-01-12","2016-01-13","2016-01-14","2016-01-15","2016-01-16","2016-01-17","2016-01-18","2016-01-19","2016-01-20","2016-01-21","2016-01-22","2016-01-23","2016-01-24","2016-01-25","2016-01-26","2016-01-27","2016-01-28","2016-01-29","2016-01-30","2016-01-31","2016-02-01","2016-02-02","2016-02-03","2016-02-04","2016-02-05","2016-02-06","2016-02-07","2016-02-08","2016-02-09","2016-02-10","2016-02-11","2016-02-12","2016-02-13","2016-02-14","2016-02-15","2016-02-16","2016-02-17","2016-02-18","2016-02-19","2016-02-20","2016-02-21","2016-02-22","2016-02-23","2016-02-24","2016-02-25","2016-02-26","2016-02-27","2016-02-28","2016-02-29","2016-03-01","2016-03-02","2016-03-03","2016-03-04","2016-03-05","2016-03-06","2016-03-07","2016-03-08",{"$f":"CA12+1","v":"2016-03-09"},"2016-03-10","2016-03-11","2016-03-12","2016-03-13","2016-03-14","2016-03-15","2016-03-16","2016-03-17","2016-03-18","2016-03-19","2016-03-20","2016-03-21","2016-03-22","2016-03-23","2016-03-24","2016-03-25","2016-03-26","2016-03-27",{"$f":"'1e kwartaal'!GG12+1","v":"2016-03-28"},{"$f":"CU12+1","v":"2016-03-29"},{"$f":"CV12+1","v":"2016-03-30"},"2016-03-31","2016-04-01","2016-04-02","2016-04-03","2016-04-04","2016-04-05","2016-04-06","2016-04-07","2016-04-08","2016-04-09","2016-04-10","2016-04-11","2016-04-12","2016-04-13","2016-04-14","2016-04-15","2016-04-16","2016-04-17","2016-04-18","2016-04-19","2016-04-20","2016-04-21","2016-04-22","2016-04-23","2016-04-24","2016-04-25","2016-04-26","2016-04-27","2016-04-28","2016-04-29","2016-04-30","2016-05-01","2016-05-02","2016-05-03","2016-05-04","2016-05-05","2016-05-06","2016-05-07","2016-05-08","2016-05-09","2016-05-10","2016-05-11","2016-05-12","2016-05-13","2016-05-14","2016-05-15","2016-05-16","2016-05-17","2016-05-18","2016-05-19","2016-05-20","2016-05-21","2016-05-22","2016-05-23","2016-05-24","2016-05-25","2016-05-26","2016-05-27","2016-05-28","2016-05-29","2016-05-30","2016-05-31","2016-06-01",{"$f":"FH12+1","v":"2016-06-02"},"2016-06-03","2016-06-04","2016-06-05","2016-06-06","2016-06-07","2016-06-08","2016-06-09","2016-06-10","2016-06-11","2016-06-12","2016-06-13","2016-06-14","2016-06-15","2016-06-16","2016-06-17","2016-06-18","2016-06-19","2016-06-20","2016-06-21","2016-06-22","2016-06-23","2016-06-24","2016-06-25","2016-06-26",{"$f":"'2e kwartaal'!JT12+1","v":"1900-01-01"},{"$f":"GH12+1","v":"1900-01-02"},{"$f":"GI12+1","v":"1900-01-03"},"1900-01-04","1900-01-05","1900-01-06","1900-01-07","1900-01-08","1900-01-09","1900-01-10","1900-01-11","1900-01-12","1900-01-13","1900-01-14","1900-01-15","1900-01-16","1900-01-17","1900-01-18","1900-01-19","1900-01-20","1900-01-21","1900-01-22","1900-01-23","1900-01-24","1900-01-25","1900-01-26","1900-01-27","1900-01-28","1900-01-29","1900-01-30","1900-01-31","1900-02-01","1900-02-02","1900-02-03","1900-02-04","1900-02-05","1900-02-06","1900-02-07","1900-02-08","1900-02-09","1900-02-10","1900-02-11","1900-02-12","1900-02-13","1900-02-14","1900-02-15","1900-02-16","1900-02-17","1900-02-18","1900-02-19","1900-02-20","1900-02-21","1900-02-22","1900-02-23","1900-02-24","1900-02-25","1900-02-26","1900-02-27","1900-02-28",60,"1900-03-01","1900-03-02","1900-03-03","1900-03-04","1900-03-05","1900-03-06",{"$f":"IU12+1","v":"1900-03-07"},"1900-03-08","1900-03-09","1900-03-10","1900-03-11","1900-03-12","1900-03-13","1900-03-14","1900-03-15","1900-03-16","1900-03-17","1900-03-18","1900-03-19","1900-03-20","1900-03-21","1900-03-22","1900-03-23","1900-03-24","1900-03-25","1900-03-26","1900-03-27","1900-03-28","1900-03-29","1900-03-30","1900-03-31",{"$f":"'3e kwartaal'!NG12+1","v":"1900-01-01"},{"$f":"JU12+1","v":"1900-01-02"},{"$f":"JV12+1","v":"1900-01-03"},"1900-01-04","1900-01-05","1900-01-06","1900-01-07","1900-01-08","1900-01-09","1900-01-10","1900-01-11","1900-01-12","1900-01-13","1900-01-14","1900-01-15","1900-01-16","1900-01-17","1900-01-18","1900-01-19","1900-01-20","1900-01-21","1900-01-22","1900-01-23","1900-01-24","1900-01-25","1900-01-26","1900-01-27","1900-01-28","1900-01-29","1900-01-30","1900-01-31","1900-02-01","1900-02-02","1900-02-03","1900-02-04","1900-02-05","1900-02-06","1900-02-07","1900-02-08","1900-02-09","1900-02-10","1900-02-11","1900-02-12","1900-02-13","1900-02-14","1900-02-15","1900-02-16","1900-02-17","1900-02-18","1900-02-19","1900-02-20","1900-02-21","1900-02-22","1900-02-23","1900-02-24","1900-02-25","1900-02-26","1900-02-27","1900-02-28",60,"1900-03-01","1900-03-02","1900-03-03","1900-03-04","1900-03-05","1900-03-06",{"$f":"MH12+1","v":"1900-03-07"},"1900-03-08","1900-03-09","1900-03-10","1900-03-11","1900-03-12","1900-03-13","1900-03-14","1900-03-15","1900-03-16","1900-03-17","1900-03-18","1900-03-19","1900-03-20","1900-03-21","1900-03-22","1900-03-23","1900-03-24","1900-03-25","1900-03-26","1900-03-27","1900-03-28","1900-03-29","1900-03-30",{"$f":"IF(NF$12=\"\",\"\",IF(MONTH(NF$12+1)=MONTH(NF$12),NF$12+1,\"\"))","v":"1900-03-31"},{"$f":"IF(NG$12=\"\",\"\",IF(MONTH(NG$12+1)=MONTH(NG$12),NG$12+1,\"\"))","v":""},"","","","","",""]
["Atalanta","Bert","2016-02-03","2016-03-24",null,null,null,"1900-01-05"]
["Atalanta","Miriam","2016-04-06","2016-04-13"]
["Campus","persoon 10"]
["CB","Jan","2016-01-06","2016-01-23","vakantie","ja",null,"1900-01-01"]
["CB","Chantal","2016-03-24","2016-04-16","vakantie","ja"]
["Komeet","Pietje Puk","2016-01-12","2016-01-22",null,null,null,"1900-01-02"]
["Komeet","persoon 8"]
["Landgoed","Maaike"]
["Linde","Klaas","2016-02-10","2016-02-23",null,null,null,"1900-01-03"]
["Skoe","persoon 7"]
["Tuinfluiter",null,"2016-01-01","2016-01-10",null,null,null,"1900-01-04"]
[null,"persoon 11"]
[null,"persoon 12"]
[null,"persoon 13"]
[null,"persoon 15"]
[null,"persoon 16"]
[null,"persoon 17"]
[null,"persoon 18"]
[null,"persoon 19"]
[null,"persoon 20"]
[null,"persoon 21"]
[null,"persoon 22"]
[null,"persoon 23"]
[null,"persoon 24"]
[null,"persoon 25"]
[null,"persoon 26"]
[null,"persoon 27"]
[null,"persoon 28"]
[null,"persoon 29"]
[null,"persoon 30"]
[null,"persoon 31"]
[null,"persoon 32"]
[null,"persoon 33"]
[null,"persoon 34"]
[null,"persoon 35"]
[null,"persoon 36"]
[null,"persoon 37"]
[null,"persoon 38"]
[null,"persoon 39"]
[null,"persoon 40"]
[null,"persoon 41"]
[null,"persoon 42"]
[null,"persoon 43"]
[null,"persoon 44"]
[null,"persoon 45"]
[null,"persoon 46"]
[null,"persoon 47"]
[null,"persoon 48"]
[null,"persoon 49"]
[null,"persoon 50"]
[null,"persoon 51"]
[null,"persoon 52"]
[null,"persoon 53"]
[null,"persoon 54"]
[null,"persoon 55"]
[null,"persoon 56"]
[null,"persoon 57"]
[null,"persoon 58"]
[null,"persoon 59"]
[null,"persoon 60"]
[null,"persoon 61"]
[null,"persoon 62"]
[null,"persoon 63"]
[null,"persoon 64"]
[null,"persoon 65"]
[null,"persoon 66"]
[null,"persoon 67"]
[null,"persoon 68"]
[null,"persoon 69"]
[null,"persoon 70"]
[null,"persoon 71"]
[null,"persoon 72"]
[null,"persoon 73"]
[null,"persoon 74"]
[null,"persoon 75"]
[null,"persoon 76"]
[null,"persoon 77"]
[null,"persoon 78"]
[null,"persoon 79"]
[null,"persoon 80"]
[null,"persoon 81"]
[null,"persoon 82"]
[null,"persoon 83"]
[null,"persoon 84"]
[null,"persoon 85"]
[null,"persoon 86"]
[null,"persoon 87"]
[null,"persoon 88"]
[null,"persoon 89"]
[null,"persoon 90"]
[null,"persoon 91"]
[null,"persoon 92"]
[null,"persoon 93"]
[null,"persoon 94"]
[null,"persoon 95"]
[null,"persoon 96"]
[null,"persoon 97"]
[null,"persoon 98"]
[null,"persoon 99"]
[null,"persoon 100"]
["Helix","Sylvia"]
["Linde","Mieke"]

{"sheet":"2e kwartaal","index":2,"n_rows":112,"n_cols":98,"rows_kept":112,"cut":false,"hidden":false,"merged":[[2,1,2,5],[2,19,2,21],[2,22,2,26],[3,19,3,21],[3,22,3,26],[7,2,7,5],[9,7,9,13],[9,14,9,20],[9,77,9,83],[9,35,9,41],[9,42,9,48],[9,49,9,55],[9,21,9,27],[9,28,9,34],[9,91,9,97],[9,84,9,90],[9,56,9,62],[9,63,9,69],[9,70,9,76],[4,19,4,21],[4,22,4,26],[5,19,5,21],[5,22,5,26],[6,19,6,21],[6,22,6,26],[5,49,5,51],[5,52,5,56],[6,49,6,51],[6,52,6,56],[2,80,2,82],[3,80,3,82],[4,80,4,82],[2,49,2,51],[3,49,3,51],[4,49,4,51],[5,80,5,82],[6,80,6,82],[2,52,2,57],[5,57,5,61],[6,57,6,61]]}
[null,"jaar:",2016,null,null,null,null,null,null,"April",null,null,null,null,null,null,null,null,null,null,null,null,null,null,null,null,null,null,null,null,null,null,null,null,null,null,null,null,null,"Mei",null,null,null,null,null,null,null,null,null,null,null,null,null,null,null,null,null,null,null,null,null,null,null,null,null,null,null,null,null,null,"Juni"]
[null,null,null,null,null,null,null,null,null,"Week",null,"M","D","W","D","V","Z","Z",null,null,null,null,null,null,null,null,null,null,null,null,null,null,null,null,null,null,null,null,null,"Week",null,"M","D","W","D","V","Z","Z",null,null,null,null,null,null,null,null,null,null,null,null,null,null,null,null,null,null,null,null,null,null,"Week",null,"M","D","W","D","V","Z","Z"]
[null,null,null,null,null,null,null,null,null,14,null,null,null,1,2,3,4,5,null,{"$f":"IFERROR(SMALL(apr,ROW()-2),\"\")","v":"2016-04-27"},null,null,{"$f":"IFERROR(VLOOKUP(T3,feestdagen,2,0),\"\")","v":"Koningsdag (N)"},null,null,null,null,null,null,null,null,null,null,null,null,null,null,null,null,18,null,null,null,null,null,1,2,3,null,{"$f":"IFERROR(SMALL(mei,ROW()-2),\"\")","v":"2016-05-05"},null,null,{"$f":"IFERROR(VLOOKUP(AX3,feestdagen,2,0),\"\")","v":"Bevreidingsdag (N)"},null,null,null,null,null,null,null,null,null,null,null,null,null,null,null,null,null,23,null,1,2,3,4,5,6,7,null,{"$f":"IFERROR(SMALL(jun,ROW()-2),\"\")","v":""},null,null,{"$f":"IFERROR(VLOOKUP(CC3,feestdagen,2,0),\"\")","v":""}]
[null,null,null,null,null,null,null,null,null,15,null,6,7,8,9,10,11,12,null,{"$f":"IFERROR(SMALL(apr,ROW()-2),\"\")","v":""},null,null,{"$f":"IFERROR(VLOOKUP(T4,feestdagen,2,0),\"\")","v":""},null,null,null,null,null,null,null,null,null,null,null,null,null,null,null,null,19,null,4,5,6,7,8,9,10,null,{"$f":"IFERROR(SMALL(mei,ROW()-2),\"\")","v":"2016-05-15"},null,null,{"$f":"IFERROR(VLOOKUP(AX4,feestdagen,2,0),\"\")","v":"1e Pinsterdag"},null,null,null,null,null,null,null,null,null,null,null,null,null,null,null,null,null,24,null,8,9,10,11,12,13,14,null,{"$f":"IFERROR(SMALL(jun,ROW()-2),\"\")","v":""},null,null,{"$f":"IFERROR(VLOOKUP(CC4,feestdagen,2,0),\"\")","v":""}]
[null,null,null,null,null,null,null,null,null,16,null,13,14,15,16,17,18,19,null,{"$f":"IFERROR(SMALL(apr,ROW()-2),\"\")","v":""},null,null,{"$f":"IFERROR(VLOOKUP(T5,feestdagen,2,0),\"\")","v":""},null,null,null,null,null,null,null,null,null,null,null,null,null,null,null,null,20,null,11,12,13,14,15,16,17,null,{"$f":"IFERROR(SMALL(mei,ROW()-2),\"\")","v":"2016-05-16"},null,null,{"$f":"IFERROR(VLOOKUP(AX5,feestdagen,2,0),\"\")","v":"2e Pinksterdag"},null,null,null,null,null,null,null,null,null,null,null,null,null,null,null,null,null,25,null,15,16,17,18,19,20,21,null,{"$f":"IFERROR(SMALL(jun,ROW()-2),\"\")","v":""},null,null,{"$f":"IFERROR(VLOOKUP(CC5,feestdagen,2,0),\"\")","v":""}]
[null,null,null,null,null,null,null,null,null,17,null,20,21,22,23,24,25,26,null,{"$f":"IFERROR(SMALL(apr,ROW()-2),\"\")","v":""},null,null,{"$f":"IFERROR(VLOOKUP(T6,feestdagen,2,0),\"\")","v":""},null,null,null,null,null,null,null,null,null,null,null,null,null,null,null,null,21,null,18,19,20,21,22,23,24,null,{"$f":"IFERROR(SMALL(mei,ROW()-2),\"\")","v":""},null,null,{"$f":"IFERROR(VLOOKUP(AX6,feestdagen,2,0),\"\")","v":""},null,null,null,null,{"$f":"IFERROR(VLOOKUP(BC6,feestdagen,2,0),\"\")","v":""},null,null,null,null,null,null,null,null,null,null,null,null,26,null,22,23,24,25,26,27,28,null,{"$f":"IFERROR(SMALL(jun,ROW()-2),\"\")","v":""},null,null,{"$f":"IFERROR(VLOOKUP(CC6,feestdagen,2,0),\"\")","v":""}]
[null,null,null,null,null,null,null,null,null,18,null,27,28,29,30,null,null,null,null,{"$f":"IFERROR(SMALL(apr,ROW()-2),\"\")","v":""},null,null,{"$f":"IFERROR(VLOOKUP(T7,feestdagen,2,0),\"\")","v":""},null,null,null,null,null,null,null,null,null,null,null,null,null,null,null,null,22,null,25,26,27,28,29,30,31,null,{"$f":"IFERROR(SMALL(mei,ROW()-2),\"\")","v":""},null,null,{"$f":"IFERROR(VLOOKUP(AX7,feestdagen,2,0),\"\")","v":""},null,null,null,null,{"$f":"IFERROR(VLOOKUP(BC7,feestdagen,2,0),\"\")","v":""},null,null,null,null,null,null,null,null,null,null,null,null,27,null,29,30,null,null,null,null,null,null,{"$f":"IFERROR(SMALL(jun,ROW()-2),\"\")","v":""},null,null,{"$f":"IFERROR(VLOOKUP(CC7,feestdagen,2,0),\"\")","v":""}]
[]
[null,null,null,null,null,null,null,{"$f":"MONTH(H12)","v":3},{"$f":"MONTH(I12)","v":3},3,3,4,4,4,4,4,4,4,4,4,4,4,4,4,4,4,4,4,4,4,4,4,4,4,4,4,4,4,4,4,4,5,5,5,5,5,5,5,5,5,5,5,5,5,5,5,5,5,5,5,5,5,5,5,5,5,5,5,5,5,5,5,{"$f":"MONTH(BU12)","v":6},6,6,6,6,6,6,6,6,6,6,6,6,6,6,6,6,6,6,6,6,6,6,6,6,6]
[null,null,null,null,null,null,null,"Week 14",null,null,null,null,null,null,"Week 15",null,null,null,null,null,null,"Week 16",null,null,null,null,null,null,"Week 17",null,null,null,null,null,null,"Week 18",null,null,null,null,null,null,"Week 19",null,null,null,null,null,null,"Week 20",null,null,null,null,null,null,"Week 21",null,null,null,null,null,null,"Week 22",null,null,null,null,null,null,"Week 23",null,null,null,null,null,null,"Week 24",null,null,null,null,null,null,"Week 25",null,null,null,null,null,null,"Week 26"]
[null,null,null,null,null,null,null,"M","D","W","D","V","Z","Z","M","D","W","D","V","Z","Z","M","D","W","D","V","Z","Z","M","D","W","D","V","Z","Z","M","D","W","D","V","Z","Z","M","D","W","D","V","Z","Z","M","D","W","D","V","Z","Z","M","D","W","D","V","Z","Z","M","D","W","D","V","Z","Z","M","D","W","D","V","Z","Z","M","D","W","D","V","Z","Z","M","D","W","D","V","Z","Z","M","D","W","D","V","Z","Z"]
[null,"Naam:","van:","tot:","Verlof:","Goedgekeurd door CP:",null,{"$f":"'1e kwartaal'!CT12+1","v":"2016-03-28"},{"$f":"H12+1","v":"2016-03-29"},{"$f":"I12+1","v":"2016-03-30"},"2016-03-31","2016-04-01","2016-04-02","2016-04-03","2016-04-04","2016-04-05","2016-04-06","2016-04-07","2016-04-08","2016-04-09","2016-04-10","2016-04-11","2016-04-12","2016-04-13","2016-04-14","2016-04-15","2016-04-16","2016-04-17","2016-04-18","2016-04-19","2016-04-20","2016-04-21","2016-04-22","2016-04-23","2016-04-24","2016-04-25","2016-04-26","2016-04-27","2016-04-28","2016-04-29","2016-04-30","2016-05-01","2016-05-02","2016-05-03","2016-05-04","2016-05-05","2016-05-06","2016-05-07","2016-05-08","2016-05-09","2016-05-10","2016-05-11","2016-05-12","2016-05-13","2016-05-14","2016-05-15","2016-05-16","2016-05-17","2016-05-18","2016-05-19","2016-05-20","2016-05-21","2016-05-22","2016-05-23","2016-05-24","2016-05-25","2016-05-26","2016-05-27","2016-05-28","2016-05-29","2016-05-30","2016-05-31","2016-06-01",{"$f":"BU12+1","v":"2016-06-02"},"2016-06-03","2016-06-04","2016-06-05","2016-06-06","2016-06-07","2016-06-08","2016-06-09","2016-06-10","2016-06-11","2016-06-12","2016-06-13","2016-06-14","2016-06-15","2016-06-16","2016-06-17","2016-06-18","2016-06-19","2016-06-20","2016-06-21","2016-06-22","2016-06-23","2016-06-24","2016-06-25","2016-06-26"]
[null,"Jan","2016-01-06","2016-01-23","vakantie","ja"]
[null,"Pietje Puk","2016-01-12","2016-01-22"]
[null,"Klaas","2016-02-10","2016-02-23"]
[null,"Dikkie Dik","2016-01-01","2016-01-10"]
[null,"Bert"]
[null,"persoon 6"]
[null,"persoon 7"]
[null,"persoon 8"]
[null,"persoon 9"]
[null,"persoon 10"]
[null,"persoon 11"]
[null,"persoon 12"]
[null,"persoon 13"]
[null,"persoon 14"]
[null,"persoon 15"]
[null,"persoon 16"]
[null,"persoon 17"]
[null,"persoon 18"]
[null,"persoon 19"]
[null,"persoon 20"]
[null,"persoon 21"]
[null,"persoon 22"]
[null,"persoon 23"]
[null,"persoon 24"]
[null,"persoon 25"]
[null,"persoon 26"]
[null,"persoon 27"]
[null,"persoon 28"]
[null,"persoon 29"]
[null,"persoon 30"]
[null,"persoon 31"]
[null,"persoon 32"]
[null,"persoon 33"]
[null,"persoon 34"]
[null,"persoon 35"]
[null,"persoon 36"]
[null,"persoon 37"]
[null,"persoon 38"]
[null,"persoon 39"]
[null,"persoon 40"]
[null,"persoon 41"]
[null,"persoon 42"]
[null,"persoon 43"]
[null,"persoon 44"]
[null,"persoon 45"]
[null,"persoon 46"]
[null,"persoon 47"]
[null,"persoon 48"]
[null,"persoon 49"]
[null,"persoon 50"]
[null,"persoon 51"]
[null,"persoon 52"]
[null,"persoon 53"]
[null,"persoon 54"]
[null,"persoon 55"]
[null,"persoon 56"]
[null,"persoon 57"]
[null,"persoon 58"]
[null,"persoon 59"]
[null,"persoon 60"]
[null,"persoon 61"]
[null,"persoon 62"]
[null,"persoon 63"]
[null,"persoon 64"]
[null,"persoon 65"]
[null,"persoon 66"]
[null,"persoon 67"]
[null,"persoon 68"]
[null,"persoon 69"]
[null,"persoon 70"]
[null,"persoon 71"]
[null,"persoon 72"]
[null,"persoon 73"]
[null,"persoon 74"]
[null,"persoon 75"]
[null,"persoon 76"]
[null,"persoon 77"]
[null,"persoon 78"]
[null,"persoon 79"]
[null,"persoon 80"]
[null,"persoon 81"]
[null,"persoon 82"]
[null,"persoon 83"]
[null,"persoon 84"]
[null,"persoon 85"]
[null,"persoon 86"]
[null,"persoon 87"]
[null,"persoon 88"]
[null,"persoon 89"]
[null,"persoon 90"]
[null,"persoon 91"]
[null,"persoon 92"]
[null,"persoon 93"]
[null,"persoon 94"]
[null,"persoon 95"]
[null,"persoon 96"]
[null,"persoon 97"]
[null,"persoon 98"]
[null,"persoon 99"]
[null,"persoon 100"]

{"sheet":"3e kwartaal","index":3,"n_rows":112,"n_cols":98,"rows_kept":112,"cut":false,"hidden":false,"merged":[[2,1,2,5],[7,2,7,5],[9,28,9,34],[9,7,9,13],[9,14,9,20],[9,21,9,27],[6,50,6,52],[9,91,9,97],[9,77,9,83],[9,84,9,90],[9,42,9,48],[9,49,9,55],[9,56,9,62],[9,63,9,69],[9,70,9,76],[3,81,3,83],[9,35,9,41],[2,19,2,21],[2,50,2,52],[2,81,2,83],[7,50,7,52],[4,81,4,83],[5,81,5,83],[6,81,6,83],[3,19,3,21],[4,19,4,21],[5,19,5,21],[6,19,6,21],[3,50,3,52],[4,50,4,52],[5,50,5,52]]}
[null,"jaar:",2016,null,null,null,null,null,null,"Juli",null,null,null,null,null,null,null,null,null,null,null,null,null,null,null,null,null,null,null,null,null,null,null,null,null,null,null,null,null,null,"Augustus",null,null,null,null,null,null,null,null,null,null,null,null,null,null,null,null,null,null,null,null,null,null,null,null,null,null,null,null,null,null,"September"]
[null,null,null,null,null,null,null,null,null,"Week",null,"M","D","W","D","V","Z","Z",null,null,null,null,null,null,null,null,null,null,null,null,null,null,null,null,null,null,null,null,null,null,"Week",null,"M","D","W","D","V","Z","Z",null,null,null,null,null,null,null,null,null,null,null,null,null,null,null,null,null,null,null,null,null,null,"Week",null,"M","D","W","D","V","Z","Z"]
[null,null,null,null,null,null,null,null,null,27,null,null,null,1,2,3,4,5,null,{"$f":"IFERROR(SMALL(jul,ROW()-2),\"\")","v":""},null,null,{"$f":"IFERROR(VLOOKUP(T3,feestdagen,2,0),\"\")","v":""},null,null,null,null,null,null,null,null,null,null,null,null,null,null,null,null,null,31,null,null,null,null,null,null,1,2,null,{"$f":"IFERROR(SMALL(aug,ROW()-2),\"\")","v":""},null,null,{"$f":"IFERROR(VLOOKUP(AY3,feestdagen,2,0),\"\")","v":""},null,null,null,null,null,null,null,null,null,null,null,null,null,null,null,null,null,36,null,null,1,2,3,4,5,6,null,{"$f":"IFERROR(SMALL(sep,ROW()-2),\"\")","v":"2016-09-20"},null,null,{"$f":"IFERROR(VLOOKUP(CD3,feestdagen,2,0),\"\")","v":"Prinsjesdag (N)"}]
[null,null,null,null,null,null,null,null,null,28,null,6,7,8,9,10,11,12,null,{"$f":"IFERROR(SMALL(jul,ROW()-2),\"\")","v":""},null,null,{"$f":"IFERROR(VLOOKUP(T4,feestdagen,2,0),\"\")","v":""},null,null,null,null,null,null,null,null,null,null,null,null,null,null,null,null,null,32,null,3,4,5,6,7,8,9,null,"",null,null,"",null,null,null,null,null,null,null,null,null,null,null,null,null,null,null,null,null,37,null,7,8,9,10,11,12,13,null,{"$f":"IFERROR(SMALL(sep,ROW()-2),\"\")","v":""},null,null,{"$f":"IFERROR(VLOOKUP(CD4,feestdagen,2,0),\"\")","v":""}]
[null,null,null,null,null,null,null,null,null,29,null,13,14,15,16,17,18,19,null,{"$f":"IFERROR(SMALL(jul,ROW()-2),\"\")","v":""},null,null,{"$f":"IFERROR(VLOOKUP(T5,feestdagen,2,0),\"\")","v":""},null,null,null,null,null,null,null,null,null,null,null,null,null,null,null,null,null,33,null,10,11,12,13,14,15,16,null,"",null,null,"",null,null,null,null,null,null,null,null,null,null,null,null,null,null,null,null,null,38,null,14,15,16,17,18,19,20,null,{"$f":"IFERROR(SMALL(sep,ROW()-2),\"\")","v":""},null,null,{"$f":"IFERROR(VLOOKUP(CD5,feestdagen,2,0),\"\")","v":""}]
[null,null,null,null,null,null,null,null,null,30,null,20,21,22,23,24,25,26,null,{"$f":"IFERROR(SMALL(jul,ROW()-2),\"\")","v":""},null,null,{"$f":"IFERROR(VLOOKUP(T6,feestdagen,2,0),\"\")","v":""},null,null,null,null,null,null,null,null,null,null,null,null,null,null,null,null,null,34,null,17,18,19,20,21,22,23,null,"",null,null,"",null,null,null,null,null,null,null,null,null,null,null,null,null,null,null,null,null,39,null,21,22,23,24,25,26,27,null,{"$f":"IFERROR(SMALL(sep,ROW()-2),\"\")","v":""},null,null,{"$f":"IFERROR(VLOOKUP(CD6,feestdagen,2,0),\"\")","v":""}]
[null,null,null,null,null,null,null,null,null,31,null,27,28,29,30,31,null,null,null,{"$f":"IFERROR(SMALL(jul,ROW()-2),\"\")","v":""},null,null,{"$f":"IFERROR(VLOOKUP(T7,feestdagen,2,0),\"\")","v":""},null,null,null,null,null,null,null,null,null,null,null,null,null,null,null,null,null,35,null,24,25,26,27,28,29,30,null,"",null,null,"",null,null,null,null,null,null,null,null,null,null,null,null,null,null,null,null,null,40,null,28,29,30,null,null,null,null,null,{"$f":"IFERROR(SMALL(sep,ROW()-2),\"\")","v":""},null,null,{"$f":"IFERROR(VLOOKUP(CD7,feestdagen,2,0),\"\")","v":""}]
[null,null,null,null,null,null,null,null,null,null,null,null,null,null,null,null,null,null,null,null,null,null,null,null,null,null,null,null,null,null,null,null,null,null,null,null,null,null,null,null,36,null,31,null,null,null,null,null,null,null,"",null,null,""]
[null,null,null,null,null,null,null,{"$f":"MONTH(H12)","v":6},{"$f":"MONTH(I12)","v":6},6,6,7,7,7,7,7,7,7,7,7,7,7,7,7,7,7,7,7,7,7,7,7,7,7,7,7,7,7,7,7,7,7,8,8,8,8,8,8,8,8,8,8,8,8,8,8,8,8,8,8,8,8,8,8,8,8,8,8,8,8,8,8,{"$f":"MONTH(BU12)","v":8},9,9,9,9,9,9,9,9,9,9,9,9,9,9,9,9,9,9,9,9,9,9,9,9,9]
[null,null,null,null,null,null,null,"Week 27",null,null,null,null,null,null,"Week 28",null,null,null,null,null,null,"Week 29",null,null,null,null,null,null,"Week 30",null,null,null,null,null,null,"Week 31",null,null,null,null,null,null,"Week 32",null,null,null,null,null,null,"Week 33",null,null,null,null,null,null,"Week 34",null,null,null,null,null,null,"Week 35",null,null,null,null,null,null,"Week 36",null,null,null,null,null,null,"Week 37",null,null,null,null,null,null,"Week 38",null,null,null,null,null,null,"Week 39"]
[null,null,null,null,null,null,null,"M","D","W","D","V","Z","Z","M","D","W","D","V","Z","Z","M","D","W","D","V","Z","Z","M","D","W","D","V","Z","Z","M","D","W","D","V","Z","Z","M","D","W","D","V","Z","Z","M","D","W","D","V","Z","Z","M","D","W","D","V","Z","Z","M","D","W","D","V","Z","Z","M","D","W","D","V","Z","Z","M","D","W","D","V","Z","Z","M","D","W","D","V","Z","Z","M","D","W","D","V","Z","Z"]
[null,"Naam:","van:","tot:","Verlof:","Goedgekeurd door CP:",null,{"$f":"'2e kwartaal'!CT12+1","v":"2016-06-27"},{"$f":"H12+1","v":"2016-06-28"},{"$f":"I12+1","v":"2016-06-29"},"2016-06-30","2016-07-01","2016-07-02","2016-07-03","2016-07-04","2016-07-05","2016-07-06","2016-07-07","2016-07-08","2016-07-09","2016-07-10","2016-07-11","2016-07-12","2016-07-13","2016-07-14","2016-07-15","2016-07-16","2016-07-17","2016-07-18","2016-07-19","2016-07-20","2016-07-21","2016-07-22","2016-07-23","2016-07-24","2016-07-25","2016-07-26","2016-07-27","2016-07-28","2016-07-29","2016-07-30","2016-07-31","2016-08-01","2016-08-02","2016-08-03","2016-08-04","2016-08-05","2016-08-06","2016-08-07","2016-08-08","2016-08-09","2016-08-10","2016-08-11","2016-08-12","2016-08-13","2016-08-14","2016-08-15","2016-08-16","2016-08-17","2016-08-18","2016-08-19","2016-08-20","2016-08-21","2016-08-22","2016-08-23","2016-08-24","2016-08-25","2016-08-26","2016-08-27","2016-08-28","2016-08-29","2016-08-30","2016-08-31",{"$f":"BU12+1","v":"2016-09-01"},"2016-09-02","2016-09-03","2016-09-04","2016-09-05","2016-09-06","2016-09-07","2016-09-08","2016-09-09","2016-09-10","2016-09-11","2016-09-12","2016-09-13","2016-09-14","2016-09-15","2016-09-16","2016-09-17","2016-09-18","2016-09-19","2016-09-20","2016-09-21","2016-09-22","2016-09-23","2016-09-24","2016-09-25"]
[null,"Jan","2016-01-06","2016-01-23","vakantie","ja"]
[null,"Pietje Puk","2016-01-12","2016-01-22"]
[null,"Klaas","2016-02-10","2016-02-23"]
[null,"Dikkie Dik","2016-01-01","2016-01-10"]
[null,"Bert"]
[null,"persoon 6"]
[null,"persoon 7"]
[null,"persoon 8"]
[null,"persoon 9"]
[null,"persoon 10"]
[null,"persoon 11"]
[null,"persoon 12"]
[null,"persoon 13"]
[null,"persoon 14"]
[null,"persoon 15"]
[null,"persoon 16"]
[null,"persoon 17"]
[null,"persoon 18"]
[null,"persoon 19"]
[null,"persoon 20"]
[null,"persoon 21"]
[null,"persoon 22"]
[null,"persoon 23"]
[null,"persoon 24"]
[null,"persoon 25"]
[null,"persoon 26"]
[null,"persoon 27"]
[null,"persoon 28"]
[null,"persoon 29"]
[null,"persoon 30"]
[null,"persoon 31"]
[null,"persoon 32"]
[null,"persoon 33"]
[null,"persoon 34"]
[null,"persoon 35"]
[null,"persoon 36"]
[null,"persoon 37"]
[null,"persoon 38"]
[null,"persoon 39"]
[null,"persoon 40"]
[null,"persoon 41"]
[null,"persoon 42"]
[null,"persoon 43"]
[null,"persoon 44"]
[null,"persoon 45"]
[null,"persoon 46"]
[null,"persoon 47"]
[null,"persoon 48"]
[null,"persoon 49"]
[null,"persoon 50"]
[null,"persoon 51"]
[null,"persoon 52"]
[null,"persoon 53"]
[null,"persoon 54"]
[null,"persoon 55"]
[null,"persoon 56"]
[null,"persoon 57"]
[null,"persoon 58"]
[null,"persoon 59"]
[null,"persoon 60"]
[null,"persoon 61"]
[null,"persoon 62"]
[null,"persoon 63"]
[null,"persoon 64"]
[null,"persoon 65"]
[null,"persoon 66"]
[null,"persoon 67"]
[null,"persoon 68"]
[null,"persoon 69"]
[null,"persoon 70"]
[null,"persoon 71"]
[null,"persoon 72"]
[null,"persoon 73"]
[null,"persoon 74"]
[null,"persoon 75"]
[null,"persoon 76"]
[null,"persoon 77"]
[null,"persoon 78"]
[null,"persoon 79"]
[null,"persoon 80"]
[null,"persoon 81"]
[null,"persoon 82"]
[null,"persoon 83"]
[null,"persoon 84"]
[null,"persoon 85"]
[null,"persoon 86"]
[null,"persoon 87"]
[null,"persoon 88"]
[null,"persoon 89"]
[null,"persoon 90"]
[null,"persoon 91"]
[null,"persoon 92"]
[null,"persoon 93"]
[null,"persoon 94"]
[null,"persoon 95"]
[null,"persoon 96"]
[null,"persoon 97"]
[null,"persoon 98"]
[null,"persoon 99"]
[null,"persoon 100"]

{"sheet":"4e kwartaal","index":4,"n_rows":112,"n_cols":105,"rows_kept":112,"cut":false,"hidden":false,"merged":[[9,35,9,41],[9,21,9,27],[9,28,9,34],[9,98,9,104],[9,70,9,76],[9,63,9,69],[9,42,9,48],[9,49,9,55],[2,1,2,5],[7,2,7,5],[9,7,9,13],[9,14,9,20],[2,20,2,23],[3,20,3,23],[4,20,4,23],[5,20,5,23],[6,20,6,23],[6,81,6,84],[3,51,3,54],[4,51,4,54],[9,56,9,62],[9,91,9,97],[9,77,9,83],[9,84,9,90],[6,51,6,54],[7,51,7,54],[2,51,2,54],[2,81,2,84],[3,81,3,84],[4,81,4,84],[5,81,5,84],[5,51,5,54]]}
[null,"jaar:",2016,null,null,null,null,null,null,null,"Oktober",null,null,null,null,null,null,null,null,null,null,null,null,null,null,null,null,null,null,null,null,null,null,null,null,null,null,null,null,null,null,"November",null,null,null,null,null,null,null,null,null,null,null,null,null,null,null,null,null,null,null,null,null,null,null,null,null,null,null,null,null,"December"]
[null,null,null,null,null,null,null,null,null,null,"Week",null,"M","D","W","D","V","Z","Z",null,null,null,null,null,null,null,null,null,null,null,null,null,null,null,null,null,null,null,null,null,null,"Week",null,"M","D","W","D","V","Z","Z",null,null,null,null,null,null,null,null,null,null,null,null,null,null,null,null,null,null,null,null,null,"Week",null,"M","D","W","D","V","Z","Z"]
[null,null,null,null,null,null,null,null,null,null,40,null,null,null,null,1,2,3,4,null,{"$f":"IFERROR(SMALL(okt,ROW()-2),\"\")","v":""},null,null,null,{"$f":"IFERROR(VLOOKUP(U3,feestdagen,2,0),\"\")","v":""},null,null,null,null,null,null,null,null,null,null,null,null,null,null,null,null,44,null,null,null,null,null,null,null,1,null,{"$f":"IFERROR(SMALL(okt,ROW()-2),\"\")","v":""},null,null,null,{"$f":"IFERROR(VLOOKUP(AZ3,feestdagen,2,0),\"\")","v":""},null,null,null,null,null,null,null,null,null,null,null,null,null,null,null,49,null,null,1,2,3,4,5,6,null,{"$f":"IFERROR(SMALL(dec,ROW()-2),\"\")","v":"2016-12-05"},null,null,null,{"$f":"IFERROR(VLOOKUP(CD3,feestdagen,2,0),\"\")","v":"Sinterklaas (N)"}]
[null,null,null,null,null,null,null,null,null,null,41,null,5,6,7,8,9,10,11,null,{"$f":"IFERROR(SMALL(okt,ROW()-2),\"\")","v":""},null,null,null,{"$f":"IFERROR(VLOOKUP(U4,feestdagen,2,0),\"\")","v":""},null,null,null,null,null,null,null,null,null,null,null,null,null,null,null,null,45,null,2,3,4,5,6,7,8,null,"",null,null,null,"",null,null,null,null,null,null,null,null,null,null,null,null,null,null,null,50,null,7,8,9,10,11,12,13,null,{"$f":"IFERROR(SMALL(dec,ROW()-2),\"\")","v":"2016-12-25"},null,null,null,{"$f":"IFERROR(VLOOKUP(CD4,feestdagen,2,0),\"\")","v":"1e Kerstdag"}]
[null,null,null,null,null,null,null,null,null,null,42,null,12,13,14,15,16,17,18,null,{"$f":"IFERROR(SMALL(okt,ROW()-2),\"\")","v":""},null,null,null,{"$f":"IFERROR(VLOOKUP(U5,feestdagen,2,0),\"\")","v":""},null,null,null,null,null,null,null,null,null,null,null,null,null,null,null,null,46,null,9,10,11,12,13,14,15,null,"",null,null,null,"",null,null,null,null,null,null,null,null,null,null,null,null,null,null,null,51,null,14,15,16,17,18,19,20,null,{"$f":"IFERROR(SMALL(dec,ROW()-2),\"\")","v":"2016-12-26"},null,null,null,{"$f":"IFERROR(VLOOKUP(CD5,feestdagen,2,0),\"\")","v":"2e Kerstdag"}]
[null,null,null,null,null,null,null,null,null,null,43,null,19,20,21,22,23,24,25,null,{"$f":"IFERROR(SMALL(okt,ROW()-2),\"\")","v":""},null,null,null,{"$f":"IFERROR(VLOOKUP(U6,feestdagen,2,0),\"\")","v":""},null,null,null,null,null,null,null,null,null,null,null,null,null,null,null,null,47,null,16,17,18,19,20,21,22,null,"",null,null,null,"",null,null,null,null,null,null,null,null,null,null,null,null,null,null,null,52,null,21,22,23,24,25,26,27,null,{"$f":"IFERROR(SMALL(dec,ROW()-2),\"\")","v":"2016-12-31"},null,null,null,{"$f":"IFERROR(VLOOKUP(CD6,feestdagen,2,0),\"\")","v":"Oudejaarsdag"}]
[null,null,null,null,null,null,null,null,null,null,44,null,26,27,28,29,30,31,null,null,{"$f":"IFERROR(SMALL(okt,ROW()-2),\"\")","v":""},null,null,null,{"$f":"IFERROR(VLOOKUP(U7,feestdagen,2,0),\"\")","v":""},null,null,null,null,null,null,null,null,null,null,null,null,null,null,null,null,48,null,23,24,25,26,27,28,29,null,"",null,null,null,"",null,null,null,null,null,null,null,null,null,null,null,null,null,null,null,53,null,28,29,30,31,null,null,null,null,{"$f":"IFERROR(SMALL(dec,ROW()-2),\"\")","v":""},null,null,null,{"$f":"IFERROR(VLOOKUP(CD7,feestdagen,2,0),\"\")","v":""}]
[null,null,null,null,null,null,null,null,null,null,null,null,null,null,null,null,null,null,null,null,null,null,null,null,null,null,null,null,null,null,null,null,null,null,null,null,null,null,null,null,null,49,null,30,null,null,null,null,null,null,null,"",null,null,null,""]
[null,null,null,null,null,null,null,{"$f":"MONTH(H12)","v":9},{"$f":"MONTH(I12)","v":9},9,9,9,10,10,10,10,10,10,10,10,10,10,10,10,10,10,10,10,10,10,10,10,10,10,10,10,10,10,10,10,10,10,10,11,11,11,11,11,11,11,11,11,11,11,11,11,11,11,11,11,11,11,11,11,11,11,11,11,11,11,11,11,{"$f":"MONTH(BU12)","v":11},12,12,12,12,12,12,12,12,12,12,12,12,12,12,12,12,12,12,12,12,12,12,12,12,12,{"$f":"IF(ISERROR(MONTH(CU12)),\"\",MONTH(CU12))","v":12},{"$f":"IF(ISERROR(MONTH(CV12)),\"\",MONTH(CV12))","v":12},12,12,12,12,""]
[null,null,null,null,null,null,null,"Week 40",null,null,null,null,null,null,"Week 41",null,null,null,null,null,null,"Week 42",null,null,null,null,null,null,"Week 43",null,null,null,null,null,null,"Week 44",null,null,null,null,null,null,"Week 45",null,null,null,null,null,null,"Week 46",null,null,null,null,null,null,"Week 47",null,null,null,null,null,null,"Week 48",null,null,null,null,null,null,"Week 49",null,null,null,null,null,null,"Week 50",null,null,null,null,null,null,"Week 51",null,null,null,null,null,null,"Week 52",null,null,null,null,null,null,"Week 53"]
[null,null,null,null,null,null,null,"M","D","W","D","V","Z","Z","M","D","W","D","V","Z","Z","M","D","W","D","V","Z","Z","M","D","W","D","V","Z","Z","M","D","W","D","V","Z","Z","M","D","W","D","V","Z","Z","M","D","W","D","V","Z","Z","M","D","W","D","V","Z","Z","M","D","W","D","V","Z","Z","M","D","W","D","V","Z","Z","M","D","W","D","V","Z","Z","M","D","W","D","V","Z","Z","M","D","W","D","V","Z","Z","M","D","W","D","V","Z","Z"]
[null,"Naam:","van:","tot:","Verlof:","Goedgekeurd door CP:",null,{"$f":"'3e kwartaal'!CT12+1","v":"2016-09-26"},{"$f":"H12+1","v":"2016-09-27"},{"$f":"I12+1","v":"2016-09-28"},"2016-09-29","2016-09-30","2016-10-01","2016-10-02","2016-10-03","2016-10-04","2016-10-05","2016-10-06","2016-10-07","2016-10-08","2016-10-09","2016-10-10","2016-10-11","2016-10-12","2016-10-13","2016-10-14","2016-10-15","2016-10-16","2016-10-17","2016-10-18","2016-10-19","2016-10-20","2016-10-21","2016-10-22","2016-10-23","2016-10-24","2016-10-25","2016-10-26","2016-10-27","2016-10-28","2016-10-29","2016-10-30","2016-10-31","2016-11-01","2016-11-02","2016-11-03","2016-11-04","2016-11-05","2016-11-06","2016-11-07","2016-11-08","2016-11-09","2016-11-10","2016-11-11","2016-11-12","2016-11-13","2016-11-14","2016-11-15","2016-11-16","2016-11-17","2016-11-18","2016-11-19","2016-11-20","2016-11-21","2016-11-22","2016-11-23","2016-11-24","2016-11-25","2016-11-26","2016-11-27","2016-11-28","2016-11-29","2016-11-30",{"$f":"BU12+1","v":"2016-12-01"},"2016-12-02","2016-12-03","2016-12-04","2016-12-05","2016-12-06","2016-12-07","2016-12-08","2016-12-09","2016-12-10","2016-12-11","2016-12-12","2016-12-13","2016-12-14","2016-12-15","2016-12-16","2016-12-17","2016-12-18","2016-12-19","2016-12-20","2016-12-21","2016-12-22","2016-12-23","2016-12-24",{"$f":"IF(CS$12=\"\",\"\",IF(MONTH(CS$12+1)=MONTH(CS$12),CS$12+1,\"\"))","v":"2016-12-25"},{"$f":"IF(CT$12=\"\",\"\",IF(MONTH(CT$12+1)=MONTH(CT$12),CT$12+1,\"\"))","v":"2016-12-26"},"2016-12-27","2016-12-28","2016-12-29","2016-12-30","2016-12-31",""]
[null,"Bert"]
[null,"Dikkie Dik","2016-01-01","2016-01-10"]
[null,"persoon 6"]
[null,"Klaas","2016-02-10","2016-02-23"]
[null,"Pietje Puk","2016-01-12","2016-01-22"]
[null,"Jan","2016-01-06","2016-01-23","vakantie","ja"]
[null,"persoon 7"]
[null,"persoon 8"]
[null,"persoon 9"]
[null,"persoon 10"]
[null,"persoon 11"]
[null,"persoon 12"]
[null,"persoon 13"]
[null,"persoon 14"]
[null,"persoon 15"]
[null,"persoon 16"]
[null,"persoon 17"]
[null,"persoon 18"]
[null,"persoon 19"]
[null,"persoon 20"]
[null,"persoon 21"]
[null,"persoon 22"]
[null,"persoon 23"]
[null,"persoon 24"]
[null,"persoon 25"]
[null,"persoon 26"]
[null,"persoon 27"]
[null,"persoon 28"]
[null,"persoon 29"]
[null,"persoon 30"]
[null,"persoon 31"]
[null,"persoon 32"]
[null,"persoon 33"]
[null,"persoon 34"]
[null,"persoon 35"]
[null,"persoon 36"]
[null,"persoon 37"]
[null,"persoon 38"]
[null,"persoon 39"]
[null,"persoon 40"]
[null,"persoon 41"]
[null,"persoon 42"]
[null,"persoon 43"]
[null,"persoon 44"]
[null,"persoon 45"]
[null,"persoon 46"]
[null,"persoon 47"]
[null,"persoon 48"]
[null,"persoon 49"]
[null,"persoon 50"]
[null,"persoon 51"]
[null,"persoon 52"]
[null,"persoon 53"]
[null,"persoon 54"]
[null,"persoon 55"]
[null,"persoon 56"]
[null,"persoon 57"]
[null,"persoon 58"]
[null,"persoon 59"]
[null,"persoon 60"]
[null,"persoon 61"]
[null,"persoon 62"]
[null,"persoon 63"]
[null,"persoon 64"]
[null,"persoon 65"]
[null,"persoon 66"]
[null,"persoon 67"]
[null,"persoon 68"]
[null,"persoon 69"]
[null,"persoon 70"]
[null,"persoon 71"]
[null,"persoon 72"]
[null,"persoon 73"]
[null,"persoon 74"]
[null,"persoon 75"]
[null,"persoon 76"]
[null,"persoon 77"]
[null,"persoon 78"]
[null,"persoon 79"]
[null,"persoon 80"]
[null,"persoon 81"]
[null,"persoon 82"]
[null,"persoon 83"]
[null,"persoon 84"]
[null,"persoon 85"]
[null,"persoon 86"]
[null,"persoon 87"]
[null,"persoon 88"]
[null,"persoon 89"]
[null,"persoon 90"]
[null,"persoon 91"]
[null,"persoon 92"]
[null,"persoon 93"]
[null,"persoon 94"]
[null,"persoon 95"]
[null,"persoon 96"]
[null,"persoon 97"]
[null,"persoon 98"]
[null,"persoon 99"]
[null,"persoon 100"]

{"sheet":"Formuleblad","index":5,"n_rows":88,"n_cols":1,"rows_kept":88,"cut":false,"hidden":true,"merged":[]}
["Kies hier uw dichtstbijzijnde Creyf's vestiging…."]
["Alkmaar , Canadaplein 8, 072 - 5116944, alkmaar@creyfs.nl"]
["Almelo, Rosa Luxemburgstraat 11, 0546 - 454160, almelo@creyfs.nl"]
["Almere, Schoutstraat 98, 036 - 5383280, almere@creyfs.nl"]
["Alphen a/d Rijn, De Aarhof 75, 0172 - 474981, alphenadrijn@creyfs.nl"]
["Amersfoort, Grote Haag 33, 033 - 4698000, amersfoort@creyfs.nl"]
["Amersfoort Office, Leusderweg 6, 033 - 4751868, amersfoortoffice@creyfs.nl"]
["Amstelveen, Stadsplein 89, 020 - 5035333, amstelveen@creyfs.nl"]
["Amsterdam, Damrak 37, 020 - 6254711, amsterdam.damrak@creyfs.nl"]
["Amsterdam, Van Baerlestraat 43, 020 - 3050200, amsterdam.vanbaerlestraat@creyfs.nl"]
["Amsterdam, Jan Evertsenstraat 89, 020 - 5891800, amsterdam.janevertsenstraat@creyfs.nl"]
["Amsterdam, Hoofddorpplein 22 - 24, 020 - 5110633, amsterdam.hoofddorpplein@creyfs.nl"]
["Amsterdam, Bijlmerdreef 99, 020 - 3113020, amsterdam.bijlmerdreef@creyfs.nl"]
["Amsterdam, Buikslotermeerplein 313, 020 - 6363131, amsterdam.buikslotermeer@creyfs.nl"]
["Apeldoorn, Nieuwstraat 8, 055 - 5787288, apeldoorn@creyfs.nl"]
["Arnhem, Looierstraat 42, 026 - 3521800, arnhem@creyfs.nl"]
["Arnhem Medical, Willemsplein 35, 026 - 3521805, arnhemmedical@creyfs.nl"]
["Assen, Lauwers 14, 0592 - 398417, assen@creyfs.nl"]
["Barendrecht, Middenbaan 105, 0180 - 611888, barendrecht@creyfs.nl"]
["Barneveld, Churchillstraat 69, 0342 - 408002, barneveld@creyfs.nl"]
["Bergen op Zoom, Burg. Van Hasseltstraat 52, 0164 - 213030, bergenopzoom@creyfs.nl"]
["Best, Oranjestraat 11, 0499 -390400, best@creyfs.nl"]
["Bladel, Sniederslaan 57-a, 0497 - 387363, bladel@creyfs.nl"]
["Boskoop, Koninginneweg 1-e, 0172 - 212424, boskoop@creyfs.nl"]
["Boxmeer, Burgemeester Verkuijlstraat 57 , 0485 - 580150, boxmeer@creyfs.nl"]
["Boxtel, Stationstraat 51a, 0411 - 674999, boxtel@creyfs.nl"]
["Breda, Van Coothplein 43 - 49, 076 - 5305630, breda@creyfs.nl"]
["Deventer, Sijzenbaanplein 11 - 15, 0570 - 665880, deventer@creyfs.nl"]
["Dongen, Hoge Ham 113-a, 0162 - 320512, dongen@creyfs.nl"]
["Dordrecht, Raamstraat 1f, 078 - 6392622, dordrecht@creyfs.nl"]
["Drachten, Moleneind Zuidzijde 69-b, 0512 - 541361, drachten@creyfs.nl"]
["Ede, Breelaan 3, 0318 - 652260, ede@creyfs.nl"]
["Eindhoven, Kruisstraat 94, 040 - 2463355, eindhoven.kruisstraat@creyfs.nl"]
["Eindhoven, Keizersgracht 28, 040 - 2606999, eindhoven.keizersgracht@creyfs.nl"]
["Emmeloord, Noordzijde 18 , 0527-630990, emmeloord@creyfs.nl"]
["Enschede, Beltstraat 1, 053 - 4344300, enschede@creyfs.nl"]
["Etten-Leur, Bisschopsmolenstraat 107, 076 - 5042450, ettenleur@creyfs.nl"]
["Genemuiden, Kruisstraat 7, 038 - 3851720, genemuiden@creyfs.nl"]
["Goes, Voorstad 3, 0113 - 211223, goes@creyfs.nl"]
["Gorinchem, Westwagenstraat 47, 0183 - 664871, gorinchem@creyfs.nl"]
["Gouda, Lange Tiendeweg 69, 0182 - 550505, gouda@creyfs.nl"]
["Den Haag, Turfmarkt 248, 070 - 3560545, denhaag@creyfs.nl"]
["Groenlo, Mattelierstraat 13, 0544 - 464303, groenlo@creyfs.nl"]
["Groningen, Oude Kijk in 't Jatstraat 29, 050 - 3199600, groningen@creyfs.nl"]
["Harderwijk, Donkerstraat 3, 0341 - 426616, harderwijk@creyfs.nl"]
["Heerenveen, Vleesmarkt 10, 0513 - 616900, heerenveen@creyfs.nl"]
["Helmond, Markt 51, 0492 - 509300, helmond@creyfs.nl"]
["Hengelo, Marktstraat 4, 074 - 2592570, hengelo@creyfs.nl"]
["Hertogenbosch 's, Stationsweg 21, 073 - 6130134, denbosch@creyfs.nl"]
["Hoofddorp, Concourslaan 2, 023 - 5671900, hoofddorp@creyfs.nl"]
["Hoogeveen, Van Echtenstraat 8, 0528 - 229420, hoogeveen@creyfs.nl"]
["Hardinxveld-Giessendam, Peulenstraat 222, 0184 - 616988, hardinxveldgiessendam@creyfs.nl"]
["Kampen, Plantage 16, 038 - 3328575, kampen@creyfs.nl"]
["Leeuwarden, De Kelders 15, 058 - 2137033, leeuwarden@creyfs.nl"]
["Lelystad, Stadhuisstraat 124, 0320 - 290190, lelystad@creyfs.nl"]
["Maarssen, Bisonspoor 2040, 0346 - 567300, maarssen@creyfs.nl"]
["Maastricht, Stationsstraat 31, 043 - 3256627, maastricht@creyfs.nl"]
["Meppel, Brouwersdwarsstraat 1, 0522 - 238820, meppel@creyfs.nl"]
["Middelburg, Lange Noordstraat 2, 0118 - 679040, middelburg@creyfs.nl"]
["Nijkerk, Holkerstraat 2, 033 - 2456964, nijkerk@creyfs.nl"]
["Nijmegen, Ziekerstraat 136, 024 - 3828100, nijmegen@creyfs.nl"]
["Oosterhout, Leijsenhoek 45a, 0162 - 497000, oosterhout@creyfs.nl"]
["Roosendaal, Nieuwe Markt 71, 0165 - 583130, roosendaal@creyfs.nl"]
["Rotterdam, Maasdamstraat 2a, 010 - 2150904, rotterdam.maasdamstraat@creyfs.nl"]
["Rotterdam, Meent 62 - 64, 010 - 4132480, rotterdam.meent@creyfs.nl"]
["Schiedam, Broersvest 50a, 010 - 2708070, schiedam@creyfs.nl"]
["Sneek, Oude Koemarkt 55, 0515 - 462515, sneek@creyfs.nl"]
["Tiel, Buurmalsenstraat 1, 0344 - 673900, tiel@creyfs.nl"]
["Tiel Intersales, Buurmalsenstraat 1, 0344 - 632111, tielintersales@creyfs.nl"]
["Tiel Intersales, Buurmalsenstraat 1, 0344 - 616070, tielintersales@creyfs.nl"]
["Tilburg, Spoorlaan 372, 013 - 5443248, tilburg@creyfs.nl"]
["Uden, Mondriaanplein 24, 0413 - 251755, uden@creyfs.nl"]
["Uithoorn, Marktplein 25, 0297 - 560171, uithoorn@creyfs.nl"]
["Urk, Wijk 2-76, 0527 - 680880, urk@creyfs.nl"]
["Utrecht, Bernadottelaan 146, 030 - 2916300, utrecht.bernadottelaan@creyfs.nl"]
["Utrecht, Biltstraat 71, 030 - 2307150, utrecht.biltstraat@creyfs.nl"]
["Utrecht Office, Potterstraat 10, 030 - 2343444, utrechtoffice@creyfs.nl"]
["Valkenswaard, Luikerweg 23, 040 - 2044995, valkenswaard@creyfs.nl"]
["Veghel, De Wiekslag 27, 0413 - 366808, veghel@creyfs.nl"]
["Waalwijk, Grotestraat 213, 0416 - 339519, waalwijk@creyfs.nl"]
["Weert, Maasstraat 11, 0495 - 580100, weert@creyfs.nl"]
["Weesp, Nieuwstad 4, 0294 - 430071, weesp@creyfs.nl"]
["Woerden, Meulmansweg 2a, 0348 - 411838, woerden@creyfs.nl"]
["Zaandam, Peperstraat 220, 075 - 6553500, zaandam@creyfs.nl"]
["Zeist , 2e Hogeweg 123, 030 - 6922084, zeist@creyfs.nl"]
["Zoetermeer, Noordwaarts 34, 079 - 3304500, zoetermeer@creyfs.nl"]
["Zwolle, Nieuwe Markt 1, 038 - 4210085, zwolle@creyfs.nl"]
["Zwolle Medical, Diezerpoortenplas 5, 038 - 4229888, zwollemedical@creyfs.nl"]