{"text_format":"1","workbook":"xlsx","n_sheets":6,"sheets":["data","1e kwartaal","2e kwartaal","3e kwartaal","4e kwartaal","Formuleblad"],"not_rendered":{"charts":0,"images":0,"macros":1,"external_links":0,"defined_names":28,"comments":0,"pivot_tables":0},"unopened":[],"bounds":{"document_bytes":16777216,"sheet_cells":100000,"rows_first":2000,"rows_last":500,"rows_between":2000,"halvings":0,"cell_chars":16384,"cell_head_chars":4096},"cells_cut":0,"cells_raw":0,"read":"whole","date_system":"1900"}

{"sheet":"data","index":0,"n_rows":81,"n_cols":27,"rows_kept":81,"cut":false,"hidden":false,"merged":[[49,3,49,4],[49,5,49,6],[49,7,49,8],[49,9,49,10],[36,7,36,9],[37,7,37,9],[38,7,38,9],[49,25,49,26],[49,11,49,12],[49,13,49,14],[49,15,49,16],[49,17,49,18],[49,19,49,20],[49,21,49,22],[49,23,49,24]]}
[{"$f":"A2-1","v":2015}]
[{"$f":"YEAR(NOW())","v":2016},null,"Het huidige jaar staat altijd in het midden."]
[{"$f":"A2+1","v":2017},null,{"$f":"\"Dus volgend jaar staat \" &A2+1 &\" in het midden.\"","v":"Dus volgend jaar staat 2017 in het midden."}]
[]
["Zijn er feestdagen die je niet nodig bebt, zet dan een spatie voor de formule in kolom A"]
[]
[{"$f":"DATE(jaar,1,1)","v":"2016-01-01"},"Nieuwjaarsdag"]
[" =DATUM(jaar;1;1+((1-(1>WEEKDAG(DATUM(jaar;1;1);2)))*7)+(1-WEEKDAG(DATUM(jaar;1;1);2)))","Driekoningen (N)"]
[" =DATUM(jaar;1;6)","Driekoningen (B)"]
[" =DATUM(jaar;2;14)","Sint-Valentijn"]
[" =AFRONDEN.BENEDEN(DAG(MINUUT(jaar/38)/2+56)&\"/5/\"&jaar;7)-81","Vastenavond (r.-k.)"]
[" =AFRONDEN.BENEDEN(DAG(MINUUT(jaar/38)/2+56)&\"/5/\"&jaar;7)-80","Aswoensdag (r.-k.)"]
[" =DATUM(jaar;3;12)","Biddag voor gewas en arbeid (pr.)"]
[" =DATUM(jaar;3;25)","Maria Boodschap (r.-k.)"]
[" =AFRONDEN.BENEDEN(DAG(MINUUT(jaar/38)/2+56)&\"/5/\"&jaar;7)-37","Witte Donderdag"]
[{"$f":"FLOOR(DAY(MINUTE(jaar/38)/2+56)&\"/5/\"&jaar,7)-36","v":"2016-03-25"},"Goede Vrijdag"]
[{"$f":"FLOOR(DAY(MINUTE(jaar/38)/2+56)&\"/5/\"&jaar,7)-34","v":"2016-03-27"},"1e Paasdag"]
[{"$f":"FLOOR(DAY(MINUTE(jaar/38)/2+56)&\"/5/\"&jaar,7)-33","v":"2016-03-28"},"2e paasdag"]
[{"$f":"IF(WEEKDAY(DATE(jaar,4,30))*1,DATE(jaar,4,27),DATE(jaar,4,30))","v":"2016-04-27"},"Koningsdag (N)"]
[" =DATUM(jaar;5;1)","Dag van de arbeid (B)"]
[{"$f":"DATE(jaar,5,5)","v":"2016-05-05"},"Bevreidingsdag (N)"]
[{"$f":"FLOOR(DAY(MINUTE(jaar/38)/2+56)&\"/5/\"&jaar,7)+5","v":"2016-05-05"},"Hemelvaartsdag"]
[" =DATUM(jaar;5;25)","Trinitatis (pr.)"]
[{"$f":"FLOOR(DAY(MINUTE(jaar/38)/2+56)&\"/5/\"&jaar,7)+15","v":"2016-05-15"},"1e Pinsterdag"]
[{"$f":"FLOOR(DAY(MINUTE(jaar/38)/2+56)&\"/5/\"&jaar,7)+16","v":"2016-05-16"},"2e Pinksterdag"]
[" =DATUM(jaar;6;1)","Sacramentsdag (r.-k.)"]
[" =DATUM(jaar;6;6)","H. Hartfeest (r.-k.)"]
[" =DATUM(jaar;7;11)","Ned.talige Cult. Gem. (B)"]
[" =DATUM(jaar;7;21)","Nationale feestdag (B)"]
[" =DATUM(jaar;8;15)","Maria-ten-hemelopneming (r.-k.)"]
[{"$f":"DATE(jaar,9,1)+IF(3<WEEKDAY(DATE(jaar,9,1)),7-WEEKDAY(DATE(jaar,9,1))+3,3-WEEKDAY(DATE(jaar,9,1)))+((3-1)*7)","v":"2016-09-20"},"Prinsjesdag (N)"]
[" =DATUM(jaar;9;27)","Franstalige Cult. Gem. (B)"]
[" =DATUM(jaar;12;26)-63-WEEKDAG(DATUM(jaar;12;26);2)","Missiezondag (r.-k.)"]
[" =DATUM(jaar;10;31)","Hervormingsdag (pr.)"]
[" =DATUM(jaar;11;1)","Allerheiligen (r.-k.)"]
[" =DATUM(jaar;11;2)","Allerzielen (r.-k.)"]
[" =F36=A38=DATUM(jaar;11;5)","Dankdag voor gewas en arbeid (pr.)"]
[" =DATUM(jaar;11;11)","Wapenstilstandsdag 1918 (B)"]
[" =DATUM(jaar;11;15)","Feest van de dynastie (B)"]
[" =DATUM(jaar;12;26)-28-WEEKDAG(DATUM(jaar;12;26);2)","1e Adventszondag"]
[" =DATUM(jaar;11;23)","Christus Koning (r.-k.)"]
[{"$f":"DATE(jaar,12,5)","v":"2016-12-05"},"Sinterklaas (N)"]
[" =DATUM(jaar;12;6)","Sinterklaas (B)"]
[" =DATUM(jaar;12;8)","Maria onbevlekte ontvangenis (r.-k.)",null,null,null,null,null,null,null,null,null,null,null,null,null," =ALS(ISFOUT(KLEINSTE($B$2:$AF$2;RIJ()-4));\"\";KLEINSTE($B$2:$AF$2;RIJ()-4))"]
[{"$f":"DATE(jaar,12,25)","v":"2016-12-25"},"1e Kerstdag"]
[{"$f":"DATE(jaar,12,26)","v":"2016-12-26"},"2e Kerstdag",null,null,null,null,null,null,null,null,null,null,null,null,null,{"$f":"SMALL(jan,1)","v":"2016-01-01"}]
[{"$f":"DATE(jaar,12,31)","v":"2016-12-31"},"Oudejaarsdag",null,null,null,null,null,null,null,null,null,null,null,null,null,{"$f":"SMALL(jan,2)","v":{"$error":"#NUM!"}}]
[]
[]
[null,null,null,"januari",null,"februari",null,"maart",null,"april",null,"mei",null,"juni",null,"juli",null,"augustus",null,"september",null,"oktober",null,"november",null,"december"]
[null,null,null,{"$f":"DATE(jaar,1,ROW()-50)","v":"2016-01-01"},{"$f":"IF(NOT(ISERROR(VLOOKUP(D51,feestdagen,1,0))),D51,\"\")","v":"2016-01-01"},{"$f":"DATE(jaar,2,ROW()-50)","v":"2016-02-01"},{"$f":"IF(NOT(ISERROR(VLOOKUP(F51,feestdagen,1,0))),F51,\"\")","v":""},{"$f":"DATE(jaar,3,ROW()-50)","v":"2016-03-01"},{"$f":"IF(NOT(ISERROR(VLOOKUP(H51,feestdagen,1,0))),H51,\"\")","v":""},{"$f":"DATE(jaar,4,ROW()-50)","v":"2016-04-01"},{"$f":"IF(NOT(ISERROR(VLOOKUP(J51,feestdagen,1,0))),J51,\"\")","v":""},{"$f":"DATE(jaar,5,ROW()-50)","v":"2016-05-01"},{"$f":"IF(NOT(ISERROR(VLOOKUP(L51,feestdagen,1,0))),L51,\"\")","v":""},{"$f":"DATE(jaar,6,ROW()-50)","v":"2016-06-01"},{"$f":"IF(NOT(ISERROR(VLOOKUP(N51,feestdagen,1,0))),N51,\"\")","v":""},{"$f":"DATE(jaar,7,ROW()-50)","v":"2016-07-01"},{"$f":"IF(NOT(ISERROR(VLOOKUP(P51,feestdagen,1,0))),P51,\"\")","v":""},{"$f":"DATE(jaar,8,ROW()-50)","v":"2016-08-01"},{"$f":"IF(NOT(ISERROR(VLOOKUP(R51,feestdagen,1,0))),R51,\"\")","v":""},{"$f":"DATE(jaar,9,ROW()-50)","v":"2016-09-01"},{"$f":"IF(NOT(ISERROR(VLOOKUP(T51,feestdagen,1,0))),T51,\"\")","v":""},{"$f":"DATE(jaar,10,ROW()-50)","v":"2016-10-01"},{"$f":"IF(NOT(ISERROR(VLOOKUP(V51,feestdagen,1,0))),V51,\"\")","v":""},{"$f":"DATE(jaar,11,ROW()-50)","v":"2016-11-01"},{"$f":"IF(NOT(ISERROR(VLOOKUP(X51,feestdagen,1,0))),X51,\"\")","v":""},{"$f":"DATE(jaar,12,ROW()-50)","v":"2016-12-01"},{"$f":"IF(NOT(ISERROR(VLOOKUP(Z51,feestdagen,1,0))),Z51,\"\")","v":""}]
[null,null,null,{"$f":"D51+1","v":"2016-01-02"},"",{"$f":"F51+1","v":"2016-02-02"},"",{"$f":"H51+1","v":"2016-03-02"},"",{"$f":"J51+1","v":"2016-04-02"},"","2016-05-02","","2016-06-02","","2016-07-02","","2016-08-02","","2016-09-02","","2016-10-02","","2016-11-02","","2016-12-02",""]
[null,null,null,{"$f":"D52+1","v":"2016-01-03"},"",{"$f":"F52+1","v":"2016-02-03"},"",{"$f":"H52+1","v":"2016-03-03"},"",{"$f":"J52+1","v":"2016-04-03"},"",{"$f":"L52+1","v":"2016-05-03"},"",{"$f":"N52+1","v":"2016-06-03"},"",{"$f":"P52+1","v":"2016-07-03"},"",{"$f":"R52+1","v":"2016-08-03"},"",{"$f":"T52+1","v":"2016-09-03"},"",{"$f":"V52+1","v":"2016-10-03"},"",{"$f":"X52+1","v":"2016-11-03"},"",{"$f":"Z52+1","v":"2016-12-03"},""]
[null,null,null,"2016-01-04","","2016-02-04","","2016-03-04","","2016-04-04","","2016-05-04","","2016-06-04","","2016-07-04","","2016-08-04","","2016-09-04","","2016-10-04","","2016-11-04","","2016-12-04",""]
[null,null,null,"2016-01-05","","2016-02-05","","2016-03-05","","2016-04-05","","2016-05-05","2016-05-05","2016-06-05","","2016-07-05","","2016-08-05","","2016-09-05","","2016-10-05","","2016-11-05","","2016-12-05","2016-12-05"]
[null,null,null,"2016-01-06","","2016-02-06","","2016-03-06","","2016-04-06","","2016-05-06","","2016-06-06","","2016-07-06","","2016-08-06","","2016-09-06","","2016-10-06","","2016-11-06","","2016-12-06",""]
[null,null,null,"2016-01-07","","2016-02-07","","2016-03-07","","2016-04-07","","2016-05-07","","2016-06-07","","2016-07-07","","2016-08-07","","2016-09-07","","2016-10-07","","2016-11-07","","2016-12-07",""]
[null,null,null,"2016-01-08","","2016-02-08","","2016-03-08","","2016-04-08","","2016-05-08","","2016-06-08","","2016-07-08","","2016-08-08","","2016-09-08","","2016-10-08","","2016-11-08","","2016-12-08",""]
[null,null,null,"2016-01-09","","2016-02-09","","2016-03-09","","2016-04-09","","2016-05-09","","2016-06-09","","2016-07-09","","2016-08-09","","2016-09-09","","2016-10-09","","2016-11-09","","2016-12-09",""]
[null,null,null,"2016-01-10","","2016-02-10","","2016-03-10","","2016-04-10","","2016-05-10","","2016-06-10","","2016-07-10","","2016-08-10","","2016-09-10","","2016-10-10","","2016-11-10","","2016-12-10",""]
[null,null,null,"2016-01-11","","2016-02-11","","2016-03-11","","2016-04-11","","2016-05-11","","2016-06-11","","2016-07-11","","2016-08-11","","2016-09-11","","2016-10-11","","2016-11-11","","2016-12-11",""]
[null,null,null,"2016-01-12","","2016-02-12","","2016-03-12","","2016-04-12","","2016-05-12","","2016-06-12","","2016-07-12","","2016-08-12","","2016-09-12","","2016-10-12","","2016-11-12","","2016-12-12",""]
[null,null,null,"2016-01-13","","2016-02-13","","2016-03-13","","2016-04-13","","2016-05-13","","2016-06-13","","2016-07-13","","2016-08-13","","2016-09-13","","2016-10-13","","2016-11-13","","2016-12-13",""]
[null,null,null,"2016-01-14","","2016-02-14","","2016-03-14","","2016-04-14","","2016-05-14","","2016-06-14","","2016-07-14","","2016-08-14","","2016-09-14","","2016-10-14","","2016-11-14","","2016-12-14",""]
[null,null,null,"2016-01-15","","2016-02-15","","2016-03-15","","2016-04-15","","2016-05-15","2016-05-15","2016-06-15","","2016-07-15","","2016-08-15","","2016-09-15","","2016-10-15","","2016-11-15","","2016-12-15",""]
[null,null,null,"2016-01-16","","2016-02-16","","2016-03-16","","2016-04-16","","2016-05-16","2016-05-16","2016-06-16","","2016-07-16","","2016-08-16","","2016-09-16","","2016-10-16","","2016-11-16","","2016-12-16",""]
[null,null,null,"2016-01-17","","2016-02-17","","2016-03-17","","2016-04-17","","2016-05-17","","2016-06-17","","2016-07-17","","2016-08-17","","2016-09-17","","2016-10-17","","2016-11-17","","2016-12-17",""]
[null,null,null,"2016-01-18","","2016-02-18","","2016-03-18","","2016-04-18","","2016-05-18","","2016-06-18","","2016-07-18","","2016-08-18","","2016-09-18","","2016-10-18","","2016-11-18","","2016-12-18",""]
[null,null,null,"2016-01-19","","2016-02-19","","2016-03-19","","2016-04-19","","2016-05-19","","2016-06-19","","2016-07-19","","2016-08-19","","2016-09-19","","2016-10-19","","2016-11-19","","2016-12-19",""]
[null,null,null,"2016-01-20","","2016-02-20","","2016-03-20","","2016-04-20","","2016-05-20","","2016-06-20","","2016-07-20","","2016-08-20","","2016-09-20","2016-09-20","2016-10-20","","2016-11-20","","2016-12-20",""]
[null,null,null,"2016-01-21","","2016-02-21","","2016-03-21","","2016-04-21","","2016-05-21","","2016-06-21","","2016-07-21","","2016-08-21","","2016-09-21","","2016-10-21","","2016-11-21","","2016-12-21",""]
[null,null,null,"2016-01-22","","2016-02-22","","2016-03-22","","2016-04-22","","2016-05-22","","2016-06-22","","2016-07-22","","2016-08-22","","2016-09-22","","2016-10-22","","2016-11-22","","2016-12-22",""]
[null,null,null,"2016-01-23","","2016-02-23","","2016-03-23","","2016-04-23","","2016-05-23","","2016-06-23","","2016-07-23","","2016-08-23","","2016-09-23","","2016-10-23","","2016-11-23","","2016-12-23",""]
[null,null,null,"2016-01-24","","2016-02-24","","2016-03-24","","2016-04-24","","2016-05-24","","2016-06-24","","2016-07-24","","2016-08-24","","2016-09-24","","2016-10-24","","2016-11-24","","2016-12-24",""]
[null,null,null,"2016-01-25","","2016-02-25","","2016-03-25","2016-03-25","2016-04-25","","2016-05-25","","2016-06-25","","2016-07-25","","2016-08-25","","2016-09-25","","2016-10-25","","2016-11-25","","2016-12-25","2016-12-25"]
[null,null,null,"2016-01-26","","2016-02-26","","2016-03-26","","2016-04-26","","2016-05-26","","2016-06-26","","2016-07-26","","2016-08-26","","2016-09-26","","2016-10-26","","2016-11-26","","2016-12-26","2016-12-26"]
[null,null,null,"2016-01-27","","2016-02-27","","2016-03-27","2016-03-27","2016-04-27","2016-04-27","2016-05-27","","2016-06-27","","2016-07-27","","2016-08-27","","2016-09-27","","2016-10-27","","2016-11-27","","2016-12-27",""]
[null,null,null,"2016-01-28","","2016-02-28","","2016-03-28","2016-03-28","2016-04-28","","2016-05-28","","2016-06-28","","2016-07-28","","2016-08-28","","2016-09-28","","2016-10-28","","2016-11-28","","2016-12-28",""]
[null,null,null,"2016-01-29","",{"$f":"IF(MONTH(F78+1)=MONTH(F78),F78+1,\"\")","v":"2016-02-29"},"","2016-03-29","","2016-04-29","","2016-05-29","","2016-06-29","","2016-07-29","","2016-08-29","","2016-09-29","","2016-10-29","","2016-11-29","","2016-12-29",""]
[null,null,null,"2016-01-30","",null,null,"2016-03-30","","2016-04-30","","2016-05-30","","2016-06-30","","2016-07-30","","2016-08-30","","2016-09-30","","2016-10-30","","2016-11-30","","2016-12-30",""]
[null,null,null,"2016-01-31","",null,null,"2016-03-31","",null,null,"2016-05-31","",null,null,"2016-07-31","","2016-08-31","",null,null,"2016-10-31","",null,null,"2016-12-31","2016-12-31"]

{"sheet":"1e kwartaal","index":1,"n_rows":112,"n_cols":188,"rows_kept":112,"cut":false,"hidden":false,"merged":[[9,174,9,180],[9,181,9,187],[9,139,9,145],[9,146,9,152],[9,153,9,159],[9,160,9,166],[9,167,9,173],[9,104,9,110],[9,111,9,117],[9,118,9,124],[9,125,9,131],[9,132,9,138],[5,170,5,172],[6,109,6,111],[6,112,6,116],[6,139,6,141],[6,142,6,146],[6,147,6,151],[6,170,6,172],[5,109,5,111],[5,112,5,116],[5,139,5,141],[5,142,5,146],[5,147,5,151],[3,109,3,111],[3,112,3,116],[3,139,3,141],[3,170,3,172],[4,109,4,111],[4,112,4,116],[4,139,4,141],[4,170,4,172],[2,109,2,111],[2,112,2,116],[2,139,2,141],[2,142,2,147],[2,170,2,172],[0,69,0,71],[0,10,0,12],[0,41,0,43],[7,2,7,5],[9,35,9,41],[9,42,9,48],[9,7,9,13],[9,14,9,20],[9,21,9,27],[2,20,2,22],[3,20,3,22],[5,20,5,22],[6,20,6,22],[2,23,2,27],[3,23,3,27],[4,23,4,27],[5,23,5,27],[2,1,2,5],[9,91,9,97],[9,28,9,34],[9,49,9,55],[9,84,9,90],[9,56,9,62],[9,63,9,69],[9,70,9,76],[9,77,9,83],[4,20,4,22],[6,23,6,27],[7,79,7,81],[2,51,2,53],[3,51,3,53],[4,51,4,53],[5,51,5,53],[6,51,6,53],[2,79,2,81],[3,79,3,81],[4,79,4,81],[5,79,5,81],[6,79,6,81]]}
[null,"jaar:",2016,null,null,null,null,null,null,null,{"$f":"DATE(jaar,1,1)","v":"2016-01-01"},null,null,null,null,null,null,null,null,null,null,null,null,null,null,null,null,null,null,null,null,null,null,null,null,null,null,null,null,null,null,{"$f":"DATE(jaar,2,1)","v":"2016-02-01"},null,null,null,null,null,null,null,null,null,null,null,null,null,null,null,null,null,null,null,null,null,null,null,null,null,null,null,{"$f":"DATE(jaar,3,1)","v":"2016-03-01"},null,null,null,null,null,null,null,null,null,null,null,null,null,null,null,null,null,null,null,null,null,null,null,null,null,null,null,null,null,"April",null,null,null,null,null,null,null,null,null,null,null,null,null,null,null,null,null,null,null,null,null,null,null,null,null,null,null,null,null,"Mei",null,null,null,null,null,null,null,null,null,null,null,null,null,null,null,null,null,null,null,null,null,null,null,null,null,null,null,null,null,null,"Juni"]
[null,null,null,null,null,null,null,null,null,null,"Week",null,"M","D","W","D","V","Z","Z",null,null,null,null,null,null,null,null,null,null,null,null,null,null,null,null,null,null,null,null,null,null,"Week",null,"M","D","W","D","V","Z","Z",null,null,null,null,null,null,null,null,null,null,null,null,null,null,null,null,null,null,null,"Week",null,"M","D","W","D","V","Z","Z",null,null,null,null,null,null,null,null,null,null,null,null,null,null,null,null,null,null,null,null,null,"Week",null,"M","D","W","D","V","Z","Z",null,null,null,null,null,null,null,null,null,null,null,null,null,null,null,null,null,null,null,null,null,"Week",null,"M","D","W","D","V","Z","Z",null,null,null,null,null,null,null,null,null,null,null,null,null,null,null,null,null,null,null,null,null,null,"Week",null,"M","D","W","D","V","Z","Z"]
[null,null,null,null,null,null,null,null,null,null,{"$f":"IFERROR(IsoWeekNumber(S3),\"\")","v":53},null,{"$f":"IF(WEEKDAY(K1,2)=1,K1,\"\")","v":""},{"$f":"IF(M3=\"\",IF(WEEKDAY(K1,2)=2,K1,\"\"),M3+1)","v":""},{"$f":"IF(N3=\"\",IF(WEEKDAY(K1,2)=3,K1,\"\"),N3+1)","v":""},{"$f":"IF(O3=\"\",IF(WEEKDAY(K1,2)=4,K1,\"\"),O3+1)","v":""},{"$f":"IF(P3=\"\",IF(WEEKDAY(K1,2)=5,K1,\"\"),P3+1)","v":"2016-01-01"},{"$f":"IF(Q3=\"\",IF(WEEKDAY(K1,2)=6,K1,\"\"),Q3+1)","v":"2016-01-02"},{"$f":"IF(R3=\"\",IF(WEEKDAY(K1,2)=7,K1,\"\"),R3+1)","v":"2016-01-03"},null,{"$f":"IFERROR(SMALL(jan,ROW()-2),\"\")","v":"2016-01-01"},null,null,{"$f":"IFERROR(VLOOKUP(U3,feestdagen,2,0),\"\")","v":"Nieuwjaarsdag"},null,null,null,null,null,null,null,null,null,null,null,null,null,null,null,null,null,{"$f":"IFERROR(IsoWeekNumber(AX3),\"\")","v":5},null,{"$f":"IF(WEEKDAY(AP1,2)=1,AP1,\"\")","v":"2016-02-01"},{"$f":"IF(AR3=\"\",IF(WEEKDAY(AP1,2)=2,AP1,\"\"),AR3+1)","v":"2016-02-02"},{"$f":"IF(AS3=\"\",IF(WEEKDAY(AP1,2)=3,AP1,\"\"),AS3+1)","v":"2016-02-03"},{"$f":"IF(AT3=\"\",IF(WEEKDAY(AP1,2)=4,AP1,\"\"),AT3+1)","v":"2016-02-04"},{"$f":"IF(AU3=\"\",IF(WEEKDAY(AP1,2)=5,AP1,\"\"),AU3+1)","v":"2016-02-05"},{"$f":"IF(AV3=\"\",IF(WEEKDAY(AP1,2)=6,AP1,\"\"),AV3+1)","v":"2016-02-06"},{"$f":"IF(AW3=\"\",IF(WEEKDAY(AP1,2)=7,AP1,\"\"),AW3+1)","v":"2016-02-07"},null,{"$f":"IFERROR(SMALL(feb,ROW()-2),\"\")","v":""},null,null,{"$f":"IFERROR(VLOOKUP(AZ3,feestdagen,2,0),\"\")","v":""},null,null,null,null,null,null,null,null,null,null,null,null,null,null,{"$f":"IFERROR(IsoWeekNumber(BZ3),\"\")","v":9},null,{"$f":"IF(WEEKDAY(BR1,2)=1,BR1,\"\")","v":""},{"$f":"IF(BT3=\"\",IF(WEEKDAY(BR1,2)=2,BR1,\"\"),BT3+1)","v":"2016-03-01"},{"$f":"IF(BU3=\"\",IF(WEEKDAY(BR1,2)=3,BR1,\"\"),BU3+1)","v":"2016-03-02"},{"$f":"IF(BV3=\"\",IF(WEEKDAY(BR1,2)=4,BR1,\"\"),BV3+1)","v":"2016-03-03"},{"$f":"IF(BW3=\"\",IF(WEEKDAY(BR1,2)=5,BR1,\"\"),BW3+1)","v":"2016-03-04"},{"$f":"IF(BX3=\"\",IF(WEEKDAY(BR1,2)=6,BR1,\"\"),BX3+1)","v":"2016-03-05"},{"$f":"IF(BY3=\"\",IF(WEEKDAY(BR1,2)=7,BR1,\"\"),BY3+1)","v":"2016-03-06"},null,{"$f":"IFERROR(SMALL(mrt,ROW()-2),\"\")","v":"2016-03-25"},null,null,{"$f":"IFERROR(VLOOKUP(CB3,feestdagen,2,0),\"\")","v":"Goede Vrijdag"},null,null,null,null,null,null,null,null,null,null,null,null,null,null,null,null,14,null,null,null,1,2,3,4,5,null,{"$f":"IFERROR(SMALL(apr,ROW()-2),\"\")","v":"2016-04-27"},null,null,{"$f":"IFERROR(VLOOKUP(DF3,feestdagen,2,0),\"\")","v":"Koningsdag (N)"},null,null,null,null,null,null,null,null,null,null,null,null,null,null,null,null,18,null,null,null,null,null,1,2,3,null,{"$f":"IFERROR(SMALL(mei,ROW()-2),\"\")","v":"2016-05-05"},null,null,{"$f":"IFERROR(VLOOKUP(EJ3,feestdagen,2,0),\"\")","v":"Bevreidingsdag (N)"},null,null,null,null,null,null,null,null,null,null,null,null,null,null,null,null,null,23,null,1,2,3,4,5,6,7,null,{"$f":"IFERROR(SMALL(jun,ROW()-2),\"\")","v":""},null,null,{"$f":"IFERROR(VLOOKUP(FO3,feestdagen,2,0),\"\")","v":""}]
[null,null,null,null,null,null,null,null,null,null,{"$f":"IFERROR(IsoWeekNumber(S4),\"\")","v":1},null,{"$f":"S3+1","v":"2016-01-04"},{"$f":"M4+1","v":"2016-01-05"},"2016-01-06","2016-01-07","2016-01-08","2016-01-09","2016-01-10",null,{"$f":"IFERROR(SMALL(jan,ROW()-2),\"\")","v":""},null,null,{"$f":"IFERROR(VLOOKUP(U4,feestdagen,2,0),\"\")","v":""},null,null,null,null,null,null,null,null,null,null,null,null,null,null,null,null,null,{"$f":"IFERROR(IsoWeekNumber(AX4),\"\")","v":6},null,{"$f":"AX3+1","v":"2016-02-08"},{"$f":"AR4+1","v":"2016-02-09"},{"$f":"AS4+1","v":"2016-02-10"},{"$f":"AT4+1","v":"2016-02-11"},{"$f":"AU4+1","v":"2016-02-12"},{"$f":"AV4+1","v":"2016-02-13"},{"$f":"AW4+1","v":"2016-02-14"},null,{"$f":"IFERROR(SMALL(feb,ROW()-2),\"\")","v":""},null,null,{"$f":"IFERROR(VLOOKUP(AZ4,feestdagen,2,0),\"\")","v":""},null,null,null,null,null,null,null,null,null,null,null,null,null,null,{"$f":"IFERROR(IsoWeekNumber(BZ4),\"\")","v":10},null,{"$f":"BZ3+1","v":"2016-03-07"},{"$f":"BT4+1","v":"2016-03-08"},{"$f":"BU4+1","v":"2016-03-09"},{"$f":"BV4+1","v":"2016-03-10"},{"$f":"BW4+1","v":"2016-03-11"},{"$f":"BX4+1","v":"2016-03-12"},{"$f":"BY4+1","v":"2016-03-13"},null,"2016-03-27",null,null,"1e Paasdag",null,null,null,null,null,null,null,null,null,null,null,null,null,null,null,null,15,null,6,7,8,9,10,11,12,null,{"$f":"IFERROR(SMALL(apr,ROW()-2),\"\")","v":""},null,null,{"$f":"IFERROR(VLOOKUP(DF4,feestdagen,2,0),\"\")","v":""},null,null,null,null,null,null,null,null,null,null,null,null,null,null,null,null,19,null,4,5,6,7,8,9,10,null,{"$f":"IFERROR(SMALL(mei,ROW()-2),\"\")","v":"2016-05-15"},null,null,{"$f":"IFERROR(VLOOKUP(EJ4,feestdagen,2,0),\"\")","v":"1e Pinsterdag"},null,null,null,null,null,null,null,null,null,null,null,null,null,null,null,null,null,24,null,8,9,10,11,12,13,14,null,{"$f":"IFERROR(SMALL(jun,ROW()-2),\"\")","v":""},null,null,{"$f":"IFERROR(VLOOKUP(FO4,feestdagen,2,0),\"\")","v":""}]
[null,null,null,null,null,null,null,null,null,null,2,null,{"$f":"S4+1","v":"2016-01-11"},"2016-01-12","2016-01-13","2016-01-14","2016-01-15","2016-01-16","2016-01-17",null,{"$f":"IFERROR(SMALL(jan,ROW()-2),\"\")","v":""},null,null,{"$f":"IFERROR(VLOOKUP(U5,feestdagen,2,0),\"\")","v":""},null,null,null,null,null,null,null,null,null,null,null,null,null,null,null,null,null,7,null,{"$f":"AX4+1","v":"2016-02-15"},"2016-02-16","2016-02-17","2016-02-18","2016-02-19","2016-02-20","2016-02-21",null,{"$f":"IFERROR(SMALL(feb,ROW()-2),\"\")","v":""},null,null,{"$f":"IFERROR(VLOOKUP(AZ5,feestdagen,2,0),\"\")","v":""},null,null,null,null,null,null,null,null,null,null,null,null,null,null,11,null,{"$f":"BZ4+1","v":"2016-03-14"},"2016-03-15","2016-03-16","2016-03-17","2016-03-18","2016-03-19","2016-03-20",null,"2016-03-28",null,null,"2e paasdag",null,null,null,null,null,null,null,null,null,null,null,null,null,null,null,null,16,null,13,14,15,16,17,18,19,null,{"$f":"IFERROR(SMALL(apr,ROW()-2),\"\")","v":""},null,null,{"$f":"IFERROR(VLOOKUP(DF5,feestdagen,2,0),\"\")","v":""},null,null,null,null,null,null,null,null,null,null,null,null,null,null,null,null,20,null,11,12,13,14,15,16,17,null,{"$f":"IFERROR(SMALL(mei,ROW()-2),\"\")","v":"2016-05-16"},null,null,{"$f":"IFERROR(VLOOKUP(EJ5,feestdagen,2,0),\"\")","v":"2e Pinksterdag"},null,null,null,null,null,null,null,null,null,null,null,null,null,null,null,null,null,25,null,15,16,17,18,19,20,21,null,{"$f":"IFERROR(SMALL(jun,ROW()-2),\"\")","v":""},null,null,{"$f":"IFERROR(VLOOKUP(FO5,feestdagen,2,0),\"\")","v":""}]
[null,null,null,null,null,null,null,null,null,null,3,null,{"$f":"S5+1","v":"2016-01-18"},"2016-01-19","2016-01-20","2016-01-21","2016-01-22","2016-01-23","2016-01-24",null,{"$f":"IFERROR(SMALL(jan,ROW()-2),\"\")","v":""},null,null,{"$f":"IFERROR(VLOOKUP(U6,feestdagen,2,0),\"\")","v":""},null,null,null,null,null,null,null,null,null,null,null,null,null,null,null,null,null,8,null,{"$f":"AX5+1","v":"2016-02-22"},"2016-02-23","2016-02-24","2016-02-25","2016-02-26","2016-02-27","2016-02-28",null,{"$f":"IFERROR(SMALL(feb,ROW()-2),\"\")","v":""},null,null,{"$f":"IFERROR(VLOOKUP(AZ6,feestdagen,2,0),\"\")","v":""},null,null,null,null,null,null,null,null,null,null,null,null,null,null,12,null,{"$f":"BZ5+1","v":"2016-03-21"},"2016-03-22","2016-03-23","2016-03-24","2016-03-25","2016-03-26","2016-03-27",null,"",null,null,"",null,null,null,null,null,null,null,null,null,null,null,null,null,null,null,null,17,null,20,21,22,23,24,25,26,null,{"$f":"IFERROR(SMALL(apr,ROW()-2),\"\")","v":""},null,null,{"$f":"IFERROR(VLOOKUP(DF6,feestdagen,2,0),\"\")","v":""},null,null,null,null,null,null,null,null,null,null,null,null,null,null,null,null,21,null,18,19,20,21,22,23,24,null,{"$f":"IFERROR(SMALL(mei,ROW()-2),\"\")","v":""},null,null,{"$f":"IFERROR(VLOOKUP(EJ6,feestdagen,2,0),\"\")","v":""},null,null,null,null,{"$f":"IFERROR(VLOOKUP(EO6,feestdagen,2,0),\"\")","v":""},null,null,null,null,null,null,null,null,null,null,null,null,26,null,22,23,24,25,26,27,28,null,{"$f":"IFERROR(SMALL(jun,ROW()-2),\"\")","v":""},null,null,{"$f":"IFERROR(VLOOKUP(FO6,feestdagen,2,0),\"\")","v":""}]
[null,null,null,null,null,null,null,null,null,null,{"$f":"IFERROR(IsoWeekNumber(M7),\"\")","v":4},null,{"$f":"IF(MONTH(S6+1)=MONTH(S6),S6+1,\"\")","v":"2016-01-25"},{"$f":"IF(M7=\"\",\"\",IF(MONTH(M7+1)=MONTH(M7),M7+1,\"\"))","v":"2016-01-26"},"2016-01-27","2016-01-28","2016-01-29","2016-01-30","2016-01-31",null,{"$f":"IFERROR(SMALL(jan,ROW()-2),\"\")","v":""},null,null,{"$f":"IFERROR(VLOOKUP(U7,feestdagen,2,0),\"\")","v":""},null,null,null,null,null,null,null,null,null,null,null,null,null,null,null,null,null,{"$f":"IFERROR(IsoWeekNumber(AR7),\"\")","v":9},null,{"$f":"IF(MONTH(AX6+1)=MONTH(AX6),AX6+1,\"\")","v":"2016-02-29"},{"$f":"IF(AR7=\"\",\"\",IF(MONTH(AR7+1)=MONTH(AR7),AR7+1,\"\"))","v":""},{"$f":"IF(AS7=\"\",\"\",IF(MONTH(AS7+1)=MONTH(AS7),AS7+1,\"\"))","v":""},{"$f":"IF(AT7=\"\",\"\",IF(MONTH(AT7+1)=MONTH(AT7),AT7+1,\"\"))","v":""},{"$f":"IF(AU7=\"\",\"\",IF(MONTH(AU7+1)=MONTH(AU7),AU7+1,\"\"))","v":""},{"$f":"IF(AV7=\"\",\"\",IF(MONTH(AV7+1)=MONTH(AV7),AV7+1,\"\"))","v":""},{"$f":"IF(AW7=\"\",\"\",IF(MONTH(AW7+1)=MONTH(AW7),AW7+1,\"\"))","v":""},null,{"$f":"IFERROR(SMALL(feb,ROW()-2),\"\")","v":""},null,null,{"$f":"IFERROR(VLOOKUP(AZ7,feestdagen,2,0),\"\")","v":""},null,null,null,null,null,null,null,null,null,null,null,null,null,null,{"$f":"IFERROR(IsoWeekNumber(BT7),\"\")","v":13},null,{"$f":"IF(MONTH(BZ6+1)=MONTH(BZ6),BZ6+1,\"\")","v":"2016-03-28"},{"$f":"IF(BT7=\"\",\"\",IF(MONTH(BT7+1)=MONTH(BT7),BT7+1,\"\"))","v":"2016-03-29"},{"$f":"IF(BU7=\"\",\"\",IF(MONTH(BU7+1)=MONTH(BU7),BU7+1,\"\"))","v":"2016-03-30"},{"$f":"IF(BV7=\"\",\"\",IF(MONTH(BV7+1)=MONTH(BV7),BV7+1,\"\"))","v":"2016-03-31"},{"$f":"IF(BW7=\"\",\"\",IF(MONTH(BW7+1)=MONTH(BW7),BW7+1,\"\"))","v":""},{"$f":"IF(BX7=\"\",\"\",IF(MONTH(BX7+1)=MONTH(BX7),BX7+1,\"\"))","v":""},{"$f":"IF(BY7=\"\",\"\",IF(MONTH(BY7+1)=MONTH(BY7),BY7+1,\"\"))","v":""},null,"",null,null,"",null,null,null,null,null,null,null,null,null,null,null,null,null,null,null,null,18,null,27,28,29,30,null,null,null,null,{"$f":"IFERROR(SMALL(apr,ROW()-2),\"\")","v":""},null,null,{"$f":"IFERROR(VLOOKUP(DF7,feestdagen,2,0),\"\")","v":""},null,null,null,null,null,null,null,null,null,null,null,null,null,null,null,null,22,null,25,26,27,28,29,30,31,null,{"$f":"IFERROR(SMALL(mei,ROW()-2),\"\")","v":""},null,null,{"$f":"IFERROR(VLOOKUP(EJ7,feestdagen,2,0),\"\")","v":""},null,null,null,null,{"$f":"IFERROR(VLOOKUP(EO7,feestdagen,2,0),\"\")","v":""},null,null,null,null,null,null,null,null,null,null,null,null,27,null,29,30,null,null,null,null,null,null,{"$f":"IFERROR(SMALL(jun,ROW()-2),\"\")","v":""},null,null,{"$f":"IFERROR(VLOOKUP(FO7,feestdagen,2,0),\"\")","v":""}]
[null,null,null,null,null,null,null,null,null,null,{"$f":"IFERROR(IsoWeekNumber(M8),\"\")","v":""},null,{"$f":"IF(S7=\"\",\"\",IF(MONTH(S7+1)=MONTH(S7),S7+1,\"\"))","v":""},{"$f":"IF(M8=\"\",\"\",IF(MONTH(M8+1)=MONTH(M8),M8+1,\"\"))","v":""},{"$f":"IF(N8=\"\",\"\",IF(MONTH(N8+1)=MONTH(N8),N8+1,\"\"))","v":""},{"$f":"IF(O8=\"\",\"\",IF(MONTH(O8+1)=MONTH(O8),O8+1,\"\"))","v":""},{"$f":"IF(P8=\"\",\"\",IF(MONTH(P8+1)=MONTH(P8),P8+1,\"\"))","v":""},{"$f":"IF(Q8=\"\",\"\",IF(MONTH(Q8+1)=MONTH(Q8),Q8+1,\"\"))","v":""},{"$f":"IF(R8=\"\",\"\",IF(MONTH(R8+1)=MONTH(R8),R8+1,\"\"))","v":""},null,null,null,null,null,null,null,null,null,null,null,null,null,null,null,null,null,null,null,null,null,null,{"$f":"IFERROR(IsoWeekNumber(AR8),\"\")","v":""},null,{"$f":"IF(AX7=\"\",\"\",IF(MONTH(AX7+1)=MONTH(AX7),AX7+1,\"\"))","v":""},"","","","","","",null,null,null,null,null,null,null,null,null,null,null,null,null,null,null,null,null,null,null,{"$f":"IFERROR(IsoWeekNumber(BT8),\"\")","v":""},null,{"$f":"IF(BZ7=\"\",\"\",IF(MONTH(BZ7+1)=MONTH(BZ7),BZ7+1,\"\"))","v":""},"","","","","","",null,"",null,null,""]
[null,null,null,null,null,null,null,null,null,null,null,null,null,null,null,null,null,null,null,null,null,null,null,null,null,null,null,null,null,null,null,null,null,null,null,null,null,null,null,null,null,null,null,null,null,null,null,null,null,null,null,null,null,null,null,null,null,null,null,null,null,null,null,null,null,null,null,null,null,null,null,null,null,null,null,null,null,null,null,null,null,null,null,null,null,null,null,null,null,null,null,null,null,null,null,null,null,null,{"$f":"MONTH(CU12)","v":3},3,3,3,4,4,4,4,4,4,4,4,4,4,4,4,4,4,4,4,4,4,4,4,4,4,4,4,4,4,4,4,4,4,5,5,5,5,5,5,5,5,5,5,5,5,5,5,5,5,5,5,5,5,5,5,5,5,5,5,5,5,5,5,{"$f":"MONTH(FG12)","v":5},6,6,6,6,6,6,6,6,6,6,6,6,6,6,6,6,6,6,6,6,6,6,6,6,6]
[null,null,null,null,null,null,null,{"$f":"IsoWeekNumber(N12)","v":53},null,null,null,null,null,null,{"$f":"IsoWeekNumber(O12)","v":1},null,null,null,null,null,null,{"$f":"IsoWeekNumber(V12)","v":2},null,null,null,null,null,null,{"$f":"IsoWeekNumber(AC12)","v":3},null,null,null,null,null,null,{"$f":"IsoWeekNumber(AJ12)","v":4},null,null,null,null,null,null,{"$f":"IsoWeekNumber(AQ12)","v":5},null,null,null,null,null,null,{"$f":"IsoWeekNumber(AX12)","v":6},null,null,null,null,null,null,{"$f":"IsoWeekNumber(BE12)","v":7},null,null,null,null,null,null,{"$f":"IsoWeekNumber(BL12)","v":8},null,null,null,null,null,null,{"$f":"IsoWeekNumber(BS12)","v":9},null,null,null,null,null,null,{"$f":"IsoWeekNumber(BZ12)","v":10},null,null,null,null,null,null,{"$f":"IsoWeekNumber(CG12)","v":11},null,null,null,null,null,null,{"$f":"IsoWeekNumber(CN12)","v":12},null,null,null,null,null,null,null,null,null,null,null,null,"Week 15",null,null,null,null,null,null,"Week 16",null,null,null,null,null,null,"Week 17",null,null,null,null,null,null,"Week 18",null,null,null,null,null,null,"Week 19",null,null,null,null,null,null,"Week 20",null,null,null,null,null,null,"Week 21",null,null,null,null,null,null,"Week 22",null,null,null,null,null,null,"Week 23",null,null,null,null,null,null,"Week 24",null,null,null,null,null,null,"Week 25",null,null,null,null,null,null,"Week 26"]
[null,null,null,null,null,null,null,"M","D","W","D","V","Z","Z","M","D","W","D","V","Z","Z","M","D","W","D","V","Z","Z","M","D","W","D","V","Z","Z","M","D","W","D","V","Z","Z","M","D","W","D","V","Z","Z","M","D","W","D","V","Z","Z","M","D","W","D","V","Z","Z","M","D","W","D","V","Z","Z","M","D","W","D","V","Z","Z","M","D","W","D","V","Z","Z","M","D","W","D","V","Z","Z","M","D","W","D","V","Z","Z","D","W","D","V","Z","Z","M","D","W","D","V","Z","Z","M","D","W","D","V","Z","Z","M","D","W","D","V","Z","Z","M","D","W","D","V","Z","Z","M","D","W","D","V","Z","Z","M","D","W","D","V","Z","Z","M","D","W","D","V","Z","Z","M","D","W","D","V","Z","Z","M","D","W","D","V","Z","Z","M","D","W","D","V","Z","Z","M","D","W","D","V","Z","Z","M","D","W","D","V","Z","Z"]
["Locatie:","Naam:","van:","tot:","Verlof:","Goedgekeurd door CP:",null,{"$f":"IF(WEEKDAY($K$1,2)=COLUMNS($M:M),$K$1,\"\")","v":""},{"$f":"IF(M3=\"\",IF(WEEKDAY($K$1,2)=COLUMNS($M:N),$K$1,\"\"),M3+1)","v":""},{"$f":"IF(N3=\"\",IF(WEEKDAY($K$1,2)=COLUMNS($M:O),$K$1,\"\"),N3+1)","v":""},{"$f":"IF(O3=\"\",IF(WEEKDAY($K$1,2)=COLUMNS($M:P),$K$1,\"\"),O3+1)","v":""},{"$f":"IF(P3=\"\",IF(WEEKDAY($K$1,2)=COLUMNS($M:Q),$K$1,\"\"),P3+1)","v":"2016-01-01"},{"$f":"IF(Q3=\"\",IF(WEEKDAY($K$1,2)=COLUMNS($M:R),$K$1,\"\"),Q3+1)","v":"2016-01-02"},{"$f":"IF(R3=\"\",IF(WEEKDAY($K$1,2)=COLUMNS($M:S),$K$1,\"\"),R3+1)","v":"2016-01-03"},{"$f":"N12+1","v":"2016-01-04"},{"$f":"O12+1","v":"2016-01-05"},"2016-01-06","2016-01-07","2016-01-08","2016-01-09","2016-01-10","2016-01-11","2016-01-12","2016-01-13","2016-01-14","2016-01-15","2016-01-16","2016-01-17","2016-01-18","2016-01-19","2016-01-20","2016-01-21","2016-01-22","2016-01-23","2016-01-24","2016-01-25","2016-01-26","2016-01-27","2016-01-28","2016-01-29","2016-01-30","2016-01-31","2016-02-01","2016-02-02","2016-02-03","2016-02-04","2016-02-05","2016-02-06","2016-02-07","2016-02-08","2016-02-09","2016-02-10","2016-02-11","2016-02-12","2016-02-13","2016-02-14","2016-02-15","2016-02-16","2016-02-17","2016-02-18","2016-02-19","2016-02-20","2016-02-21","2016-02-22","2016-02-23","2016-02-24","2016-02-25","2016-02-26","2016-02-27","2016-02-28","2016-02-29","2016-03-01","2016-03-02","2016-03-03","2016-03-04","2016-03-05","2016-03-06","2016-03-07","2016-03-08",{"$f":"CA12+1","v":"2016-03-09"},"2016-03-10","2016-03-11","2016-03-12","2016-03-13","2016-03-14","2016-03-15","2016-03-16","2016-03-17","2016-03-18","2016-03-19","2016-03-20","2016-03-21","2016-03-22","2016-03-23","2016-03-24","2016-03-25","2016-03-26","2016-03-27",{"$f":"CT12+1","v":"2016-03-28"},{"$f":"CU12+1","v":"2016-03-29"},"2016-03-30","2016-03-31","2016-04-01","2016-04-02","2016-04-03","2016-04-04","2016-04-05","2016-04-06","2016-04-07","2016-04-08","2016-04-09","2016-04-10","2016-04-11","2016-04-12","2016-04-13","2016-04-14","2016-04-15","2016-04-16","2016-04-17","2016-04-18","2016-04-19","2016-04-20","2016-04-21","2016-04-22","2016-04-23","2016-04-24","2016-04-25","2016-04-26","2016-04-27","2016-04-28","2016-04-29","2016-04-30","2016-05-01","2016-05-02","2016-05-03","2016-05-04","2016-05-05","2016-05-06","2016-05-07","2016-05-08","2016-05-09","2016-05-10","2016-05-11","2016-05-12","2016-05-13","2016-05-14","2016-05-15","2016-05-16","2016-05-17","2016-05-18","2016-05-19","2016-05-20","2016-05-21","2016-05-22","2016-05-23","2016-05-24","2016-05-25","2016-05-26","2016-05-27","2016-05-28","2016-05-29","2016-05-30","2016-05-31",{"$f":"FG12+1","v":"2016-06-01"},"2016-06-02","2016-06-03","2016-06-04","2016-06-05","2016-06-06","2016-06-07","2016-06-08","2016-06-09","2016-06-10","2016-06-11","2016-06-12","2016-06-13","2016-06-14","2016-06-15","2016-06-16","2016-06-17","2016-06-18","2016-06-19","2016-06-20","2016-06-21","2016-06-22","2016-06-23","2016-06-24","2016-06-25"]
["Atalanta","bert","2016-02-03","2016-03-24"]
["Campus","Trien","2016-03-21","2016-04-16"]
["CB","Jan","2016-01-06","2016-01-23","vakantie"]
["CB","Jan","2017-01-06","2017-01-23"]
["CB","miep","2017-02-03","2017-03-24"]
["Helix","Dikkie Dik","2017-01-01","2017-01-10"]
["Komeet","Pietje Puk","2016-01-12","2016-01-22"]
["Linde","Klaas","2016-02-10","2016-02-23"]
["Linde","Klaas","2017-02-10","2017-02-23"]
["Tuinfluiter","truus","2016-01-01","2016-01-10"]
[null,"persoon 15"]
[null,"persoon 16"]
[null,"persoon 17"]
[null,"persoon 18"]
[null,"persoon 19"]
[null,"persoon 20"]
[null,"persoon 21"]
[null,"persoon 22"]
[null,"persoon 23"]
[null,"persoon 24"]
[null,"persoon 25"]
[null,"persoon 26"]
[null,"persoon 27"]
[null,"persoon 28"]
[null,"persoon 29"]
[null,"persoon 30"]
[null,"persoon 31"]
[null,"persoon 32"]
[null,"persoon 33"]
[null,"persoon 34"]
[null,"persoon 35"]
[null,"persoon 36"]
[null,"persoon 37"]
[null,"persoon 38"]
[null,"persoon 39"]
[null,"persoon 40"]
[null,"persoon 41"]
[null,"persoon 42"]
[null,"persoon 43"]
[null,"persoon 44"]
[null,"persoon 45"]
[null,"persoon 46"]
[null,"persoon 47"]
[null,"persoon 48"]
[null,"persoon 49"]
[null,"persoon 50"]
[null,"persoon 51"]
[null,"persoon 52"]
[null,"persoon 53"]
[null,"persoon 54"]
[null,"persoon 55"]
[null,"persoon 56"]
[null,"persoon 57"]
[null,"persoon 58"]
[null,"persoon 59"]
[null,"persoon 6"]
[null,"persoon 60"]
[null,"persoon 61"]
[null,"persoon 62"]
[null,"persoon 63"]
[null,"persoon 64"]
[null,"persoon 65"]
[null,"persoon 66"]
[null,"persoon 67"]
[null,"persoon 68"]
[null,"persoon 69"]
[null,"persoon 7"]
[null,"persoon 70"]
[null,"persoon 71"]
[null,"persoon 72"]
[null,"persoon 73"]
[null,"persoon 74"]
[null,"persoon 75"]
[null,"persoon 76"]
[null,"persoon 77"]
[null,"persoon 78"]
[null,"persoon 79"]
[null,"persoon 8"]
[null,"persoon 80"]
[null,"persoon 81"]
[null,"persoon 82"]
[null,"persoon 83"]
[null,"persoon 84"]
[null,"persoon 85"]
[null,"persoon 86"]
[null,"persoon 87"]
[null,"persoon 88"]
[null,"persoon 89"]
[null,"persoon 9"]
[null,"persoon 90"]
[null,"persoon 91"]
[null,"persoon 92"]
[null,"persoon 93"]
[null,"persoon 94"]
[null,"persoon 95"]
[null,"persoon 96"]
[null,"persoon 97"]
[null,"persoon 98"]
[null,"persoon 99"]
[null,"Pietje Puk","2017-01-12","2017-01-22"]

{"sheet":"2e kwartaal","index":2,"n_rows":112,"n_cols":96,"rows_kept":112,"cut":false,"hidden":false,"merged":[[2,0,2,4],[2,17,2,19],[2,20,2,24],[3,17,3,19],[3,20,3,24],[7,1,7,4],[9,5,9,11],[9,12,9,18],[9,75,9,81],[9,33,9,39],[9,40,9,46],[9,47,9,53],[9,19,9,25],[9,26,9,32],[9,89,9,95],[9,82,9,88],[9,54,9,60],[9,61,9,67],[9,68,9,74],[4,17,4,19],[4,20,4,24],[5,17,5,19],[5,20,5,24],[6,17,6,19],[6,20,6,24],[5,47,5,49],[5,50,5,54],[6,47,6,49],[6,50,6,54],[2,78,2,80],[3,78,3,80],[4,78,4,80],[2,47,2,49],[3,47,3,49],[4,47,4,49],[5,78,5,80],[6,78,6,80],[2,50,2,55],[5,55,5,59],[6,55,6,59]]}
["jaar:",2016,null,null,null,null,null,"April",null,null,null,null,null,null,null,null,null,null,null,null,null,null,null,null,null,null,null,null,null,null,null,null,null,null,null,null,null,"Mei",null,null,null,null,null,null,null,null,null,null,null,null,null,null,null,null,null,null,null,null,null,null,null,null,null,null,null,null,null,null,"Juni"]
[null,null,null,null,null,null,null,"Week",null,"M","D","W","D","V","Z","Z",null,null,null,null,null,null,null,null,null,null,null,null,null,null,null,null,null,null,null,null,null,"Week",null,"M","D","W","D","V","Z","Z",null,null,null,null,null,null,null,null,null,null,null,null,null,null,null,null,null,null,null,null,null,null,"Week",null,"M","D","W","D","V","Z","Z"]
[null,null,null,null,null,null,null,14,null,null,null,1,2,3,4,5,null,{"$f":"IFERROR(SMALL(apr,ROW()-2),\"\")","v":"2016-04-27"},null,null,{"$f":"IFERROR(VLOOKUP(R3,feestdagen,2,0),\"\")","v":"Koningsdag (N)"},null,null,null,null,null,null,null,null,null,null,null,null,null,null,null,null,18,null,null,null,null,null,1,2,3,null,{"$f":"IFERROR(SMALL(mei,ROW()-2),\"\")","v":"2016-05-05"},null,null,{"$f":"IFERROR(VLOOKUP(AV3,feestdagen,2,0),\"\")","v":"Bevreidingsdag (N)"},null,null,null,null,null,null,null,null,null,null,null,null,null,null,null,null,null,23,null,1,2,3,4,5,6,7,null,{"$f":"IFERROR(SMALL(jun,ROW()-2),\"\")","v":""},null,null,{"$f":"IFERROR(VLOOKUP(CA3,feestdagen,2,0),\"\")","v":""}]
[null,null,null,null,null,null,null,15,null,6,7,8,9,10,11,12,null,{"$f":"IFERROR(SMALL(apr,ROW()-2),\"\")","v":""},null,null,{"$f":"IFERROR(VLOOKUP(R4,feestdagen,2,0),\"\")","v":""},null,null,null,null,null,null,null,null,null,null,null,null,null,null,null,null,19,null,4,5,6,7,8,9,10,null,{"$f":"IFERROR(SMALL(mei,ROW()-2),\"\")","v":"2016-05-15"},null,null,{"$f":"IFERROR(VLOOKUP(AV4,feestdagen,2,0),\"\")","v":"1e Pinsterdag"},null,null,null,null,null,null,null,null,null,null,null,null,null,null,null,null,null,24,null,8,9,10,11,12,13,14,null,{"$f":"IFERROR(SMALL(jun,ROW()-2),\"\")","v":""},null,null,{"$f":"IFERROR(VLOOKUP(CA4,feestdagen,2,0),\"\")","v":""}]
[null,null,null,null,null,null,null,16,null,13,14,15,16,17,18,19,null,{"$f":"IFERROR(SMALL(apr,ROW()-2),\"\")","v":""},null,null,{"$f":"IFERROR(VLOOKUP(R5,feestdagen,2,0),\"\")","v":""},null,null,null,null,null,null,null,null,null,null,null,null,null,null,null,null,20,null,11,12,13,14,15,16,17,null,{"$f":"IFERROR(SMALL(mei,ROW()-2),\"\")","v":"2016-05-16"},null,null,{"$f":"IFERROR(VLOOKUP(AV5,feestdagen,2,0),\"\")","v":"2e Pinksterdag"},null,null,null,null,null,null,null,null,null,null,null,null,null,null,null,null,null,25,null,15,16,17,18,19,20,21,null,{"$f":"IFERROR(SMALL(jun,ROW()-2),\"\")","v":""},null,null,{"$f":"IFERROR(VLOOKUP(CA5,feestdagen,2,0),\"\")","v":""}]
[null,null,null,null,null,null,null,17,null,20,21,22,23,24,25,26,null,{"$f":"IFERROR(SMALL(apr,ROW()-2),\"\")","v":""},null,null,{"$f":"IFERROR(VLOOKUP(R6,feestdagen,2,0),\"\")","v":""},null,null,null,null,null,null,null,null,null,null,null,null,null,null,null,null,21,null,18,19,20,21,22,23,24,null,{"$f":"IFERROR(SMALL(mei,ROW()-2),\"\")","v":""},null,null,{"$f":"IFERROR(VLOOKUP(AV6,feestdagen,2,0),\"\")","v":""},null,null,null,null,{"$f":"IFERROR(VLOOKUP(BA6,feestdagen,2,0),\"\")","v":""},null,null,null,null,null,null,null,null,null,null,null,null,26,null,22,23,24,25,26,27,28,null,{"$f":"IFERROR(SMALL(jun,ROW()-2),\"\")","v":""},null,null,{"$f":"IFERROR(VLOOKUP(CA6,feestdagen,2,0),\"\")","v":""}]
[null,null,null,null,null,null,null,18,null,27,28,29,30,null,null,null,null,{"$f":"IFERROR(SMALL(apr,ROW()-2),\"\")","v":""},null,null,{"$f":"IFERROR(VLOOKUP(R7,feestdagen,2,0),\"\")","v":""},null,null,null,null,null,null,null,null,null,null,null,null,null,null,null,null,22,null,25,26,27,28,29,30,31,null,{"$f":"IFERROR(SMALL(mei,ROW()-2),\"\")","v":""},null,null,{"$f":"IFERROR(VLOOKUP(AV7,feestdagen,2,0),\"\")","v":""},null,null,null,null,{"$f":"IFERROR(VLOOKUP(BA7,feestdagen,2,0),\"\")","v":""},null,null,null,null,null,null,null,null,null,null,null,null,27,null,29,30,null,null,null,null,null,null,{"$f":"IFERROR(SMALL(jun,ROW()-2),\"\")","v":""},null,null,{"$f":"IFERROR(VLOOKUP(CA7,feestdagen,2,0),\"\")","v":""}]
[]
[null,null,null,null,null,{"$f":"MONTH(F12)","v":3},{"$f":"MONTH(G12)","v":3},3,3,4,4,4,4,4,4,4,4,4,4,4,4,4,4,4,4,4,4,4,4,4,4,4,4,4,4,4,4,4,4,5,5,5,5,5,5,5,5,5,5,5,5,5,5,5,5,5,5,5,5,5,5,5,5,5,5,5,5,5,5,5,{"$f":"MONTH(BS12)","v":6},6,6,6,6,6,6,6,6,6,6,6,6,6,6,6,6,6,6,6,6,6,6,6,6,6]
[null,null,null,null,null,"Week 14",null,null,null,null,null,null,"Week 15",null,null,null,null,null,null,"Week 16",null,null,null,null,null,null,"Week 17",null,null,null,null,null,null,"Week 18",null,null,null,null,null,null,"Week 19",null,null,null,null,null,null,"Week 20",null,null,null,null,null,null,"Week 21",null,null,null,null,null,null,"Week 22",null,null,null,null,null,null,"Week 23",null,null,null,null,null,null,"Week 24",null,null,null,null,null,null,"Week 25",null,null,null,null,null,null,"Week 26"]
[null,null,null,null,null,"M","D","W","D","V","Z","Z","M","D","W","D","V","Z","Z","M","D","W","D","V","Z","Z","M","D","W","D","V","Z","Z","M","D","W","D","V","Z","Z","M","D","W","D","V","Z","Z","M","D","W","D","V","Z","Z","M","D","W","D","V","Z","Z","M","D","W","D","V","Z","Z","M","D","W","D","V","Z","Z","M","D","W","D","V","Z","Z","M","D","W","D","V","Z","Z","M","D","W","D","V","Z","Z"]
["Naam:","van:","tot:","Verlof:","Goedgekeurd door CP:",{"$f":"'1e kwartaal'!CT12+1","v":"2016-03-28"},{"$f":"F12+1","v":"2016-03-29"},{"$f":"G12+1","v":"2016-03-30"},"2016-03-31","2016-04-01","2016-04-02","2016-04-03","2016-04-04","2016-04-05","2016-04-06","2016-04-07","2016-04-08","2016-04-09","2016-04-10","2016-04-11","2016-04-12","2016-04-13","2016-04-14","2016-04-15","2016-04-16","2016-04-17","2016-04-18","2016-04-19","2016-04-20","2016-04-21","2016-04-22","2016-04-23","2016-04-24","2016-04-25","2016-04-26","2016-04-27","2016-04-28","2016-04-29","2016-04-30","2016-05-01","2016-05-02","2016-05-03","2016-05-04","2016-05-05","2016-05-06","2016-05-07","2016-05-08","2016-05-09","2016-05-10","2016-05-11","2016-05-12","2016-05-13","2016-05-14","2016-05-15","2016-05-16","2016-05-17","2016-05-18","2016-05-19","2016-05-20","2016-05-21","2016-05-22","2016-05-23","2016-05-24","2016-05-25","2016-05-26","2016-05-27","2016-05-28","2016-05-29","2016-05-30","2016-05-31","2016-06-01",{"$f":"BS12+1","v":"2016-06-02"},"2016-06-03","2016-06-04","2016-06-05","2016-06-06","2016-06-07","2016-06-08","2016-06-09","2016-06-10","2016-06-11","2016-06-12","2016-06-13","2016-06-14","2016-06-15","2016-06-16","2016-06-17","2016-06-18","2016-06-19","2016-06-20","2016-06-21","2016-06-22","2016-06-23","2016-06-24","2016-06-25","2016-06-26"]
["CB - Jan","2016-01-06","2016-01-23","vakantie","ja"]
["Komeet - Pietje Puk","2016-01-12","2016-01-22"]
["Tuinfluiter - Klaas","2016-02-10","2016-02-23"]
["Linde - Dikkie Dik","2016-01-01","2016-01-10"]
["persoon 5"]
["persoon 6"]
["persoon 7"]
["persoon 8"]
["persoon 9"]
["persoon 10"]
["persoon 11"]
["persoon 12"]
["persoon 13"]
["persoon 14"]
["persoon 15"]
["persoon 16"]
["persoon 17"]
["persoon 18"]
["persoon 19"]
["persoon 20"]
["persoon 21"]
["persoon 22"]
["persoon 23"]
["persoon 24"]
["persoon 25"]
["persoon 26"]
["persoon 27"]
["persoon 28"]
["persoon 29"]
["persoon 30"]
["persoon 31"]
["persoon 32"]
["persoon 33"]
["persoon 34"]
["persoon 35"]
["persoon 36"]
["persoon 37"]
["persoon 38"]
["persoon 39"]
["persoon 40"]
["persoon 41"]
["persoon 42"]
["persoon 43"]
["persoon 44"]
["persoon 45"]
["persoon 46"]
["persoon 47"]
["persoon 48"]
["persoon 49"]
["persoon 50"]
["persoon 51"]
["persoon 52"]
["persoon 53"]
["persoon 54"]
["persoon 55"]
["persoon 56"]
["persoon 57"]
["persoon 58"]
["persoon 59"]
["persoon 60"]
["persoon 61"]
["persoon 62"]
["persoon 63"]
["persoon 64"]
["persoon 65"]
["persoon 66"]
["persoon 67"]
["persoon 68"]
["persoon 69"]
["persoon 70"]
["persoon 71"]
["persoon 72"]
["persoon 73"]
["persoon 74"]
["persoon 75"]
["persoon 76"]
["persoon 77"]
["persoon 78"]
["persoon 79"]
["persoon 80"]
["persoon 81"]
["persoon 82"]
["persoon 83"]
["persoon 84"]
["persoon 85"]
["persoon 86"]
["persoon 87"]
["persoon 88"]
["persoon 89"]
["persoon 90"]
["persoon 91"]
["persoon 92"]
["persoon 93"]
["persoon 94"]
["persoon 95"]
["persoon 96"]
["persoon 97"]
["persoon 98"]
["persoon 99"]
["persoon 100"]

{"sheet":"3e kwartaal","index":3,"n_rows":112,"n_cols":96,"rows_kept":112,"cut":false,"hidden":false,"merged":[[2,0,2,4],[7,1,7,4],[9,26,9,32],[9,5,9,11],[9,12,9,18],[9,19,9,25],[6,48,6,50],[9,89,9,95],[9,75,9,81],[9,82,9,88],[9,40,9,46],[9,47,9,53],[9,54,9,60],[9,61,9,67],[9,68,9,74],[3,79,3,81],[9,33,9,39],[2,17,2,19],[2,48,2,50],[2,79,2,81],[7,48,7,50],[4,79,4,81],[5,79,5,81],[6,79,6,81],[3,17,3,19],[4,17,4,19],[5,17,5,19],[6,17,6,19],[3,48,3,50],[4,48,4,50],[5,48,5,50]]}
["jaar:",2016,null,null,null,null,null,"Juli",null,null,null,null,null,null,null,null,null,null,null,null,null,null,null,null,null,null,null,null,null,null,null,null,null,null,null,null,null,null,"Augustus",null,null,null,null,null,null,null,null,null,null,null,null,null,null,null,null,null,null,null,null,null,null,null,null,null,null,null,null,null,null,"September"]
[null,null,null,null,null,null,null,"Week",null,"M","D","W","D","V","Z","Z",null,null,null,null,null,null,null,null,null,null,null,null,null,null,null,null,null,null,null,null,null,null,"Week",null,"M","D","W","D","V","Z","Z",null,null,null,null,null,null,null,null,null,null,null,null,null,null,null,null,null,null,null,null,null,null,"Week",null,"M","D","W","D","V","Z","Z"]
[null,null,null,null,null,null,null,27,null,null,null,1,2,3,4,5,null,{"$f":"IFERROR(SMALL(jul,ROW()-2),\"\")","v":""},null,null,{"$f":"IFERROR(VLOOKUP(R3,feestdagen,2,0),\"\")","v":""},null,null,null,null,null,null,null,null,null,null,null,null,null,null,null,null,null,31,null,null,null,null,null,null,1,2,null,{"$f":"IFERROR(SMALL(aug,ROW()-2),\"\")","v":""},null,null,{"$f":"IFERROR(VLOOKUP(AW3,feestdagen,2,0),\"\")","v":""},null,null,null,null,null,null,null,null,null,null,null,null,null,null,null,null,null,36,null,null,1,2,3,4,5,6,null,{"$f":"IFERROR(SMALL(sep,ROW()-2),\"\")","v":"2016-09-20"},null,null,{"$f":"IFERROR(VLOOKUP(CB3,feestdagen,2,0),\"\")","v":"Prinsjesdag (N)"}]
[null,null,null,null,null,null,null,28,null,6,7,8,9,10,11,12,null,{"$f":"IFERROR(SMALL(jul,ROW()-2),\"\")","v":""},null,null,{"$f":"IFERROR(VLOOKUP(R4,feestdagen,2,0),\"\")","v":""},null,null,null,null,null,null,null,null,null,null,null,null,null,null,null,null,null,32,null,3,4,5,6,7,8,9,null,"",null,null,"",null,null,null,null,null,null,null,null,null,null,null,null,null,null,null,null,null,37,null,7,8,9,10,11,12,13,null,{"$f":"IFERROR(SMALL(sep,ROW()-2),\"\")","v":""},null,null,{"$f":"IFERROR(VLOOKUP(CB4,feestdagen,2,0),\"\")","v":""}]
[null,null,null,null,null,null,null,29,null,13,14,15,16,17,18,19,null,{"$f":"IFERROR(SMALL(jul,ROW()-2),\"\")","v":""},null,null,{"$f":"IFERROR(VLOOKUP(R5,feestdagen,2,0),\"\")","v":""},null,null,null,null,null,null,null,null,null,null,null,null,null,null,null,null,null,33,null,10,11,12,13,14,15,16,null,"",null,null,"",null,null,null,null,null,null,null,null,null,null,null,null,null,null,null,null,null,38,null,14,15,16,17,18,19,20,null,{"$f":"IFERROR(SMALL(sep,ROW()-2),\"\")","v":""},null,null,{"$f":"IFERROR(VLOOKUP(CB5,feestdagen,2,0),\"\")","v":""}]
[null,null,null,null,null,null,null,30,null,20,21,22,23,24,25,26,null,{"$f":"IFERROR(SMALL(jul,ROW()-2),\"\")","v":""},null,null,{"$f":"IFERROR(VLOOKUP(R6,feestdagen,2,0),\"\")","v":""},null,null,null,null,null,null,null,null,null,null,null,null,null,null,null,null,null,34,null,17,18,19,20,21,22,23,null,"",null,null,"",null,null,null,null,null,null,null,null,null,null,null,null,null,null,null,null,null,39,null,21,22,23,24,25,26,27,null,{"$f":"IFERROR(SMALL(sep,ROW()-2),\"\")","v":""},null,null,{"$f":"IFERROR(VLOOKUP(CB6,feestdagen,2,0),\"\")","v":""}]
[null,null,null,null,null,null,null,31,null,27,28,29,30,31,null,null,null,{"$f":"IFERROR(SMALL(jul,ROW()-2),\"\")","v":""},null,null,{"$f":"IFERROR(VLOOKUP(R7,feestdagen,2,0),\"\")","v":""},null,null,null,null,null,null,null,null,null,null,null,null,null,null,null,null,null,35,null,24,25,26,27,28,29,30,null,"",null,null,"",null,null,null,null,null,null,null,null,null,null,null,null,null,null,null,null,null,40,null,28,29,30,null,null,null,null,null,{"$f":"IFERROR(SMALL(sep,ROW()-2),\"\")","v":""},null,null,{"$f":"IFERROR(VLOOKUP(CB7,feestdagen,2,0),\"\")","v":""}]
[null,null,null,null,null,null,null,null,null,null,null,null,null,null,null,null,null,null,null,null,null,null,null,null,null,null,null,null,null,null,null,null,null,null,null,null,null,null,36,null,31,null,null,null,null,null,null,null,"",null,null,""]
[null,null,null,null,null,{"$f":"MONTH(F12)","v":6},{"$f":"MONTH(G12)","v":6},6,6,7,7,7,7,7,7,7,7,7,7,7,7,7,7,7,7,7,7,7,7,7,7,7,7,7,7,7,7,7,7,7,8,8,8,8,8,8,8,8,8,8,8,8,8,8,8,8,8,8,8,8,8,8,8,8,8,8,8,8,8,8,{"$f":"MONTH(BS12)","v":8},9,9,9,9,9,9,9,9,9,9,9,9,9,9,9,9,9,9,9,9,9,9,9,9,9]
[null,null,null,null,null,"Week 27",null,null,null,null,null,null,"Week 28",null,null,null,null,null,null,"Week 29",null,null,null,null,null,null,"Week 30",null,null,null,null,null,null,"Week 31",null,null,null,null,null,null,"Week 32",null,null,null,null,null,null,"Week 33",null,null,null,null,null,null,"Week 34",null,null,null,null,null,null,"Week 35",null,null,null,null,null,null,"Week 36",null,null,null,null,null,null,"Week 37",null,null,null,null,null,null,"Week 38",null,null,null,null,null,null,"Week 39"]
[null,null,null,null,null,"M","D","W","D","V","Z","Z","M","D","W","D","V","Z","Z","M","D","W","D","V","Z","Z","M","D","W","D","V","Z","Z","M","D","W","D","V","Z","Z","M","D","W","D","V","Z","Z","M","D","W","D","V","Z","Z","M","D","W","D","V","Z","Z","M","D","W","D","V","Z","Z","M","D","W","D","V","Z","Z","M","D","W","D","V","Z","Z","M","D","W","D","V","Z","Z","M","D","W","D","V","Z","Z"]
["Naam:","van:","tot:","Verlof:","Goedgekeurd door CP:",{"$f":"'2e kwartaal'!CR12+1","v":"2016-06-27"},{"$f":"F12+1","v":"2016-06-28"},{"$f":"G12+1","v":"2016-06-29"},"2016-06-30","2016-07-01","2016-07-02","2016-07-03","2016-07-04","2016-07-05","2016-07-06","2016-07-07","2016-07-08","2016-07-09","2016-07-10","2016-07-11","2016-07-12","2016-07-13","2016-07-14","2016-07-15","2016-07-16","2016-07-17","2016-07-18","2016-07-19","2016-07-20","2016-07-21","2016-07-22","2016-07-23","2016-07-24","2016-07-25","2016-07-26","2016-07-27","2016-07-28","2016-07-29","2016-07-30","2016-07-31","2016-08-01","2016-08-02","2016-08-03","2016-08-04","2016-08-05","2016-08-06","2016-08-07","2016-08-08","2016-08-09","2016-08-10","2016-08-11","2016-08-12","2016-08-13","2016-08-14","2016-08-15","2016-08-16","2016-08-17","2016-08-18","2016-08-19","2016-08-20","2016-08-21","2016-08-22","2016-08-23","2016-08-24","2016-08-25","2016-08-26","2016-08-27","2016-08-28","2016-08-29","2016-08-30","2016-08-31",{"$f":"BS12+1","v":"2016-09-01"},"2016-09-02","2016-09-03","2016-09-04","2016-09-05","2016-09-06","2016-09-07","2016-09-08","2016-09-09","2016-09-10","2016-09-11","2016-09-12","2016-09-13","2016-09-14","2016-09-15","2016-09-16","2016-09-17","2016-09-18","2016-09-19","2016-09-20","2016-09-21","2016-09-22","2016-09-23","2016-09-24","2016-09-25"]
["CB - Jan","2016-01-06","2016-01-23","vakantie","ja"]
["Komeet - Pietje Puk","2016-01-12","2016-01-22"]
["Tuinfluiter - Klaas","2016-02-10","2016-02-23"]
["Linde - Dikkie Dik","2016-01-01","2016-01-10"]
["persoon 5"]
["persoon 6"]
["persoon 7"]
["persoon 8"]
["persoon 9"]
["persoon 10"]
["persoon 11"]
["persoon 12"]
["persoon 13"]
["persoon 14"]
["persoon 15"]
["persoon 16"]
["persoon 17"]
["persoon 18"]
["persoon 19"]
["persoon 20"]
["persoon 21"]
["persoon 22"]
["persoon 23"]
["persoon 24"]
["persoon 25"]
["persoon 26"]
["persoon 27"]
["persoon 28"]
["persoon 29"]
["persoon 30"]
["persoon 31"]
["persoon 32"]
["persoon 33"]
["persoon 34"]
["persoon 35"]
["persoon 36"]
["persoon 37"]
["persoon 38"]
["persoon 39"]
["persoon 40"]
["persoon 41"]
["persoon 42"]
["persoon 43"]
["persoon 44"]
["persoon 45"]
["persoon 46"]
["persoon 47"]
["persoon 48"]
["persoon 49"]
["persoon 50"]
["persoon 51"]
["persoon 52"]
["persoon 53"]
["persoon 54"]
["persoon 55"]
["persoon 56"]
["persoon 57"]
["persoon 58"]
["persoon 59"]
["persoon 60"]
["persoon 61"]
["persoon 62"]
["persoon 63"]
["persoon 64"]
["persoon 65"]
["persoon 66"]
["persoon 67"]
["persoon 68"]
["persoon 69"]
["persoon 70"]
["persoon 71"]
["persoon 72"]
["persoon 73"]
["persoon 74"]
["persoon 75"]
["persoon 76"]
["persoon 77"]
["persoon 78"]
["persoon 79"]
["persoon 80"]
["persoon 81"]
["persoon 82"]
["persoon 83"]
["persoon 84"]
["persoon 85"]
["persoon 86"]
["persoon 87"]
["persoon 88"]
["persoon 89"]
["persoon 90"]
["persoon 91"]
["persoon 92"]
["persoon 93"]
["persoon 94"]
["persoon 95"]
["persoon 96"]
["persoon 97"]
["persoon 98"]
["persoon 99"]
["persoon 100"]

{"sheet":"4e kwartaal","index":4,"n_rows":112,"n_cols":103,"rows_kept":112,"cut":false,"hidden":false,"merged":[[9,33,9,39],[9,19,9,25],[9,26,9,32],[9,96,9,102],[9,68,9,74],[9,61,9,67],[9,40,9,46],[9,47,9,53],[2,0,2,4],[7,1,7,4],[9,5,9,11],[9,12,9,18],[2,18,2,21],[3,18,3,21],[4,18,4,21],[5,18,5,21],[6,18,6,21],[6,79,6,82],[3,49,3,52],[4,49,4,52],[9,54,9,60],[9,89,9,95],[9,75,9,81],[9,82,9,88],[6,49,6,52],[7,49,7,52],[2,49,2,52],[2,79,2,82],[3,79,3,82],[4,79,4,82],[5,79,5,82],[5,49,5,52]]}
["jaar:",2016,null,null,null,null,null,null,"Oktober",null,null,null,null,null,null,null,null,null,null,null,null,null,null,null,null,null,null,null,null,null,null,null,null,null,null,null,null,null,null,"November",null,null,null,null,null,null,null,null,null,null,null,null,null,null,null,null,null,null,null,null,null,null,null,null,null,null,null,null,null,"December"]
[null,null,null,null,null,null,null,null,"Week",null,"M","D","W","D","V","Z","Z",null,null,null,null,null,null,null,null,null,null,null,null,null,null,null,null,null,null,null,null,null,null,"Week",null,"M","D","W","D","V","Z","Z",null,null,null,null,null,null,null,null,null,null,null,null,null,null,null,null,null,null,null,null,null,"Week",null,"M","D","W","D","V","Z","Z"]
[null,null,null,null,null,null,null,null,40,null,null,null,null,1,2,3,4,null,{"$f":"IFERROR(SMALL(okt,ROW()-2),\"\")","v":""},null,null,null,{"$f":"IFERROR(VLOOKUP(S3,feestdagen,2,0),\"\")","v":""},null,null,null,null,null,null,null,null,null,null,null,null,null,null,null,null,44,null,null,null,null,null,null,null,1,null,{"$f":"IFERROR(SMALL(okt,ROW()-2),\"\")","v":""},null,null,null,{"$f":"IFERROR(VLOOKUP(AX3,feestdagen,2,0),\"\")","v":""},null,null,null,null,null,null,null,null,null,null,null,null,null,null,null,49,null,null,1,2,3,4,5,6,null,{"$f":"IFERROR(SMALL(dec,ROW()-2),\"\")","v":"2016-12-05"},null,null,null,{"$f":"IFERROR(VLOOKUP(CB3,feestdagen,2,0),\"\")","v":"Sinterklaas (N)"}]
[null,null,null,null,null,null,null,null,41,null,5,6,7,8,9,10,11,null,{"$f":"IFERROR(SMALL(okt,ROW()-2),\"\")","v":""},null,null,null,{"$f":"IFERROR(VLOOKUP(S4,feestdagen,2,0),\"\")","v":""},null,null,null,null,null,null,null,null,null,null,null,null,null,null,null,null,45,null,2,3,4,5,6,7,8,null,"",null,null,null,"",null,null,null,null,null,null,null,null,null,null,null,null,null,null,null,50,null,7,8,9,10,11,12,13,null,{"$f":"IFERROR(SMALL(dec,ROW()-2),\"\")","v":"2016-12-25"},null,null,null,{"$f":"IFERROR(VLOOKUP(CB4,feestdagen,2,0),\"\")","v":"1e Kerstdag"}]
[null,null,null,null,null,null,null,null,42,null,12,13,14,15,16,17,18,null,{"$f":"IFERROR(SMALL(okt,ROW()-2),\"\")","v":""},null,null,null,{"$f":"IFERROR(VLOOKUP(S5,feestdagen,2,0),\"\")","v":""},null,null,null,null,null,null,null,null,null,null,null,null,null,null,null,null,46,null,9,10,11,12,13,14,15,null,"",null,null,null,"",null,null,null,null,null,null,null,null,null,null,null,null,null,null,null,51,null,14,15,16,17,18,19,20,null,{"$f":"IFERROR(SMALL(dec,ROW()-2),\"\")","v":"2016-12-26"},null,null,null,{"$f":"IFERROR(VLOOKUP(CB5,feestdagen,2,0),\"\")","v":"2e Kerstdag"}]
[null,null,null,null,null,null,null,null,43,null,19,20,21,22,23,24,25,null,{"$f":"IFERROR(SMALL(okt,ROW()-2),\"\")","v":""},null,null,null,{"$f":"IFERROR(VLOOKUP(S6,feestdagen,2,0),\"\")","v":""},null,null,null,null,null,null,null,null,null,null,null,null,null,null,null,null,47,null,16,17,18,19,20,21,22,null,"",null,null,null,"",null,null,null,null,null,null,null,null,null,null,null,null,null,null,null,52,null,21,22,23,24,25,26,27,null,{"$f":"IFERROR(SMALL(dec,ROW()-2),\"\")","v":"2016-12-31"},null,null,null,{"$f":"IFERROR(VLOOKUP(CB6,feestdagen,2,0),\"\")","v":"Oudejaarsdag"}]
[null,null,null,null,null,null,null,null,44,null,26,27,28,29,30,31,null,null,{"$f":"IFERROR(SMALL(okt,ROW()-2),\"\")","v":""},null,null,null,{"$f":"IFERROR(VLOOKUP(S7,feestdagen,2,0),\"\")","v":""},null,null,null,null,null,null,null,null,null,null,null,null,null,null,null,null,48,null,23,24,25,26,27,28,29,null,"",null,null,null,"",null,null,null,null,null,null,null,null,null,null,null,null,null,null,null,53,null,28,29,30,31,null,null,null,null,{"$f":"IFERROR(SMALL(dec,ROW()-2),\"\")","v":""},null,null,null,{"$f":"IFERROR(VLOOKUP(CB7,feestdagen,2,0),\"\")","v":""}]
[null,null,null,null,null,null,null,null,null,null,null,null,null,null,null,null,null,null,null,null,null,null,null,null,null,null,null,null,null,null,null,null,null,null,null,null,null,null,null,49,null,30,null,null,null,null,null,null,null,"",null,null,null,""]
[null,null,null,null,null,{"$f":"MONTH(F12)","v":9},{"$f":"MONTH(G12)","v":9},9,9,9,10,10,10,10,10,10,10,10,10,10,10,10,10,10,10,10,10,10,10,10,10,10,10,10,10,10,10,10,10,10,10,11,11,11,11,11,11,11,11,11,11,11,11,11,11,11,11,11,11,11,11,11,11,11,11,11,11,11,11,11,{"$f":"MONTH(BS12)","v":11},12,12,12,12,12,12,12,12,12,12,12,12,12,12,12,12,12,12,12,12,12,12,12,12,12,{"$f":"IF(ISERROR(MONTH(CS12)),\"\",MONTH(CS12))","v":12},{"$f":"IF(ISERROR(MONTH(CT12)),\"\",MONTH(CT12))","v":12},12,12,12,12,""]
[null,null,null,null,null,"Week 40",null,null,null,null,null,null,"Week 41",null,null,null,null,null,null,"Week 42",null,null,null,null,null,null,"Week 43",null,null,null,null,null,null,"Week 44",null,null,null,null,null,null,"Week 45",null,null,null,null,null,null,"Week 46",null,null,null,null,null,null,"Week 47",null,null,null,null,null,null,"Week 48",null,null,null,null,null,null,"Week 49",null,null,null,null,null,null,"Week 50",null,null,null,null,null,null,"Week 51",null,null,null,null,null,null,"Week 52",null,null,null,null,null,null,"Week 53"]
[null,null,null,null,null,"M","D","W","D","V","Z","Z","M","D","W","D","V","Z","Z","M","D","W","D","V","Z","Z","M","D","W","D","V","Z","Z","M","D","W","D","V","Z","Z","M","D","W","D","V","Z","Z","M","D","W","D","V","Z","Z","M","D","W","D","V","Z","Z","M","D","W","D","V","Z","Z","M","D","W","D","V","Z","Z","M","D","W","D","V","Z","Z","M","D","W","D","V","Z","Z","M","D","W","D","V","Z","Z","M","D","W","D","V","Z","Z"]
["Naam:","van:","tot:","Verlof:","Goedgekeurd door CP:",{"$f":"'3e kwartaal'!CR12+1","v":"2016-09-26"},{"$f":"F12+1","v":"2016-09-27"},{"$f":"G12+1","v":"2016-09-28"},"2016-09-29","2016-09-30","2016-10-01","2016-10-02","2016-10-03","2016-10-04","2016-10-05","2016-10-06","2016-10-07","2016-10-08","2016-10-09","2016-10-10","2016-10-11","2016-10-12","2016-10-13","2016-10-14","2016-10-15","2016-10-16","2016-10-17","2016-10-18","2016-10-19","2016-10-20","2016-10-21","2016-10-22","2016-10-23","2016-10-24","2016-10-25","2016-10-26","2016-10-27","2016-10-28","2016-10-29","2016-10-30","2016-10-31","2016-11-01","2016-11-02","2016-11-03","2016-11-04","2016-11-05","2016-11-06","2016-11-07","2016-11-08","2016-11-09","2016-11-10","2016-11-11","2016-11-12","2016-11-13","2016-11-14","2016-11-15","2016-11-16","2016-11-17","2016-11-18","2016-11-19","2016-11-20","2016-11-21","2016-11-22","2016-11-23","2016-11-24","2016-11-25","2016-11-26","2016-11-27","2016-11-28","2016-11-29","2016-11-30",{"$f":"BS12+1","v":"2016-12-01"},"2016-12-02","2016-12-03","2016-12-04","2016-12-05","2016-12-06","2016-12-07","2016-12-08","2016-12-09","2016-12-10","2016-12-11","2016-12-12","2016-12-13","2016-12-14","2016-12-15","2016-12-16","2016-12-17","2016-12-18","2016-12-19","2016-12-20","2016-12-21","2016-12-22","2016-12-23","2016-12-24",{"$f":"IF(CQ$12=\"\",\"\",IF(MONTH(CQ$12+1)=MONTH(CQ$12),CQ$12+1,\"\"))","v":"2016-12-25"},{"$f":"IF(CR$12=\"\",\"\",IF(MONTH(CR$12+1)=MONTH(CR$12),CR$12+1,\"\"))","v":"2016-12-26"},"2016-12-27","2016-12-28","2016-12-29","2016-12-30","2016-12-31",""]
["CB - Jan","2016-01-06","2016-01-23","vakantie","ja"]
["Komeet - Pietje Puk","2016-01-12","2016-01-22"]
["Tuinfluiter - Klaas","2016-02-10","2016-02-23"]
["Linde - Dikkie Dik","2016-01-01","2016-01-10"]
["persoon 5"]
["persoon 6"]
["persoon 7"]
["persoon 8"]
["persoon 9"]
["persoon 10"]
["persoon 11"]
["persoon 12"]
["persoon 13"]
["persoon 14"]
["persoon 15"]
["persoon 16"]
["persoon 17"]
["persoon 18"]
["persoon 19"]
["persoon 20"]
["persoon 21"]
["persoon 22"]
["persoon 23"]
["persoon 24"]
["persoon 25"]
["persoon 26"]
["persoon 27"]
["persoon 28"]
["persoon 29"]
["persoon 30"]
["persoon 31"]
["persoon 32"]
["persoon 33"]
["persoon 34"]
["persoon 35"]
["persoon 36"]
["persoon 37"]
["persoon 38"]
["persoon 39"]
["persoon 40"]
["persoon 41"]
["persoon 42"]
["persoon 43"]
["persoon 44"]
["persoon 45"]
["persoon 46"]
["persoon 47"]
["persoon 48"]
["persoon 49"]
["persoon 50"]
["persoon 51"]
["persoon 52"]
["persoon 53"]
["persoon 54"]
["persoon 55"]
["persoon 56"]
["persoon 57"]
["persoon 58"]
["persoon 59"]
["persoon 60"]
["persoon 61"]
["persoon 62"]
["persoon 63"]
["persoon 64"]
["persoon 65"]
["persoon 66"]
["persoon 67"]
["persoon 68"]
["persoon 69"]
["persoon 70"]
["persoon 71"]
["persoon 72"]
["persoon 73"]
["persoon 74"]
["persoon 75"]
["persoon 76"]
["persoon 77"]
["persoon 78"]
["persoon 79"]
["persoon 80"]
["persoon 81"]
["persoon 82"]
["persoon 83"]
["persoon 84"]
["persoon 85"]
["persoon 86"]
["persoon 87"]
["persoon 88"]
["persoon 89"]
["persoon 90"]
["persoon 91"]
["persoon 92"]
["persoon 93"]
["persoon 94"]
["persoon 95"]
["persoon 96"]
["persoon 97"]
["persoon 98"]
["persoon 99"]
["persoon 100"]

{"sheet":"Formuleblad","index":5,"n_rows":88,"n_cols":1,"rows_kept":88,"cut":false,"hidden":true,"merged":[]}
["Kies hier uw dichtstbijzijnde Creyf's vestiging…."]
["Alkmaar , Canadaplein 8, 072 - 5116944, alkmaar@creyfs.nl"]
["Almelo, Rosa Luxemburgstraat 11, 0546 - 454160, almelo@creyfs.nl"]
["Almere, Schoutstraat 98, 036 - 5383280, almere@creyfs.nl"]
["Alphen a/d Rijn, De Aarhof 75, 0172 - 474981, alphenadrijn@creyfs.nl"]
["Amersfoort, Grote Haag 33, 033 - 4698000, amersfoort@creyfs.nl"]
["Amersfoort Office, Leusderweg 6, 033 - 4751868, amersfoortoffice@creyfs.nl"]
["Amstelveen, Stadsplein 89, 020 - 5035333, amstelveen@creyfs.nl"]
["Amsterdam, Damrak 37, 020 - 6254711, amsterdam.damrak@creyfs.nl"]
["Amsterdam, Van Baerlestraat 43, 020 - 3050200, amsterdam.vanbaerlestraat@creyfs.nl"]
["Amsterdam, Jan Evertsenstraat 89, 020 - 5891800, amsterdam.janevertsenstraat@creyfs.nl"]
["Amsterdam, Hoofddorpplein 22 - 24, 020 - 5110633, amsterdam.hoofddorpplein@creyfs.nl"]
["Amsterdam, Bijlmerdreef 99, 020 - 3113020, amsterdam.bijlmerdreef@creyfs.nl"]
["Amsterdam, Buikslotermeerplein 313, 020 - 6363131, amsterdam.buikslotermeer@creyfs.nl"]
["Apeldoorn, Nieuwstraat 8, 055 - 5787288, apeldoorn@creyfs.nl"]
["Arnhem, Looierstraat 42, 026 - 3521800, arnhem@creyfs.nl"]
["Arnhem Medical, Willemsplein 35, 026 - 3521805, arnhemmedical@creyfs.nl"]
["Assen, Lauwers 14, 0592 - 398417, assen@creyfs.nl"]
["Barendrecht, Middenbaan 105, 0180 - 611888, barendrecht@creyfs.nl"]
["Barneveld, Churchillstraat 69, 0342 - 408002, barneveld@creyfs.nl"]
["Bergen op Zoom, Burg. Van Hasseltstraat 52, 0164 - 213030, bergenopzoom@creyfs.nl"]
["Best, Oranjestraat 11, 0499 -390400, best@creyfs.nl"]
["Bladel, Sniederslaan 57-a, 0497 - 387363, bladel@creyfs.nl"]
["Boskoop, Koninginneweg 1-e, 0172 - 212424, boskoop@creyfs.nl"]
["Boxmeer, Burgemeester Verkuijlstraat 57 , 0485 - 580150, boxmeer@creyfs.nl"]
["Boxtel, Stationstraat 51a, 0411 - 674999, boxtel@creyfs.nl"]
["Breda, Van Coothplein 43 - 49, 076 - 5305630, breda@creyfs.nl"]
["Deventer, Sijzenbaanplein 11 - 15, 0570 - 665880, deventer@creyfs.nl"]
["Dongen, Hoge Ham 113-a, 0162 - 320512, dongen@creyfs.nl"]
["Dordrecht, Raamstraat 1f, 078 - 6392622, dordrecht@creyfs.nl"]
["Drachten, Moleneind Zuidzijde 69-b, 0512 - 541361, drachten@creyfs.nl"]
["Ede, Breelaan 3, 0318 - 652260, ede@creyfs.nl"]
["Eindhoven, Kruisstraat 94, 040 - 2463355, eindhoven.kruisstraat@creyfs.nl"]
["Eindhoven, Keizersgracht 28, 040 - 2606999, eindhoven.keizersgracht@creyfs.nl"]
["Emmeloord, Noordzijde 18 , 0527-630990, emmeloord@creyfs.nl"]
["Enschede, Beltstraat 1, 053 - 4344300, enschede@creyfs.nl"]
["Etten-Leur, Bisschopsmolenstraat 107, 076 - 5042450, ettenleur@creyfs.nl"]
["Genemuiden, Kruisstraat 7, 038 - 3851720, genemuiden@creyfs.nl"]
["Goes, Voorstad 3, 0113 - 211223, goes@creyfs.nl"]
["Gorinchem, Westwagenstraat 47, 0183 - 664871, gorinchem@creyfs.nl"]
["Gouda, Lange Tiendeweg 69, 0182 - 550505, gouda@creyfs.nl"]
["Den Haag, Turfmarkt 248, 070 - 3560545, denhaag@creyfs.nl"]
["Groenlo, Mattelierstraat 13, 0544 - 464303, groenlo@creyfs.nl"]
["Groningen, Oude Kijk in 't Jatstraat 29, 050 - 3199600, groningen@creyfs.nl"]
["Harderwijk, Donkerstraat 3, 0341 - 426616, harderwijk@creyfs.nl"]
["Heerenveen, Vleesmarkt 10, 0513 - 616900, heerenveen@creyfs.nl"]
["Helmond, Markt 51, 0492 - 509300, helmond@creyfs.nl"]
["Hengelo, Marktstraat 4, 074 - 2592570, hengelo@creyfs.nl"]
["Hertogenbosch 's, Stationsweg 21, 073 - 6130134, denbosch@creyfs.nl"]
["Hoofddorp, Concourslaan 2, 023 - 5671900, hoofddorp@creyfs.nl"]
["Hoogeveen, Van Echtenstraat 8, 0528 - 229420, hoogeveen@creyfs.nl"]
["Hardinxveld-Giessendam, Peulenstraat 222, 0184 - 616988, hardinxveldgiessendam@creyfs.nl"]
["Kampen, Plantage 16, 038 - 3328575, kampen@creyfs.nl"]
["Leeuwarden, De Kelders 15, 058 - 2137033, leeuwarden@creyfs.nl"]
["Lelystad, Stadhuisstraat 124, 0320 - 290190, lelystad@creyfs.nl"]
["Maarssen, Bisonspoor 2040, 0346 - 567300, maarssen@creyfs.nl"]
["Maastricht, Stationsstraat 31, 043 - 3256627, maastricht@creyfs.nl"]
["Meppel, Brouwersdwarsstraat 1, 0522 - 238820, meppel@creyfs.nl"]
["Middelburg, Lange Noordstraat 2, 0118 - 679040, middelburg@creyfs.nl"]
["Nijkerk, Holkerstraat 2, 033 - 2456964, nijkerk@creyfs.nl"]
["Nijmegen, Ziekerstraat 136, 024 - 3828100, nijmegen@creyfs.nl"]
["Oosterhout, Leijsenhoek 45a, 0162 - 497000, oosterhout@creyfs.nl"]
["Roosendaal, Nieuwe Markt 71, 0165 - 583130, roosendaal@creyfs.nl"]
["Rotterdam, Maasdamstraat 2a, 010 - 2150904, rotterdam.maasdamstraat@creyfs.nl"]
["Rotterdam, Meent 62 - 64, 010 - 4132480, rotterdam.meent@creyfs.nl"]
["Schiedam, Broersvest 50a, 010 - 2708070, schiedam@creyfs.nl"]
["Sneek, Oude Koemarkt 55, 0515 - 462515, sneek@creyfs.nl"]
["Tiel, Buurmalsenstraat 1, 0344 - 673900, tiel@creyfs.nl"]
["Tiel Intersales, Buurmalsenstraat 1, 0344 - 632111, tielintersales@creyfs.nl"]
["Tiel Intersales, Buurmalsenstraat 1, 0344 - 616070, tielintersales@creyfs.nl"]
["Tilburg, Spoorlaan 372, 013 - 5443248, tilburg@creyfs.nl"]
["Uden, Mondriaanplein 24, 0413 - 251755, uden@creyfs.nl"]
["Uithoorn, Marktplein 25, 0297 - 560171, uithoorn@creyfs.nl"]
["Urk, Wijk 2-76, 0527 - 680880, urk@creyfs.nl"]
["Utrecht, Bernadottelaan 146, 030 - 2916300, utrecht.bernadottelaan@creyfs.nl"]
["Utrecht, Biltstraat 71, 030 - 2307150, utrecht.biltstraat@creyfs.nl"]
["Utrecht Office, Potterstraat 10, 030 - 2343444, utrechtoffice@creyfs.nl"]
["Valkenswaard, Luikerweg 23, 040 - 2044995, valkenswaard@creyfs.nl"]
["Veghel, De Wiekslag 27, 0413 - 366808, veghel@creyfs.nl"]
["Waalwijk, Grotestraat 213, 0416 - 339519, waalwijk@creyfs.nl"]
["Weert, Maasstraat 11, 0495 - 580100, weert@creyfs.nl"]
["Weesp, Nieuwstad 4, 0294 - 430071, weesp@creyfs.nl"]
["Woerden, Meulmansweg 2a, 0348 - 411838, woerden@creyfs.nl"]
["Zaandam, Peperstraat 220, 075 - 6553500, zaandam@creyfs.nl"]
["Zeist , 2e Hogeweg 123, 030 - 6922084, zeist@creyfs.nl"]
["Zoetermeer, Noordwaarts 34, 079 - 3304500, zoetermeer@creyfs.nl"]
["Zwolle, Nieuwe Markt 1, 038 - 4210085, zwolle@creyfs.nl"]
["Zwolle Medical, Diezerpoortenplas 5, 038 - 4229888, zwollemedical@creyfs.nl"]