{"text_format":"1","workbook":"xlsx","n_sheets":3,"sheets":["data","2016","Formuleblad"],"not_rendered":{"charts":0,"images":0,"macros":1,"external_links":0,"defined_names":19,"comments":0,"pivot_tables":0},"unopened":[],"bounds":{"document_bytes":16777216,"sheet_cells":100000,"rows_first":2000,"rows_last":500,"rows_between":2000,"halvings":0,"cell_chars":16384,"cell_head_chars":4096},"cells_cut":0,"cells_raw":0,"read":"whole","date_system":"1900"}

{"sheet":"data","index":0,"n_rows":81,"n_cols":27,"rows_kept":81,"cut":false,"hidden":false,"merged":[[49,3,49,4],[49,5,49,6],[49,7,49,8],[49,9,49,10],[36,7,36,9],[37,7,37,9],[38,7,38,9],[49,25,49,26],[49,11,49,12],[49,13,49,14],[49,15,49,16],[49,17,49,18],[49,19,49,20],[49,21,49,22],[49,23,49,24]]}
[{"$f":"A2-1","v":2015}]
[{"$f":"YEAR(NOW())","v":2016},null,"Het huidige jaar staat altijd in het midden."]
[{"$f":"A2+1","v":2017},null,{"$f":"\"Dus volgend jaar staat \" &A2+1 &\" in het midden.\"","v":"Dus volgend jaar staat 2017 in het midden."}]
[]
["Zijn er feestdagen die je niet nodig bebt, zet dan een spatie voor de formule in kolom A"]
[]
[{"$f":"DATE(jaar,1,1)","v":"2016-01-01"},"Nieuwjaarsdag"]
[" =DATUM(jaar;1;1+((1-(1>WEEKDAG(DATUM(jaar;1;1);2)))*7)+(1-WEEKDAG(DATUM(jaar;1;1);2)))","Driekoningen (N)"]
[" =DATUM(jaar;1;6)","Driekoningen (B)"]
[" =DATUM(jaar;2;14)","Sint-Valentijn"]
[" =AFRONDEN.BENEDEN(DAG(MINUUT(jaar/38)/2+56)&\"/5/\"&jaar;7)-81","Vastenavond (r.-k.)"]
[" =AFRONDEN.BENEDEN(DAG(MINUUT(jaar/38)/2+56)&\"/5/\"&jaar;7)-80","Aswoensdag (r.-k.)"]
[" =DATUM(jaar;3;12)","Biddag voor gewas en arbeid (pr.)"]
[" =DATUM(jaar;3;25)","Maria Boodschap (r.-k.)"]
[" =AFRONDEN.BENEDEN(DAG(MINUUT(jaar/38)/2+56)&\"/5/\"&jaar;7)-37","Witte Donderdag"]
[{"$f":"FLOOR(DAY(MINUTE(jaar/38)/2+56)&\"/5/\"&jaar,7)-36","v":"2016-03-25"},"Goede Vrijdag"]
[{"$f":"FLOOR(DAY(MINUTE(jaar/38)/2+56)&\"/5/\"&jaar,7)-34","v":"2016-03-27"},"1e Paasdag"]
[{"$f":"FLOOR(DAY(MINUTE(jaar/38)/2+56)&\"/5/\"&jaar,7)-33","v":"2016-03-28"},"2e paasdag"]
[{"$f":"IF(WEEKDAY(DATE(jaar,4,30))*1,DATE(jaar,4,27),DATE(jaar,4,30))","v":"2016-04-27"},"Koningsdag (N)"]
[" =DATUM(jaar;5;1)","Dag van de arbeid (B)"]
[{"$f":"DATE(jaar,5,5)","v":"2016-05-05"},"Bevreidingsdag (N)"]
[{"$f":"FLOOR(DAY(MINUTE(jaar/38)/2+56)&\"/5/\"&jaar,7)+5","v":"2016-05-05"},"Hemelvaartsdag"]
[" =DATUM(jaar;5;25)","Trinitatis (pr.)"]
[{"$f":"FLOOR(DAY(MINUTE(jaar/38)/2+56)&\"/5/\"&jaar,7)+15","v":"2016-05-15"},"1e Pinsterdag"]
[{"$f":"FLOOR(DAY(MINUTE(jaar/38)/2+56)&\"/5/\"&jaar,7)+16","v":"2016-05-16"},"2e Pinksterdag"]
[" =DATUM(jaar;6;1)","Sacramentsdag (r.-k.)"]
[" =DATUM(jaar;6;6)","H. Hartfeest (r.-k.)"]
[" =DATUM(jaar;7;11)","Ned.talige Cult. Gem. (B)"]
[" =DATUM(jaar;7;21)","Nationale feestdag (B)"]
[" =DATUM(jaar;8;15)","Maria-ten-hemelopneming (r.-k.)"]
[{"$f":"DATE(jaar,9,1)+IF(3<WEEKDAY(DATE(jaar,9,1)),7-WEEKDAY(DATE(jaar,9,1))+3,3-WEEKDAY(DATE(jaar,9,1)))+((3-1)*7)","v":"2016-09-20"},"Prinsjesdag (N)"]
[" =DATUM(jaar;9;27)","Franstalige Cult. Gem. (B)"]
[" =DATUM(jaar;12;26)-63-WEEKDAG(DATUM(jaar;12;26);2)","Missiezondag (r.-k.)"]
[" =DATUM(jaar;10;31)","Hervormingsdag (pr.)"]
[" =DATUM(jaar;11;1)","Allerheiligen (r.-k.)"]
[" =DATUM(jaar;11;2)","Allerzielen (r.-k.)"]
[" =F36=A38=DATUM(jaar;11;5)","Dankdag voor gewas en arbeid (pr.)"]
[" =DATUM(jaar;11;11)","Wapenstilstandsdag 1918 (B)"]
[" =DATUM(jaar;11;15)","Feest van de dynastie (B)"]
[" =DATUM(jaar;12;26)-28-WEEKDAG(DATUM(jaar;12;26);2)","1e Adventszondag"]
[" =DATUM(jaar;11;23)","Christus Koning (r.-k.)"]
[{"$f":"DATE(jaar,12,5)","v":"2016-12-05"},"Sinterklaas (N)"]
[" =DATUM(jaar;12;6)","Sinterklaas (B)"]
[" =DATUM(jaar;12;8)","Maria onbevlekte ontvangenis (r.-k.)",null,null,null,null,null,null,null,null,null,null,null,null,null," =ALS(ISFOUT(KLEINSTE($B$2:$AF$2;RIJ()-4));\"\";KLEINSTE($B$2:$AF$2;RIJ()-4))"]
[{"$f":"DATE(jaar,12,25)","v":"2016-12-25"},"1e Kerstdag"]
[{"$f":"DATE(jaar,12,26)","v":"2016-12-26"},"2e Kerstdag",null,null,null,null,null,null,null,null,null,null,null,null,null,{"$f":"SMALL(jan,1)","v":"2016-01-01"}]
[{"$f":"DATE(jaar,12,31)","v":"2016-12-31"},"Oudejaarsdag",null,null,null,null,null,null,null,null,null,null,null,null,null,{"$f":"SMALL(jan,2)","v":{"$error":"#NUM!"}}]
[]
[]
[null,null,null,"januari",null,"februari",null,"maart",null,"april",null,"mei",null,"juni",null,"juli",null,"augustus",null,"september",null,"oktober",null,"november",null,"december"]
[null,null,null,{"$f":"DATE(jaar,1,ROW()-50)","v":"2016-01-01"},{"$f":"IF(NOT(ISERROR(VLOOKUP(D51,feestdagen,1,0))),D51,\"\")","v":"2016-01-01"},{"$f":"DATE(jaar,2,ROW()-50)","v":"2016-02-01"},{"$f":"IF(NOT(ISERROR(VLOOKUP(F51,feestdagen,1,0))),F51,\"\")","v":""},{"$f":"DATE(jaar,3,ROW()-50)","v":"2016-03-01"},{"$f":"IF(NOT(ISERROR(VLOOKUP(H51,feestdagen,1,0))),H51,\"\")","v":""},{"$f":"DATE(jaar,4,ROW()-50)","v":"2016-04-01"},{"$f":"IF(NOT(ISERROR(VLOOKUP(J51,feestdagen,1,0))),J51,\"\")","v":""},{"$f":"DATE(jaar,5,ROW()-50)","v":"2016-05-01"},{"$f":"IF(NOT(ISERROR(VLOOKUP(L51,feestdagen,1,0))),L51,\"\")","v":""},{"$f":"DATE(jaar,6,ROW()-50)","v":"2016-06-01"},{"$f":"IF(NOT(ISERROR(VLOOKUP(N51,feestdagen,1,0))),N51,\"\")","v":""},{"$f":"DATE(jaar,7,ROW()-50)","v":"2016-07-01"},{"$f":"IF(NOT(ISERROR(VLOOKUP(P51,feestdagen,1,0))),P51,\"\")","v":""},{"$f":"DATE(jaar,8,ROW()-50)","v":"2016-08-01"},{"$f":"IF(NOT(ISERROR(VLOOKUP(R51,feestdagen,1,0))),R51,\"\")","v":""},{"$f":"DATE(jaar,9,ROW()-50)","v":"2016-09-01"},{"$f":"IF(NOT(ISERROR(VLOOKUP(T51,feestdagen,1,0))),T51,\"\")","v":""},{"$f":"DATE(jaar,10,ROW()-50)","v":"2016-10-01"},{"$f":"IF(NOT(ISERROR(VLOOKUP(V51,feestdagen,1,0))),V51,\"\")","v":""},{"$f":"DATE(jaar,11,ROW()-50)","v":"2016-11-01"},{"$f":"IF(NOT(ISERROR(VLOOKUP(X51,feestdagen,1,0))),X51,\"\")","v":""},{"$f":"DATE(jaar,12,ROW()-50)","v":"2016-12-01"},{"$f":"IF(NOT(ISERROR(VLOOKUP(Z51,feestdagen,1,0))),Z51,\"\")","v":""}]
[null,null,null,{"$f":"D51+1","v":"2016-01-02"},"",{"$f":"F51+1","v":"2016-02-02"},"",{"$f":"H51+1","v":"2016-03-02"},"",{"$f":"J51+1","v":"2016-04-02"},"","2016-05-02","","2016-06-02","","2016-07-02","","2016-08-02","","2016-09-02","","2016-10-02","","2016-11-02","","2016-12-02",""]
[null,null,null,{"$f":"D52+1","v":"2016-01-03"},"",{"$f":"F52+1","v":"2016-02-03"},"",{"$f":"H52+1","v":"2016-03-03"},"",{"$f":"J52+1","v":"2016-04-03"},"",{"$f":"L52+1","v":"2016-05-03"},"",{"$f":"N52+1","v":"2016-06-03"},"",{"$f":"P52+1","v":"2016-07-03"},"",{"$f":"R52+1","v":"2016-08-03"},"",{"$f":"T52+1","v":"2016-09-03"},"",{"$f":"V52+1","v":"2016-10-03"},"",{"$f":"X52+1","v":"2016-11-03"},"",{"$f":"Z52+1","v":"2016-12-03"},""]
[null,null,null,"2016-01-04","","2016-02-04","","2016-03-04","","2016-04-04","","2016-05-04","","2016-06-04","","2016-07-04","","2016-08-04","","2016-09-04","","2016-10-04","","2016-11-04","","2016-12-04",""]
[null,null,null,"2016-01-05","","2016-02-05","","2016-03-05","","2016-04-05","","2016-05-05","2016-05-05","2016-06-05","","2016-07-05","","2016-08-05","","2016-09-05","","2016-10-05","","2016-11-05","","2016-12-05","2016-12-05"]
[null,null,null,"2016-01-06","","2016-02-06","","2016-03-06","","2016-04-06","","2016-05-06","","2016-06-06","","2016-07-06","","2016-08-06","","2016-09-06","","2016-10-06","","2016-11-06","","2016-12-06",""]
[null,null,null,"2016-01-07","","2016-02-07","","2016-03-07","","2016-04-07","","2016-05-07","","2016-06-07","","2016-07-07","","2016-08-07","","2016-09-07","","2016-10-07","","2016-11-07","","2016-12-07",""]
[null,null,null,"2016-01-08","","2016-02-08","","2016-03-08","","2016-04-08","","2016-05-08","","2016-06-08","","2016-07-08","","2016-08-08","","2016-09-08","","2016-10-08","","2016-11-08","","2016-12-08",""]
[null,null,null,"2016-01-09","","2016-02-09","","2016-03-09","","2016-04-09","","2016-05-09","","2016-06-09","","2016-07-09","","2016-08-09","","2016-09-09","","2016-10-09","","2016-11-09","","2016-12-09",""]
[null,null,null,"2016-01-10","","2016-02-10","","2016-03-10","","2016-04-10","","2016-05-10","","2016-06-10","","2016-07-10","","2016-08-10","","2016-09-10","","2016-10-10","","2016-11-10","","2016-12-10",""]
[null,null,null,"2016-01-11","","2016-02-11","","2016-03-11","","2016-04-11","","2016-05-11","","2016-06-11","","2016-07-11","","2016-08-11","","2016-09-11","","2016-10-11","","2016-11-11","","2016-12-11",""]
[null,null,null,"2016-01-12","","2016-02-12","","2016-03-12","","2016-04-12","","2016-05-12","","2016-06-12","","2016-07-12","","2016-08-12","","2016-09-12","","2016-10-12","","2016-11-12","","2016-12-12",""]
[null,null,null,"2016-01-13","","2016-02-13","","2016-03-13","","2016-04-13","","2016-05-13","","2016-06-13","","2016-07-13","","2016-08-13","","2016-09-13","","2016-10-13","","2016-11-13","","2016-12-13",""]
[null,null,null,"2016-01-14","","2016-02-14","","2016-03-14","","2016-04-14","","2016-05-14","","2016-06-14","","2016-07-14","","2016-08-14","","2016-09-14","","2016-10-14","","2016-11-14","","2016-12-14",""]
[null,null,null,"2016-01-15","","2016-02-15","","2016-03-15","","2016-04-15","","2016-05-15","2016-05-15","2016-06-15","","2016-07-15","","2016-08-15","","2016-09-15","","2016-10-15","","2016-11-15","","2016-12-15",""]
[null,null,null,"2016-01-16","","2016-02-16","","2016-03-16","","2016-04-16","","2016-05-16","2016-05-16","2016-06-16","","2016-07-16","","2016-08-16","","2016-09-16","","2016-10-16","","2016-11-16","","2016-12-16",""]
[null,null,null,"2016-01-17","","2016-02-17","","2016-03-17","","2016-04-17","","2016-05-17","","2016-06-17","","2016-07-17","","2016-08-17","","2016-09-17","","2016-10-17","","2016-11-17","","2016-12-17",""]
[null,null,null,"2016-01-18","","2016-02-18","","2016-03-18","","2016-04-18","","2016-05-18","","2016-06-18","","2016-07-18","","2016-08-18","","2016-09-18","","2016-10-18","","2016-11-18","","2016-12-18",""]
[null,null,null,"2016-01-19","","2016-02-19","","2016-03-19","","2016-04-19","","2016-05-19","","2016-06-19","","2016-07-19","","2016-08-19","","2016-09-19","","2016-10-19","","2016-11-19","","2016-12-19",""]
[null,null,null,"2016-01-20","","2016-02-20","","2016-03-20","","2016-04-20","","2016-05-20","","2016-06-20","","2016-07-20","","2016-08-20","","2016-09-20","2016-09-20","2016-10-20","","2016-11-20","","2016-12-20",""]
[null,null,null,"2016-01-21","","2016-02-21","","2016-03-21","","2016-04-21","","2016-05-21","","2016-06-21","","2016-07-21","","2016-08-21","","2016-09-21","","2016-10-21","","2016-11-21","","2016-12-21",""]
[null,null,null,"2016-01-22","","2016-02-22","","2016-03-22","","2016-04-22","","2016-05-22","","2016-06-22","","2016-07-22","","2016-08-22","","2016-09-22","","2016-10-22","","2016-11-22","","2016-12-22",""]
[null,null,null,"2016-01-23","","2016-02-23","","2016-03-23","","2016-04-23","","2016-05-23","","2016-06-23","","2016-07-23","","2016-08-23","","2016-09-23","","2016-10-23","","2016-11-23","","2016-12-23",""]
[null,null,null,"2016-01-24","","2016-02-24","","2016-03-24","","2016-04-24","","2016-05-24","","2016-06-24","","2016-07-24","","2016-08-24","","2016-09-24","","2016-10-24","","2016-11-24","","2016-12-24",""]
[null,null,null,"2016-01-25","","2016-02-25","","2016-03-25","2016-03-25","2016-04-25","","2016-05-25","","2016-06-25","","2016-07-25","","2016-08-25","","2016-09-25","","2016-10-25","","2016-11-25","","2016-12-25","2016-12-25"]
[null,null,null,"2016-01-26","","2016-02-26","","2016-03-26","","2016-04-26","","2016-05-26","","2016-06-26","","2016-07-26","","2016-08-26","","2016-09-26","","2016-10-26","","2016-11-26","","2016-12-26","2016-12-26"]
[null,null,null,"2016-01-27","","2016-02-27","","2016-03-27","2016-03-27","2016-04-27","2016-04-27","2016-05-27","","2016-06-27","","2016-07-27","","2016-08-27","","2016-09-27","","2016-10-27","","2016-11-27","","2016-12-27",""]
[null,null,null,"2016-01-28","","2016-02-28","","2016-03-28","2016-03-28","2016-04-28","","2016-05-28","","2016-06-28","","2016-07-28","","2016-08-28","","2016-09-28","","2016-10-28","","2016-11-28","","2016-12-28",""]
[null,null,null,"2016-01-29","",{"$f":"IF(MONTH(F78+1)=MONTH(F78),F78+1,\"\")","v":"2016-02-29"},"","2016-03-29","","2016-04-29","","2016-05-29","","2016-06-29","","2016-07-29","","2016-08-29","","2016-09-29","","2016-10-29","","2016-11-29","","2016-12-29",""]
[null,null,null,"2016-01-30","",null,null,"2016-03-30","","2016-04-30","","2016-05-30","","2016-06-30","","2016-07-30","","2016-08-30","","2016-09-30","","2016-10-30","","2016-11-30","","2016-12-30",""]
[null,null,null,"2016-01-31","",null,null,"2016-03-31","",null,null,"2016-05-31","",null,null,"2016-07-31","","2016-08-31","",null,null,"2016-10-31","",null,null,"2016-12-31","2016-12-31"]

{"sheet":"2016","index":1,"n_rows":112,"n_cols":378,"rows_kept":112,"cut":false,"hidden":false,"merged":[[6,300,6,303],[6,331,6,334],[6,361,6,364],[7,331,7,334],[0,290,0,298],[4,300,4,303],[4,331,4,334],[4,361,4,364],[5,300,5,303],[5,331,5,334],[5,361,5,364],[2,300,2,303],[2,331,2,334],[2,361,2,364],[3,300,3,303],[3,331,3,334],[3,361,3,364],[5,270,5,272],[6,208,6,210],[6,239,6,241],[6,270,6,272],[7,239,7,241],[2,270,2,272],[3,208,3,210],[3,239,3,241],[3,270,3,272],[4,208,4,210],[4,239,4,241],[4,270,4,272],[6,143,6,147],[6,148,6,152],[6,171,6,173],[2,208,2,210],[2,239,2,241],[5,208,5,210],[5,239,5,241],[4,171,4,173],[5,110,5,112],[5,113,5,117],[5,140,5,142],[5,143,5,147],[5,148,5,152],[5,171,5,173],[2,143,2,148],[2,171,2,173],[3,110,3,112],[3,113,3,117],[3,140,3,142],[3,171,3,173],[2,110,2,112],[2,113,2,117],[2,140,2,142],[4,110,4,112],[4,113,4,117],[4,140,4,142],[6,110,6,112],[6,113,6,117],[6,140,6,142],[2,87,2,89],[3,87,3,89],[4,87,4,89],[5,87,5,89],[6,87,6,89],[9,343,9,349],[9,350,9,356],[9,357,9,363],[9,364,9,370],[9,371,9,377],[9,308,9,314],[9,315,9,321],[9,322,9,328],[9,329,9,335],[9,336,9,342],[9,273,9,279],[9,280,9,286],[9,287,9,293],[9,294,9,300],[9,301,9,307],[9,238,9,244],[9,245,9,251],[9,252,9,258],[9,259,9,265],[9,266,9,272],[9,203,9,209],[9,210,9,216],[9,217,9,223],[9,224,9,230],[9,231,9,237],[9,168,9,174],[9,175,9,181],[9,182,9,188],[9,189,9,195],[9,196,9,202],[9,133,9,139],[9,140,9,146],[9,147,9,153],[9,154,9,160],[9,161,9,167],[9,98,9,104],[9,105,9,111],[9,112,9,118],[9,119,9,125],[9,126,9,132],[7,2,7,5],[9,35,9,41],[9,42,9,48],[9,7,9,13],[9,14,9,20],[9,21,9,27],[2,20,2,22],[3,20,3,22],[5,20,5,22],[6,20,6,22],[2,23,2,27],[3,23,3,27],[4,23,4,27],[5,23,5,27],[2,1,2,5],[9,91,9,97],[9,28,9,34],[9,49,9,55],[9,84,9,90],[9,56,9,62],[9,63,9,69],[9,70,9,76],[9,77,9,83],[4,20,4,22],[6,23,6,27],[7,79,7,81],[2,51,2,53],[3,51,3,53],[4,51,4,53],[5,51,5,53],[6,51,6,53],[2,79,2,81],[3,79,3,81],[4,79,4,81],[5,79,5,81],[6,79,6,81]]}
[null,"jaar:",2016,null,null,null,null,null,null,null,{"$f":"DATE(jaar,1,1)","v":"2016-01-01"},null,null,null,null,null,null,null,null,null,null,null,null,null,null,null,null,null,null,null,null,null,null,null,null,null,null,null,null,null,null,{"$f":"DATE(jaar,2,1)","v":"2016-02-01"},null,null,null,null,null,null,null,null,null,null,null,null,null,null,null,null,null,null,null,null,null,null,null,null,null,null,null,{"$f":"DATE(jaar,3,1)","v":"2016-03-01"},null,null,null,null,null,null,null,null,null,null,null,null,null,null,null,null,null,null,null,null,null,null,null,null,null,null,null,null,null,null,{"$f":"DATE(jaar,4,1)","v":"2016-04-01"},null,null,null,null,null,null,null,null,null,null,null,null,null,null,null,null,null,null,null,null,null,null,null,null,null,null,null,null,null,{"$f":"DATE(jaar,5,1)","v":"2016-05-01"},null,null,null,null,null,null,null,null,null,null,null,null,null,null,null,null,null,null,null,null,null,null,null,null,null,null,null,null,null,null,{"$f":"DATE(jaar,6,1)","v":"2016-06-01"},null,null,null,null,null,null,null,null,null,null,null,null,null,null,null,null,null,null,null,null,null,null,null,null,null,null,null,null,null,null,null,null,null,null,null,null,{"$f":"DATE(jaar,7,1)","v":"2016-07-01"},null,null,null,null,null,null,null,null,null,null,null,null,null,null,null,null,null,null,null,null,null,null,null,null,null,null,null,null,null,null,{"$f":"DATE(jaar,8,1)","v":"2016-08-01"},null,null,null,null,null,null,null,null,null,null,null,null,null,null,null,null,null,null,null,null,null,null,null,null,null,null,null,null,null,null,{"$f":"DATE(jaar,9,1)","v":"2016-09-01"},null,null,null,null,null,null,null,null,null,null,null,null,null,null,null,null,null,null,null,null,null,null,null,null,null,null,null,null,null,{"$f":"DATE(jaar,10,1)","v":"2016-10-01"},null,null,null,null,null,null,null,null,null,null,null,null,null,null,null,null,null,null,null,null,null,null,null,null,null,null,null,null,null,null,{"$f":"DATE(jaar,11,1)","v":"2016-11-01"},null,null,null,null,null,null,null,null,null,null,null,null,null,null,null,null,null,null,null,null,null,null,null,null,null,null,null,null,null,{"$f":"DATE(jaar,12,1)","v":"2016-12-01"}]
[null,null,null,null,null,null,null,null,null,null,"Week",null,"M","D","W","D","V","Z","Z",null,null,null,null,null,null,null,null,null,null,null,null,null,null,null,null,null,null,null,null,null,null,"Week",null,"M","D","W","D","V","Z","Z",null,null,null,null,null,null,null,null,null,null,null,null,null,null,null,null,null,null,null,"Week",null,"M","D","W","D","V","Z","Z",null,null,null,null,null,null,null,null,null,null,null,null,null,null,null,null,null,null,null,null,null,null,"Week",null,"M","D","W","D","V","Z","Z",null,null,null,null,null,null,null,null,null,null,null,null,null,null,null,null,null,null,null,null,null,"Week",null,"M","D","W","D","V","Z","Z",null,null,null,null,null,null,null,null,null,null,null,null,null,null,null,null,null,null,null,null,null,null,"Week",null,"M","D","W","D","V","Z","Z",null,null,null,null,null,null,null,null,null,null,null,null,null,null,null,null,null,null,null,null,null,null,null,null,null,null,null,null,"Week",null,"M","D","W","D","V","Z","Z",null,null,null,null,null,null,null,null,null,null,null,null,null,null,null,null,null,null,null,null,null,null,"Week",null,"M","D","W","D","V","Z","Z",null,null,null,null,null,null,null,null,null,null,null,null,null,null,null,null,null,null,null,null,null,null,"Week",null,"M","D","W","D","V","Z","Z",null,null,null,null,null,null,null,null,null,null,null,null,null,null,null,null,null,null,null,null,null,"Week",null,"M","D","W","D","V","Z","Z",null,null,null,null,null,null,null,null,null,null,null,null,null,null,null,null,null,null,null,null,null,null,"Week",null,"M","D","W","D","V","Z","Z",null,null,null,null,null,null,null,null,null,null,null,null,null,null,null,null,null,null,null,null,null,"Week",null,"M","D","W","D","V","Z","Z"]
[null,null,null,null,null,null,null,null,null,null,{"$f":"IFERROR(IsoWeekNumber(S3),\"\")","v":53},null,{"$f":"IF(WEEKDAY(K1,2)=1,K1,\"\")","v":""},{"$f":"IF(M3=\"\",IF(WEEKDAY(K1,2)=2,K1,\"\"),M3+1)","v":""},{"$f":"IF(N3=\"\",IF(WEEKDAY(K1,2)=3,K1,\"\"),N3+1)","v":""},{"$f":"IF(O3=\"\",IF(WEEKDAY(K1,2)=4,K1,\"\"),O3+1)","v":""},{"$f":"IF(P3=\"\",IF(WEEKDAY(K1,2)=5,K1,\"\"),P3+1)","v":"2016-01-01"},{"$f":"IF(Q3=\"\",IF(WEEKDAY(K1,2)=6,K1,\"\"),Q3+1)","v":"2016-01-02"},{"$f":"IF(R3=\"\",IF(WEEKDAY(K1,2)=7,K1,\"\"),R3+1)","v":"2016-01-03"},null,{"$f":"IFERROR(SMALL(jan,ROW()-2),\"\")","v":"2016-01-01"},null,null,{"$f":"IFERROR(VLOOKUP(U3,feestdagen,2,0),\"\")","v":"Nieuwjaarsdag"},null,null,null,null,null,null,null,null,null,null,null,null,null,null,null,null,null,{"$f":"IFERROR(IsoWeekNumber(AX3),\"\")","v":5},null,{"$f":"IF(WEEKDAY(AP1,2)=1,AP1,\"\")","v":"2016-02-01"},{"$f":"IF(AR3=\"\",IF(WEEKDAY(AP1,2)=2,AP1,\"\"),AR3+1)","v":"2016-02-02"},{"$f":"IF(AS3=\"\",IF(WEEKDAY(AP1,2)=3,AP1,\"\"),AS3+1)","v":"2016-02-03"},{"$f":"IF(AT3=\"\",IF(WEEKDAY(AP1,2)=4,AP1,\"\"),AT3+1)","v":"2016-02-04"},{"$f":"IF(AU3=\"\",IF(WEEKDAY(AP1,2)=5,AP1,\"\"),AU3+1)","v":"2016-02-05"},{"$f":"IF(AV3=\"\",IF(WEEKDAY(AP1,2)=6,AP1,\"\"),AV3+1)","v":"2016-02-06"},{"$f":"IF(AW3=\"\",IF(WEEKDAY(AP1,2)=7,AP1,\"\"),AW3+1)","v":"2016-02-07"},null,{"$f":"IFERROR(SMALL(feb,ROW()-2),\"\")","v":""},null,null,{"$f":"IFERROR(VLOOKUP(AZ3,feestdagen,2,0),\"\")","v":""},null,null,null,null,null,null,null,null,null,null,null,null,null,null,{"$f":"IFERROR(IsoWeekNumber(BZ3),\"\")","v":9},null,{"$f":"IF(WEEKDAY(BR1,2)=1,BR1,\"\")","v":""},{"$f":"IF(BT3=\"\",IF(WEEKDAY(BR1,2)=2,BR1,\"\"),BT3+1)","v":"2016-03-01"},{"$f":"IF(BU3=\"\",IF(WEEKDAY(BR1,2)=3,BR1,\"\"),BU3+1)","v":"2016-03-02"},{"$f":"IF(BV3=\"\",IF(WEEKDAY(BR1,2)=4,BR1,\"\"),BV3+1)","v":"2016-03-03"},{"$f":"IF(BW3=\"\",IF(WEEKDAY(BR1,2)=5,BR1,\"\"),BW3+1)","v":"2016-03-04"},{"$f":"IF(BX3=\"\",IF(WEEKDAY(BR1,2)=6,BR1,\"\"),BX3+1)","v":"2016-03-05"},{"$f":"IF(BY3=\"\",IF(WEEKDAY(BR1,2)=7,BR1,\"\"),BY3+1)","v":"2016-03-06"},null,{"$f":"IFERROR(SMALL(maa,ROW()-2),\"\")","v":"2016-03-25"},null,null,{"$f":"IFERROR(VLOOKUP(CB3,feestdagen,2,0),\"\")","v":"Goede Vrijdag"},null,null,null,null,{"$f":"IFERROR(SMALL(feb,ROW()-2),\"\")","v":""},null,null,{"$f":"IFERROR(VLOOKUP(CJ3,feestdagen,2,0),\"\")","v":""},null,null,null,null,null,null,null,null,null,{"$f":"IFERROR(IsoWeekNumber(DE3),\"\")","v":13},null,{"$f":"IF(WEEKDAY(CW1,2)=1,CW1,\"\")","v":""},{"$f":"IF(CY3=\"\",IF(WEEKDAY(CW1,2)=2,CW1,\"\"),CY3+1)","v":""},{"$f":"IF(CZ3=\"\",IF(WEEKDAY(CW1,2)=3,CW1,\"\"),CZ3+1)","v":""},{"$f":"IF(DA3=\"\",IF(WEEKDAY(CW1,2)=4,CW1,\"\"),DA3+1)","v":""},{"$f":"IF(DB3=\"\",IF(WEEKDAY(CW1,2)=5,CW1,\"\"),DB3+1)","v":"2016-04-01"},{"$f":"IF(DC3=\"\",IF(WEEKDAY(CW1,2)=6,CW1,\"\"),DC3+1)","v":"2016-04-02"},{"$f":"IF(DD3=\"\",IF(WEEKDAY(CW1,2)=7,CW1,\"\"),DD3+1)","v":"2016-04-03"},null,{"$f":"IFERROR(SMALL(apr,ROW()-2),\"\")","v":"2016-04-27"},null,null,{"$f":"IFERROR(VLOOKUP(DG3,feestdagen,2,0),\"\")","v":"Koningsdag (N)"},null,null,null,null,null,null,null,null,null,null,null,null,null,null,null,null,{"$f":"IFERROR(IsoWeekNumber(EI3),\"\")","v":17},null,{"$f":"IF(WEEKDAY(EA1,2)=1,EA1,\"\")","v":""},{"$f":"IF(EC3=\"\",IF(WEEKDAY(EA1,2)=2,EA1,\"\"),EC3+1)","v":""},{"$f":"IF(ED3=\"\",IF(WEEKDAY(EA1,2)=3,EA1,\"\"),ED3+1)","v":""},{"$f":"IF(EE3=\"\",IF(WEEKDAY(EA1,2)=4,EA1,\"\"),EE3+1)","v":""},{"$f":"IF(EF3=\"\",IF(WEEKDAY(EA1,2)=5,EA1,\"\"),EF3+1)","v":""},{"$f":"IF(EG3=\"\",IF(WEEKDAY(EA1,2)=6,EA1,\"\"),EG3+1)","v":""},{"$f":"IF(EH3=\"\",IF(WEEKDAY(EA1,2)=7,EA1,\"\"),EH3+1)","v":"2016-05-01"},null,{"$f":"IFERROR(SMALL(mei,ROW()-2),\"\")","v":"2016-05-05"},null,null,{"$f":"IFERROR(VLOOKUP(EK3,feestdagen,2,0),\"\")","v":"Bevreidingsdag (N)"},null,null,null,null,null,null,null,null,null,null,null,null,null,null,null,null,null,{"$f":"IFERROR(IsoWeekNumber(FN3),\"\")","v":22},null,{"$f":"IF(WEEKDAY(FF1,2)=1,FF1,\"\")","v":""},{"$f":"IF(FH3=\"\",IF(WEEKDAY(FF1,2)=2,FF1,\"\"),FH3+1)","v":""},{"$f":"IF(FI3=\"\",IF(WEEKDAY(FF1,2)=3,FF1,\"\"),FI3+1)","v":"2016-06-01"},{"$f":"IF(FJ3=\"\",IF(WEEKDAY(FF1,2)=4,FF1,\"\"),FJ3+1)","v":"2016-06-02"},{"$f":"IF(FK3=\"\",IF(WEEKDAY(FF1,2)=5,FF1,\"\"),FK3+1)","v":"2016-06-03"},{"$f":"IF(FL3=\"\",IF(WEEKDAY(FF1,2)=6,FF1,\"\"),FL3+1)","v":"2016-06-04"},{"$f":"IF(FM3=\"\",IF(WEEKDAY(FF1,2)=7,FF1,\"\"),FM3+1)","v":"2016-06-05"},null,{"$f":"IFERROR(SMALL(jun,ROW()-2),\"\")","v":""},null,null,{"$f":"IFERROR(VLOOKUP(FP3,feestdagen,2,0),\"\")","v":""},null,null,null,null,null,null,null,null,null,null,null,null,null,null,null,null,null,null,null,null,null,null,null,{"$f":"IFERROR(IsoWeekNumber(GY3),\"\")","v":26},null,{"$f":"IF(WEEKDAY(GQ1,2)=1,GQ1,\"\")","v":""},{"$f":"IF(GS3=\"\",IF(WEEKDAY(GQ1,2)=2,GQ1,\"\"),GS3+1)","v":""},{"$f":"IF(GT3=\"\",IF(WEEKDAY(GQ1,2)=3,GQ1,\"\"),GT3+1)","v":""},{"$f":"IF(GU3=\"\",IF(WEEKDAY(GQ1,2)=4,GQ1,\"\"),GU3+1)","v":""},{"$f":"IF(GV3=\"\",IF(WEEKDAY(GQ1,2)=5,GQ1,\"\"),GV3+1)","v":"2016-07-01"},{"$f":"IF(GW3=\"\",IF(WEEKDAY(GQ1,2)=6,GQ1,\"\"),GW3+1)","v":"2016-07-02"},{"$f":"IF(GX3=\"\",IF(WEEKDAY(GQ1,2)=7,GQ1,\"\"),GX3+1)","v":"2016-07-03"},null,{"$f":"IFERROR(SMALL(jul,ROW()-2),\"\")","v":""},null,null,{"$f":"IFERROR(VLOOKUP(HA3,feestdagen,2,0),\"\")","v":""},null,null,null,null,null,null,null,null,null,null,null,null,null,null,null,null,null,{"$f":"IFERROR(IsoWeekNumber(ID3),\"\")","v":31},null,{"$f":"IF(WEEKDAY(HV1,2)=1,HV1,\"\")","v":"2016-08-01"},{"$f":"IF(HX3=\"\",IF(WEEKDAY(HV1,2)=2,HV1,\"\"),HX3+1)","v":"2016-08-02"},{"$f":"IF(HY3=\"\",IF(WEEKDAY(HV1,2)=3,HV1,\"\"),HY3+1)","v":"2016-08-03"},{"$f":"IF(HZ3=\"\",IF(WEEKDAY(HV1,2)=4,HV1,\"\"),HZ3+1)","v":"2016-08-04"},{"$f":"IF(IA3=\"\",IF(WEEKDAY(HV1,2)=5,HV1,\"\"),IA3+1)","v":"2016-08-05"},{"$f":"IF(IB3=\"\",IF(WEEKDAY(HV1,2)=6,HV1,\"\"),IB3+1)","v":"2016-08-06"},{"$f":"IF(IC3=\"\",IF(WEEKDAY(HV1,2)=7,HV1,\"\"),IC3+1)","v":"2016-08-07"},null,{"$f":"IFERROR(SMALL(aug,ROW()-2),\"\")","v":""},null,null,{"$f":"IFERROR(VLOOKUP(IF3,feestdagen,2,0),\"\")","v":""},null,null,null,null,null,null,null,null,null,null,null,null,null,null,null,null,null,{"$f":"IFERROR(IsoWeekNumber(JI3),\"\")","v":35},null,{"$f":"IF(WEEKDAY(JA1,2)=1,JA1,\"\")","v":""},{"$f":"IF(JC3=\"\",IF(WEEKDAY(JA1,2)=2,JA1,\"\"),JC3+1)","v":""},{"$f":"IF(JD3=\"\",IF(WEEKDAY(JA1,2)=3,JA1,\"\"),JD3+1)","v":""},{"$f":"IF(JE3=\"\",IF(WEEKDAY(JA1,2)=4,JA1,\"\"),JE3+1)","v":"2016-09-01"},{"$f":"IF(JF3=\"\",IF(WEEKDAY(JA1,2)=5,JA1,\"\"),JF3+1)","v":"2016-09-02"},{"$f":"IF(JG3=\"\",IF(WEEKDAY(JA1,2)=6,JA1,\"\"),JG3+1)","v":"2016-09-03"},{"$f":"IF(JH3=\"\",IF(WEEKDAY(JA1,2)=7,JA1,\"\"),JH3+1)","v":"2016-09-04"},null,{"$f":"IFERROR(SMALL(sep,ROW()-2),\"\")","v":"2016-09-20"},null,null,{"$f":"IFERROR(VLOOKUP(JK3,feestdagen,2,0),\"\")","v":"Prinsjesdag (N)"},null,null,null,null,null,null,null,null,null,null,null,null,null,null,null,null,{"$f":"IFERROR(IsoWeekNumber(KM3),\"\")","v":39},null,{"$f":"IF(WEEKDAY(KE1,2)=1,KE1,\"\")","v":""},{"$f":"IF(KG3=\"\",IF(WEEKDAY(KE1,2)=2,KE1,\"\"),KG3+1)","v":""},{"$f":"IF(KH3=\"\",IF(WEEKDAY(KE1,2)=3,KE1,\"\"),KH3+1)","v":""},{"$f":"IF(KI3=\"\",IF(WEEKDAY(KE1,2)=4,KE1,\"\"),KI3+1)","v":""},{"$f":"IF(KJ3=\"\",IF(WEEKDAY(KE1,2)=5,KE1,\"\"),KJ3+1)","v":""},{"$f":"IF(KK3=\"\",IF(WEEKDAY(KE1,2)=6,KE1,\"\"),KK3+1)","v":"2016-10-01"},{"$f":"IF(KL3=\"\",IF(WEEKDAY(KE1,2)=7,KE1,\"\"),KL3+1)","v":"2016-10-02"},null,{"$f":"IFERROR(SMALL(okt,ROW()-2),\"\")","v":""},null,null,null,{"$f":"IFERROR(VLOOKUP(KO3,feestdagen,2,0),\"\")","v":""},null,null,null,null,null,null,null,null,null,null,null,null,null,null,null,null,{"$f":"IFERROR(IsoWeekNumber(LR3),\"\")","v":44},null,{"$f":"IF(WEEKDAY(LJ1,2)=1,LJ1,\"\")","v":""},{"$f":"IF(LL3=\"\",IF(WEEKDAY(LJ1,2)=2,LJ1,\"\"),LL3+1)","v":"2016-11-01"},{"$f":"IF(LM3=\"\",IF(WEEKDAY(LJ1,2)=3,LJ1,\"\"),LM3+1)","v":"2016-11-02"},{"$f":"IF(LN3=\"\",IF(WEEKDAY(LJ1,2)=4,LJ1,\"\"),LN3+1)","v":"2016-11-03"},{"$f":"IF(LO3=\"\",IF(WEEKDAY(LJ1,2)=5,LJ1,\"\"),LO3+1)","v":"2016-11-04"},{"$f":"IF(LP3=\"\",IF(WEEKDAY(LJ1,2)=6,LJ1,\"\"),LP3+1)","v":"2016-11-05"},{"$f":"IF(LQ3=\"\",IF(WEEKDAY(LJ1,2)=7,LJ1,\"\"),LQ3+1)","v":"2016-11-06"},null,{"$f":"IFERROR(SMALL(okt,ROW()-2),\"\")","v":""},null,null,null,{"$f":"IFERROR(VLOOKUP(LT3,feestdagen,2,0),\"\")","v":""},null,null,null,null,null,null,null,null,null,null,null,null,null,null,null,{"$f":"IFERROR(IsoWeekNumber(MV3),\"\")","v":48},null,{"$f":"IF(WEEKDAY(MN1,2)=1,MN1,\"\")","v":""},{"$f":"IF(MP3=\"\",IF(WEEKDAY(MN1,2)=2,MN1,\"\"),MP3+1)","v":""},{"$f":"IF(MQ3=\"\",IF(WEEKDAY(MN1,2)=3,MN1,\"\"),MQ3+1)","v":""},{"$f":"IF(MR3=\"\",IF(WEEKDAY(MN1,2)=4,MN1,\"\"),MR3+1)","v":"2016-12-01"},{"$f":"IF(MS3=\"\",IF(WEEKDAY(MN1,2)=5,MN1,\"\"),MS3+1)","v":"2016-12-02"},{"$f":"IF(MT3=\"\",IF(WEEKDAY(MN1,2)=6,MN1,\"\"),MT3+1)","v":"2016-12-03"},{"$f":"IF(MU3=\"\",IF(WEEKDAY(MN1,2)=7,MN1,\"\"),MU3+1)","v":"2016-12-04"},null,{"$f":"IFERROR(SMALL(dec,ROW()-2),\"\")","v":"2016-12-05"},null,null,null,{"$f":"IFERROR(VLOOKUP(MX3,feestdagen,2,0),\"\")","v":"Sinterklaas (N)"}]
[null,null,null,null,null,null,null,null,null,null,{"$f":"IFERROR(IsoWeekNumber(S4),\"\")","v":1},null,{"$f":"S3+1","v":"2016-01-04"},{"$f":"M4+1","v":"2016-01-05"},"2016-01-06","2016-01-07","2016-01-08","2016-01-09","2016-01-10",null,{"$f":"IFERROR(SMALL(jan,ROW()-2),\"\")","v":""},null,null,{"$f":"IFERROR(VLOOKUP(U4,feestdagen,2,0),\"\")","v":""},null,null,null,null,null,null,null,null,null,null,null,null,null,null,null,null,null,{"$f":"IFERROR(IsoWeekNumber(AX4),\"\")","v":6},null,{"$f":"AX3+1","v":"2016-02-08"},{"$f":"AR4+1","v":"2016-02-09"},{"$f":"AS4+1","v":"2016-02-10"},{"$f":"AT4+1","v":"2016-02-11"},{"$f":"AU4+1","v":"2016-02-12"},{"$f":"AV4+1","v":"2016-02-13"},{"$f":"AW4+1","v":"2016-02-14"},null,{"$f":"IFERROR(SMALL(feb,ROW()-2),\"\")","v":""},null,null,{"$f":"IFERROR(VLOOKUP(AZ4,feestdagen,2,0),\"\")","v":""},null,null,null,null,null,null,null,null,null,null,null,null,null,null,{"$f":"IFERROR(IsoWeekNumber(BZ4),\"\")","v":10},null,{"$f":"BZ3+1","v":"2016-03-07"},{"$f":"BT4+1","v":"2016-03-08"},{"$f":"BU4+1","v":"2016-03-09"},{"$f":"BV4+1","v":"2016-03-10"},{"$f":"BW4+1","v":"2016-03-11"},{"$f":"BX4+1","v":"2016-03-12"},{"$f":"BY4+1","v":"2016-03-13"},null,"2016-03-27",null,null,"1e Paasdag",null,null,null,null,{"$f":"IFERROR(SMALL(feb,ROW()-2),\"\")","v":""},null,null,{"$f":"IFERROR(VLOOKUP(CJ4,feestdagen,2,0),\"\")","v":""},null,null,null,null,null,null,null,null,null,{"$f":"IFERROR(IsoWeekNumber(DE4),\"\")","v":14},null,{"$f":"DE3+1","v":"2016-04-04"},{"$f":"CY4+1","v":"2016-04-05"},{"$f":"CZ4+1","v":"2016-04-06"},{"$f":"DA4+1","v":"2016-04-07"},{"$f":"DB4+1","v":"2016-04-08"},{"$f":"DC4+1","v":"2016-04-09"},{"$f":"DD4+1","v":"2016-04-10"},null,{"$f":"IFERROR(SMALL(apr,ROW()-2),\"\")","v":""},null,null,{"$f":"IFERROR(VLOOKUP(DG4,feestdagen,2,0),\"\")","v":""},null,null,null,null,null,null,null,null,null,null,null,null,null,null,null,null,{"$f":"IFERROR(IsoWeekNumber(EI4),\"\")","v":18},null,{"$f":"EI3+1","v":"2016-05-02"},{"$f":"EC4+1","v":"2016-05-03"},{"$f":"ED4+1","v":"2016-05-04"},{"$f":"EE4+1","v":"2016-05-05"},{"$f":"EF4+1","v":"2016-05-06"},{"$f":"EG4+1","v":"2016-05-07"},{"$f":"EH4+1","v":"2016-05-08"},null,{"$f":"IFERROR(SMALL(mei,ROW()-2),\"\")","v":"2016-05-15"},null,null,{"$f":"IFERROR(VLOOKUP(EK4,feestdagen,2,0),\"\")","v":"1e Pinsterdag"},null,null,null,null,null,null,null,null,null,null,null,null,null,null,null,null,null,{"$f":"IFERROR(IsoWeekNumber(FN4),\"\")","v":23},null,{"$f":"FN3+1","v":"2016-06-06"},{"$f":"FH4+1","v":"2016-06-07"},{"$f":"FI4+1","v":"2016-06-08"},{"$f":"FJ4+1","v":"2016-06-09"},{"$f":"FK4+1","v":"2016-06-10"},{"$f":"FL4+1","v":"2016-06-11"},{"$f":"FM4+1","v":"2016-06-12"},null,{"$f":"IFERROR(SMALL(jun,ROW()-2),\"\")","v":""},null,null,{"$f":"IFERROR(VLOOKUP(FP4,feestdagen,2,0),\"\")","v":""},null,null,null,null,null,null,null,null,null,null,null,null,null,null,null,null,null,null,null,null,null,null,null,{"$f":"IFERROR(IsoWeekNumber(GY4),\"\")","v":27},null,{"$f":"GY3+1","v":"2016-07-04"},{"$f":"GS4+1","v":"2016-07-05"},{"$f":"GT4+1","v":"2016-07-06"},{"$f":"GU4+1","v":"2016-07-07"},{"$f":"GV4+1","v":"2016-07-08"},{"$f":"GW4+1","v":"2016-07-09"},{"$f":"GX4+1","v":"2016-07-10"},null,{"$f":"IFERROR(SMALL(jul,ROW()-2),\"\")","v":""},null,null,{"$f":"IFERROR(VLOOKUP(HA4,feestdagen,2,0),\"\")","v":""},null,null,null,null,null,null,null,null,null,null,null,null,null,null,null,null,null,{"$f":"IFERROR(IsoWeekNumber(ID4),\"\")","v":32},null,{"$f":"ID3+1","v":"2016-08-08"},{"$f":"HX4+1","v":"2016-08-09"},{"$f":"HY4+1","v":"2016-08-10"},{"$f":"HZ4+1","v":"2016-08-11"},{"$f":"IA4+1","v":"2016-08-12"},{"$f":"IB4+1","v":"2016-08-13"},{"$f":"IC4+1","v":"2016-08-14"},null,"",null,null,"",null,null,null,null,null,null,null,null,null,null,null,null,null,null,null,null,null,{"$f":"IFERROR(IsoWeekNumber(JI4),\"\")","v":36},null,{"$f":"JI3+1","v":"2016-09-05"},{"$f":"JC4+1","v":"2016-09-06"},{"$f":"JD4+1","v":"2016-09-07"},{"$f":"JE4+1","v":"2016-09-08"},{"$f":"JF4+1","v":"2016-09-09"},{"$f":"JG4+1","v":"2016-09-10"},{"$f":"JH4+1","v":"2016-09-11"},null,{"$f":"IFERROR(SMALL(sep,ROW()-2),\"\")","v":""},null,null,{"$f":"IFERROR(VLOOKUP(JK4,feestdagen,2,0),\"\")","v":""},null,null,null,null,null,null,null,null,null,null,null,null,null,null,null,null,{"$f":"IFERROR(IsoWeekNumber(KM4),\"\")","v":40},null,{"$f":"KM3+1","v":"2016-10-03"},{"$f":"KG4+1","v":"2016-10-04"},{"$f":"KH4+1","v":"2016-10-05"},{"$f":"KI4+1","v":"2016-10-06"},{"$f":"KJ4+1","v":"2016-10-07"},{"$f":"KK4+1","v":"2016-10-08"},{"$f":"KL4+1","v":"2016-10-09"},null,{"$f":"IFERROR(SMALL(okt,ROW()-2),\"\")","v":""},null,null,null,{"$f":"IFERROR(VLOOKUP(KO4,feestdagen,2,0),\"\")","v":""},null,null,null,null,null,null,null,null,null,null,null,null,null,null,null,null,{"$f":"IFERROR(IsoWeekNumber(LR4),\"\")","v":45},null,{"$f":"LR3+1","v":"2016-11-07"},{"$f":"LL4+1","v":"2016-11-08"},{"$f":"LM4+1","v":"2016-11-09"},{"$f":"LN4+1","v":"2016-11-10"},{"$f":"LO4+1","v":"2016-11-11"},{"$f":"LP4+1","v":"2016-11-12"},{"$f":"LQ4+1","v":"2016-11-13"},null,"",null,null,null,"",null,null,null,null,null,null,null,null,null,null,null,null,null,null,null,{"$f":"IFERROR(IsoWeekNumber(MV4),\"\")","v":49},null,{"$f":"MV3+1","v":"2016-12-05"},{"$f":"MP4+1","v":"2016-12-06"},{"$f":"MQ4+1","v":"2016-12-07"},{"$f":"MR4+1","v":"2016-12-08"},{"$f":"MS4+1","v":"2016-12-09"},{"$f":"MT4+1","v":"2016-12-10"},{"$f":"MU4+1","v":"2016-12-11"},null,{"$f":"IFERROR(SMALL(dec,ROW()-2),\"\")","v":"2016-12-25"},null,null,null,{"$f":"IFERROR(VLOOKUP(MX4,feestdagen,2,0),\"\")","v":"1e Kerstdag"}]
[null,null,null,null,null,null,null,null,null,null,2,null,{"$f":"S4+1","v":"2016-01-11"},"2016-01-12","2016-01-13","2016-01-14","2016-01-15","2016-01-16","2016-01-17",null,{"$f":"IFERROR(SMALL(jan,ROW()-2),\"\")","v":""},null,null,{"$f":"IFERROR(VLOOKUP(U5,feestdagen,2,0),\"\")","v":""},null,null,null,null,null,null,null,null,null,null,null,null,null,null,null,null,null,7,null,{"$f":"AX4+1","v":"2016-02-15"},"2016-02-16","2016-02-17","2016-02-18","2016-02-19","2016-02-20","2016-02-21",null,{"$f":"IFERROR(SMALL(feb,ROW()-2),\"\")","v":""},null,null,{"$f":"IFERROR(VLOOKUP(AZ5,feestdagen,2,0),\"\")","v":""},null,null,null,null,null,null,null,null,null,null,null,null,null,null,11,null,{"$f":"BZ4+1","v":"2016-03-14"},"2016-03-15","2016-03-16","2016-03-17","2016-03-18","2016-03-19","2016-03-20",null,"2016-03-28",null,null,"2e paasdag",null,null,null,null,{"$f":"IFERROR(SMALL(feb,ROW()-2),\"\")","v":""},null,null,{"$f":"IFERROR(VLOOKUP(CJ5,feestdagen,2,0),\"\")","v":""},null,null,null,null,null,null,null,null,null,15,null,{"$f":"DE4+1","v":"2016-04-11"},"2016-04-12","2016-04-13","2016-04-14","2016-04-15","2016-04-16","2016-04-17",null,{"$f":"IFERROR(SMALL(apr,ROW()-2),\"\")","v":""},null,null,{"$f":"IFERROR(VLOOKUP(DG5,feestdagen,2,0),\"\")","v":""},null,null,null,null,null,null,null,null,null,null,null,null,null,null,null,null,19,null,{"$f":"EI4+1","v":"2016-05-09"},"2016-05-10","2016-05-11","2016-05-12","2016-05-13","2016-05-14","2016-05-15",null,{"$f":"IFERROR(SMALL(mei,ROW()-2),\"\")","v":"2016-05-16"},null,null,{"$f":"IFERROR(VLOOKUP(EK5,feestdagen,2,0),\"\")","v":"2e Pinksterdag"},null,null,null,null,null,null,null,null,null,null,null,null,null,null,null,null,null,24,null,{"$f":"FN4+1","v":"2016-06-13"},"2016-06-14","2016-06-15","2016-06-16","2016-06-17","2016-06-18","2016-06-19",null,{"$f":"IFERROR(SMALL(jun,ROW()-2),\"\")","v":""},null,null,{"$f":"IFERROR(VLOOKUP(FP5,feestdagen,2,0),\"\")","v":""},null,null,null,null,null,null,null,null,null,null,null,null,null,null,null,null,null,null,null,null,null,null,null,28,null,{"$f":"GY4+1","v":"2016-07-11"},"2016-07-12","2016-07-13","2016-07-14","2016-07-15","2016-07-16","2016-07-17",null,{"$f":"IFERROR(SMALL(jul,ROW()-2),\"\")","v":""},null,null,{"$f":"IFERROR(VLOOKUP(HA5,feestdagen,2,0),\"\")","v":""},null,null,null,null,null,null,null,null,null,null,null,null,null,null,null,null,null,33,null,{"$f":"ID4+1","v":"2016-08-15"},"2016-08-16","2016-08-17","2016-08-18","2016-08-19","2016-08-20","2016-08-21",null,"",null,null,"",null,null,null,null,null,null,null,null,null,null,null,null,null,null,null,null,null,37,null,{"$f":"JI4+1","v":"2016-09-12"},"2016-09-13","2016-09-14","2016-09-15","2016-09-16","2016-09-17","2016-09-18",null,{"$f":"IFERROR(SMALL(sep,ROW()-2),\"\")","v":""},null,null,{"$f":"IFERROR(VLOOKUP(JK5,feestdagen,2,0),\"\")","v":""},null,null,null,null,null,null,null,null,null,null,null,null,null,null,null,null,41,null,{"$f":"KM4+1","v":"2016-10-10"},"2016-10-11","2016-10-12","2016-10-13","2016-10-14","2016-10-15","2016-10-16",null,{"$f":"IFERROR(SMALL(okt,ROW()-2),\"\")","v":""},null,null,null,{"$f":"IFERROR(VLOOKUP(KO5,feestdagen,2,0),\"\")","v":""},null,null,null,null,null,null,null,null,null,null,null,null,null,null,null,null,46,null,{"$f":"LR4+1","v":"2016-11-14"},"2016-11-15","2016-11-16","2016-11-17","2016-11-18","2016-11-19","2016-11-20",null,"",null,null,null,"",null,null,null,null,null,null,null,null,null,null,null,null,null,null,null,50,null,{"$f":"MV4+1","v":"2016-12-12"},"2016-12-13","2016-12-14","2016-12-15","2016-12-16","2016-12-17","2016-12-18",null,{"$f":"IFERROR(SMALL(dec,ROW()-2),\"\")","v":"2016-12-26"},null,null,null,{"$f":"IFERROR(VLOOKUP(MX5,feestdagen,2,0),\"\")","v":"2e Kerstdag"}]
[null,null,null,null,null,null,null,null,null,null,3,null,{"$f":"S5+1","v":"2016-01-18"},"2016-01-19","2016-01-20","2016-01-21","2016-01-22","2016-01-23","2016-01-24",null,{"$f":"IFERROR(SMALL(jan,ROW()-2),\"\")","v":""},null,null,{"$f":"IFERROR(VLOOKUP(U6,feestdagen,2,0),\"\")","v":""},null,null,null,null,null,null,null,null,null,null,null,null,null,null,null,null,null,8,null,{"$f":"AX5+1","v":"2016-02-22"},"2016-02-23","2016-02-24","2016-02-25","2016-02-26","2016-02-27","2016-02-28",null,{"$f":"IFERROR(SMALL(feb,ROW()-2),\"\")","v":""},null,null,{"$f":"IFERROR(VLOOKUP(AZ6,feestdagen,2,0),\"\")","v":""},null,null,null,null,null,null,null,null,null,null,null,null,null,null,12,null,{"$f":"BZ5+1","v":"2016-03-21"},"2016-03-22","2016-03-23","2016-03-24","2016-03-25","2016-03-26","2016-03-27",null,"",null,null,"",null,null,null,null,{"$f":"IFERROR(SMALL(feb,ROW()-2),\"\")","v":""},null,null,{"$f":"IFERROR(VLOOKUP(CJ6,feestdagen,2,0),\"\")","v":""},null,null,null,null,null,null,null,null,null,16,null,{"$f":"DE5+1","v":"2016-04-18"},"2016-04-19","2016-04-20","2016-04-21","2016-04-22","2016-04-23","2016-04-24",null,{"$f":"IFERROR(SMALL(apr,ROW()-2),\"\")","v":""},null,null,{"$f":"IFERROR(VLOOKUP(DG6,feestdagen,2,0),\"\")","v":""},null,null,null,null,null,null,null,null,null,null,null,null,null,null,null,null,20,null,{"$f":"EI5+1","v":"2016-05-16"},"2016-05-17","2016-05-18","2016-05-19","2016-05-20","2016-05-21","2016-05-22",null,{"$f":"IFERROR(SMALL(mei,ROW()-2),\"\")","v":""},null,null,{"$f":"IFERROR(VLOOKUP(EK6,feestdagen,2,0),\"\")","v":""},null,null,null,null,{"$f":"IFERROR(VLOOKUP(EP6,feestdagen,2,0),\"\")","v":""},null,null,null,null,null,null,null,null,null,null,null,null,25,null,{"$f":"FN5+1","v":"2016-06-20"},"2016-06-21","2016-06-22","2016-06-23","2016-06-24","2016-06-25","2016-06-26",null,{"$f":"IFERROR(SMALL(jun,ROW()-2),\"\")","v":""},null,null,{"$f":"IFERROR(VLOOKUP(FP6,feestdagen,2,0),\"\")","v":""},null,null,null,null,null,null,null,null,null,null,null,null,null,null,null,null,null,null,null,null,null,null,null,29,null,{"$f":"GY5+1","v":"2016-07-18"},"2016-07-19","2016-07-20","2016-07-21","2016-07-22","2016-07-23","2016-07-24",null,{"$f":"IFERROR(SMALL(jul,ROW()-2),\"\")","v":""},null,null,{"$f":"IFERROR(VLOOKUP(HA6,feestdagen,2,0),\"\")","v":""},null,null,null,null,null,null,null,null,null,null,null,null,null,null,null,null,null,34,null,{"$f":"ID5+1","v":"2016-08-22"},"2016-08-23","2016-08-24","2016-08-25","2016-08-26","2016-08-27","2016-08-28",null,"",null,null,"",null,null,null,null,null,null,null,null,null,null,null,null,null,null,null,null,null,38,null,{"$f":"JI5+1","v":"2016-09-19"},"2016-09-20","2016-09-21","2016-09-22","2016-09-23","2016-09-24","2016-09-25",null,{"$f":"IFERROR(SMALL(sep,ROW()-2),\"\")","v":""},null,null,{"$f":"IFERROR(VLOOKUP(JK6,feestdagen,2,0),\"\")","v":""},null,null,null,null,null,null,null,null,null,null,null,null,null,null,null,null,42,null,{"$f":"KM5+1","v":"2016-10-17"},"2016-10-18","2016-10-19","2016-10-20","2016-10-21","2016-10-22","2016-10-23",null,{"$f":"IFERROR(SMALL(okt,ROW()-2),\"\")","v":""},null,null,null,{"$f":"IFERROR(VLOOKUP(KO6,feestdagen,2,0),\"\")","v":""},null,null,null,null,null,null,null,null,null,null,null,null,null,null,null,null,47,null,{"$f":"LR5+1","v":"2016-11-21"},"2016-11-22","2016-11-23","2016-11-24","2016-11-25","2016-11-26","2016-11-27",null,"",null,null,null,"",null,null,null,null,null,null,null,null,null,null,null,null,null,null,null,51,null,{"$f":"MV5+1","v":"2016-12-19"},"2016-12-20","2016-12-21","2016-12-22","2016-12-23","2016-12-24","2016-12-25",null,{"$f":"IFERROR(SMALL(dec,ROW()-2),\"\")","v":"2016-12-31"},null,null,null,{"$f":"IFERROR(VLOOKUP(MX6,feestdagen,2,0),\"\")","v":"Oudejaarsdag"}]
[null,null,null,null,null,null,null,null,null,null,{"$f":"IFERROR(IsoWeekNumber(M7),\"\")","v":4},null,{"$f":"IF(MONTH(S6+1)=MONTH(S6),S6+1,\"\")","v":"2016-01-25"},{"$f":"IF(M7=\"\",\"\",IF(MONTH(M7+1)=MONTH(M7),M7+1,\"\"))","v":"2016-01-26"},"2016-01-27","2016-01-28","2016-01-29","2016-01-30","2016-01-31",null,{"$f":"IFERROR(SMALL(jan,ROW()-2),\"\")","v":""},null,null,{"$f":"IFERROR(VLOOKUP(U7,feestdagen,2,0),\"\")","v":""},null,null,null,null,null,null,null,null,null,null,null,null,null,null,null,null,null,{"$f":"IFERROR(IsoWeekNumber(AR7),\"\")","v":9},null,{"$f":"IF(MONTH(AX6+1)=MONTH(AX6),AX6+1,\"\")","v":"2016-02-29"},{"$f":"IF(AR7=\"\",\"\",IF(MONTH(AR7+1)=MONTH(AR7),AR7+1,\"\"))","v":""},{"$f":"IF(AS7=\"\",\"\",IF(MONTH(AS7+1)=MONTH(AS7),AS7+1,\"\"))","v":""},{"$f":"IF(AT7=\"\",\"\",IF(MONTH(AT7+1)=MONTH(AT7),AT7+1,\"\"))","v":""},{"$f":"IF(AU7=\"\",\"\",IF(MONTH(AU7+1)=MONTH(AU7),AU7+1,\"\"))","v":""},{"$f":"IF(AV7=\"\",\"\",IF(MONTH(AV7+1)=MONTH(AV7),AV7+1,\"\"))","v":""},{"$f":"IF(AW7=\"\",\"\",IF(MONTH(AW7+1)=MONTH(AW7),AW7+1,\"\"))","v":""},null,{"$f":"IFERROR(SMALL(feb,ROW()-2),\"\")","v":""},null,null,{"$f":"IFERROR(VLOOKUP(AZ7,feestdagen,2,0),\"\")","v":""},null,null,null,null,null,null,null,null,null,null,null,null,null,null,{"$f":"IFERROR(IsoWeekNumber(BT7),\"\")","v":13},null,{"$f":"IF(MONTH(BZ6+1)=MONTH(BZ6),BZ6+1,\"\")","v":"2016-03-28"},{"$f":"IF(BT7=\"\",\"\",IF(MONTH(BT7+1)=MONTH(BT7),BT7+1,\"\"))","v":"2016-03-29"},{"$f":"IF(BU7=\"\",\"\",IF(MONTH(BU7+1)=MONTH(BU7),BU7+1,\"\"))","v":"2016-03-30"},{"$f":"IF(BV7=\"\",\"\",IF(MONTH(BV7+1)=MONTH(BV7),BV7+1,\"\"))","v":"2016-03-31"},{"$f":"IF(BW7=\"\",\"\",IF(MONTH(BW7+1)=MONTH(BW7),BW7+1,\"\"))","v":""},{"$f":"IF(BX7=\"\",\"\",IF(MONTH(BX7+1)=MONTH(BX7),BX7+1,\"\"))","v":""},{"$f":"IF(BY7=\"\",\"\",IF(MONTH(BY7+1)=MONTH(BY7),BY7+1,\"\"))","v":""},null,"",null,null,"",null,null,null,null,{"$f":"IFERROR(SMALL(feb,ROW()-2),\"\")","v":""},null,null,{"$f":"IFERROR(VLOOKUP(CJ7,feestdagen,2,0),\"\")","v":""},null,null,null,null,null,null,null,null,null,{"$f":"IFERROR(IsoWeekNumber(CY7),\"\")","v":17},null,{"$f":"IF(MONTH(DE6+1)=MONTH(DE6),DE6+1,\"\")","v":"2016-04-25"},{"$f":"IF(CY7=\"\",\"\",IF(MONTH(CY7+1)=MONTH(CY7),CY7+1,\"\"))","v":"2016-04-26"},{"$f":"IF(CZ7=\"\",\"\",IF(MONTH(CZ7+1)=MONTH(CZ7),CZ7+1,\"\"))","v":"2016-04-27"},{"$f":"IF(DA7=\"\",\"\",IF(MONTH(DA7+1)=MONTH(DA7),DA7+1,\"\"))","v":"2016-04-28"},{"$f":"IF(DB7=\"\",\"\",IF(MONTH(DB7+1)=MONTH(DB7),DB7+1,\"\"))","v":"2016-04-29"},{"$f":"IF(DC7=\"\",\"\",IF(MONTH(DC7+1)=MONTH(DC7),DC7+1,\"\"))","v":"2016-04-30"},{"$f":"IF(DD7=\"\",\"\",IF(MONTH(DD7+1)=MONTH(DD7),DD7+1,\"\"))","v":""},null,{"$f":"IFERROR(SMALL(apr,ROW()-2),\"\")","v":""},null,null,{"$f":"IFERROR(VLOOKUP(DG7,feestdagen,2,0),\"\")","v":""},null,null,null,null,null,null,null,null,null,null,null,null,null,null,null,null,{"$f":"IFERROR(IsoWeekNumber(EC7),\"\")","v":21},null,{"$f":"IF(MONTH(EI6+1)=MONTH(EI6),EI6+1,\"\")","v":"2016-05-23"},{"$f":"IF(EC7=\"\",\"\",IF(MONTH(EC7+1)=MONTH(EC7),EC7+1,\"\"))","v":"2016-05-24"},{"$f":"IF(ED7=\"\",\"\",IF(MONTH(ED7+1)=MONTH(ED7),ED7+1,\"\"))","v":"2016-05-25"},{"$f":"IF(EE7=\"\",\"\",IF(MONTH(EE7+1)=MONTH(EE7),EE7+1,\"\"))","v":"2016-05-26"},{"$f":"IF(EF7=\"\",\"\",IF(MONTH(EF7+1)=MONTH(EF7),EF7+1,\"\"))","v":"2016-05-27"},{"$f":"IF(EG7=\"\",\"\",IF(MONTH(EG7+1)=MONTH(EG7),EG7+1,\"\"))","v":"2016-05-28"},{"$f":"IF(EH7=\"\",\"\",IF(MONTH(EH7+1)=MONTH(EH7),EH7+1,\"\"))","v":"2016-05-29"},null,{"$f":"IFERROR(SMALL(mei,ROW()-2),\"\")","v":""},null,null,{"$f":"IFERROR(VLOOKUP(EK7,feestdagen,2,0),\"\")","v":""},null,null,null,null,{"$f":"IFERROR(VLOOKUP(EP7,feestdagen,2,0),\"\")","v":""},null,null,null,null,null,null,null,null,null,null,null,null,{"$f":"IFERROR(IsoWeekNumber(FH7),\"\")","v":26},null,{"$f":"IF(MONTH(FN6+1)=MONTH(FN6),FN6+1,\"\")","v":"2016-06-27"},{"$f":"IF(FH7=\"\",\"\",IF(MONTH(FH7+1)=MONTH(FH7),FH7+1,\"\"))","v":"2016-06-28"},{"$f":"IF(FI7=\"\",\"\",IF(MONTH(FI7+1)=MONTH(FI7),FI7+1,\"\"))","v":"2016-06-29"},{"$f":"IF(FJ7=\"\",\"\",IF(MONTH(FJ7+1)=MONTH(FJ7),FJ7+1,\"\"))","v":"2016-06-30"},{"$f":"IF(FK7=\"\",\"\",IF(MONTH(FK7+1)=MONTH(FK7),FK7+1,\"\"))","v":""},{"$f":"IF(FL7=\"\",\"\",IF(MONTH(FL7+1)=MONTH(FL7),FL7+1,\"\"))","v":""},{"$f":"IF(FM7=\"\",\"\",IF(MONTH(FM7+1)=MONTH(FM7),FM7+1,\"\"))","v":""},null,{"$f":"IFERROR(SMALL(jun,ROW()-2),\"\")","v":""},null,null,{"$f":"IFERROR(VLOOKUP(FP7,feestdagen,2,0),\"\")","v":""},null,null,null,null,null,null,null,null,null,null,null,null,null,null,null,null,null,null,null,null,null,null,null,{"$f":"IFERROR(IsoWeekNumber(GS7),\"\")","v":30},null,{"$f":"IF(MONTH(GY6+1)=MONTH(GY6),GY6+1,\"\")","v":"2016-07-25"},{"$f":"IF(GS7=\"\",\"\",IF(MONTH(GS7+1)=MONTH(GS7),GS7+1,\"\"))","v":"2016-07-26"},{"$f":"IF(GT7=\"\",\"\",IF(MONTH(GT7+1)=MONTH(GT7),GT7+1,\"\"))","v":"2016-07-27"},{"$f":"IF(GU7=\"\",\"\",IF(MONTH(GU7+1)=MONTH(GU7),GU7+1,\"\"))","v":"2016-07-28"},{"$f":"IF(GV7=\"\",\"\",IF(MONTH(GV7+1)=MONTH(GV7),GV7+1,\"\"))","v":"2016-07-29"},{"$f":"IF(GW7=\"\",\"\",IF(MONTH(GW7+1)=MONTH(GW7),GW7+1,\"\"))","v":"2016-07-30"},{"$f":"IF(GX7=\"\",\"\",IF(MONTH(GX7+1)=MONTH(GX7),GX7+1,\"\"))","v":"2016-07-31"},null,{"$f":"IFERROR(SMALL(jul,ROW()-2),\"\")","v":""},null,null,{"$f":"IFERROR(VLOOKUP(HA7,feestdagen,2,0),\"\")","v":""},null,null,null,null,null,null,null,null,null,null,null,null,null,null,null,null,null,{"$f":"IFERROR(IsoWeekNumber(HX7),\"\")","v":35},null,{"$f":"IF(MONTH(ID6+1)=MONTH(ID6),ID6+1,\"\")","v":"2016-08-29"},{"$f":"IF(HX7=\"\",\"\",IF(MONTH(HX7+1)=MONTH(HX7),HX7+1,\"\"))","v":"2016-08-30"},{"$f":"IF(HY7=\"\",\"\",IF(MONTH(HY7+1)=MONTH(HY7),HY7+1,\"\"))","v":"2016-08-31"},{"$f":"IF(HZ7=\"\",\"\",IF(MONTH(HZ7+1)=MONTH(HZ7),HZ7+1,\"\"))","v":""},{"$f":"IF(IA7=\"\",\"\",IF(MONTH(IA7+1)=MONTH(IA7),IA7+1,\"\"))","v":""},{"$f":"IF(IB7=\"\",\"\",IF(MONTH(IB7+1)=MONTH(IB7),IB7+1,\"\"))","v":""},{"$f":"IF(IC7=\"\",\"\",IF(MONTH(IC7+1)=MONTH(IC7),IC7+1,\"\"))","v":""},null,"",null,null,"",null,null,null,null,null,null,null,null,null,null,null,null,null,null,null,null,null,{"$f":"IFERROR(IsoWeekNumber(JC7),\"\")","v":39},null,{"$f":"IF(MONTH(JI6+1)=MONTH(JI6),JI6+1,\"\")","v":"2016-09-26"},{"$f":"IF(JC7=\"\",\"\",IF(MONTH(JC7+1)=MONTH(JC7),JC7+1,\"\"))","v":"2016-09-27"},{"$f":"IF(JD7=\"\",\"\",IF(MONTH(JD7+1)=MONTH(JD7),JD7+1,\"\"))","v":"2016-09-28"},{"$f":"IF(JE7=\"\",\"\",IF(MONTH(JE7+1)=MONTH(JE7),JE7+1,\"\"))","v":"2016-09-29"},{"$f":"IF(JF7=\"\",\"\",IF(MONTH(JF7+1)=MONTH(JF7),JF7+1,\"\"))","v":"2016-09-30"},{"$f":"IF(JG7=\"\",\"\",IF(MONTH(JG7+1)=MONTH(JG7),JG7+1,\"\"))","v":""},{"$f":"IF(JH7=\"\",\"\",IF(MONTH(JH7+1)=MONTH(JH7),JH7+1,\"\"))","v":""},null,{"$f":"IFERROR(SMALL(sep,ROW()-2),\"\")","v":""},null,null,{"$f":"IFERROR(VLOOKUP(JK7,feestdagen,2,0),\"\")","v":""},null,null,null,null,null,null,null,null,null,null,null,null,null,null,null,null,{"$f":"IFERROR(IsoWeekNumber(KG7),\"\")","v":43},null,{"$f":"IF(MONTH(KM6+1)=MONTH(KM6),KM6+1,\"\")","v":"2016-10-24"},{"$f":"IF(KG7=\"\",\"\",IF(MONTH(KG7+1)=MONTH(KG7),KG7+1,\"\"))","v":"2016-10-25"},{"$f":"IF(KH7=\"\",\"\",IF(MONTH(KH7+1)=MONTH(KH7),KH7+1,\"\"))","v":"2016-10-26"},{"$f":"IF(KI7=\"\",\"\",IF(MONTH(KI7+1)=MONTH(KI7),KI7+1,\"\"))","v":"2016-10-27"},{"$f":"IF(KJ7=\"\",\"\",IF(MONTH(KJ7+1)=MONTH(KJ7),KJ7+1,\"\"))","v":"2016-10-28"},{"$f":"IF(KK7=\"\",\"\",IF(MONTH(KK7+1)=MONTH(KK7),KK7+1,\"\"))","v":"2016-10-29"},{"$f":"IF(KL7=\"\",\"\",IF(MONTH(KL7+1)=MONTH(KL7),KL7+1,\"\"))","v":"2016-10-30"},null,{"$f":"IFERROR(SMALL(okt,ROW()-2),\"\")","v":""},null,null,null,{"$f":"IFERROR(VLOOKUP(KO7,feestdagen,2,0),\"\")","v":""},null,null,null,null,null,null,null,null,null,null,null,null,null,null,null,null,{"$f":"IFERROR(IsoWeekNumber(LL7),\"\")","v":48},null,{"$f":"IF(MONTH(LR6+1)=MONTH(LR6),LR6+1,\"\")","v":"2016-11-28"},{"$f":"IF(LL7=\"\",\"\",IF(MONTH(LL7+1)=MONTH(LL7),LL7+1,\"\"))","v":"2016-11-29"},{"$f":"IF(LM7=\"\",\"\",IF(MONTH(LM7+1)=MONTH(LM7),LM7+1,\"\"))","v":"2016-11-30"},{"$f":"IF(LN7=\"\",\"\",IF(MONTH(LN7+1)=MONTH(LN7),LN7+1,\"\"))","v":""},{"$f":"IF(LO7=\"\",\"\",IF(MONTH(LO7+1)=MONTH(LO7),LO7+1,\"\"))","v":""},{"$f":"IF(LP7=\"\",\"\",IF(MONTH(LP7+1)=MONTH(LP7),LP7+1,\"\"))","v":""},{"$f":"IF(LQ7=\"\",\"\",IF(MONTH(LQ7+1)=MONTH(LQ7),LQ7+1,\"\"))","v":""},null,"",null,null,null,"",null,null,null,null,null,null,null,null,null,null,null,null,null,null,null,{"$f":"IFERROR(IsoWeekNumber(MP7),\"\")","v":52},null,{"$f":"IF(MONTH(MV6+1)=MONTH(MV6),MV6+1,\"\")","v":"2016-12-26"},{"$f":"IF(MP7=\"\",\"\",IF(MONTH(MP7+1)=MONTH(MP7),MP7+1,\"\"))","v":"2016-12-27"},{"$f":"IF(MQ7=\"\",\"\",IF(MONTH(MQ7+1)=MONTH(MQ7),MQ7+1,\"\"))","v":"2016-12-28"},{"$f":"IF(MR7=\"\",\"\",IF(MONTH(MR7+1)=MONTH(MR7),MR7+1,\"\"))","v":"2016-12-29"},{"$f":"IF(MS7=\"\",\"\",IF(MONTH(MS7+1)=MONTH(MS7),MS7+1,\"\"))","v":"2016-12-30"},{"$f":"IF(MT7=\"\",\"\",IF(MONTH(MT7+1)=MONTH(MT7),MT7+1,\"\"))","v":"2016-12-31"},{"$f":"IF(MU7=\"\",\"\",IF(MONTH(MU7+1)=MONTH(MU7),MU7+1,\"\"))","v":""},null,{"$f":"IFERROR(SMALL(dec,ROW()-2),\"\")","v":""},null,null,null,{"$f":"IFERROR(VLOOKUP(MX7,feestdagen,2,0),\"\")","v":""}]
[null,null,null,null,null,null,null,null,null,null,{"$f":"IFERROR(IsoWeekNumber(M8),\"\")","v":""},null,{"$f":"IF(S7=\"\",\"\",IF(MONTH(S7+1)=MONTH(S7),S7+1,\"\"))","v":""},{"$f":"IF(M8=\"\",\"\",IF(MONTH(M8+1)=MONTH(M8),M8+1,\"\"))","v":""},{"$f":"IF(N8=\"\",\"\",IF(MONTH(N8+1)=MONTH(N8),N8+1,\"\"))","v":""},{"$f":"IF(O8=\"\",\"\",IF(MONTH(O8+1)=MONTH(O8),O8+1,\"\"))","v":""},{"$f":"IF(P8=\"\",\"\",IF(MONTH(P8+1)=MONTH(P8),P8+1,\"\"))","v":""},{"$f":"IF(Q8=\"\",\"\",IF(MONTH(Q8+1)=MONTH(Q8),Q8+1,\"\"))","v":""},{"$f":"IF(R8=\"\",\"\",IF(MONTH(R8+1)=MONTH(R8),R8+1,\"\"))","v":""},null,null,null,null,null,null,null,null,null,null,null,null,null,null,null,null,null,null,null,null,null,null,{"$f":"IFERROR(IsoWeekNumber(AR8),\"\")","v":""},null,{"$f":"IF(AX7=\"\",\"\",IF(MONTH(AX7+1)=MONTH(AX7),AX7+1,\"\"))","v":""},"","","","","","",null,null,null,null,null,null,null,null,null,null,null,null,null,null,null,null,null,null,null,{"$f":"IFERROR(IsoWeekNumber(BT8),\"\")","v":""},null,{"$f":"IF(BZ7=\"\",\"\",IF(MONTH(BZ7+1)=MONTH(BZ7),BZ7+1,\"\"))","v":""},"","","","","","",null,"",null,null,"",null,null,null,null,null,null,null,null,null,null,null,null,null,null,null,null,null,{"$f":"IFERROR(IsoWeekNumber(CY8),\"\")","v":""},null,{"$f":"IF(DE7=\"\",\"\",IF(MONTH(DE7+1)=MONTH(DE7),DE7+1,\"\"))","v":""},"","","","","","",null,null,null,null,null,null,null,null,null,null,null,null,null,null,null,null,null,null,null,null,null,{"$f":"IFERROR(IsoWeekNumber(EC8),\"\")","v":22},null,{"$f":"IF(EI7=\"\",\"\",IF(MONTH(EI7+1)=MONTH(EI7),EI7+1,\"\"))","v":"2016-05-30"},"2016-05-31","","","","","",null,null,null,null,null,null,null,null,null,null,null,null,null,null,null,null,null,null,null,null,null,null,{"$f":"IFERROR(IsoWeekNumber(FH8),\"\")","v":""},null,{"$f":"IF(FN7=\"\",\"\",IF(MONTH(FN7+1)=MONTH(FN7),FN7+1,\"\"))","v":""},"","","","","","",null,null,null,null,null,null,null,null,null,null,null,null,null,null,null,null,null,null,null,null,null,null,null,null,null,null,null,null,{"$f":"IFERROR(IsoWeekNumber(GS8),\"\")","v":""},null,{"$f":"IF(GY7=\"\",\"\",IF(MONTH(GY7+1)=MONTH(GY7),GY7+1,\"\"))","v":""},"","","","","","",null,null,null,null,null,null,null,null,null,null,null,null,null,null,null,null,null,null,null,null,null,null,{"$f":"IFERROR(IsoWeekNumber(HX8),\"\")","v":""},null,{"$f":"IF(ID7=\"\",\"\",IF(MONTH(ID7+1)=MONTH(ID7),ID7+1,\"\"))","v":""},"","","","","","",null,"",null,null,"",null,null,null,null,null,null,null,null,null,null,null,null,null,null,null,null,null,{"$f":"IFERROR(IsoWeekNumber(JC8),\"\")","v":""},null,{"$f":"IF(JI7=\"\",\"\",IF(MONTH(JI7+1)=MONTH(JI7),JI7+1,\"\"))","v":""},"","","","","","",null,null,null,null,null,null,null,null,null,null,null,null,null,null,null,null,null,null,null,null,null,{"$f":"IFERROR(IsoWeekNumber(KG8),\"\")","v":44},null,{"$f":"IF(KM7=\"\",\"\",IF(MONTH(KM7+1)=MONTH(KM7),KM7+1,\"\"))","v":"2016-10-31"},"","","","","","",null,null,null,null,null,null,null,null,null,null,null,null,null,null,null,null,null,null,null,null,null,null,{"$f":"IFERROR(IsoWeekNumber(LL8),\"\")","v":""},null,{"$f":"IF(LR7=\"\",\"\",IF(MONTH(LR7+1)=MONTH(LR7),LR7+1,\"\"))","v":""},"","","","","","",null,"",null,null,null,"",null,null,null,null,null,null,null,null,null,null,null,null,null,null,null,{"$f":"IFERROR(IsoWeekNumber(MP8),\"\")","v":""},null,{"$f":"IF(MV7=\"\",\"\",IF(MONTH(MV7+1)=MONTH(MV7),MV7+1,\"\"))","v":""},"","","","","",""]
[]
[null,null,null,null,null,null,null,{"$f":"IsoWeekNumber(N12)","v":53},null,null,null,null,null,null,{"$f":"IsoWeekNumber(O12)","v":1},null,null,null,null,null,null,{"$f":"IsoWeekNumber(V12)","v":2},null,null,null,null,null,null,{"$f":"IsoWeekNumber(AC12)","v":3},null,null,null,null,null,null,{"$f":"IsoWeekNumber(AJ12)","v":4},null,null,null,null,null,null,{"$f":"IsoWeekNumber(AQ12)","v":5},null,null,null,null,null,null,{"$f":"IsoWeekNumber(AX12)","v":6},null,null,null,null,null,null,{"$f":"IsoWeekNumber(BE12)","v":7},null,null,null,null,null,null,{"$f":"IsoWeekNumber(BL12)","v":8},null,null,null,null,null,null,{"$f":"IsoWeekNumber(BS12)","v":9},null,null,null,null,null,null,{"$f":"IsoWeekNumber(BZ12)","v":10},null,null,null,null,null,null,{"$f":"IsoWeekNumber(CG12)","v":11},null,null,null,null,null,null,{"$f":"IsoWeekNumber(CN12)","v":12},null,null,null,null,null,null,{"$f":"IsoWeekNumber(CU12)","v":13},null,null,null,null,null,null,14,null,null,null,null,null,null,15,null,null,null,null,null,null,16,null,null,null,null,null,null,17,null,null,null,null,null,null,18,null,null,null,null,null,null,19,null,null,null,null,null,null,20,null,null,null,null,null,null,21,null,null,null,null,null,null,22,null,null,null,null,null,null,{"$f":"IsoWeekNumber(FM12)","v":23},null,null,null,null,null,null,{"$f":"IsoWeekNumber(FT12)","v":24},null,null,null,null,null,null,{"$f":"IsoWeekNumber(GA12)","v":25},null,null,null,null,null,null,{"$f":"IsoWeekNumber(GH12)","v":26},null,null,null,null,null,null,{"$f":"IsoWeekNumber(GO12)","v":27},null,null,null,null,null,null,{"$f":"IsoWeekNumber(GV12)","v":28},null,null,null,null,null,null,{"$f":"IsoWeekNumber(HC12)","v":29},null,null,null,null,null,null,{"$f":"IsoWeekNumber(HJ12)","v":30},null,null,null,null,null,null,{"$f":"IsoWeekNumber(HQ12)","v":31},null,null,null,null,null,null,{"$f":"IsoWeekNumber(HX12)","v":32},null,null,null,null,null,null,{"$f":"IsoWeekNumber(IE12)","v":33},null,null,null,null,null,null,{"$f":"IsoWeekNumber(IL12)","v":34},null,null,null,null,null,null,{"$f":"IsoWeekNumber(IS12)","v":35},null,null,null,null,null,null,{"$f":"IsoWeekNumber(IZ12)","v":36},null,null,null,null,null,null,{"$f":"IsoWeekNumber(JG12)","v":37},null,null,null,null,null,null,{"$f":"IsoWeekNumber(JN12)","v":38},null,null,null,null,null,null,{"$f":"IsoWeekNumber(JU12)","v":39},null,null,null,null,null,null,{"$f":"IsoWeekNumber(KB12)","v":40},null,null,null,null,null,null,{"$f":"IsoWeekNumber(KI12)","v":41},null,null,null,null,null,null,{"$f":"IsoWeekNumber(KP12)","v":42},null,null,null,null,null,null,{"$f":"IsoWeekNumber(KW12)","v":43},null,null,null,null,null,null,{"$f":"IsoWeekNumber(LD12)","v":44},null,null,null,null,null,null,{"$f":"IsoWeekNumber(LK12)","v":45},null,null,null,null,null,null,{"$f":"IsoWeekNumber(LR12)","v":46},null,null,null,null,null,null,{"$f":"IsoWeekNumber(LY12)","v":47},null,null,null,null,null,null,{"$f":"IsoWeekNumber(MF12)","v":48},null,null,null,null,null,null,{"$f":"IsoWeekNumber(MM12)","v":49},null,null,null,null,null,null,{"$f":"IsoWeekNumber(MT12)","v":50},null,null,null,null,null,null,{"$f":"IsoWeekNumber(NA12)","v":51},null,null,null,null,null,null,{"$f":"IsoWeekNumber(NH12)","v":52}]
[null,null,null,null,null,null,null,"M","D","W","D","V","Z","Z","M","D","W","D","V","Z","Z","M","D","W","D","V","Z","Z","M","D","W","D","V","Z","Z","M","D","W","D","V","Z","Z","M","D","W","D","V","Z","Z","M","D","W","D","V","Z","Z","M","D","W","D","V","Z","Z","M","D","W","D","V","Z","Z","M","D","W","D","V","Z","Z","M","D","W","D","V","Z","Z","M","D","W","D","V","Z","Z","M","D","W","D","V","Z","Z","M","D","W","D","V","Z","Z","M","D","W","D","V","Z","Z","M","D","W","D","V","Z","Z","M","D","W","D","V","Z","Z","M","D","W","D","V","Z","Z","M","D","W","D","V","Z","Z","M","D","W","D","V","Z","Z","M","D","W","D","V","Z","Z","M","D","W","D","V","Z","Z","M","D","W","D","V","Z","Z","M","D","W","D","V","Z","Z","M","D","W","D","V","Z","Z","M","D","W","D","V","Z","Z","M","D","W","D","V","Z","Z","M","D","W","D","V","Z","Z","M","D","W","D","V","Z","Z","M","D","W","D","V","Z","Z","M","D","W","D","V","Z","Z","M","D","W","D","V","Z","Z","M","D","W","D","V","Z","Z","M","D","W","D","V","Z","Z","M","D","W","D","V","Z","Z","M","D","W","D","V","Z","Z","M","D","W","D","V","Z","Z","M","D","W","D","V","Z","Z","M","D","W","D","V","Z","Z","M","D","W","D","V","Z","Z","M","D","W","D","V","Z","Z","M","D","W","D","V","Z","Z","M","D","W","D","V","Z","Z","M","D","W","D","V","Z","Z","M","D","W","D","V","Z","Z","M","D","W","D","V","Z","Z","M","D","W","D","V","Z","Z","M","D","W","D","V","Z","Z","M","D","W","D","V","Z","Z","M","D","W","D","V","Z","Z","M","D","W","D","V","Z","Z","M","D","W","D","V","Z","Z","M","D","W","D","V","Z","Z"]
["Locatie:","Naam:","van:","tot:","Verlof:","Goedgekeurd door CP:",null,{"$f":"IF(WEEKDAY($K$1,2)=COLUMNS($M:M),$K$1,\"\")","v":""},{"$f":"IF(M3=\"\",IF(WEEKDAY($K$1,2)=COLUMNS($M:N),$K$1,\"\"),M3+1)","v":""},{"$f":"IF(N3=\"\",IF(WEEKDAY($K$1,2)=COLUMNS($M:O),$K$1,\"\"),N3+1)","v":""},{"$f":"IF(O3=\"\",IF(WEEKDAY($K$1,2)=COLUMNS($M:P),$K$1,\"\"),O3+1)","v":""},{"$f":"IF(P3=\"\",IF(WEEKDAY($K$1,2)=COLUMNS($M:Q),$K$1,\"\"),P3+1)","v":"2016-01-01"},{"$f":"IF(Q3=\"\",IF(WEEKDAY($K$1,2)=COLUMNS($M:R),$K$1,\"\"),Q3+1)","v":"2016-01-02"},{"$f":"IF(R3=\"\",IF(WEEKDAY($K$1,2)=COLUMNS($M:S),$K$1,\"\"),R3+1)","v":"2016-01-03"},{"$f":"N12+1","v":"2016-01-04"},{"$f":"O12+1","v":"2016-01-05"},"2016-01-06","2016-01-07","2016-01-08","2016-01-09","2016-01-10","2016-01-11","2016-01-12","2016-01-13","2016-01-14","2016-01-15","2016-01-16","2016-01-17","2016-01-18","2016-01-19","2016-01-20","2016-01-21","2016-01-22","2016-01-23","2016-01-24","2016-01-25","2016-01-26","2016-01-27","2016-01-28","2016-01-29","2016-01-30","2016-01-31","2016-02-01","2016-02-02","2016-02-03","2016-02-04","2016-02-05","2016-02-06","2016-02-07","2016-02-08","2016-02-09","2016-02-10","2016-02-11","2016-02-12","2016-02-13","2016-02-14","2016-02-15","2016-02-16","2016-02-17","2016-02-18","2016-02-19","2016-02-20","2016-02-21","2016-02-22","2016-02-23","2016-02-24","2016-02-25","2016-02-26","2016-02-27","2016-02-28","2016-02-29","2016-03-01","2016-03-02","2016-03-03","2016-03-04","2016-03-05","2016-03-06","2016-03-07","2016-03-08",{"$f":"CA12+1","v":"2016-03-09"},"2016-03-10","2016-03-11","2016-03-12","2016-03-13","2016-03-14","2016-03-15","2016-03-16","2016-03-17","2016-03-18","2016-03-19","2016-03-20","2016-03-21","2016-03-22","2016-03-23","2016-03-24","2016-03-25","2016-03-26","2016-03-27",{"$f":"CT12+1","v":"2016-03-28"},{"$f":"CU12+1","v":"2016-03-29"},{"$f":"CV12+1","v":"2016-03-30"},{"$f":"CW12+1","v":"2016-03-31"},{"$f":"CX12+1","v":"2016-04-01"},{"$f":"CY12+1","v":"2016-04-02"},{"$f":"CZ12+1","v":"2016-04-03"},{"$f":"DA12+1","v":"2016-04-04"},{"$f":"DB12+1","v":"2016-04-05"},{"$f":"DC12+1","v":"2016-04-06"},{"$f":"DD12+1","v":"2016-04-07"},{"$f":"DE12+1","v":"2016-04-08"},{"$f":"DF12+1","v":"2016-04-09"},{"$f":"DG12+1","v":"2016-04-10"},{"$f":"DH12+1","v":"2016-04-11"},{"$f":"DI12+1","v":"2016-04-12"},{"$f":"DJ12+1","v":"2016-04-13"},{"$f":"DK12+1","v":"2016-04-14"},{"$f":"DL12+1","v":"2016-04-15"},{"$f":"DM12+1","v":"2016-04-16"},{"$f":"DN12+1","v":"2016-04-17"},{"$f":"DO12+1","v":"2016-04-18"},{"$f":"DP12+1","v":"2016-04-19"},{"$f":"DQ12+1","v":"2016-04-20"},{"$f":"DR12+1","v":"2016-04-21"},{"$f":"DS12+1","v":"2016-04-22"},{"$f":"DT12+1","v":"2016-04-23"},{"$f":"DU12+1","v":"2016-04-24"},{"$f":"DV12+1","v":"2016-04-25"},{"$f":"DW12+1","v":"2016-04-26"},{"$f":"DX12+1","v":"2016-04-27"},{"$f":"DY12+1","v":"2016-04-28"},{"$f":"DZ12+1","v":"2016-04-29"},{"$f":"EA12+1","v":"2016-04-30"},{"$f":"EB12+1","v":"2016-05-01"},{"$f":"EC12+1","v":"2016-05-02"},{"$f":"ED12+1","v":"2016-05-03"},{"$f":"EE12+1","v":"2016-05-04"},{"$f":"EF12+1","v":"2016-05-05"},{"$f":"EG12+1","v":"2016-05-06"},{"$f":"EH12+1","v":"2016-05-07"},{"$f":"EI12+1","v":"2016-05-08"},{"$f":"EJ12+1","v":"2016-05-09"},{"$f":"EK12+1","v":"2016-05-10"},{"$f":"EL12+1","v":"2016-05-11"},{"$f":"EM12+1","v":"2016-05-12"},{"$f":"EN12+1","v":"2016-05-13"},{"$f":"EO12+1","v":"2016-05-14"},{"$f":"EP12+1","v":"2016-05-15"},{"$f":"EQ12+1","v":"2016-05-16"},{"$f":"ER12+1","v":"2016-05-17"},{"$f":"ES12+1","v":"2016-05-18"},{"$f":"ET12+1","v":"2016-05-19"},{"$f":"EU12+1","v":"2016-05-20"},{"$f":"EV12+1","v":"2016-05-21"},{"$f":"EW12+1","v":"2016-05-22"},{"$f":"EX12+1","v":"2016-05-23"},{"$f":"EY12+1","v":"2016-05-24"},{"$f":"EZ12+1","v":"2016-05-25"},{"$f":"FA12+1","v":"2016-05-26"},{"$f":"FB12+1","v":"2016-05-27"},{"$f":"FC12+1","v":"2016-05-28"},{"$f":"FD12+1","v":"2016-05-29"},{"$f":"FE12+1","v":"2016-05-30"},{"$f":"FF12+1","v":"2016-05-31"},{"$f":"FG12+1","v":"2016-06-01"},{"$f":"FH12+1","v":"2016-06-02"},{"$f":"FI12+1","v":"2016-06-03"},{"$f":"FJ12+1","v":"2016-06-04"},{"$f":"FK12+1","v":"2016-06-05"},{"$f":"FL12+1","v":"2016-06-06"},{"$f":"FM12+1","v":"2016-06-07"},{"$f":"FN12+1","v":"2016-06-08"},{"$f":"FO12+1","v":"2016-06-09"},{"$f":"FP12+1","v":"2016-06-10"},{"$f":"FQ12+1","v":"2016-06-11"},{"$f":"FR12+1","v":"2016-06-12"},{"$f":"FS12+1","v":"2016-06-13"},{"$f":"FT12+1","v":"2016-06-14"},{"$f":"FU12+1","v":"2016-06-15"},{"$f":"FV12+1","v":"2016-06-16"},{"$f":"FW12+1","v":"2016-06-17"},{"$f":"FX12+1","v":"2016-06-18"},{"$f":"FY12+1","v":"2016-06-19"},{"$f":"FZ12+1","v":"2016-06-20"},{"$f":"GA12+1","v":"2016-06-21"},{"$f":"GB12+1","v":"2016-06-22"},{"$f":"GC12+1","v":"2016-06-23"},{"$f":"GD12+1","v":"2016-06-24"},{"$f":"GE12+1","v":"2016-06-25"},{"$f":"GF12+1","v":"2016-06-26"},{"$f":"GG12+1","v":"2016-06-27"},{"$f":"GH12+1","v":"2016-06-28"},{"$f":"GI12+1","v":"2016-06-29"},{"$f":"GJ12+1","v":"2016-06-30"},{"$f":"GK12+1","v":"2016-07-01"},{"$f":"GL12+1","v":"2016-07-02"},{"$f":"GM12+1","v":"2016-07-03"},{"$f":"GN12+1","v":"2016-07-04"},{"$f":"GO12+1","v":"2016-07-05"},{"$f":"GP12+1","v":"2016-07-06"},{"$f":"GQ12+1","v":"2016-07-07"},{"$f":"GR12+1","v":"2016-07-08"},{"$f":"GS12+1","v":"2016-07-09"},{"$f":"GT12+1","v":"2016-07-10"},{"$f":"GU12+1","v":"2016-07-11"},{"$f":"GV12+1","v":"2016-07-12"},{"$f":"GW12+1","v":"2016-07-13"},{"$f":"GX12+1","v":"2016-07-14"},{"$f":"GY12+1","v":"2016-07-15"},{"$f":"GZ12+1","v":"2016-07-16"},{"$f":"HA12+1","v":"2016-07-17"},{"$f":"HB12+1","v":"2016-07-18"},{"$f":"HC12+1","v":"2016-07-19"},{"$f":"HD12+1","v":"2016-07-20"},{"$f":"HE12+1","v":"2016-07-21"},{"$f":"HF12+1","v":"2016-07-22"},{"$f":"HG12+1","v":"2016-07-23"},{"$f":"HH12+1","v":"2016-07-24"},{"$f":"HI12+1","v":"2016-07-25"},{"$f":"HJ12+1","v":"2016-07-26"},{"$f":"HK12+1","v":"2016-07-27"},{"$f":"HL12+1","v":"2016-07-28"},{"$f":"HM12+1","v":"2016-07-29"},{"$f":"HN12+1","v":"2016-07-30"},{"$f":"HO12+1","v":"2016-07-31"},{"$f":"HP12+1","v":"2016-08-01"},{"$f":"HQ12+1","v":"2016-08-02"},{"$f":"HR12+1","v":"2016-08-03"},{"$f":"HS12+1","v":"2016-08-04"},{"$f":"HT12+1","v":"2016-08-05"},{"$f":"HU12+1","v":"2016-08-06"},{"$f":"HV12+1","v":"2016-08-07"},{"$f":"HW12+1","v":"2016-08-08"},{"$f":"HX12+1","v":"2016-08-09"},{"$f":"HY12+1","v":"2016-08-10"},{"$f":"HZ12+1","v":"2016-08-11"},{"$f":"IA12+1","v":"2016-08-12"},{"$f":"IB12+1","v":"2016-08-13"},{"$f":"IC12+1","v":"2016-08-14"},{"$f":"ID12+1","v":"2016-08-15"},{"$f":"IE12+1","v":"2016-08-16"},{"$f":"IF12+1","v":"2016-08-17"},{"$f":"IG12+1","v":"2016-08-18"},{"$f":"IH12+1","v":"2016-08-19"},{"$f":"II12+1","v":"2016-08-20"},{"$f":"IJ12+1","v":"2016-08-21"},{"$f":"IK12+1","v":"2016-08-22"},{"$f":"IL12+1","v":"2016-08-23"},{"$f":"IM12+1","v":"2016-08-24"},{"$f":"IN12+1","v":"2016-08-25"},{"$f":"IO12+1","v":"2016-08-26"},{"$f":"IP12+1","v":"2016-08-27"},{"$f":"IQ12+1","v":"2016-08-28"},{"$f":"IR12+1","v":"2016-08-29"},{"$f":"IS12+1","v":"2016-08-30"},{"$f":"IT12+1","v":"2016-08-31"},{"$f":"IU12+1","v":"2016-09-01"},{"$f":"IV12+1","v":"2016-09-02"},{"$f":"IW12+1","v":"2016-09-03"},{"$f":"IX12+1","v":"2016-09-04"},{"$f":"IY12+1","v":"2016-09-05"},{"$f":"IZ12+1","v":"2016-09-06"},{"$f":"JA12+1","v":"2016-09-07"},{"$f":"JB12+1","v":"2016-09-08"},{"$f":"JC12+1","v":"2016-09-09"},{"$f":"JD12+1","v":"2016-09-10"},{"$f":"JE12+1","v":"2016-09-11"},{"$f":"JF12+1","v":"2016-09-12"},{"$f":"JG12+1","v":"2016-09-13"},{"$f":"JH12+1","v":"2016-09-14"},{"$f":"JI12+1","v":"2016-09-15"},{"$f":"JJ12+1","v":"2016-09-16"},{"$f":"JK12+1","v":"2016-09-17"},{"$f":"JL12+1","v":"2016-09-18"},{"$f":"JM12+1","v":"2016-09-19"},{"$f":"JN12+1","v":"2016-09-20"},{"$f":"JO12+1","v":"2016-09-21"},{"$f":"JP12+1","v":"2016-09-22"},{"$f":"JQ12+1","v":"2016-09-23"},{"$f":"JR12+1","v":"2016-09-24"},{"$f":"JS12+1","v":"2016-09-25"},{"$f":"JT12+1","v":"2016-09-26"},{"$f":"JU12+1","v":"2016-09-27"},{"$f":"JV12+1","v":"2016-09-28"},{"$f":"JW12+1","v":"2016-09-29"},{"$f":"JX12+1","v":"2016-09-30"},{"$f":"JY12+1","v":"2016-10-01"},{"$f":"JZ12+1","v":"2016-10-02"},{"$f":"KA12+1","v":"2016-10-03"},{"$f":"KB12+1","v":"2016-10-04"},{"$f":"KC12+1","v":"2016-10-05"},{"$f":"KD12+1","v":"2016-10-06"},{"$f":"KE12+1","v":"2016-10-07"},{"$f":"KF12+1","v":"2016-10-08"},{"$f":"KG12+1","v":"2016-10-09"},{"$f":"KH12+1","v":"2016-10-10"},{"$f":"KI12+1","v":"2016-10-11"},{"$f":"KJ12+1","v":"2016-10-12"},{"$f":"KK12+1","v":"2016-10-13"},{"$f":"KL12+1","v":"2016-10-14"},{"$f":"KM12+1","v":"2016-10-15"},{"$f":"KN12+1","v":"2016-10-16"},{"$f":"KO12+1","v":"2016-10-17"},{"$f":"KP12+1","v":"2016-10-18"},{"$f":"KQ12+1","v":"2016-10-19"},{"$f":"KR12+1","v":"2016-10-20"},{"$f":"KS12+1","v":"2016-10-21"},{"$f":"KT12+1","v":"2016-10-22"},{"$f":"KU12+1","v":"2016-10-23"},{"$f":"KV12+1","v":"2016-10-24"},{"$f":"KW12+1","v":"2016-10-25"},{"$f":"KX12+1","v":"2016-10-26"},{"$f":"KY12+1","v":"2016-10-27"},{"$f":"KZ12+1","v":"2016-10-28"},{"$f":"LA12+1","v":"2016-10-29"},{"$f":"LB12+1","v":"2016-10-30"},{"$f":"LC12+1","v":"2016-10-31"},{"$f":"LD12+1","v":"2016-11-01"},{"$f":"LE12+1","v":"2016-11-02"},{"$f":"LF12+1","v":"2016-11-03"},{"$f":"LG12+1","v":"2016-11-04"},{"$f":"LH12+1","v":"2016-11-05"},{"$f":"LI12+1","v":"2016-11-06"},{"$f":"LJ12+1","v":"2016-11-07"},{"$f":"LK12+1","v":"2016-11-08"},{"$f":"LL12+1","v":"2016-11-09"},{"$f":"LM12+1","v":"2016-11-10"},{"$f":"LN12+1","v":"2016-11-11"},{"$f":"LO12+1","v":"2016-11-12"},{"$f":"LP12+1","v":"2016-11-13"},{"$f":"LQ12+1","v":"2016-11-14"},{"$f":"LR12+1","v":"2016-11-15"},{"$f":"LS12+1","v":"2016-11-16"},{"$f":"LT12+1","v":"2016-11-17"},{"$f":"LU12+1","v":"2016-11-18"},{"$f":"LV12+1","v":"2016-11-19"},{"$f":"LW12+1","v":"2016-11-20"},{"$f":"LX12+1","v":"2016-11-21"},{"$f":"LY12+1","v":"2016-11-22"},{"$f":"LZ12+1","v":"2016-11-23"},{"$f":"MA12+1","v":"2016-11-24"},{"$f":"MB12+1","v":"2016-11-25"},{"$f":"MC12+1","v":"2016-11-26"},{"$f":"MD12+1","v":"2016-11-27"},{"$f":"ME12+1","v":"2016-11-28"},{"$f":"MF12+1","v":"2016-11-29"},{"$f":"MG12+1","v":"2016-11-30"},{"$f":"MH12+1","v":"2016-12-01"},{"$f":"MI12+1","v":"2016-12-02"},{"$f":"MJ12+1","v":"2016-12-03"},{"$f":"MK12+1","v":"2016-12-04"},{"$f":"ML12+1","v":"2016-12-05"},{"$f":"MM12+1","v":"2016-12-06"},{"$f":"MN12+1","v":"2016-12-07"},{"$f":"MO12+1","v":"2016-12-08"},{"$f":"MP12+1","v":"2016-12-09"},{"$f":"MQ12+1","v":"2016-12-10"},{"$f":"MR12+1","v":"2016-12-11"},{"$f":"MS12+1","v":"2016-12-12"},{"$f":"MT12+1","v":"2016-12-13"},{"$f":"MU12+1","v":"2016-12-14"},{"$f":"MV12+1","v":"2016-12-15"},{"$f":"MW12+1","v":"2016-12-16"},{"$f":"MX12+1","v":"2016-12-17"},{"$f":"MY12+1","v":"2016-12-18"},{"$f":"MZ12+1","v":"2016-12-19"},{"$f":"NA12+1","v":"2016-12-20"},{"$f":"NB12+1","v":"2016-12-21"},{"$f":"NC12+1","v":"2016-12-22"},{"$f":"ND12+1","v":"2016-12-23"},{"$f":"NE12+1","v":"2016-12-24"},{"$f":"NF12+1","v":"2016-12-25"},{"$f":"NG12+1","v":"2016-12-26"},{"$f":"NH12+1","v":"2016-12-27"},{"$f":"NI12+1","v":"2016-12-28"},{"$f":"NJ12+1","v":"2016-12-29"},{"$f":"NK12+1","v":"2016-12-30"},{"$f":"NL12+1","v":"2016-12-31"},{"$f":"NM12+1","v":"2017-01-01"}]
["Atalanta","persoon 1","2016-02-03","2016-03-24","vakantie","ja"]
["Atalanta","persoon 8","2017-01-12","2017-01-22"]
["Campus","persoon 7","2017-01-06","2017-01-23"]
["CB","persoon 2","2016-01-06","2016-01-23","vakantie","ja"]
["CB","persoon 10","2017-01-01","2017-01-10"]
["Helix","persoon 6","2017-02-03","2017-03-24"]
["Komeet","persoon 3","2016-01-12","2016-01-22","vakantie","nee ivm teveel vrij van dezelfde locatie"]
["Landgoed","persoon 9","2017-02-10","2017-02-23"]
["Linde","persoon 4","2016-02-10","2016-02-23","vakantie","nee ivm teveel vrij in dezelfde periode"]
["qw","persoon 15"]
["Tuinfluiter","persoon 5","2016-01-01","2016-01-10"]
["Tuinfluiter","persoon 14"]
[null,"persoon 16"]
[null,"persoon 17"]
[null,"persoon 18"]
[null,"persoon 19"]
[null,"persoon 20"]
[null,"persoon 21"]
[null,"persoon 22"]
[null,"persoon 23"]
[null,"persoon 24"]
[null,"persoon 25"]
[null,"persoon 26"]
[null,"persoon 27"]
[null,"persoon 28"]
[null,"persoon 29"]
[null,"persoon 30"]
[null,"persoon 31"]
[null,"persoon 32"]
[null,"persoon 33"]
[null,"persoon 34"]
[null,"persoon 35"]
[null,"persoon 36"]
[null,"persoon 37"]
[null,"persoon 38"]
[null,"persoon 39"]
[null,"persoon 40"]
[null,"persoon 41"]
[null,"persoon 42"]
[null,"persoon 43"]
[null,"persoon 44"]
[null,"persoon 45"]
[null,"persoon 46"]
[null,"persoon 47"]
[null,"persoon 48"]
[null,"persoon 49"]
[null,"persoon 50"]
[null,"persoon 51"]
[null,"persoon 52"]
[null,"persoon 53"]
[null,"persoon 54"]
[null,"persoon 55"]
[null,"persoon 56"]
[null,"persoon 57"]
[null,"persoon 58"]
[null,"persoon 59"]
[null,"persoon 6"]
[null,"persoon 60"]
[null,"persoon 61"]
[null,"persoon 62"]
[null,"persoon 63"]
[null,"persoon 64"]
[null,"persoon 65"]
[null,"persoon 66"]
[null,"persoon 67"]
[null,"persoon 68"]
[null,"persoon 69"]
[null,"persoon 7"]
[null,"persoon 70"]
[null,"persoon 71"]
[null,"persoon 72"]
[null,"persoon 73"]
[null,"persoon 74"]
[null,"persoon 75"]
[null,"persoon 76"]
[null,"persoon 77"]
[null,"persoon 78"]
[null,"persoon 79"]
[null,"persoon 8"]
[null,"persoon 80"]
[null,"persoon 81"]
[null,"persoon 82"]
[null,"persoon 83"]
[null,"persoon 84"]
[null,"persoon 85"]
[null,"persoon 86"]
[null,"persoon 87"]
[null,"persoon 88"]
[null,"persoon 89"]
[null,"persoon 9"]
[null,"persoon 90"]
[null,"persoon 91"]
[null,"persoon 92"]
[null,"persoon 93"]
[null,"persoon 94"]
[null,"persoon 95"]
[null,"persoon 96"]
[null,"persoon 97"]
[null,"persoon 98"]
[null,"persoon 99"]

{"sheet":"Formuleblad","index":2,"n_rows":88,"n_cols":1,"rows_kept":88,"cut":false,"hidden":true,"merged":[]}
["Kies hier uw dichtstbijzijnde Creyf's vestiging…."]
["Alkmaar , Canadaplein 8, 072 - 5116944, alkmaar@creyfs.nl"]
["Almelo, Rosa Luxemburgstraat 11, 0546 - 454160, almelo@creyfs.nl"]
["Almere, Schoutstraat 98, 036 - 5383280, almere@creyfs.nl"]
["Alphen a/d Rijn, De Aarhof 75, 0172 - 474981, alphenadrijn@creyfs.nl"]
["Amersfoort, Grote Haag 33, 033 - 4698000, amersfoort@creyfs.nl"]
["Amersfoort Office, Leusderweg 6, 033 - 4751868, amersfoortoffice@creyfs.nl"]
["Amstelveen, Stadsplein 89, 020 - 5035333, amstelveen@creyfs.nl"]
["Amsterdam, Damrak 37, 020 - 6254711, amsterdam.damrak@creyfs.nl"]
["Amsterdam, Van Baerlestraat 43, 020 - 3050200, amsterdam.vanbaerlestraat@creyfs.nl"]
["Amsterdam, Jan Evertsenstraat 89, 020 - 5891800, amsterdam.janevertsenstraat@creyfs.nl"]
["Amsterdam, Hoofddorpplein 22 - 24, 020 - 5110633, amsterdam.hoofddorpplein@creyfs.nl"]
["Amsterdam, Bijlmerdreef 99, 020 - 3113020, amsterdam.bijlmerdreef@creyfs.nl"]
["Amsterdam, Buikslotermeerplein 313, 020 - 6363131, amsterdam.buikslotermeer@creyfs.nl"]
["Apeldoorn, Nieuwstraat 8, 055 - 5787288, apeldoorn@creyfs.nl"]
["Arnhem, Looierstraat 42, 026 - 3521800, arnhem@creyfs.nl"]
["Arnhem Medical, Willemsplein 35, 026 - 3521805, arnhemmedical@creyfs.nl"]
["Assen, Lauwers 14, 0592 - 398417, assen@creyfs.nl"]
["Barendrecht, Middenbaan 105, 0180 - 611888, barendrecht@creyfs.nl"]
["Barneveld, Churchillstraat 69, 0342 - 408002, barneveld@creyfs.nl"]
["Bergen op Zoom, Burg. Van Hasseltstraat 52, 0164 - 213030, bergenopzoom@creyfs.nl"]
["Best, Oranjestraat 11, 0499 -390400, best@creyfs.nl"]
["Bladel, Sniederslaan 57-a, 0497 - 387363, bladel@creyfs.nl"]
["Boskoop, Koninginneweg 1-e, 0172 - 212424, boskoop@creyfs.nl"]
["Boxmeer, Burgemeester Verkuijlstraat 57 , 0485 - 580150, boxmeer@creyfs.nl"]
["Boxtel, Stationstraat 51a, 0411 - 674999, boxtel@creyfs.nl"]
["Breda, Van Coothplein 43 - 49, 076 - 5305630, breda@creyfs.nl"]
["Deventer, Sijzenbaanplein 11 - 15, 0570 - 665880, deventer@creyfs.nl"]
["Dongen, Hoge Ham 113-a, 0162 - 320512, dongen@creyfs.nl"]
["Dordrecht, Raamstraat 1f, 078 - 6392622, dordrecht@creyfs.nl"]
["Drachten, Moleneind Zuidzijde 69-b, 0512 - 541361, drachten@creyfs.nl"]
["Ede, Breelaan 3, 0318 - 652260, ede@creyfs.nl"]
["Eindhoven, Kruisstraat 94, 040 - 2463355, eindhoven.kruisstraat@creyfs.nl"]
["Eindhoven, Keizersgracht 28, 040 - 2606999, eindhoven.keizersgracht@creyfs.nl"]
["Emmeloord, Noordzijde 18 , 0527-630990, emmeloord@creyfs.nl"]
["Enschede, Beltstraat 1, 053 - 4344300, enschede@creyfs.nl"]
["Etten-Leur, Bisschopsmolenstraat 107, 076 - 5042450, ettenleur@creyfs.nl"]
["Genemuiden, Kruisstraat 7, 038 - 3851720, genemuiden@creyfs.nl"]
["Goes, Voorstad 3, 0113 - 211223, goes@creyfs.nl"]
["Gorinchem, Westwagenstraat 47, 0183 - 664871, gorinchem@creyfs.nl"]
["Gouda, Lange Tiendeweg 69, 0182 - 550505, gouda@creyfs.nl"]
["Den Haag, Turfmarkt 248, 070 - 3560545, denhaag@creyfs.nl"]
["Groenlo, Mattelierstraat 13, 0544 - 464303, groenlo@creyfs.nl"]
["Groningen, Oude Kijk in 't Jatstraat 29, 050 - 3199600, groningen@creyfs.nl"]
["Harderwijk, Donkerstraat 3, 0341 - 426616, harderwijk@creyfs.nl"]
["Heerenveen, Vleesmarkt 10, 0513 - 616900, heerenveen@creyfs.nl"]
["Helmond, Markt 51, 0492 - 509300, helmond@creyfs.nl"]
["Hengelo, Marktstraat 4, 074 - 2592570, hengelo@creyfs.nl"]
["Hertogenbosch 's, Stationsweg 21, 073 - 6130134, denbosch@creyfs.nl"]
["Hoofddorp, Concourslaan 2, 023 - 5671900, hoofddorp@creyfs.nl"]
["Hoogeveen, Van Echtenstraat 8, 0528 - 229420, hoogeveen@creyfs.nl"]
["Hardinxveld-Giessendam, Peulenstraat 222, 0184 - 616988, hardinxveldgiessendam@creyfs.nl"]
["Kampen, Plantage 16, 038 - 3328575, kampen@creyfs.nl"]
["Leeuwarden, De Kelders 15, 058 - 2137033, leeuwarden@creyfs.nl"]
["Lelystad, Stadhuisstraat 124, 0320 - 290190, lelystad@creyfs.nl"]
["Maarssen, Bisonspoor 2040, 0346 - 567300, maarssen@creyfs.nl"]
["Maastricht, Stationsstraat 31, 043 - 3256627, maastricht@creyfs.nl"]
["Meppel, Brouwersdwarsstraat 1, 0522 - 238820, meppel@creyfs.nl"]
["Middelburg, Lange Noordstraat 2, 0118 - 679040, middelburg@creyfs.nl"]
["Nijkerk, Holkerstraat 2, 033 - 2456964, nijkerk@creyfs.nl"]
["Nijmegen, Ziekerstraat 136, 024 - 3828100, nijmegen@creyfs.nl"]
["Oosterhout, Leijsenhoek 45a, 0162 - 497000, oosterhout@creyfs.nl"]
["Roosendaal, Nieuwe Markt 71, 0165 - 583130, roosendaal@creyfs.nl"]
["Rotterdam, Maasdamstraat 2a, 010 - 2150904, rotterdam.maasdamstraat@creyfs.nl"]
["Rotterdam, Meent 62 - 64, 010 - 4132480, rotterdam.meent@creyfs.nl"]
["Schiedam, Broersvest 50a, 010 - 2708070, schiedam@creyfs.nl"]
["Sneek, Oude Koemarkt 55, 0515 - 462515, sneek@creyfs.nl"]
["Tiel, Buurmalsenstraat 1, 0344 - 673900, tiel@creyfs.nl"]
["Tiel Intersales, Buurmalsenstraat 1, 0344 - 632111, tielintersales@creyfs.nl"]
["Tiel Intersales, Buurmalsenstraat 1, 0344 - 616070, tielintersales@creyfs.nl"]
["Tilburg, Spoorlaan 372, 013 - 5443248, tilburg@creyfs.nl"]
["Uden, Mondriaanplein 24, 0413 - 251755, uden@creyfs.nl"]
["Uithoorn, Marktplein 25, 0297 - 560171, uithoorn@creyfs.nl"]
["Urk, Wijk 2-76, 0527 - 680880, urk@creyfs.nl"]
["Utrecht, Bernadottelaan 146, 030 - 2916300, utrecht.bernadottelaan@creyfs.nl"]
["Utrecht, Biltstraat 71, 030 - 2307150, utrecht.biltstraat@creyfs.nl"]
["Utrecht Office, Potterstraat 10, 030 - 2343444, utrechtoffice@creyfs.nl"]
["Valkenswaard, Luikerweg 23, 040 - 2044995, valkenswaard@creyfs.nl"]
["Veghel, De Wiekslag 27, 0413 - 366808, veghel@creyfs.nl"]
["Waalwijk, Grotestraat 213, 0416 - 339519, waalwijk@creyfs.nl"]
["Weert, Maasstraat 11, 0495 - 580100, weert@creyfs.nl"]
["Weesp, Nieuwstad 4, 0294 - 430071, weesp@creyfs.nl"]
["Woerden, Meulmansweg 2a, 0348 - 411838, woerden@creyfs.nl"]
["Zaandam, Peperstraat 220, 075 - 6553500, zaandam@creyfs.nl"]
["Zeist , 2e Hogeweg 123, 030 - 6922084, zeist@creyfs.nl"]
["Zoetermeer, Noordwaarts 34, 079 - 3304500, zoetermeer@creyfs.nl"]
["Zwolle, Nieuwe Markt 1, 038 - 4210085, zwolle@creyfs.nl"]
["Zwolle Medical, Diezerpoortenplas 5, 038 - 4229888, zwollemedical@creyfs.nl"]