{"text_format":"1","workbook":"xlsx","n_sheets":2,"sheets":["Blad1","Blad2"],"not_rendered":{"charts":0,"images":0,"macros":1,"external_links":2,"defined_names":0,"comments":0,"pivot_tables":1},"unopened":[],"bounds":{"document_bytes":16777216,"sheet_cells":100000,"rows_first":2000,"rows_last":500,"rows_between":2000,"halvings":0,"cell_chars":16384,"cell_head_chars":4096},"cells_cut":0,"cells_raw":0,"read":"whole","date_system":"1900"}

{"sheet":"Blad1","index":0,"n_rows":10,"n_cols":27,"rows_kept":10,"cut":false,"hidden":false,"merged":[]}
[null,"Dier","Gamma","Product klasse","Artikelnr","E.A.N. code ","Merk","Product naam ","Hoeveelheid","Eenheid ","Omschrijving","Aantal per tussenverpakking","Aantal per omverpakking","Pallet ","Aantal per pallet ","Min Bestel Hoeveelheid","Familie","Subfamilie","K / G","BTW %","Aanbevolen verkoopprijs incl.BTW","Palletkorting gerekend op winkelier 500 kg","Order","inkoop Netto ","inkoop totaal","verkoop waarde","ja/nee"]
[{"$f":"VLOOKUP($E2,[1]BELGIE!$A$1:$AX$1889,22,FALSE)","v":"↑"},"Siervogel","onderhouds pellet","Voeding",422066,5410340220665,null,"K4",800,"g",null,0,5,"EURO",360,5,"2. ","6. ","K",{"$f":"VLOOKUP($E2,[1]BELGIE!$A$1:$AX$1889,31,FALSE)*100","v":21},21.5,null,null,11.32,{"$f":"W2*X2","v":0},{"$f":"U2*W2","v":0},{"$f":"IF(W2=\"\",\"\",\"x\")","v":""}]
[{"$f":"VLOOKUP($E3,[1]BELGIE!$A$1:$AX$1889,22,FALSE)","v":"↑"},"Siervogel","onderhouds pellet","Voeding",422067,5410340220672,null,"B14",4,"kg",null,0,4,"EURO",64,4,"2. ","6. ","K",{"$f":"VLOOKUP($E3,[1]BELGIE!$A$1:$AX$1889,31,FALSE)*100","v":21},7.5,null,null,3.25,{"$f":"W3*X3","v":0},{"$f":"U3*W3","v":0},{"$f":"IF(W3=\"\",\"\",\"x\")","v":""}]
[{"$f":"VLOOKUP($E4,[1]BELGIE!$A$1:$AX$1889,22,FALSE)","v":"↑"},"Siervogel","onderhouds pellet","Voeding",422068,5410340220689,null,"B18",4,"kg",null,0,4,"EURO",64,4,"2. ","6. ","K",{"$f":"VLOOKUP($E4,[1]BELGIE!$A$1:$AX$1889,31,FALSE)*100","v":21},21.75,null,null,12.36,0,0,""]
[{"$f":"VLOOKUP($E5,[1]BELGIE!$A$1:$AX$1889,22,FALSE)","v":"↑"},"Siervogel","onderhouds pellet","Voeding",422063,5410340220634,null,"H21",500,"g",null,0,5,"EURO",360,5,"2. ","6. ","K",{"$f":"VLOOKUP($E5,[1]BELGIE!$A$1:$AX$1889,31,FALSE)*100","v":21},16.649999999999999,null,9,9.9499999999999993,89.55,149.85,"x"]
[{"$f":"VLOOKUP($E6,[1]BELGIE!$A$1:$AX$1889,22,FALSE)","v":"↑"},"Siervogel","onderhouds pellet","Voeding",422065,5410340220658,null,"J44",10,"kg",null,0,1,"VL",50,1,"2. ","6. ","G",{"$f":"VLOOKUP($E6,[1]BELGIE!$A$1:$AX$1889,31,FALSE)*100","v":21},{"$f":"VLOOKUP($E6,[1]BELGIE!$A$1:$AX$1889,32,FALSE)","v":41.2},null,10,22.36,223.6,412,"x"]
[{"$f":"VLOOKUP($E7,[1]BELGIE!$A$1:$AX$1889,22,FALSE)","v":"↑"},"Siervogel","onderhouds pellet","Voeding",422022,5410340220221,null,"C15",1,"kg",null,0,5,"EURO",360,5,"2. ","6. ","K",{"$f":"VLOOKUP($E7,[1]BELGIE!$A$1:$AX$1889,31,FALSE)*100","v":21},99.32,null,null,78.2,0,0,""]
[{"$f":"VLOOKUP($E8,[1]BELGIE!$A$1:$AX$1889,22,FALSE)","v":"↑"},"Siervogel","onderhouds pellet","Voeding",422019,5410340220191,null,"C45",5,"kg",null,0,4,"EURO",64,4,"2. ","6. ","K",{"$f":"VLOOKUP($E8,[1]BELGIE!$A$1:$AX$1889,31,FALSE)*100","v":21},{"$f":"VLOOKUP($E8,[1]BELGIE!$A$1:$AX$1889,32,FALSE)","v":17.850000000000001},null,4,{"$f":"IFERROR(VLOOKUP(E8,[2]Prijslijst!$G:$AP,36,0),\"\")","v":11.34},45.36,71.400000000000006,"x"]
[{"$f":"VLOOKUP($E9,[1]BELGIE!$A$1:$AX$1889,22,FALSE)","v":"↑"},"Siervogel","onderhouds pellet","Voeding",422034,5410340220344,null,"C32",5,"kg",null,0,4,"EURO",64,4,"2. ","6. ","K",{"$f":"VLOOKUP($E9,[1]BELGIE!$A$1:$AX$1889,31,FALSE)*100","v":21},{"$f":"VLOOKUP($E9,[1]BELGIE!$A$1:$AX$1889,32,FALSE)","v":19.200000000000003},null,null,{"$f":"IFERROR(VLOOKUP(E9,[2]Prijslijst!$G:$AP,36,0),\"\")","v":12.19},0,0,""]
[{"$f":"VLOOKUP($E10,[1]BELGIE!$A$1:$AX$1889,22,FALSE)","v":"↑"},"Siervogel","onderhouds pellet","Voeding",422086,5410340220863,null,"F11",800,"g",null,0,5,"EURO",360,5,"2. ","6. ","K",{"$f":"VLOOKUP($E10,[1]BELGIE!$A$1:$AX$1889,31,FALSE)*100","v":21},33,null,null,24.75,0,0,""]

{"sheet":"Blad2","index":1,"n_rows":6,"n_cols":25,"rows_kept":6,"cut":false,"hidden":false,"merged":[]}
["ja/nee","(Multiple Items)"]
[]
["Row Labels","Gamma","Product klasse","Artikelnr","E.A.N. code ","Merk","Product naam ","Hoeveelheid","Eenheid ","Omschrijving","Aantal per tussenverpakking","Aantal per omverpakking","Pallet ","Aantal per pallet ","Min Bestel Hoeveelheid","Familie","Subfamilie","K / G","BTW %","Aanbevolen verkoopprijs incl.BTW","Palletkorting gerekend op winkelier 500 kg","Order","inkoop Netto ","inkoop totaal","verkoop waarde"]
["Siervogel","onderhouds pellet","Voeding",422019,5410340220191,"(blank)","C45",5,"kg","(blank)",0,4,"EURO",64,4,"2. ","6. ","K",21,17.850000000000001,"(blank)",4,11.34,45.36,71.400000000000006]
[null,null,null,422063,5410340220634,"(blank)","H21",500,"g","(blank)",0,5,"EURO",360,5,"2. ","6. ","K",21,16.649999999999999,"(blank)",9,9.9499999999999993,89.55,149.85]
[null,null,null,422065,5410340220658,"(blank)","J44",10,"kg","(blank)",0,1,"VL",50,1,"2. ","6. ","G",21,41.2,"(blank)",10,22.36,223.6,412]