{"text_format":"1","workbook":"xlsx","n_sheets":3,"sheets":["Invoer","Orders","Constant"],"not_rendered":{"charts":0,"images":0,"macros":1,"external_links":0,"defined_names":10,"comments":0,"pivot_tables":0},"unopened":[],"bounds":{"document_bytes":16777216,"sheet_cells":100000,"rows_first":2000,"rows_last":500,"rows_between":2000,"halvings":0,"cell_chars":16384,"cell_head_chars":4096},"cells_cut":0,"cells_raw":0,"read":"whole","date_system":"1900"}

{"sheet":"Invoer","index":0,"n_rows":101,"n_cols":10,"rows_kept":101,"cut":false,"hidden":false,"merged":[]}
["Order","Datum","Soort","Zone","Aantal","Kleur","Rij","Boom","Probleem","Harde kleur"]
[330730,"2016-10-26","Pompelmoes",1,3952,9511,25,1,"a",{"$f":"VLOOKUP(Tabel146[[#This Row],[Kleur]],harde,2,0)","v":"donker legergroen"}]
[330730,"2016-10-26","Pompelmoes",1,3952,9511,25,2,"z",{"$f":"VLOOKUP(Tabel146[[#This Row],[Kleur]],harde,2,0)","v":"donker legergroen"}]
[330730,"2016-10-26","Pompelmoes",1,3952,9511,25,4,"e",{"$f":"VLOOKUP(Tabel146[[#This Row],[Kleur]],harde,2,0)","v":"donker legergroen"}]
[330730,"2016-10-26","Pompelmoes",1,3952,9511,25,10,"r",{"$f":"VLOOKUP(Tabel146[[#This Row],[Kleur]],harde,2,0)","v":"donker legergroen"}]
[330730,"2016-10-26","Pompelmoes",1,3952,9511,25,11,"g",{"$f":"VLOOKUP(Tabel146[[#This Row],[Kleur]],harde,2,0)","v":"donker legergroen"}]
[330730,"2016-10-26","Pompelmoes",1,3952,9511,25,11,"f",{"$f":"VLOOKUP(Tabel146[[#This Row],[Kleur]],harde,2,0)","v":"donker legergroen"}]
[330730,"2016-10-26","Pompelmoes",1,3952,9511,25,11,"d",{"$f":"VLOOKUP(Tabel146[[#This Row],[Kleur]],harde,2,0)","v":"donker legergroen"}]
[330730,"2016-10-26","Pompelmoes",1,3952,9511,25,11,"s",{"$f":"VLOOKUP(Tabel146[[#This Row],[Kleur]],harde,2,0)","v":"donker legergroen"}]
[330730,"2016-10-26","Pompelmoes",1,3952,9511,25,11,"z",{"$f":"VLOOKUP(Tabel146[[#This Row],[Kleur]],harde,2,0)","v":"donker legergroen"}]
[330731,"2016-10-26","Pompelmoes",2,3952,9511,25,2,"a",{"$f":"VLOOKUP(Tabel146[[#This Row],[Kleur]],harde,2,0)","v":"donker legergroen"}]
[330731,"2016-10-26","Pompelmoes",2,3952,9511,25,4,"d",{"$f":"VLOOKUP(Tabel146[[#This Row],[Kleur]],harde,2,0)","v":"donker legergroen"}]
[330731,"2016-10-26","Pompelmoes",2,3952,9511,25,6,"e",{"$f":"VLOOKUP(Tabel146[[#This Row],[Kleur]],harde,2,0)","v":"donker legergroen"}]
[330731,"2016-10-26","Pompelmoes",2,3952,9511,25,9,"e",{"$f":"VLOOKUP(Tabel146[[#This Row],[Kleur]],harde,2,0)","v":"donker legergroen"}]
[332389,"2016-10-27","Pompelmoes",1,2608,7218,25,2,"z",{"$f":"VLOOKUP(Tabel146[[#This Row],[Kleur]],harde,2,0)","v":"donkergroen"}]
[332389,"2016-10-27","Pompelmoes",1,2608,7218,25,4,"g",{"$f":"VLOOKUP(Tabel146[[#This Row],[Kleur]],harde,2,0)","v":"donkergroen"}]
[332389,"2016-10-27","Pompelmoes",1,2608,7218,25,5,"e",{"$f":"VLOOKUP(Tabel146[[#This Row],[Kleur]],harde,2,0)","v":"donkergroen"}]
[332389,"2016-10-27","Pompelmoes",1,2608,7218,25,6,"a",{"$f":"VLOOKUP(Tabel146[[#This Row],[Kleur]],harde,2,0)","v":"donkergroen"}]
[332390,"2016-10-27","Pompelmoes",2,2608,8208,25,3,"z",{"$f":"VLOOKUP(Tabel146[[#This Row],[Kleur]],harde,2,0)","v":"lichtblauw"}]
[332390,"2016-10-27","Pompelmoes",2,2608,8208,25,5,"d",{"$f":"VLOOKUP(Tabel146[[#This Row],[Kleur]],harde,2,0)","v":"lichtblauw"}]
[332390,"2016-10-27","Pompelmoes",2,2608,8208,25,6,"s",{"$f":"VLOOKUP(Tabel146[[#This Row],[Kleur]],harde,2,0)","v":"lichtblauw"}]
[331106,"2016-10-29","Pompelmoes",1,3952,9511,25,1,"z",{"$f":"VLOOKUP(Tabel146[[#This Row],[Kleur]],harde,2,0)","v":"donker legergroen"}]
[331106,"2016-10-29","Pompelmoes",1,3952,9511,25,2,"e",{"$f":"VLOOKUP(Tabel146[[#This Row],[Kleur]],harde,2,0)","v":"donker legergroen"}]
[331106,"2016-10-29","Pompelmoes",1,3952,9511,25,10,"r",{"$f":"VLOOKUP(Tabel146[[#This Row],[Kleur]],harde,2,0)","v":"donker legergroen"}]
[331107,"2016-10-29","Pompelmoes",2,3952,9511,25,7,"z",{"$f":"VLOOKUP(Tabel146[[#This Row],[Kleur]],harde,2,0)","v":"donker legergroen"}]
[331107,"2016-10-29","Pompelmoes",2,3952,9511,25,7,"a",{"$f":"VLOOKUP(Tabel146[[#This Row],[Kleur]],harde,2,0)","v":"donker legergroen"}]
[331107,"2016-10-29","Pompelmoes",2,3952,9511,25,10,"z",{"$f":"VLOOKUP(Tabel146[[#This Row],[Kleur]],harde,2,0)","v":"donker legergroen"}]
[331107,"2016-10-29","Pompelmoes",2,3952,9511,25,10,"e",{"$f":"VLOOKUP(Tabel146[[#This Row],[Kleur]],harde,2,0)","v":"donker legergroen"}]
[331107,"2016-10-29","Pompelmoes",2,3952,9511,25,11,"r",{"$f":"VLOOKUP(Tabel146[[#This Row],[Kleur]],harde,2,0)","v":"donker legergroen"}]
[330188,"2016-10-30","Appel",1,3322,4208,82,1,"z",{"$f":"VLOOKUP(Tabel146[[#This Row],[Kleur]],harde,2,0)","v":"bloedrood"}]
[330188,"2016-10-30","Appel",1,3322,4208,82,1,"e",{"$f":"VLOOKUP(Tabel146[[#This Row],[Kleur]],harde,2,0)","v":"bloedrood"}]
[330188,"2016-10-30","Appel",1,3322,4208,82,1,"e",{"$f":"VLOOKUP(Tabel146[[#This Row],[Kleur]],harde,2,0)","v":"bloedrood"}]
[330188,"2016-10-30","Appel",1,3322,4208,82,4,"a",{"$f":"VLOOKUP(Tabel146[[#This Row],[Kleur]],harde,2,0)","v":"bloedrood"}]
[330188,"2016-10-30","Appel",1,3322,4208,82,4,"z",{"$f":"VLOOKUP(Tabel146[[#This Row],[Kleur]],harde,2,0)","v":"bloedrood"}]
[330188,"2016-10-30","Appel",1,3322,4208,82,5,"e",{"$f":"VLOOKUP(Tabel146[[#This Row],[Kleur]],harde,2,0)","v":"bloedrood"}]
[330188,"2016-10-30","Appel",1,3322,4208,82,5,"r",{"$f":"VLOOKUP(Tabel146[[#This Row],[Kleur]],harde,2,0)","v":"bloedrood"}]
[330188,"2016-10-30","Appel",1,3322,4208,82,5,"a",{"$f":"VLOOKUP(Tabel146[[#This Row],[Kleur]],harde,2,0)","v":"bloedrood"}]
[330188,"2016-10-30","Appel",1,3322,4208,82,5,"z",{"$f":"VLOOKUP(Tabel146[[#This Row],[Kleur]],harde,2,0)","v":"bloedrood"}]
[330188,"2016-10-30","Appel",1,3322,4208,82,6,"e",{"$f":"VLOOKUP(Tabel146[[#This Row],[Kleur]],harde,2,0)","v":"bloedrood"}]
[330188,"2016-10-30","Appel",1,3322,4208,82,6,"r",{"$f":"VLOOKUP(Tabel146[[#This Row],[Kleur]],harde,2,0)","v":"bloedrood"}]
[330188,"2016-10-30","Appel",1,3322,4208,82,7,"t",{"$f":"VLOOKUP(Tabel146[[#This Row],[Kleur]],harde,2,0)","v":"bloedrood"}]
[330188,"2016-10-30","Appel",1,3322,4208,82,7,"d",{"$f":"VLOOKUP(Tabel146[[#This Row],[Kleur]],harde,2,0)","v":"bloedrood"}]
[330188,"2016-10-30","Appel",1,3322,4208,82,7,"d",{"$f":"VLOOKUP(Tabel146[[#This Row],[Kleur]],harde,2,0)","v":"bloedrood"}]
[330188,"2016-10-30","Appel",1,3322,4208,82,8,"e",{"$f":"VLOOKUP(Tabel146[[#This Row],[Kleur]],harde,2,0)","v":"bloedrood"}]
[330188,"2016-10-30","Appel",1,3322,4208,82,8,"r",{"$f":"VLOOKUP(Tabel146[[#This Row],[Kleur]],harde,2,0)","v":"bloedrood"}]
[330188,"2016-10-30","Appel",1,3322,4208,82,8,"z",{"$f":"VLOOKUP(Tabel146[[#This Row],[Kleur]],harde,2,0)","v":"bloedrood"}]
[330188,"2016-10-30","Appel",1,3322,4208,82,8,"a",{"$f":"VLOOKUP(Tabel146[[#This Row],[Kleur]],harde,2,0)","v":"bloedrood"}]
[330188,"2016-10-30","Appel",1,3322,4208,82,8,"z",{"$f":"VLOOKUP(Tabel146[[#This Row],[Kleur]],harde,2,0)","v":"bloedrood"}]
[330188,"2016-10-30","Appel",1,3322,4208,82,8,"e",{"$f":"VLOOKUP(Tabel146[[#This Row],[Kleur]],harde,2,0)","v":"bloedrood"}]
[330188,"2016-10-30","Appel",1,3322,4208,82,9,"r",{"$f":"VLOOKUP(Tabel146[[#This Row],[Kleur]],harde,2,0)","v":"bloedrood"}]
[330188,"2016-10-30","Appel",1,3322,4208,82,10,"z",{"$f":"VLOOKUP(Tabel146[[#This Row],[Kleur]],harde,2,0)","v":"bloedrood"}]
[330188,"2016-10-30","Appel",1,3322,4208,82,10,"e",{"$f":"VLOOKUP(Tabel146[[#This Row],[Kleur]],harde,2,0)","v":"bloedrood"}]
[330188,"2016-10-30","Appel",1,3322,4208,82,10,"e",{"$f":"VLOOKUP(Tabel146[[#This Row],[Kleur]],harde,2,0)","v":"bloedrood"}]
[330188,"2016-10-30","Appel",1,3322,4208,82,10,"a",{"$f":"VLOOKUP(Tabel146[[#This Row],[Kleur]],harde,2,0)","v":"bloedrood"}]
[330189,"2016-10-30","Appel",2,3322,9032,82,4,"z",{"$f":"VLOOKUP(Tabel146[[#This Row],[Kleur]],harde,2,0)","v":"tin"}]
[330189,"2016-10-30","Appel",2,3322,9032,82,4,"e",{"$f":"VLOOKUP(Tabel146[[#This Row],[Kleur]],harde,2,0)","v":"tin"}]
[330189,"2016-10-30","Appel",2,3322,9032,82,4,"r",{"$f":"VLOOKUP(Tabel146[[#This Row],[Kleur]],harde,2,0)","v":"tin"}]
[330189,"2016-10-30","Appel",2,3322,9032,82,4,"a",{"$f":"VLOOKUP(Tabel146[[#This Row],[Kleur]],harde,2,0)","v":"tin"}]
[330189,"2016-10-30","Appel",2,3322,9032,82,5,"z",{"$f":"VLOOKUP(Tabel146[[#This Row],[Kleur]],harde,2,0)","v":"tin"}]
[330189,"2016-10-30","Appel",2,3322,9032,82,6,"e",{"$f":"VLOOKUP(Tabel146[[#This Row],[Kleur]],harde,2,0)","v":"tin"}]
[330189,"2016-10-30","Appel",2,3322,9032,82,6,"r",{"$f":"VLOOKUP(Tabel146[[#This Row],[Kleur]],harde,2,0)","v":"tin"}]
[330189,"2016-10-30","Appel",2,3322,9032,82,8,"t",{"$f":"VLOOKUP(Tabel146[[#This Row],[Kleur]],harde,2,0)","v":"tin"}]
[330189,"2016-10-30","Appel",2,3322,9032,82,8,"d",{"$f":"VLOOKUP(Tabel146[[#This Row],[Kleur]],harde,2,0)","v":"tin"}]
[330189,"2016-10-30","Appel",2,3322,9032,82,8,"d",{"$f":"VLOOKUP(Tabel146[[#This Row],[Kleur]],harde,2,0)","v":"tin"}]
[330189,"2016-10-30","Appel",2,3322,9032,82,8,"e",{"$f":"VLOOKUP(Tabel146[[#This Row],[Kleur]],harde,2,0)","v":"tin"}]
[330189,"2016-10-30","Appel",2,3322,9032,82,8,"r",{"$f":"VLOOKUP(Tabel146[[#This Row],[Kleur]],harde,2,0)","v":"tin"}]
[330189,"2016-10-30","Appel",2,3322,9032,82,8,"z",{"$f":"VLOOKUP(Tabel146[[#This Row],[Kleur]],harde,2,0)","v":"tin"}]
[330189,"2016-10-30","Appel",2,3322,9032,82,8,"a",{"$f":"VLOOKUP(Tabel146[[#This Row],[Kleur]],harde,2,0)","v":"tin"}]
[330189,"2016-10-30","Appel",2,3322,9032,82,8,"z",{"$f":"VLOOKUP(Tabel146[[#This Row],[Kleur]],harde,2,0)","v":"tin"}]
[330189,"2016-10-30","Appel",2,3322,9032,82,8,"e",{"$f":"VLOOKUP(Tabel146[[#This Row],[Kleur]],harde,2,0)","v":"tin"}]
[326579,"2016-11-02","Peer",1,3718,9032,82,1,"r",{"$f":"VLOOKUP(Tabel146[[#This Row],[Kleur]],harde,2,0)","v":"tin"}]
[326579,"2016-11-02","Peer",1,3718,9032,82,1,"z",{"$f":"VLOOKUP(Tabel146[[#This Row],[Kleur]],harde,2,0)","v":"tin"}]
[326579,"2016-11-02","Peer",1,3718,9032,82,3,"e",{"$f":"VLOOKUP(Tabel146[[#This Row],[Kleur]],harde,2,0)","v":"tin"}]
[326579,"2016-11-02","Peer",1,3718,9032,82,3,"e",{"$f":"VLOOKUP(Tabel146[[#This Row],[Kleur]],harde,2,0)","v":"tin"}]
[326579,"2016-11-02","Peer",1,3718,9032,82,3,"a",{"$f":"VLOOKUP(Tabel146[[#This Row],[Kleur]],harde,2,0)","v":"tin"}]
[326579,"2016-11-02","Peer",1,3718,9032,82,3,"z",{"$f":"VLOOKUP(Tabel146[[#This Row],[Kleur]],harde,2,0)","v":"tin"}]
[326579,"2016-11-02","Peer",1,3718,9032,82,7,"e",{"$f":"VLOOKUP(Tabel146[[#This Row],[Kleur]],harde,2,0)","v":"tin"}]
[326579,"2016-11-02","Peer",1,3718,9032,82,8,"r",{"$f":"VLOOKUP(Tabel146[[#This Row],[Kleur]],harde,2,0)","v":"tin"}]
[326579,"2016-11-02","Peer",1,3718,9032,82,8,"a",{"$f":"VLOOKUP(Tabel146[[#This Row],[Kleur]],harde,2,0)","v":"tin"}]
[326579,"2016-11-02","Peer",1,3718,9032,82,9,"z",{"$f":"VLOOKUP(Tabel146[[#This Row],[Kleur]],harde,2,0)","v":"tin"}]
[326579,"2016-11-02","Peer",1,3718,9032,82,9,"e",{"$f":"VLOOKUP(Tabel146[[#This Row],[Kleur]],harde,2,0)","v":"tin"}]
[326579,"2016-11-02","Peer",1,3718,9032,82,10,"r",{"$f":"VLOOKUP(Tabel146[[#This Row],[Kleur]],harde,2,0)","v":"tin"}]
[326579,"2016-11-02","Peer",1,3718,9032,82,10,"t",{"$f":"VLOOKUP(Tabel146[[#This Row],[Kleur]],harde,2,0)","v":"tin"}]
[326579,"2016-11-02","Peer",1,3718,9032,82,10,"d",{"$f":"VLOOKUP(Tabel146[[#This Row],[Kleur]],harde,2,0)","v":"tin"}]
[326580,"2016-11-02","Peer",2,3718,9032,82,1,"d",{"$f":"VLOOKUP(Tabel146[[#This Row],[Kleur]],harde,2,0)","v":"tin"}]
[326580,"2016-11-02","Peer",2,3718,9032,82,1,"e",{"$f":"VLOOKUP(Tabel146[[#This Row],[Kleur]],harde,2,0)","v":"tin"}]
[326580,"2016-11-02","Peer",2,3718,9032,82,1,"r",{"$f":"VLOOKUP(Tabel146[[#This Row],[Kleur]],harde,2,0)","v":"tin"}]
[326580,"2016-11-02","Peer",2,3718,9032,82,1,"z",{"$f":"VLOOKUP(Tabel146[[#This Row],[Kleur]],harde,2,0)","v":"tin"}]
[326580,"2016-11-02","Peer",2,3718,9032,82,2,"a",{"$f":"VLOOKUP(Tabel146[[#This Row],[Kleur]],harde,2,0)","v":"tin"}]
[326580,"2016-11-02","Peer",2,3718,9032,82,3,"z",{"$f":"VLOOKUP(Tabel146[[#This Row],[Kleur]],harde,2,0)","v":"tin"}]
[326580,"2016-11-02","Peer",2,3718,9032,82,3,"e",{"$f":"VLOOKUP(Tabel146[[#This Row],[Kleur]],harde,2,0)","v":"tin"}]
[326580,"2016-11-02","Peer",2,3718,9032,82,3,"r",{"$f":"VLOOKUP(Tabel146[[#This Row],[Kleur]],harde,2,0)","v":"tin"}]
[326580,"2016-11-02","Peer",2,3718,9032,82,6,"z",{"$f":"VLOOKUP(Tabel146[[#This Row],[Kleur]],harde,2,0)","v":"tin"}]
[326580,"2016-11-02","Peer",2,3718,9032,82,7,"e",{"$f":"VLOOKUP(Tabel146[[#This Row],[Kleur]],harde,2,0)","v":"tin"}]
[326580,"2016-11-02","Peer",2,3718,9032,82,9,"e",{"$f":"VLOOKUP(Tabel146[[#This Row],[Kleur]],harde,2,0)","v":"tin"}]
[326580,"2016-11-02","Peer",2,3718,9032,82,10,"a",{"$f":"VLOOKUP(Tabel146[[#This Row],[Kleur]],harde,2,0)","v":"tin"}]
[326580,"2016-11-02","Peer",2,3718,9032,82,10,"z",{"$f":"VLOOKUP(Tabel146[[#This Row],[Kleur]],harde,2,0)","v":"tin"}]
[326580,"2016-11-02","Peer",2,3718,9032,82,10,"e",{"$f":"VLOOKUP(Tabel146[[#This Row],[Kleur]],harde,2,0)","v":"tin"}]
[326580,"2016-11-02","Peer",2,3718,9032,82,10,"r",{"$f":"VLOOKUP(Tabel146[[#This Row],[Kleur]],harde,2,0)","v":"tin"}]
[326580,"2016-11-02","Peer",2,3718,9032,82,11,"a",{"$f":"VLOOKUP(Tabel146[[#This Row],[Kleur]],harde,2,0)","v":"tin"}]
[326580,"2016-11-02","Peer",2,3718,9032,82,11,"z",{"$f":"VLOOKUP(Tabel146[[#This Row],[Kleur]],harde,2,0)","v":"tin"}]

{"sheet":"Orders","index":1,"n_rows":110,"n_cols":11,"rows_kept":110,"cut":false,"hidden":false,"merged":[]}
["Order","Datum","Soort","Kleur","Aantal","Harde kleur","totaal problemen","probleem \"z\"","problemen \"a\""]
[{"$f":"IF(COUNTIF(Invoer!#REF!,Invoer!#REF!)=1,Invoer!#REF!,\"\")","v":{"$error":"#REF!"}},{"$f":"VLOOKUP(A2,Invoer!#REF!,2,0)","v":{"$error":"#REF!"}},{"$f":"VLOOKUP(A2,Invoer!#REF!,3,0)","v":{"$error":"#REF!"}},{"$f":"VLOOKUP(A2,Invoer!#REF!,6,0)","v":{"$error":"#REF!"}},{"$f":"VLOOKUP(A2,Invoer!#REF!,5,0)","v":{"$error":"#REF!"}},{"$f":"VLOOKUP(A2,Invoer!#REF!,10,0)","v":{"$error":"#REF!"}},{"$f":"COUNTIF(Invoer!#REF!,A2)","v":{"$error":"#REF!"}},{"$f":"COUNTIFS(Invoer!#REF!,A2,Invoer!#REF!,\"z\")","v":{"$error":"#REF!"}},{"$f":"COUNTIFS(Invoer!#REF!,A2,Invoer!#REF!,\"a\")","v":{"$error":"#REF!"}},null,{"$f":"IF(COUNTIF(A$2:A2,A2)=1,A2,\"\")","v":{"$error":"#REF!"}}]
[{"$f":"IF(COUNTIF(Invoer!#REF!,Invoer!#REF!)=1,Invoer!#REF!,\"\")","v":{"$error":"#REF!"}},{"$f":"VLOOKUP(A3,Invoer!#REF!,2,0)","v":{"$error":"#REF!"}},{"$f":"VLOOKUP(A3,Invoer!#REF!,3,0)","v":{"$error":"#REF!"}},{"$f":"VLOOKUP(A3,Invoer!#REF!,6,0)","v":{"$error":"#REF!"}},{"$f":"VLOOKUP(A3,Invoer!#REF!,5,0)","v":{"$error":"#REF!"}},{"$f":"VLOOKUP(A3,Invoer!#REF!,10,0)","v":{"$error":"#REF!"}},{"$f":"COUNTIF(Invoer!#REF!,A3)","v":{"$error":"#REF!"}},{"$f":"COUNTIFS(Invoer!#REF!,A3,Invoer!#REF!,\"z\")","v":{"$error":"#REF!"}},{"$f":"COUNTIFS(Invoer!#REF!,A3,Invoer!#REF!,\"a\")","v":{"$error":"#REF!"}},null,{"$f":"IF(COUNTIF(A$2:A3,A3)=1,A3,\"\")","v":""}]
[{"$f":"IF(COUNTIF(Invoer!#REF!,Invoer!#REF!)=1,Invoer!#REF!,\"\")","v":{"$error":"#REF!"}},{"$f":"VLOOKUP(A4,Invoer!#REF!,2,0)","v":{"$error":"#REF!"}},{"$f":"VLOOKUP(A4,Invoer!#REF!,3,0)","v":{"$error":"#REF!"}},{"$f":"VLOOKUP(A4,Invoer!#REF!,6,0)","v":{"$error":"#REF!"}},{"$f":"VLOOKUP(A4,Invoer!#REF!,5,0)","v":{"$error":"#REF!"}},{"$f":"VLOOKUP(A4,Invoer!#REF!,10,0)","v":{"$error":"#REF!"}},{"$f":"COUNTIF(Invoer!#REF!,A4)","v":{"$error":"#REF!"}},{"$f":"COUNTIFS(Invoer!#REF!,A4,Invoer!#REF!,\"z\")","v":{"$error":"#REF!"}},{"$f":"COUNTIFS(Invoer!#REF!,A4,Invoer!#REF!,\"a\")","v":{"$error":"#REF!"}},null,{"$f":"IF(COUNTIF(A$2:A4,A4)=1,A4,\"\")","v":""}]
[{"$f":"IF(COUNTIF(Invoer!#REF!,Invoer!#REF!)=1,Invoer!#REF!,\"\")","v":{"$error":"#REF!"}},{"$f":"VLOOKUP(A5,Invoer!#REF!,2,0)","v":{"$error":"#REF!"}},{"$f":"VLOOKUP(A5,Invoer!#REF!,3,0)","v":{"$error":"#REF!"}},{"$f":"VLOOKUP(A5,Invoer!#REF!,6,0)","v":{"$error":"#REF!"}},{"$f":"VLOOKUP(A5,Invoer!#REF!,5,0)","v":{"$error":"#REF!"}},{"$f":"VLOOKUP(A5,Invoer!#REF!,10,0)","v":{"$error":"#REF!"}},{"$f":"COUNTIF(Invoer!#REF!,A5)","v":{"$error":"#REF!"}},{"$f":"COUNTIFS(Invoer!#REF!,A5,Invoer!#REF!,\"z\")","v":{"$error":"#REF!"}},{"$f":"COUNTIFS(Invoer!#REF!,A5,Invoer!#REF!,\"a\")","v":{"$error":"#REF!"}},null,{"$f":"IF(COUNTIF(A$2:A5,A5)=1,A5,\"\")","v":""}]
[{"$f":"IF(COUNTIF(Invoer!#REF!,Invoer!#REF!)=1,Invoer!#REF!,\"\")","v":{"$error":"#REF!"}},{"$f":"VLOOKUP(A6,Invoer!#REF!,2,0)","v":{"$error":"#REF!"}},{"$f":"VLOOKUP(A6,Invoer!#REF!,3,0)","v":{"$error":"#REF!"}},{"$f":"VLOOKUP(A6,Invoer!#REF!,6,0)","v":{"$error":"#REF!"}},{"$f":"VLOOKUP(A6,Invoer!#REF!,5,0)","v":{"$error":"#REF!"}},{"$f":"VLOOKUP(A6,Invoer!#REF!,10,0)","v":{"$error":"#REF!"}},{"$f":"COUNTIF(Invoer!#REF!,A6)","v":{"$error":"#REF!"}},{"$f":"COUNTIFS(Invoer!#REF!,A6,Invoer!#REF!,\"z\")","v":{"$error":"#REF!"}},{"$f":"COUNTIFS(Invoer!#REF!,A6,Invoer!#REF!,\"a\")","v":{"$error":"#REF!"}},null,{"$f":"IF(COUNTIF(A$2:A6,A6)=1,A6,\"\")","v":""}]
[{"$f":"IF(COUNTIF(Invoer!#REF!,Invoer!#REF!)=1,Invoer!#REF!,\"\")","v":{"$error":"#REF!"}},{"$f":"VLOOKUP(A7,Invoer!#REF!,2,0)","v":{"$error":"#REF!"}},{"$f":"VLOOKUP(A7,Invoer!#REF!,3,0)","v":{"$error":"#REF!"}},{"$f":"VLOOKUP(A7,Invoer!#REF!,6,0)","v":{"$error":"#REF!"}},{"$f":"VLOOKUP(A7,Invoer!#REF!,5,0)","v":{"$error":"#REF!"}},{"$f":"VLOOKUP(A7,Invoer!#REF!,10,0)","v":{"$error":"#REF!"}},{"$f":"COUNTIF(Invoer!#REF!,A7)","v":{"$error":"#REF!"}},{"$f":"COUNTIFS(Invoer!#REF!,A7,Invoer!#REF!,\"z\")","v":{"$error":"#REF!"}},{"$f":"COUNTIFS(Invoer!#REF!,A7,Invoer!#REF!,\"a\")","v":{"$error":"#REF!"}},null,{"$f":"IF(COUNTIF(A$2:A7,A7)=1,A7,\"\")","v":""}]
[{"$f":"IF(COUNTIF(Invoer!#REF!,Invoer!#REF!)=1,Invoer!#REF!,\"\")","v":{"$error":"#REF!"}},{"$f":"VLOOKUP(A8,Invoer!#REF!,2,0)","v":{"$error":"#REF!"}},{"$f":"VLOOKUP(A8,Invoer!#REF!,3,0)","v":{"$error":"#REF!"}},{"$f":"VLOOKUP(A8,Invoer!#REF!,6,0)","v":{"$error":"#REF!"}},{"$f":"VLOOKUP(A8,Invoer!#REF!,5,0)","v":{"$error":"#REF!"}},{"$f":"VLOOKUP(A8,Invoer!#REF!,10,0)","v":{"$error":"#REF!"}},{"$f":"COUNTIF(Invoer!#REF!,A8)","v":{"$error":"#REF!"}},{"$f":"COUNTIFS(Invoer!#REF!,A8,Invoer!#REF!,\"z\")","v":{"$error":"#REF!"}},{"$f":"COUNTIFS(Invoer!#REF!,A8,Invoer!#REF!,\"a\")","v":{"$error":"#REF!"}},null,{"$f":"IF(COUNTIF(A$2:A8,A8)=1,A8,\"\")","v":""}]
[{"$f":"IF(COUNTIF(Invoer!#REF!,Invoer!#REF!)=1,Invoer!#REF!,\"\")","v":{"$error":"#REF!"}},{"$f":"VLOOKUP(A9,Invoer!#REF!,2,0)","v":{"$error":"#REF!"}},{"$f":"VLOOKUP(A9,Invoer!#REF!,3,0)","v":{"$error":"#REF!"}},{"$f":"VLOOKUP(A9,Invoer!#REF!,6,0)","v":{"$error":"#REF!"}},{"$f":"VLOOKUP(A9,Invoer!#REF!,5,0)","v":{"$error":"#REF!"}},{"$f":"VLOOKUP(A9,Invoer!#REF!,10,0)","v":{"$error":"#REF!"}},{"$f":"COUNTIF(Invoer!#REF!,A9)","v":{"$error":"#REF!"}},{"$f":"COUNTIFS(Invoer!#REF!,A9,Invoer!#REF!,\"z\")","v":{"$error":"#REF!"}},{"$f":"COUNTIFS(Invoer!#REF!,A9,Invoer!#REF!,\"a\")","v":{"$error":"#REF!"}},null,{"$f":"IF(COUNTIF(A$2:A9,A9)=1,A9,\"\")","v":""}]
[{"$f":"IF(COUNTIF(Invoer!#REF!,Invoer!#REF!)=1,Invoer!#REF!,\"\")","v":{"$error":"#REF!"}},{"$f":"VLOOKUP(A10,Invoer!#REF!,2,0)","v":{"$error":"#REF!"}},{"$f":"VLOOKUP(A10,Invoer!#REF!,3,0)","v":{"$error":"#REF!"}},{"$f":"VLOOKUP(A10,Invoer!#REF!,6,0)","v":{"$error":"#REF!"}},{"$f":"VLOOKUP(A10,Invoer!#REF!,5,0)","v":{"$error":"#REF!"}},{"$f":"VLOOKUP(A10,Invoer!#REF!,10,0)","v":{"$error":"#REF!"}},{"$f":"COUNTIF(Invoer!#REF!,A10)","v":{"$error":"#REF!"}},{"$f":"COUNTIFS(Invoer!#REF!,A10,Invoer!#REF!,\"z\")","v":{"$error":"#REF!"}},{"$f":"COUNTIFS(Invoer!#REF!,A10,Invoer!#REF!,\"a\")","v":{"$error":"#REF!"}},null,{"$f":"IF(COUNTIF(A$2:A10,A10)=1,A10,\"\")","v":""}]
[{"$f":"IF(COUNTIF(Invoer!#REF!,Invoer!#REF!)=1,Invoer!#REF!,\"\")","v":{"$error":"#REF!"}},{"$f":"VLOOKUP(A11,Invoer!#REF!,2,0)","v":{"$error":"#REF!"}},{"$f":"VLOOKUP(A11,Invoer!#REF!,3,0)","v":{"$error":"#REF!"}},{"$f":"VLOOKUP(A11,Invoer!#REF!,6,0)","v":{"$error":"#REF!"}},{"$f":"VLOOKUP(A11,Invoer!#REF!,5,0)","v":{"$error":"#REF!"}},{"$f":"VLOOKUP(A11,Invoer!#REF!,10,0)","v":{"$error":"#REF!"}},{"$f":"COUNTIF(Invoer!#REF!,A11)","v":{"$error":"#REF!"}},{"$f":"COUNTIFS(Invoer!#REF!,A11,Invoer!#REF!,\"z\")","v":{"$error":"#REF!"}},{"$f":"COUNTIFS(Invoer!#REF!,A11,Invoer!#REF!,\"a\")","v":{"$error":"#REF!"}},null,{"$f":"IF(COUNTIF(A$2:A11,A11)=1,A11,\"\")","v":""}]
[{"$f":"IF(COUNTIF(Invoer!#REF!,Invoer!#REF!)=1,Invoer!#REF!,\"\")","v":{"$error":"#REF!"}},{"$f":"VLOOKUP(A12,Invoer!#REF!,2,0)","v":{"$error":"#REF!"}},{"$f":"VLOOKUP(A12,Invoer!#REF!,3,0)","v":{"$error":"#REF!"}},{"$f":"VLOOKUP(A12,Invoer!#REF!,6,0)","v":{"$error":"#REF!"}},{"$f":"VLOOKUP(A12,Invoer!#REF!,5,0)","v":{"$error":"#REF!"}},{"$f":"VLOOKUP(A12,Invoer!#REF!,10,0)","v":{"$error":"#REF!"}},{"$f":"COUNTIF(Invoer!#REF!,A12)","v":{"$error":"#REF!"}},{"$f":"COUNTIFS(Invoer!#REF!,A12,Invoer!#REF!,\"z\")","v":{"$error":"#REF!"}},{"$f":"COUNTIFS(Invoer!#REF!,A12,Invoer!#REF!,\"a\")","v":{"$error":"#REF!"}},null,{"$f":"IF(COUNTIF(A$2:A12,A12)=1,A12,\"\")","v":""}]
[{"$f":"IF(COUNTIF(Invoer!#REF!,Invoer!#REF!)=1,Invoer!#REF!,\"\")","v":{"$error":"#REF!"}},{"$f":"VLOOKUP(A13,Invoer!#REF!,2,0)","v":{"$error":"#REF!"}},{"$f":"VLOOKUP(A13,Invoer!#REF!,3,0)","v":{"$error":"#REF!"}},{"$f":"VLOOKUP(A13,Invoer!#REF!,6,0)","v":{"$error":"#REF!"}},{"$f":"VLOOKUP(A13,Invoer!#REF!,5,0)","v":{"$error":"#REF!"}},{"$f":"VLOOKUP(A13,Invoer!#REF!,10,0)","v":{"$error":"#REF!"}},{"$f":"COUNTIF(Invoer!#REF!,A13)","v":{"$error":"#REF!"}},{"$f":"COUNTIFS(Invoer!#REF!,A13,Invoer!#REF!,\"z\")","v":{"$error":"#REF!"}},{"$f":"COUNTIFS(Invoer!#REF!,A13,Invoer!#REF!,\"a\")","v":{"$error":"#REF!"}},null,{"$f":"IF(COUNTIF(A$2:A13,A13)=1,A13,\"\")","v":""}]
[{"$f":"IF(COUNTIF(Invoer!#REF!,Invoer!#REF!)=1,Invoer!#REF!,\"\")","v":{"$error":"#REF!"}},{"$f":"VLOOKUP(A14,Invoer!#REF!,2,0)","v":{"$error":"#REF!"}},{"$f":"VLOOKUP(A14,Invoer!#REF!,3,0)","v":{"$error":"#REF!"}},{"$f":"VLOOKUP(A14,Invoer!#REF!,6,0)","v":{"$error":"#REF!"}},{"$f":"VLOOKUP(A14,Invoer!#REF!,5,0)","v":{"$error":"#REF!"}},{"$f":"VLOOKUP(A14,Invoer!#REF!,10,0)","v":{"$error":"#REF!"}},{"$f":"COUNTIF(Invoer!#REF!,A14)","v":{"$error":"#REF!"}},{"$f":"COUNTIFS(Invoer!#REF!,A14,Invoer!#REF!,\"z\")","v":{"$error":"#REF!"}},{"$f":"COUNTIFS(Invoer!#REF!,A14,Invoer!#REF!,\"a\")","v":{"$error":"#REF!"}},null,{"$f":"IF(COUNTIF(A$2:A14,A14)=1,A14,\"\")","v":""}]
[{"$f":"IF(COUNTIF(Invoer!#REF!,Invoer!#REF!)=1,Invoer!#REF!,\"\")","v":{"$error":"#REF!"}},{"$f":"VLOOKUP(A15,Invoer!#REF!,2,0)","v":{"$error":"#REF!"}},{"$f":"VLOOKUP(A15,Invoer!#REF!,3,0)","v":{"$error":"#REF!"}},{"$f":"VLOOKUP(A15,Invoer!#REF!,6,0)","v":{"$error":"#REF!"}},{"$f":"VLOOKUP(A15,Invoer!#REF!,5,0)","v":{"$error":"#REF!"}},{"$f":"VLOOKUP(A15,Invoer!#REF!,10,0)","v":{"$error":"#REF!"}},{"$f":"COUNTIF(Invoer!#REF!,A15)","v":{"$error":"#REF!"}},{"$f":"COUNTIFS(Invoer!#REF!,A15,Invoer!#REF!,\"z\")","v":{"$error":"#REF!"}},{"$f":"COUNTIFS(Invoer!#REF!,A15,Invoer!#REF!,\"a\")","v":{"$error":"#REF!"}},null,{"$f":"IF(COUNTIF(A$2:A15,A15)=1,A15,\"\")","v":""}]
[{"$f":"IF(COUNTIF(Invoer!#REF!,Invoer!#REF!)=1,Invoer!#REF!,\"\")","v":{"$error":"#REF!"}},{"$f":"VLOOKUP(A16,Invoer!#REF!,2,0)","v":{"$error":"#REF!"}},{"$f":"VLOOKUP(A16,Invoer!#REF!,3,0)","v":{"$error":"#REF!"}},{"$f":"VLOOKUP(A16,Invoer!#REF!,6,0)","v":{"$error":"#REF!"}},{"$f":"VLOOKUP(A16,Invoer!#REF!,5,0)","v":{"$error":"#REF!"}},{"$f":"VLOOKUP(A16,Invoer!#REF!,10,0)","v":{"$error":"#REF!"}},{"$f":"COUNTIF(Invoer!#REF!,A16)","v":{"$error":"#REF!"}},{"$f":"COUNTIFS(Invoer!#REF!,A16,Invoer!#REF!,\"z\")","v":{"$error":"#REF!"}},{"$f":"COUNTIFS(Invoer!#REF!,A16,Invoer!#REF!,\"a\")","v":{"$error":"#REF!"}},null,{"$f":"IF(COUNTIF(A$2:A16,A16)=1,A16,\"\")","v":""}]
[{"$f":"IF(COUNTIF(Invoer!#REF!,Invoer!#REF!)=1,Invoer!#REF!,\"\")","v":{"$error":"#REF!"}},{"$f":"VLOOKUP(A17,Invoer!#REF!,2,0)","v":{"$error":"#REF!"}},{"$f":"VLOOKUP(A17,Invoer!#REF!,3,0)","v":{"$error":"#REF!"}},{"$f":"VLOOKUP(A17,Invoer!#REF!,6,0)","v":{"$error":"#REF!"}},{"$f":"VLOOKUP(A17,Invoer!#REF!,5,0)","v":{"$error":"#REF!"}},{"$f":"VLOOKUP(A17,Invoer!#REF!,10,0)","v":{"$error":"#REF!"}},{"$f":"COUNTIF(Invoer!#REF!,A17)","v":{"$error":"#REF!"}},{"$f":"COUNTIFS(Invoer!#REF!,A17,Invoer!#REF!,\"z\")","v":{"$error":"#REF!"}},{"$f":"COUNTIFS(Invoer!#REF!,A17,Invoer!#REF!,\"a\")","v":{"$error":"#REF!"}},null,{"$f":"IF(COUNTIF(A$2:A17,A17)=1,A17,\"\")","v":""}]
[{"$f":"IF(COUNTIF(Invoer!#REF!,Invoer!#REF!)=1,Invoer!#REF!,\"\")","v":{"$error":"#REF!"}},{"$f":"VLOOKUP(A18,Invoer!#REF!,2,0)","v":{"$error":"#REF!"}},{"$f":"VLOOKUP(A18,Invoer!#REF!,3,0)","v":{"$error":"#REF!"}},{"$f":"VLOOKUP(A18,Invoer!#REF!,6,0)","v":{"$error":"#REF!"}},{"$f":"VLOOKUP(A18,Invoer!#REF!,5,0)","v":{"$error":"#REF!"}},{"$f":"VLOOKUP(A18,Invoer!#REF!,10,0)","v":{"$error":"#REF!"}},{"$f":"COUNTIF(Invoer!#REF!,A18)","v":{"$error":"#REF!"}},{"$f":"COUNTIFS(Invoer!#REF!,A18,Invoer!#REF!,\"z\")","v":{"$error":"#REF!"}},{"$f":"COUNTIFS(Invoer!#REF!,A18,Invoer!#REF!,\"a\")","v":{"$error":"#REF!"}},null,{"$f":"IF(COUNTIF(A$2:A18,A18)=1,A18,\"\")","v":""}]
[{"$f":"IF(COUNTIF(Invoer!#REF!,Invoer!#REF!)=1,Invoer!#REF!,\"\")","v":{"$error":"#REF!"}},{"$f":"VLOOKUP(A19,Invoer!#REF!,2,0)","v":{"$error":"#REF!"}},{"$f":"VLOOKUP(A19,Invoer!#REF!,3,0)","v":{"$error":"#REF!"}},{"$f":"VLOOKUP(A19,Invoer!#REF!,6,0)","v":{"$error":"#REF!"}},{"$f":"VLOOKUP(A19,Invoer!#REF!,5,0)","v":{"$error":"#REF!"}},{"$f":"VLOOKUP(A19,Invoer!#REF!,10,0)","v":{"$error":"#REF!"}},{"$f":"COUNTIF(Invoer!#REF!,A19)","v":{"$error":"#REF!"}},{"$f":"COUNTIFS(Invoer!#REF!,A19,Invoer!#REF!,\"z\")","v":{"$error":"#REF!"}},{"$f":"COUNTIFS(Invoer!#REF!,A19,Invoer!#REF!,\"a\")","v":{"$error":"#REF!"}},null,{"$f":"IF(COUNTIF(A$2:A19,A19)=1,A19,\"\")","v":""}]
[{"$f":"IF(COUNTIF(Invoer!#REF!,Invoer!#REF!)=1,Invoer!#REF!,\"\")","v":{"$error":"#REF!"}},{"$f":"VLOOKUP(A20,Invoer!#REF!,2,0)","v":{"$error":"#REF!"}},{"$f":"VLOOKUP(A20,Invoer!#REF!,3,0)","v":{"$error":"#REF!"}},{"$f":"VLOOKUP(A20,Invoer!#REF!,6,0)","v":{"$error":"#REF!"}},{"$f":"VLOOKUP(A20,Invoer!#REF!,5,0)","v":{"$error":"#REF!"}},{"$f":"VLOOKUP(A20,Invoer!#REF!,10,0)","v":{"$error":"#REF!"}},{"$f":"COUNTIF(Invoer!#REF!,A20)","v":{"$error":"#REF!"}},{"$f":"COUNTIFS(Invoer!#REF!,A20,Invoer!#REF!,\"z\")","v":{"$error":"#REF!"}},{"$f":"COUNTIFS(Invoer!#REF!,A20,Invoer!#REF!,\"a\")","v":{"$error":"#REF!"}},null,{"$f":"IF(COUNTIF(A$2:A20,A20)=1,A20,\"\")","v":""}]
[{"$f":"IF(COUNTIF(Invoer!#REF!,Invoer!#REF!)=1,Invoer!#REF!,\"\")","v":{"$error":"#REF!"}},{"$f":"VLOOKUP(A21,Invoer!#REF!,2,0)","v":{"$error":"#REF!"}},{"$f":"VLOOKUP(A21,Invoer!#REF!,3,0)","v":{"$error":"#REF!"}},{"$f":"VLOOKUP(A21,Invoer!#REF!,6,0)","v":{"$error":"#REF!"}},{"$f":"VLOOKUP(A21,Invoer!#REF!,5,0)","v":{"$error":"#REF!"}},{"$f":"VLOOKUP(A21,Invoer!#REF!,10,0)","v":{"$error":"#REF!"}},{"$f":"COUNTIF(Invoer!#REF!,A21)","v":{"$error":"#REF!"}},{"$f":"COUNTIFS(Invoer!#REF!,A21,Invoer!#REF!,\"z\")","v":{"$error":"#REF!"}},{"$f":"COUNTIFS(Invoer!#REF!,A21,Invoer!#REF!,\"a\")","v":{"$error":"#REF!"}},null,{"$f":"IF(COUNTIF(A$2:A21,A21)=1,A21,\"\")","v":""}]
[{"$f":"IF(COUNTIF(Invoer!#REF!,Invoer!#REF!)=1,Invoer!#REF!,\"\")","v":{"$error":"#REF!"}},{"$f":"VLOOKUP(A22,Invoer!#REF!,2,0)","v":{"$error":"#REF!"}},{"$f":"VLOOKUP(A22,Invoer!#REF!,3,0)","v":{"$error":"#REF!"}},{"$f":"VLOOKUP(A22,Invoer!#REF!,6,0)","v":{"$error":"#REF!"}},{"$f":"VLOOKUP(A22,Invoer!#REF!,5,0)","v":{"$error":"#REF!"}},{"$f":"VLOOKUP(A22,Invoer!#REF!,10,0)","v":{"$error":"#REF!"}},{"$f":"COUNTIF(Invoer!#REF!,A22)","v":{"$error":"#REF!"}},{"$f":"COUNTIFS(Invoer!#REF!,A22,Invoer!#REF!,\"z\")","v":{"$error":"#REF!"}},{"$f":"COUNTIFS(Invoer!#REF!,A22,Invoer!#REF!,\"a\")","v":{"$error":"#REF!"}},null,{"$f":"IF(COUNTIF(A$2:A22,A22)=1,A22,\"\")","v":""}]
[{"$f":"IF(COUNTIF(Invoer!#REF!,Invoer!#REF!)=1,Invoer!#REF!,\"\")","v":{"$error":"#REF!"}},{"$f":"VLOOKUP(A23,Invoer!#REF!,2,0)","v":{"$error":"#REF!"}},{"$f":"VLOOKUP(A23,Invoer!#REF!,3,0)","v":{"$error":"#REF!"}},{"$f":"VLOOKUP(A23,Invoer!#REF!,6,0)","v":{"$error":"#REF!"}},{"$f":"VLOOKUP(A23,Invoer!#REF!,5,0)","v":{"$error":"#REF!"}},{"$f":"VLOOKUP(A23,Invoer!#REF!,10,0)","v":{"$error":"#REF!"}},{"$f":"COUNTIF(Invoer!#REF!,A23)","v":{"$error":"#REF!"}},{"$f":"COUNTIFS(Invoer!#REF!,A23,Invoer!#REF!,\"z\")","v":{"$error":"#REF!"}},{"$f":"COUNTIFS(Invoer!#REF!,A23,Invoer!#REF!,\"a\")","v":{"$error":"#REF!"}},null,{"$f":"IF(COUNTIF(A$2:A23,A23)=1,A23,\"\")","v":""}]
[{"$f":"IF(COUNTIF(Invoer!#REF!,Invoer!#REF!)=1,Invoer!#REF!,\"\")","v":{"$error":"#REF!"}},{"$f":"VLOOKUP(A24,Invoer!#REF!,2,0)","v":{"$error":"#REF!"}},{"$f":"VLOOKUP(A24,Invoer!#REF!,3,0)","v":{"$error":"#REF!"}},{"$f":"VLOOKUP(A24,Invoer!#REF!,6,0)","v":{"$error":"#REF!"}},{"$f":"VLOOKUP(A24,Invoer!#REF!,5,0)","v":{"$error":"#REF!"}},{"$f":"VLOOKUP(A24,Invoer!#REF!,10,0)","v":{"$error":"#REF!"}},{"$f":"COUNTIF(Invoer!#REF!,A24)","v":{"$error":"#REF!"}},{"$f":"COUNTIFS(Invoer!#REF!,A24,Invoer!#REF!,\"z\")","v":{"$error":"#REF!"}},{"$f":"COUNTIFS(Invoer!#REF!,A24,Invoer!#REF!,\"a\")","v":{"$error":"#REF!"}},null,{"$f":"IF(COUNTIF(A$2:A24,A24)=1,A24,\"\")","v":""}]
[{"$f":"IF(COUNTIF(Invoer!#REF!,Invoer!#REF!)=1,Invoer!#REF!,\"\")","v":{"$error":"#REF!"}},{"$f":"VLOOKUP(A25,Invoer!#REF!,2,0)","v":{"$error":"#REF!"}},{"$f":"VLOOKUP(A25,Invoer!#REF!,3,0)","v":{"$error":"#REF!"}},{"$f":"VLOOKUP(A25,Invoer!#REF!,6,0)","v":{"$error":"#REF!"}},{"$f":"VLOOKUP(A25,Invoer!#REF!,5,0)","v":{"$error":"#REF!"}},{"$f":"VLOOKUP(A25,Invoer!#REF!,10,0)","v":{"$error":"#REF!"}},{"$f":"COUNTIF(Invoer!#REF!,A25)","v":{"$error":"#REF!"}},{"$f":"COUNTIFS(Invoer!#REF!,A25,Invoer!#REF!,\"z\")","v":{"$error":"#REF!"}},{"$f":"COUNTIFS(Invoer!#REF!,A25,Invoer!#REF!,\"a\")","v":{"$error":"#REF!"}},null,{"$f":"IF(COUNTIF(A$2:A25,A25)=1,A25,\"\")","v":""}]
[{"$f":"IF(COUNTIF(Invoer!#REF!,Invoer!#REF!)=1,Invoer!#REF!,\"\")","v":{"$error":"#REF!"}},{"$f":"VLOOKUP(A26,Invoer!#REF!,2,0)","v":{"$error":"#REF!"}},{"$f":"VLOOKUP(A26,Invoer!#REF!,3,0)","v":{"$error":"#REF!"}},{"$f":"VLOOKUP(A26,Invoer!#REF!,6,0)","v":{"$error":"#REF!"}},{"$f":"VLOOKUP(A26,Invoer!#REF!,5,0)","v":{"$error":"#REF!"}},{"$f":"VLOOKUP(A26,Invoer!#REF!,10,0)","v":{"$error":"#REF!"}},{"$f":"COUNTIF(Invoer!#REF!,A26)","v":{"$error":"#REF!"}},{"$f":"COUNTIFS(Invoer!#REF!,A26,Invoer!#REF!,\"z\")","v":{"$error":"#REF!"}},{"$f":"COUNTIFS(Invoer!#REF!,A26,Invoer!#REF!,\"a\")","v":{"$error":"#REF!"}},null,{"$f":"IF(COUNTIF(A$2:A26,A26)=1,A26,\"\")","v":""}]
[{"$f":"IF(COUNTIF(Invoer!#REF!,Invoer!#REF!)=1,Invoer!#REF!,\"\")","v":{"$error":"#REF!"}},{"$f":"VLOOKUP(A27,Invoer!#REF!,2,0)","v":{"$error":"#REF!"}},{"$f":"VLOOKUP(A27,Invoer!#REF!,3,0)","v":{"$error":"#REF!"}},{"$f":"VLOOKUP(A27,Invoer!#REF!,6,0)","v":{"$error":"#REF!"}},{"$f":"VLOOKUP(A27,Invoer!#REF!,5,0)","v":{"$error":"#REF!"}},{"$f":"VLOOKUP(A27,Invoer!#REF!,10,0)","v":{"$error":"#REF!"}},{"$f":"COUNTIF(Invoer!#REF!,A27)","v":{"$error":"#REF!"}},{"$f":"COUNTIFS(Invoer!#REF!,A27,Invoer!#REF!,\"z\")","v":{"$error":"#REF!"}},{"$f":"COUNTIFS(Invoer!#REF!,A27,Invoer!#REF!,\"a\")","v":{"$error":"#REF!"}},null,{"$f":"IF(COUNTIF(A$2:A27,A27)=1,A27,\"\")","v":""}]
[{"$f":"IF(COUNTIF(Invoer!#REF!,Invoer!#REF!)=1,Invoer!#REF!,\"\")","v":{"$error":"#REF!"}},{"$f":"VLOOKUP(A28,Invoer!#REF!,2,0)","v":{"$error":"#REF!"}},{"$f":"VLOOKUP(A28,Invoer!#REF!,3,0)","v":{"$error":"#REF!"}},{"$f":"VLOOKUP(A28,Invoer!#REF!,6,0)","v":{"$error":"#REF!"}},{"$f":"VLOOKUP(A28,Invoer!#REF!,5,0)","v":{"$error":"#REF!"}},{"$f":"VLOOKUP(A28,Invoer!#REF!,10,0)","v":{"$error":"#REF!"}},{"$f":"COUNTIF(Invoer!#REF!,A28)","v":{"$error":"#REF!"}},{"$f":"COUNTIFS(Invoer!#REF!,A28,Invoer!#REF!,\"z\")","v":{"$error":"#REF!"}},{"$f":"COUNTIFS(Invoer!#REF!,A28,Invoer!#REF!,\"a\")","v":{"$error":"#REF!"}},null,{"$f":"IF(COUNTIF(A$2:A28,A28)=1,A28,\"\")","v":""}]
[{"$f":"IF(COUNTIF(Invoer!#REF!,Invoer!#REF!)=1,Invoer!#REF!,\"\")","v":{"$error":"#REF!"}},{"$f":"VLOOKUP(A29,Invoer!#REF!,2,0)","v":{"$error":"#REF!"}},{"$f":"VLOOKUP(A29,Invoer!#REF!,3,0)","v":{"$error":"#REF!"}},{"$f":"VLOOKUP(A29,Invoer!#REF!,6,0)","v":{"$error":"#REF!"}},{"$f":"VLOOKUP(A29,Invoer!#REF!,5,0)","v":{"$error":"#REF!"}},{"$f":"VLOOKUP(A29,Invoer!#REF!,10,0)","v":{"$error":"#REF!"}},{"$f":"COUNTIF(Invoer!#REF!,A29)","v":{"$error":"#REF!"}},{"$f":"COUNTIFS(Invoer!#REF!,A29,Invoer!#REF!,\"z\")","v":{"$error":"#REF!"}},{"$f":"COUNTIFS(Invoer!#REF!,A29,Invoer!#REF!,\"a\")","v":{"$error":"#REF!"}},null,{"$f":"IF(COUNTIF(A$2:A29,A29)=1,A29,\"\")","v":""}]
[{"$f":"IF(COUNTIF(Invoer!#REF!,Invoer!#REF!)=1,Invoer!#REF!,\"\")","v":{"$error":"#REF!"}},{"$f":"VLOOKUP(A30,Invoer!#REF!,2,0)","v":{"$error":"#REF!"}},{"$f":"VLOOKUP(A30,Invoer!#REF!,3,0)","v":{"$error":"#REF!"}},{"$f":"VLOOKUP(A30,Invoer!#REF!,6,0)","v":{"$error":"#REF!"}},{"$f":"VLOOKUP(A30,Invoer!#REF!,5,0)","v":{"$error":"#REF!"}},{"$f":"VLOOKUP(A30,Invoer!#REF!,10,0)","v":{"$error":"#REF!"}},{"$f":"COUNTIF(Invoer!#REF!,A30)","v":{"$error":"#REF!"}},{"$f":"COUNTIFS(Invoer!#REF!,A30,Invoer!#REF!,\"z\")","v":{"$error":"#REF!"}},{"$f":"COUNTIFS(Invoer!#REF!,A30,Invoer!#REF!,\"a\")","v":{"$error":"#REF!"}},null,{"$f":"IF(COUNTIF(A$2:A30,A30)=1,A30,\"\")","v":""}]
[{"$f":"IF(COUNTIF(Invoer!#REF!,Invoer!#REF!)=1,Invoer!#REF!,\"\")","v":{"$error":"#REF!"}},{"$f":"VLOOKUP(A31,Invoer!#REF!,2,0)","v":{"$error":"#REF!"}},{"$f":"VLOOKUP(A31,Invoer!#REF!,3,0)","v":{"$error":"#REF!"}},{"$f":"VLOOKUP(A31,Invoer!#REF!,6,0)","v":{"$error":"#REF!"}},{"$f":"VLOOKUP(A31,Invoer!#REF!,5,0)","v":{"$error":"#REF!"}},{"$f":"VLOOKUP(A31,Invoer!#REF!,10,0)","v":{"$error":"#REF!"}},{"$f":"COUNTIF(Invoer!#REF!,A31)","v":{"$error":"#REF!"}},{"$f":"COUNTIFS(Invoer!#REF!,A31,Invoer!#REF!,\"z\")","v":{"$error":"#REF!"}},{"$f":"COUNTIFS(Invoer!#REF!,A31,Invoer!#REF!,\"a\")","v":{"$error":"#REF!"}},null,{"$f":"IF(COUNTIF(A$2:A31,A31)=1,A31,\"\")","v":""}]
[{"$f":"IF(COUNTIF(Invoer!#REF!,Invoer!#REF!)=1,Invoer!#REF!,\"\")","v":{"$error":"#REF!"}},{"$f":"VLOOKUP(A32,Invoer!#REF!,2,0)","v":{"$error":"#REF!"}},{"$f":"VLOOKUP(A32,Invoer!#REF!,3,0)","v":{"$error":"#REF!"}},{"$f":"VLOOKUP(A32,Invoer!#REF!,6,0)","v":{"$error":"#REF!"}},{"$f":"VLOOKUP(A32,Invoer!#REF!,5,0)","v":{"$error":"#REF!"}},{"$f":"VLOOKUP(A32,Invoer!#REF!,10,0)","v":{"$error":"#REF!"}},{"$f":"COUNTIF(Invoer!#REF!,A32)","v":{"$error":"#REF!"}},{"$f":"COUNTIFS(Invoer!#REF!,A32,Invoer!#REF!,\"z\")","v":{"$error":"#REF!"}},{"$f":"COUNTIFS(Invoer!#REF!,A32,Invoer!#REF!,\"a\")","v":{"$error":"#REF!"}},null,{"$f":"IF(COUNTIF(A$2:A32,A32)=1,A32,\"\")","v":""}]
[{"$f":"IF(COUNTIF(Invoer!#REF!,Invoer!#REF!)=1,Invoer!#REF!,\"\")","v":{"$error":"#REF!"}},{"$f":"VLOOKUP(A33,Invoer!#REF!,2,0)","v":{"$error":"#REF!"}},{"$f":"VLOOKUP(A33,Invoer!#REF!,3,0)","v":{"$error":"#REF!"}},{"$f":"VLOOKUP(A33,Invoer!#REF!,6,0)","v":{"$error":"#REF!"}},{"$f":"VLOOKUP(A33,Invoer!#REF!,5,0)","v":{"$error":"#REF!"}},{"$f":"VLOOKUP(A33,Invoer!#REF!,10,0)","v":{"$error":"#REF!"}},{"$f":"COUNTIF(Invoer!#REF!,A33)","v":{"$error":"#REF!"}},{"$f":"COUNTIFS(Invoer!#REF!,A33,Invoer!#REF!,\"z\")","v":{"$error":"#REF!"}},{"$f":"COUNTIFS(Invoer!#REF!,A33,Invoer!#REF!,\"a\")","v":{"$error":"#REF!"}},null,{"$f":"IF(COUNTIF(A$2:A33,A33)=1,A33,\"\")","v":""}]
[{"$f":"IF(COUNTIF(Invoer!#REF!,Invoer!#REF!)=1,Invoer!#REF!,\"\")","v":{"$error":"#REF!"}},{"$f":"VLOOKUP(A34,Invoer!#REF!,2,0)","v":{"$error":"#REF!"}},{"$f":"VLOOKUP(A34,Invoer!#REF!,3,0)","v":{"$error":"#REF!"}},{"$f":"VLOOKUP(A34,Invoer!#REF!,6,0)","v":{"$error":"#REF!"}},{"$f":"VLOOKUP(A34,Invoer!#REF!,5,0)","v":{"$error":"#REF!"}},{"$f":"VLOOKUP(A34,Invoer!#REF!,10,0)","v":{"$error":"#REF!"}},{"$f":"COUNTIF(Invoer!#REF!,A34)","v":{"$error":"#REF!"}},{"$f":"COUNTIFS(Invoer!#REF!,A34,Invoer!#REF!,\"z\")","v":{"$error":"#REF!"}},{"$f":"COUNTIFS(Invoer!#REF!,A34,Invoer!#REF!,\"a\")","v":{"$error":"#REF!"}},null,{"$f":"IF(COUNTIF(A$2:A34,A34)=1,A34,\"\")","v":""}]
[{"$f":"IF(COUNTIF(Invoer!#REF!,Invoer!#REF!)=1,Invoer!#REF!,\"\")","v":{"$error":"#REF!"}},{"$f":"VLOOKUP(A35,Invoer!#REF!,2,0)","v":{"$error":"#REF!"}},{"$f":"VLOOKUP(A35,Invoer!#REF!,3,0)","v":{"$error":"#REF!"}},{"$f":"VLOOKUP(A35,Invoer!#REF!,6,0)","v":{"$error":"#REF!"}},{"$f":"VLOOKUP(A35,Invoer!#REF!,5,0)","v":{"$error":"#REF!"}},{"$f":"VLOOKUP(A35,Invoer!#REF!,10,0)","v":{"$error":"#REF!"}},{"$f":"COUNTIF(Invoer!#REF!,A35)","v":{"$error":"#REF!"}},{"$f":"COUNTIFS(Invoer!#REF!,A35,Invoer!#REF!,\"z\")","v":{"$error":"#REF!"}},{"$f":"COUNTIFS(Invoer!#REF!,A35,Invoer!#REF!,\"a\")","v":{"$error":"#REF!"}},null,{"$f":"IF(COUNTIF(A$2:A35,A35)=1,A35,\"\")","v":""}]
[{"$f":"IF(COUNTIF(Invoer!#REF!,Invoer!#REF!)=1,Invoer!#REF!,\"\")","v":{"$error":"#REF!"}},{"$f":"VLOOKUP(A36,Invoer!#REF!,2,0)","v":{"$error":"#REF!"}},{"$f":"VLOOKUP(A36,Invoer!#REF!,3,0)","v":{"$error":"#REF!"}},{"$f":"VLOOKUP(A36,Invoer!#REF!,6,0)","v":{"$error":"#REF!"}},{"$f":"VLOOKUP(A36,Invoer!#REF!,5,0)","v":{"$error":"#REF!"}},{"$f":"VLOOKUP(A36,Invoer!#REF!,10,0)","v":{"$error":"#REF!"}},{"$f":"COUNTIF(Invoer!#REF!,A36)","v":{"$error":"#REF!"}},{"$f":"COUNTIFS(Invoer!#REF!,A36,Invoer!#REF!,\"z\")","v":{"$error":"#REF!"}},{"$f":"COUNTIFS(Invoer!#REF!,A36,Invoer!#REF!,\"a\")","v":{"$error":"#REF!"}},null,{"$f":"IF(COUNTIF(A$2:A36,A36)=1,A36,\"\")","v":""}]
[{"$f":"IF(COUNTIF(Invoer!#REF!,Invoer!#REF!)=1,Invoer!#REF!,\"\")","v":{"$error":"#REF!"}},{"$f":"VLOOKUP(A37,Invoer!#REF!,2,0)","v":{"$error":"#REF!"}},{"$f":"VLOOKUP(A37,Invoer!#REF!,3,0)","v":{"$error":"#REF!"}},{"$f":"VLOOKUP(A37,Invoer!#REF!,6,0)","v":{"$error":"#REF!"}},{"$f":"VLOOKUP(A37,Invoer!#REF!,5,0)","v":{"$error":"#REF!"}},{"$f":"VLOOKUP(A37,Invoer!#REF!,10,0)","v":{"$error":"#REF!"}},{"$f":"COUNTIF(Invoer!#REF!,A37)","v":{"$error":"#REF!"}},{"$f":"COUNTIFS(Invoer!#REF!,A37,Invoer!#REF!,\"z\")","v":{"$error":"#REF!"}},{"$f":"COUNTIFS(Invoer!#REF!,A37,Invoer!#REF!,\"a\")","v":{"$error":"#REF!"}},null,{"$f":"IF(COUNTIF(A$2:A37,A37)=1,A37,\"\")","v":""}]
[{"$f":"IF(COUNTIF(Invoer!#REF!,Invoer!#REF!)=1,Invoer!#REF!,\"\")","v":{"$error":"#REF!"}},{"$f":"VLOOKUP(A38,Invoer!#REF!,2,0)","v":{"$error":"#REF!"}},{"$f":"VLOOKUP(A38,Invoer!#REF!,3,0)","v":{"$error":"#REF!"}},{"$f":"VLOOKUP(A38,Invoer!#REF!,6,0)","v":{"$error":"#REF!"}},{"$f":"VLOOKUP(A38,Invoer!#REF!,5,0)","v":{"$error":"#REF!"}},{"$f":"VLOOKUP(A38,Invoer!#REF!,10,0)","v":{"$error":"#REF!"}},{"$f":"COUNTIF(Invoer!#REF!,A38)","v":{"$error":"#REF!"}},{"$f":"COUNTIFS(Invoer!#REF!,A38,Invoer!#REF!,\"z\")","v":{"$error":"#REF!"}},{"$f":"COUNTIFS(Invoer!#REF!,A38,Invoer!#REF!,\"a\")","v":{"$error":"#REF!"}},null,{"$f":"IF(COUNTIF(A$2:A38,A38)=1,A38,\"\")","v":""}]
[{"$f":"IF(COUNTIF(Invoer!#REF!,Invoer!#REF!)=1,Invoer!#REF!,\"\")","v":{"$error":"#REF!"}},{"$f":"VLOOKUP(A39,Invoer!#REF!,2,0)","v":{"$error":"#REF!"}},{"$f":"VLOOKUP(A39,Invoer!#REF!,3,0)","v":{"$error":"#REF!"}},{"$f":"VLOOKUP(A39,Invoer!#REF!,6,0)","v":{"$error":"#REF!"}},{"$f":"VLOOKUP(A39,Invoer!#REF!,5,0)","v":{"$error":"#REF!"}},{"$f":"VLOOKUP(A39,Invoer!#REF!,10,0)","v":{"$error":"#REF!"}},{"$f":"COUNTIF(Invoer!#REF!,A39)","v":{"$error":"#REF!"}},{"$f":"COUNTIFS(Invoer!#REF!,A39,Invoer!#REF!,\"z\")","v":{"$error":"#REF!"}},{"$f":"COUNTIFS(Invoer!#REF!,A39,Invoer!#REF!,\"a\")","v":{"$error":"#REF!"}},null,{"$f":"IF(COUNTIF(A$2:A39,A39)=1,A39,\"\")","v":""}]
[{"$f":"IF(COUNTIF(Invoer!#REF!,Invoer!#REF!)=1,Invoer!#REF!,\"\")","v":{"$error":"#REF!"}},{"$f":"VLOOKUP(A40,Invoer!#REF!,2,0)","v":{"$error":"#REF!"}},{"$f":"VLOOKUP(A40,Invoer!#REF!,3,0)","v":{"$error":"#REF!"}},{"$f":"VLOOKUP(A40,Invoer!#REF!,6,0)","v":{"$error":"#REF!"}},{"$f":"VLOOKUP(A40,Invoer!#REF!,5,0)","v":{"$error":"#REF!"}},{"$f":"VLOOKUP(A40,Invoer!#REF!,10,0)","v":{"$error":"#REF!"}},{"$f":"COUNTIF(Invoer!#REF!,A40)","v":{"$error":"#REF!"}},{"$f":"COUNTIFS(Invoer!#REF!,A40,Invoer!#REF!,\"z\")","v":{"$error":"#REF!"}},{"$f":"COUNTIFS(Invoer!#REF!,A40,Invoer!#REF!,\"a\")","v":{"$error":"#REF!"}},null,{"$f":"IF(COUNTIF(A$2:A40,A40)=1,A40,\"\")","v":""}]
[{"$f":"IF(COUNTIF(Invoer!#REF!,Invoer!#REF!)=1,Invoer!#REF!,\"\")","v":{"$error":"#REF!"}},{"$f":"VLOOKUP(A41,Invoer!#REF!,2,0)","v":{"$error":"#REF!"}},{"$f":"VLOOKUP(A41,Invoer!#REF!,3,0)","v":{"$error":"#REF!"}},{"$f":"VLOOKUP(A41,Invoer!#REF!,6,0)","v":{"$error":"#REF!"}},{"$f":"VLOOKUP(A41,Invoer!#REF!,5,0)","v":{"$error":"#REF!"}},{"$f":"VLOOKUP(A41,Invoer!#REF!,10,0)","v":{"$error":"#REF!"}},{"$f":"COUNTIF(Invoer!#REF!,A41)","v":{"$error":"#REF!"}},{"$f":"COUNTIFS(Invoer!#REF!,A41,Invoer!#REF!,\"z\")","v":{"$error":"#REF!"}},{"$f":"COUNTIFS(Invoer!#REF!,A41,Invoer!#REF!,\"a\")","v":{"$error":"#REF!"}},null,{"$f":"IF(COUNTIF(A$2:A41,A41)=1,A41,\"\")","v":""}]
[{"$f":"IF(COUNTIF(Invoer!#REF!,Invoer!#REF!)=1,Invoer!#REF!,\"\")","v":{"$error":"#REF!"}},{"$f":"VLOOKUP(A42,Invoer!#REF!,2,0)","v":{"$error":"#REF!"}},{"$f":"VLOOKUP(A42,Invoer!#REF!,3,0)","v":{"$error":"#REF!"}},{"$f":"VLOOKUP(A42,Invoer!#REF!,6,0)","v":{"$error":"#REF!"}},{"$f":"VLOOKUP(A42,Invoer!#REF!,5,0)","v":{"$error":"#REF!"}},{"$f":"VLOOKUP(A42,Invoer!#REF!,10,0)","v":{"$error":"#REF!"}},{"$f":"COUNTIF(Invoer!#REF!,A42)","v":{"$error":"#REF!"}},{"$f":"COUNTIFS(Invoer!#REF!,A42,Invoer!#REF!,\"z\")","v":{"$error":"#REF!"}},{"$f":"COUNTIFS(Invoer!#REF!,A42,Invoer!#REF!,\"a\")","v":{"$error":"#REF!"}},null,{"$f":"IF(COUNTIF(A$2:A42,A42)=1,A42,\"\")","v":""}]
[{"$f":"IF(COUNTIF(Invoer!#REF!,Invoer!#REF!)=1,Invoer!#REF!,\"\")","v":{"$error":"#REF!"}},{"$f":"VLOOKUP(A43,Invoer!#REF!,2,0)","v":{"$error":"#REF!"}},{"$f":"VLOOKUP(A43,Invoer!#REF!,3,0)","v":{"$error":"#REF!"}},{"$f":"VLOOKUP(A43,Invoer!#REF!,6,0)","v":{"$error":"#REF!"}},{"$f":"VLOOKUP(A43,Invoer!#REF!,5,0)","v":{"$error":"#REF!"}},{"$f":"VLOOKUP(A43,Invoer!#REF!,10,0)","v":{"$error":"#REF!"}},{"$f":"COUNTIF(Invoer!#REF!,A43)","v":{"$error":"#REF!"}},{"$f":"COUNTIFS(Invoer!#REF!,A43,Invoer!#REF!,\"z\")","v":{"$error":"#REF!"}},{"$f":"COUNTIFS(Invoer!#REF!,A43,Invoer!#REF!,\"a\")","v":{"$error":"#REF!"}},null,{"$f":"IF(COUNTIF(A$2:A43,A43)=1,A43,\"\")","v":""}]
[{"$f":"IF(COUNTIF(Invoer!#REF!,Invoer!#REF!)=1,Invoer!#REF!,\"\")","v":{"$error":"#REF!"}},{"$f":"VLOOKUP(A44,Invoer!#REF!,2,0)","v":{"$error":"#REF!"}},{"$f":"VLOOKUP(A44,Invoer!#REF!,3,0)","v":{"$error":"#REF!"}},{"$f":"VLOOKUP(A44,Invoer!#REF!,6,0)","v":{"$error":"#REF!"}},{"$f":"VLOOKUP(A44,Invoer!#REF!,5,0)","v":{"$error":"#REF!"}},{"$f":"VLOOKUP(A44,Invoer!#REF!,10,0)","v":{"$error":"#REF!"}},{"$f":"COUNTIF(Invoer!#REF!,A44)","v":{"$error":"#REF!"}},{"$f":"COUNTIFS(Invoer!#REF!,A44,Invoer!#REF!,\"z\")","v":{"$error":"#REF!"}},{"$f":"COUNTIFS(Invoer!#REF!,A44,Invoer!#REF!,\"a\")","v":{"$error":"#REF!"}},null,{"$f":"IF(COUNTIF(A$2:A44,A44)=1,A44,\"\")","v":""}]
[{"$f":"IF(COUNTIF(Invoer!#REF!,Invoer!#REF!)=1,Invoer!#REF!,\"\")","v":{"$error":"#REF!"}},{"$f":"VLOOKUP(A45,Invoer!#REF!,2,0)","v":{"$error":"#REF!"}},{"$f":"VLOOKUP(A45,Invoer!#REF!,3,0)","v":{"$error":"#REF!"}},{"$f":"VLOOKUP(A45,Invoer!#REF!,6,0)","v":{"$error":"#REF!"}},{"$f":"VLOOKUP(A45,Invoer!#REF!,5,0)","v":{"$error":"#REF!"}},{"$f":"VLOOKUP(A45,Invoer!#REF!,10,0)","v":{"$error":"#REF!"}},{"$f":"COUNTIF(Invoer!#REF!,A45)","v":{"$error":"#REF!"}},{"$f":"COUNTIFS(Invoer!#REF!,A45,Invoer!#REF!,\"z\")","v":{"$error":"#REF!"}},{"$f":"COUNTIFS(Invoer!#REF!,A45,Invoer!#REF!,\"a\")","v":{"$error":"#REF!"}},null,{"$f":"IF(COUNTIF(A$2:A45,A45)=1,A45,\"\")","v":""}]
[{"$f":"IF(COUNTIF(Invoer!#REF!,Invoer!#REF!)=1,Invoer!#REF!,\"\")","v":{"$error":"#REF!"}},{"$f":"VLOOKUP(A46,Invoer!#REF!,2,0)","v":{"$error":"#REF!"}},{"$f":"VLOOKUP(A46,Invoer!#REF!,3,0)","v":{"$error":"#REF!"}},{"$f":"VLOOKUP(A46,Invoer!#REF!,6,0)","v":{"$error":"#REF!"}},{"$f":"VLOOKUP(A46,Invoer!#REF!,5,0)","v":{"$error":"#REF!"}},{"$f":"VLOOKUP(A46,Invoer!#REF!,10,0)","v":{"$error":"#REF!"}},{"$f":"COUNTIF(Invoer!#REF!,A46)","v":{"$error":"#REF!"}},{"$f":"COUNTIFS(Invoer!#REF!,A46,Invoer!#REF!,\"z\")","v":{"$error":"#REF!"}},{"$f":"COUNTIFS(Invoer!#REF!,A46,Invoer!#REF!,\"a\")","v":{"$error":"#REF!"}},null,{"$f":"IF(COUNTIF(A$2:A46,A46)=1,A46,\"\")","v":""}]
[{"$f":"IF(COUNTIF(Invoer!#REF!,Invoer!#REF!)=1,Invoer!#REF!,\"\")","v":{"$error":"#REF!"}},{"$f":"VLOOKUP(A47,Invoer!#REF!,2,0)","v":{"$error":"#REF!"}},{"$f":"VLOOKUP(A47,Invoer!#REF!,3,0)","v":{"$error":"#REF!"}},{"$f":"VLOOKUP(A47,Invoer!#REF!,6,0)","v":{"$error":"#REF!"}},{"$f":"VLOOKUP(A47,Invoer!#REF!,5,0)","v":{"$error":"#REF!"}},{"$f":"VLOOKUP(A47,Invoer!#REF!,10,0)","v":{"$error":"#REF!"}},{"$f":"COUNTIF(Invoer!#REF!,A47)","v":{"$error":"#REF!"}},{"$f":"COUNTIFS(Invoer!#REF!,A47,Invoer!#REF!,\"z\")","v":{"$error":"#REF!"}},{"$f":"COUNTIFS(Invoer!#REF!,A47,Invoer!#REF!,\"a\")","v":{"$error":"#REF!"}},null,{"$f":"IF(COUNTIF(A$2:A47,A47)=1,A47,\"\")","v":""}]
[{"$f":"IF(COUNTIF(Invoer!#REF!,Invoer!#REF!)=1,Invoer!#REF!,\"\")","v":{"$error":"#REF!"}},{"$f":"VLOOKUP(A48,Invoer!#REF!,2,0)","v":{"$error":"#REF!"}},{"$f":"VLOOKUP(A48,Invoer!#REF!,3,0)","v":{"$error":"#REF!"}},{"$f":"VLOOKUP(A48,Invoer!#REF!,6,0)","v":{"$error":"#REF!"}},{"$f":"VLOOKUP(A48,Invoer!#REF!,5,0)","v":{"$error":"#REF!"}},{"$f":"VLOOKUP(A48,Invoer!#REF!,10,0)","v":{"$error":"#REF!"}},{"$f":"COUNTIF(Invoer!#REF!,A48)","v":{"$error":"#REF!"}},{"$f":"COUNTIFS(Invoer!#REF!,A48,Invoer!#REF!,\"z\")","v":{"$error":"#REF!"}},{"$f":"COUNTIFS(Invoer!#REF!,A48,Invoer!#REF!,\"a\")","v":{"$error":"#REF!"}},null,{"$f":"IF(COUNTIF(A$2:A48,A48)=1,A48,\"\")","v":""}]
[{"$f":"IF(COUNTIF(Invoer!#REF!,Invoer!#REF!)=1,Invoer!#REF!,\"\")","v":{"$error":"#REF!"}},{"$f":"VLOOKUP(A49,Invoer!#REF!,2,0)","v":{"$error":"#REF!"}},{"$f":"VLOOKUP(A49,Invoer!#REF!,3,0)","v":{"$error":"#REF!"}},{"$f":"VLOOKUP(A49,Invoer!#REF!,6,0)","v":{"$error":"#REF!"}},{"$f":"VLOOKUP(A49,Invoer!#REF!,5,0)","v":{"$error":"#REF!"}},{"$f":"VLOOKUP(A49,Invoer!#REF!,10,0)","v":{"$error":"#REF!"}},{"$f":"COUNTIF(Invoer!#REF!,A49)","v":{"$error":"#REF!"}},{"$f":"COUNTIFS(Invoer!#REF!,A49,Invoer!#REF!,\"z\")","v":{"$error":"#REF!"}},{"$f":"COUNTIFS(Invoer!#REF!,A49,Invoer!#REF!,\"a\")","v":{"$error":"#REF!"}},null,{"$f":"IF(COUNTIF(A$2:A49,A49)=1,A49,\"\")","v":""}]
[{"$f":"IF(COUNTIF(Invoer!#REF!,Invoer!#REF!)=1,Invoer!#REF!,\"\")","v":{"$error":"#REF!"}},{"$f":"VLOOKUP(A50,Invoer!#REF!,2,0)","v":{"$error":"#REF!"}},{"$f":"VLOOKUP(A50,Invoer!#REF!,3,0)","v":{"$error":"#REF!"}},{"$f":"VLOOKUP(A50,Invoer!#REF!,6,0)","v":{"$error":"#REF!"}},{"$f":"VLOOKUP(A50,Invoer!#REF!,5,0)","v":{"$error":"#REF!"}},{"$f":"VLOOKUP(A50,Invoer!#REF!,10,0)","v":{"$error":"#REF!"}},{"$f":"COUNTIF(Invoer!#REF!,A50)","v":{"$error":"#REF!"}},{"$f":"COUNTIFS(Invoer!#REF!,A50,Invoer!#REF!,\"z\")","v":{"$error":"#REF!"}},{"$f":"COUNTIFS(Invoer!#REF!,A50,Invoer!#REF!,\"a\")","v":{"$error":"#REF!"}},null,{"$f":"IF(COUNTIF(A$2:A50,A50)=1,A50,\"\")","v":""}]
[{"$f":"IF(COUNTIF(Invoer!#REF!,Invoer!#REF!)=1,Invoer!#REF!,\"\")","v":{"$error":"#REF!"}},{"$f":"VLOOKUP(A51,Invoer!#REF!,2,0)","v":{"$error":"#REF!"}},{"$f":"VLOOKUP(A51,Invoer!#REF!,3,0)","v":{"$error":"#REF!"}},{"$f":"VLOOKUP(A51,Invoer!#REF!,6,0)","v":{"$error":"#REF!"}},{"$f":"VLOOKUP(A51,Invoer!#REF!,5,0)","v":{"$error":"#REF!"}},{"$f":"VLOOKUP(A51,Invoer!#REF!,10,0)","v":{"$error":"#REF!"}},{"$f":"COUNTIF(Invoer!#REF!,A51)","v":{"$error":"#REF!"}},{"$f":"COUNTIFS(Invoer!#REF!,A51,Invoer!#REF!,\"z\")","v":{"$error":"#REF!"}},{"$f":"COUNTIFS(Invoer!#REF!,A51,Invoer!#REF!,\"a\")","v":{"$error":"#REF!"}},null,{"$f":"IF(COUNTIF(A$2:A51,A51)=1,A51,\"\")","v":""}]
[{"$f":"IF(COUNTIF(Invoer!#REF!,Invoer!#REF!)=1,Invoer!#REF!,\"\")","v":{"$error":"#REF!"}},{"$f":"VLOOKUP(A52,Invoer!#REF!,2,0)","v":{"$error":"#REF!"}},{"$f":"VLOOKUP(A52,Invoer!#REF!,3,0)","v":{"$error":"#REF!"}},{"$f":"VLOOKUP(A52,Invoer!#REF!,6,0)","v":{"$error":"#REF!"}},{"$f":"VLOOKUP(A52,Invoer!#REF!,5,0)","v":{"$error":"#REF!"}},{"$f":"VLOOKUP(A52,Invoer!#REF!,10,0)","v":{"$error":"#REF!"}},{"$f":"COUNTIF(Invoer!#REF!,A52)","v":{"$error":"#REF!"}},{"$f":"COUNTIFS(Invoer!#REF!,A52,Invoer!#REF!,\"z\")","v":{"$error":"#REF!"}},{"$f":"COUNTIFS(Invoer!#REF!,A52,Invoer!#REF!,\"a\")","v":{"$error":"#REF!"}},null,{"$f":"IF(COUNTIF(A$2:A52,A52)=1,A52,\"\")","v":""}]
[{"$f":"IF(COUNTIF(Invoer!#REF!,Invoer!#REF!)=1,Invoer!#REF!,\"\")","v":{"$error":"#REF!"}},{"$f":"VLOOKUP(A53,Invoer!#REF!,2,0)","v":{"$error":"#REF!"}},{"$f":"VLOOKUP(A53,Invoer!#REF!,3,0)","v":{"$error":"#REF!"}},{"$f":"VLOOKUP(A53,Invoer!#REF!,6,0)","v":{"$error":"#REF!"}},{"$f":"VLOOKUP(A53,Invoer!#REF!,5,0)","v":{"$error":"#REF!"}},{"$f":"VLOOKUP(A53,Invoer!#REF!,10,0)","v":{"$error":"#REF!"}},{"$f":"COUNTIF(Invoer!#REF!,A53)","v":{"$error":"#REF!"}},{"$f":"COUNTIFS(Invoer!#REF!,A53,Invoer!#REF!,\"z\")","v":{"$error":"#REF!"}},{"$f":"COUNTIFS(Invoer!#REF!,A53,Invoer!#REF!,\"a\")","v":{"$error":"#REF!"}},null,{"$f":"IF(COUNTIF(A$2:A53,A53)=1,A53,\"\")","v":""}]
[{"$f":"IF(COUNTIF(Invoer!#REF!,Invoer!#REF!)=1,Invoer!#REF!,\"\")","v":{"$error":"#REF!"}},{"$f":"VLOOKUP(A54,Invoer!#REF!,2,0)","v":{"$error":"#REF!"}},{"$f":"VLOOKUP(A54,Invoer!#REF!,3,0)","v":{"$error":"#REF!"}},{"$f":"VLOOKUP(A54,Invoer!#REF!,6,0)","v":{"$error":"#REF!"}},{"$f":"VLOOKUP(A54,Invoer!#REF!,5,0)","v":{"$error":"#REF!"}},{"$f":"VLOOKUP(A54,Invoer!#REF!,10,0)","v":{"$error":"#REF!"}},{"$f":"COUNTIF(Invoer!#REF!,A54)","v":{"$error":"#REF!"}},{"$f":"COUNTIFS(Invoer!#REF!,A54,Invoer!#REF!,\"z\")","v":{"$error":"#REF!"}},{"$f":"COUNTIFS(Invoer!#REF!,A54,Invoer!#REF!,\"a\")","v":{"$error":"#REF!"}},null,{"$f":"IF(COUNTIF(A$2:A54,A54)=1,A54,\"\")","v":""}]
[{"$f":"IF(COUNTIF(Invoer!#REF!,Invoer!#REF!)=1,Invoer!#REF!,\"\")","v":{"$error":"#REF!"}},{"$f":"VLOOKUP(A55,Invoer!#REF!,2,0)","v":{"$error":"#REF!"}},{"$f":"VLOOKUP(A55,Invoer!#REF!,3,0)","v":{"$error":"#REF!"}},{"$f":"VLOOKUP(A55,Invoer!#REF!,6,0)","v":{"$error":"#REF!"}},{"$f":"VLOOKUP(A55,Invoer!#REF!,5,0)","v":{"$error":"#REF!"}},{"$f":"VLOOKUP(A55,Invoer!#REF!,10,0)","v":{"$error":"#REF!"}},{"$f":"COUNTIF(Invoer!#REF!,A55)","v":{"$error":"#REF!"}},{"$f":"COUNTIFS(Invoer!#REF!,A55,Invoer!#REF!,\"z\")","v":{"$error":"#REF!"}},{"$f":"COUNTIFS(Invoer!#REF!,A55,Invoer!#REF!,\"a\")","v":{"$error":"#REF!"}},null,{"$f":"IF(COUNTIF(A$2:A55,A55)=1,A55,\"\")","v":""}]
[{"$f":"IF(COUNTIF(Invoer!#REF!,Invoer!#REF!)=1,Invoer!#REF!,\"\")","v":{"$error":"#REF!"}},{"$f":"VLOOKUP(A56,Invoer!#REF!,2,0)","v":{"$error":"#REF!"}},{"$f":"VLOOKUP(A56,Invoer!#REF!,3,0)","v":{"$error":"#REF!"}},{"$f":"VLOOKUP(A56,Invoer!#REF!,6,0)","v":{"$error":"#REF!"}},{"$f":"VLOOKUP(A56,Invoer!#REF!,5,0)","v":{"$error":"#REF!"}},{"$f":"VLOOKUP(A56,Invoer!#REF!,10,0)","v":{"$error":"#REF!"}},{"$f":"COUNTIF(Invoer!#REF!,A56)","v":{"$error":"#REF!"}},{"$f":"COUNTIFS(Invoer!#REF!,A56,Invoer!#REF!,\"z\")","v":{"$error":"#REF!"}},{"$f":"COUNTIFS(Invoer!#REF!,A56,Invoer!#REF!,\"a\")","v":{"$error":"#REF!"}},null,{"$f":"IF(COUNTIF(A$2:A56,A56)=1,A56,\"\")","v":""}]
[{"$f":"IF(COUNTIF(Invoer!#REF!,Invoer!#REF!)=1,Invoer!#REF!,\"\")","v":{"$error":"#REF!"}},{"$f":"VLOOKUP(A57,Invoer!#REF!,2,0)","v":{"$error":"#REF!"}},{"$f":"VLOOKUP(A57,Invoer!#REF!,3,0)","v":{"$error":"#REF!"}},{"$f":"VLOOKUP(A57,Invoer!#REF!,6,0)","v":{"$error":"#REF!"}},{"$f":"VLOOKUP(A57,Invoer!#REF!,5,0)","v":{"$error":"#REF!"}},{"$f":"VLOOKUP(A57,Invoer!#REF!,10,0)","v":{"$error":"#REF!"}},{"$f":"COUNTIF(Invoer!#REF!,A57)","v":{"$error":"#REF!"}},{"$f":"COUNTIFS(Invoer!#REF!,A57,Invoer!#REF!,\"z\")","v":{"$error":"#REF!"}},{"$f":"COUNTIFS(Invoer!#REF!,A57,Invoer!#REF!,\"a\")","v":{"$error":"#REF!"}},null,{"$f":"IF(COUNTIF(A$2:A57,A57)=1,A57,\"\")","v":""}]
[{"$f":"IF(COUNTIF(Invoer!#REF!,Invoer!#REF!)=1,Invoer!#REF!,\"\")","v":{"$error":"#REF!"}},{"$f":"VLOOKUP(A58,Invoer!#REF!,2,0)","v":{"$error":"#REF!"}},{"$f":"VLOOKUP(A58,Invoer!#REF!,3,0)","v":{"$error":"#REF!"}},{"$f":"VLOOKUP(A58,Invoer!#REF!,6,0)","v":{"$error":"#REF!"}},{"$f":"VLOOKUP(A58,Invoer!#REF!,5,0)","v":{"$error":"#REF!"}},{"$f":"VLOOKUP(A58,Invoer!#REF!,10,0)","v":{"$error":"#REF!"}},{"$f":"COUNTIF(Invoer!#REF!,A58)","v":{"$error":"#REF!"}},{"$f":"COUNTIFS(Invoer!#REF!,A58,Invoer!#REF!,\"z\")","v":{"$error":"#REF!"}},{"$f":"COUNTIFS(Invoer!#REF!,A58,Invoer!#REF!,\"a\")","v":{"$error":"#REF!"}},null,{"$f":"IF(COUNTIF(A$2:A58,A58)=1,A58,\"\")","v":""}]
[{"$f":"IF(COUNTIF(Invoer!#REF!,Invoer!#REF!)=1,Invoer!#REF!,\"\")","v":{"$error":"#REF!"}},{"$f":"VLOOKUP(A59,Invoer!#REF!,2,0)","v":{"$error":"#REF!"}},{"$f":"VLOOKUP(A59,Invoer!#REF!,3,0)","v":{"$error":"#REF!"}},{"$f":"VLOOKUP(A59,Invoer!#REF!,6,0)","v":{"$error":"#REF!"}},{"$f":"VLOOKUP(A59,Invoer!#REF!,5,0)","v":{"$error":"#REF!"}},{"$f":"VLOOKUP(A59,Invoer!#REF!,10,0)","v":{"$error":"#REF!"}},{"$f":"COUNTIF(Invoer!#REF!,A59)","v":{"$error":"#REF!"}},{"$f":"COUNTIFS(Invoer!#REF!,A59,Invoer!#REF!,\"z\")","v":{"$error":"#REF!"}},{"$f":"COUNTIFS(Invoer!#REF!,A59,Invoer!#REF!,\"a\")","v":{"$error":"#REF!"}},null,{"$f":"IF(COUNTIF(A$2:A59,A59)=1,A59,\"\")","v":""}]
[{"$f":"IF(COUNTIF(Invoer!#REF!,Invoer!#REF!)=1,Invoer!#REF!,\"\")","v":{"$error":"#REF!"}},{"$f":"VLOOKUP(A60,Invoer!#REF!,2,0)","v":{"$error":"#REF!"}},{"$f":"VLOOKUP(A60,Invoer!#REF!,3,0)","v":{"$error":"#REF!"}},{"$f":"VLOOKUP(A60,Invoer!#REF!,6,0)","v":{"$error":"#REF!"}},{"$f":"VLOOKUP(A60,Invoer!#REF!,5,0)","v":{"$error":"#REF!"}},{"$f":"VLOOKUP(A60,Invoer!#REF!,10,0)","v":{"$error":"#REF!"}},{"$f":"COUNTIF(Invoer!#REF!,A60)","v":{"$error":"#REF!"}},{"$f":"COUNTIFS(Invoer!#REF!,A60,Invoer!#REF!,\"z\")","v":{"$error":"#REF!"}},{"$f":"COUNTIFS(Invoer!#REF!,A60,Invoer!#REF!,\"a\")","v":{"$error":"#REF!"}},null,{"$f":"IF(COUNTIF(A$2:A60,A60)=1,A60,\"\")","v":""}]
[{"$f":"IF(COUNTIF(Invoer!#REF!,Invoer!#REF!)=1,Invoer!#REF!,\"\")","v":{"$error":"#REF!"}},{"$f":"VLOOKUP(A61,Invoer!#REF!,2,0)","v":{"$error":"#REF!"}},{"$f":"VLOOKUP(A61,Invoer!#REF!,3,0)","v":{"$error":"#REF!"}},{"$f":"VLOOKUP(A61,Invoer!#REF!,6,0)","v":{"$error":"#REF!"}},{"$f":"VLOOKUP(A61,Invoer!#REF!,5,0)","v":{"$error":"#REF!"}},{"$f":"VLOOKUP(A61,Invoer!#REF!,10,0)","v":{"$error":"#REF!"}},{"$f":"COUNTIF(Invoer!#REF!,A61)","v":{"$error":"#REF!"}},{"$f":"COUNTIFS(Invoer!#REF!,A61,Invoer!#REF!,\"z\")","v":{"$error":"#REF!"}},{"$f":"COUNTIFS(Invoer!#REF!,A61,Invoer!#REF!,\"a\")","v":{"$error":"#REF!"}},null,{"$f":"IF(COUNTIF(A$2:A61,A61)=1,A61,\"\")","v":""}]
[{"$f":"IF(COUNTIF(Invoer!#REF!,Invoer!#REF!)=1,Invoer!#REF!,\"\")","v":{"$error":"#REF!"}},{"$f":"VLOOKUP(A62,Invoer!#REF!,2,0)","v":{"$error":"#REF!"}},{"$f":"VLOOKUP(A62,Invoer!#REF!,3,0)","v":{"$error":"#REF!"}},{"$f":"VLOOKUP(A62,Invoer!#REF!,6,0)","v":{"$error":"#REF!"}},{"$f":"VLOOKUP(A62,Invoer!#REF!,5,0)","v":{"$error":"#REF!"}},{"$f":"VLOOKUP(A62,Invoer!#REF!,10,0)","v":{"$error":"#REF!"}},{"$f":"COUNTIF(Invoer!#REF!,A62)","v":{"$error":"#REF!"}},{"$f":"COUNTIFS(Invoer!#REF!,A62,Invoer!#REF!,\"z\")","v":{"$error":"#REF!"}},{"$f":"COUNTIFS(Invoer!#REF!,A62,Invoer!#REF!,\"a\")","v":{"$error":"#REF!"}},null,{"$f":"IF(COUNTIF(A$2:A62,A62)=1,A62,\"\")","v":""}]
[{"$f":"IF(COUNTIF(Invoer!#REF!,Invoer!#REF!)=1,Invoer!#REF!,\"\")","v":{"$error":"#REF!"}},{"$f":"VLOOKUP(A63,Invoer!#REF!,2,0)","v":{"$error":"#REF!"}},{"$f":"VLOOKUP(A63,Invoer!#REF!,3,0)","v":{"$error":"#REF!"}},{"$f":"VLOOKUP(A63,Invoer!#REF!,6,0)","v":{"$error":"#REF!"}},{"$f":"VLOOKUP(A63,Invoer!#REF!,5,0)","v":{"$error":"#REF!"}},{"$f":"VLOOKUP(A63,Invoer!#REF!,10,0)","v":{"$error":"#REF!"}},{"$f":"COUNTIF(Invoer!#REF!,A63)","v":{"$error":"#REF!"}},{"$f":"COUNTIFS(Invoer!#REF!,A63,Invoer!#REF!,\"z\")","v":{"$error":"#REF!"}},{"$f":"COUNTIFS(Invoer!#REF!,A63,Invoer!#REF!,\"a\")","v":{"$error":"#REF!"}},null,{"$f":"IF(COUNTIF(A$2:A63,A63)=1,A63,\"\")","v":""}]
[{"$f":"IF(COUNTIF(Invoer!#REF!,Invoer!#REF!)=1,Invoer!#REF!,\"\")","v":{"$error":"#REF!"}},{"$f":"VLOOKUP(A64,Invoer!#REF!,2,0)","v":{"$error":"#REF!"}},{"$f":"VLOOKUP(A64,Invoer!#REF!,3,0)","v":{"$error":"#REF!"}},{"$f":"VLOOKUP(A64,Invoer!#REF!,6,0)","v":{"$error":"#REF!"}},{"$f":"VLOOKUP(A64,Invoer!#REF!,5,0)","v":{"$error":"#REF!"}},{"$f":"VLOOKUP(A64,Invoer!#REF!,10,0)","v":{"$error":"#REF!"}},{"$f":"COUNTIF(Invoer!#REF!,A64)","v":{"$error":"#REF!"}},{"$f":"COUNTIFS(Invoer!#REF!,A64,Invoer!#REF!,\"z\")","v":{"$error":"#REF!"}},{"$f":"COUNTIFS(Invoer!#REF!,A64,Invoer!#REF!,\"a\")","v":{"$error":"#REF!"}},null,{"$f":"IF(COUNTIF(A$2:A64,A64)=1,A64,\"\")","v":""}]
[{"$f":"IF(COUNTIF(Invoer!#REF!,Invoer!#REF!)=1,Invoer!#REF!,\"\")","v":{"$error":"#REF!"}},{"$f":"VLOOKUP(A65,Invoer!#REF!,2,0)","v":{"$error":"#REF!"}},{"$f":"VLOOKUP(A65,Invoer!#REF!,3,0)","v":{"$error":"#REF!"}},{"$f":"VLOOKUP(A65,Invoer!#REF!,6,0)","v":{"$error":"#REF!"}},{"$f":"VLOOKUP(A65,Invoer!#REF!,5,0)","v":{"$error":"#REF!"}},{"$f":"VLOOKUP(A65,Invoer!#REF!,10,0)","v":{"$error":"#REF!"}},{"$f":"COUNTIF(Invoer!#REF!,A65)","v":{"$error":"#REF!"}},{"$f":"COUNTIFS(Invoer!#REF!,A65,Invoer!#REF!,\"z\")","v":{"$error":"#REF!"}},{"$f":"COUNTIFS(Invoer!#REF!,A65,Invoer!#REF!,\"a\")","v":{"$error":"#REF!"}},null,{"$f":"IF(COUNTIF(A$2:A65,A65)=1,A65,\"\")","v":""}]
[{"$f":"IF(COUNTIF(Invoer!#REF!,Invoer!#REF!)=1,Invoer!#REF!,\"\")","v":{"$error":"#REF!"}},{"$f":"VLOOKUP(A66,Invoer!#REF!,2,0)","v":{"$error":"#REF!"}},{"$f":"VLOOKUP(A66,Invoer!#REF!,3,0)","v":{"$error":"#REF!"}},{"$f":"VLOOKUP(A66,Invoer!#REF!,6,0)","v":{"$error":"#REF!"}},{"$f":"VLOOKUP(A66,Invoer!#REF!,5,0)","v":{"$error":"#REF!"}},{"$f":"VLOOKUP(A66,Invoer!#REF!,10,0)","v":{"$error":"#REF!"}},{"$f":"COUNTIF(Invoer!#REF!,A66)","v":{"$error":"#REF!"}},{"$f":"COUNTIFS(Invoer!#REF!,A66,Invoer!#REF!,\"z\")","v":{"$error":"#REF!"}},{"$f":"COUNTIFS(Invoer!#REF!,A66,Invoer!#REF!,\"a\")","v":{"$error":"#REF!"}},null,{"$f":"IF(COUNTIF(A$2:A66,A66)=1,A66,\"\")","v":""}]
[{"$f":"IF(COUNTIF(Invoer!#REF!,Invoer!#REF!)=1,Invoer!#REF!,\"\")","v":{"$error":"#REF!"}},{"$f":"VLOOKUP(A67,Invoer!#REF!,2,0)","v":{"$error":"#REF!"}},{"$f":"VLOOKUP(A67,Invoer!#REF!,3,0)","v":{"$error":"#REF!"}},{"$f":"VLOOKUP(A67,Invoer!#REF!,6,0)","v":{"$error":"#REF!"}},{"$f":"VLOOKUP(A67,Invoer!#REF!,5,0)","v":{"$error":"#REF!"}},{"$f":"VLOOKUP(A67,Invoer!#REF!,10,0)","v":{"$error":"#REF!"}},{"$f":"COUNTIF(Invoer!#REF!,A67)","v":{"$error":"#REF!"}},{"$f":"COUNTIFS(Invoer!#REF!,A67,Invoer!#REF!,\"z\")","v":{"$error":"#REF!"}},{"$f":"COUNTIFS(Invoer!#REF!,A67,Invoer!#REF!,\"a\")","v":{"$error":"#REF!"}},null,{"$f":"IF(COUNTIF(A$2:A67,A67)=1,A67,\"\")","v":""}]
[{"$f":"IF(COUNTIF(Invoer!#REF!,Invoer!#REF!)=1,Invoer!#REF!,\"\")","v":{"$error":"#REF!"}},{"$f":"VLOOKUP(A68,Invoer!#REF!,2,0)","v":{"$error":"#REF!"}},{"$f":"VLOOKUP(A68,Invoer!#REF!,3,0)","v":{"$error":"#REF!"}},{"$f":"VLOOKUP(A68,Invoer!#REF!,6,0)","v":{"$error":"#REF!"}},{"$f":"VLOOKUP(A68,Invoer!#REF!,5,0)","v":{"$error":"#REF!"}},{"$f":"VLOOKUP(A68,Invoer!#REF!,10,0)","v":{"$error":"#REF!"}},{"$f":"COUNTIF(Invoer!#REF!,A68)","v":{"$error":"#REF!"}},{"$f":"COUNTIFS(Invoer!#REF!,A68,Invoer!#REF!,\"z\")","v":{"$error":"#REF!"}},{"$f":"COUNTIFS(Invoer!#REF!,A68,Invoer!#REF!,\"a\")","v":{"$error":"#REF!"}},null,{"$f":"IF(COUNTIF(A$2:A68,A68)=1,A68,\"\")","v":""}]
[{"$f":"IF(COUNTIF(Invoer!#REF!,Invoer!#REF!)=1,Invoer!#REF!,\"\")","v":{"$error":"#REF!"}},{"$f":"VLOOKUP(A69,Invoer!#REF!,2,0)","v":{"$error":"#REF!"}},{"$f":"VLOOKUP(A69,Invoer!#REF!,3,0)","v":{"$error":"#REF!"}},{"$f":"VLOOKUP(A69,Invoer!#REF!,6,0)","v":{"$error":"#REF!"}},{"$f":"VLOOKUP(A69,Invoer!#REF!,5,0)","v":{"$error":"#REF!"}},{"$f":"VLOOKUP(A69,Invoer!#REF!,10,0)","v":{"$error":"#REF!"}},{"$f":"COUNTIF(Invoer!#REF!,A69)","v":{"$error":"#REF!"}},{"$f":"COUNTIFS(Invoer!#REF!,A69,Invoer!#REF!,\"z\")","v":{"$error":"#REF!"}},{"$f":"COUNTIFS(Invoer!#REF!,A69,Invoer!#REF!,\"a\")","v":{"$error":"#REF!"}},null,{"$f":"IF(COUNTIF(A$2:A69,A69)=1,A69,\"\")","v":""}]
[{"$f":"IF(COUNTIF(Invoer!#REF!,Invoer!#REF!)=1,Invoer!#REF!,\"\")","v":{"$error":"#REF!"}},{"$f":"VLOOKUP(A70,Invoer!#REF!,2,0)","v":{"$error":"#REF!"}},{"$f":"VLOOKUP(A70,Invoer!#REF!,3,0)","v":{"$error":"#REF!"}},{"$f":"VLOOKUP(A70,Invoer!#REF!,6,0)","v":{"$error":"#REF!"}},{"$f":"VLOOKUP(A70,Invoer!#REF!,5,0)","v":{"$error":"#REF!"}},{"$f":"VLOOKUP(A70,Invoer!#REF!,10,0)","v":{"$error":"#REF!"}},{"$f":"COUNTIF(Invoer!#REF!,A70)","v":{"$error":"#REF!"}},{"$f":"COUNTIFS(Invoer!#REF!,A70,Invoer!#REF!,\"z\")","v":{"$error":"#REF!"}},{"$f":"COUNTIFS(Invoer!#REF!,A70,Invoer!#REF!,\"a\")","v":{"$error":"#REF!"}},null,{"$f":"IF(COUNTIF(A$2:A70,A70)=1,A70,\"\")","v":""}]
[{"$f":"IF(COUNTIF(Invoer!#REF!,Invoer!#REF!)=1,Invoer!#REF!,\"\")","v":{"$error":"#REF!"}},{"$f":"VLOOKUP(A71,Invoer!#REF!,2,0)","v":{"$error":"#REF!"}},{"$f":"VLOOKUP(A71,Invoer!#REF!,3,0)","v":{"$error":"#REF!"}},{"$f":"VLOOKUP(A71,Invoer!#REF!,6,0)","v":{"$error":"#REF!"}},{"$f":"VLOOKUP(A71,Invoer!#REF!,5,0)","v":{"$error":"#REF!"}},{"$f":"VLOOKUP(A71,Invoer!#REF!,10,0)","v":{"$error":"#REF!"}},{"$f":"COUNTIF(Invoer!#REF!,A71)","v":{"$error":"#REF!"}},{"$f":"COUNTIFS(Invoer!#REF!,A71,Invoer!#REF!,\"z\")","v":{"$error":"#REF!"}},{"$f":"COUNTIFS(Invoer!#REF!,A71,Invoer!#REF!,\"a\")","v":{"$error":"#REF!"}},null,{"$f":"IF(COUNTIF(A$2:A71,A71)=1,A71,\"\")","v":""}]
[{"$f":"IF(COUNTIF(Invoer!#REF!,Invoer!#REF!)=1,Invoer!#REF!,\"\")","v":{"$error":"#REF!"}},{"$f":"VLOOKUP(A72,Invoer!#REF!,2,0)","v":{"$error":"#REF!"}},{"$f":"VLOOKUP(A72,Invoer!#REF!,3,0)","v":{"$error":"#REF!"}},{"$f":"VLOOKUP(A72,Invoer!#REF!,6,0)","v":{"$error":"#REF!"}},{"$f":"VLOOKUP(A72,Invoer!#REF!,5,0)","v":{"$error":"#REF!"}},{"$f":"VLOOKUP(A72,Invoer!#REF!,10,0)","v":{"$error":"#REF!"}},{"$f":"COUNTIF(Invoer!#REF!,A72)","v":{"$error":"#REF!"}},{"$f":"COUNTIFS(Invoer!#REF!,A72,Invoer!#REF!,\"z\")","v":{"$error":"#REF!"}},{"$f":"COUNTIFS(Invoer!#REF!,A72,Invoer!#REF!,\"a\")","v":{"$error":"#REF!"}},null,{"$f":"IF(COUNTIF(A$2:A72,A72)=1,A72,\"\")","v":""}]
[{"$f":"IF(COUNTIF(Invoer!#REF!,Invoer!#REF!)=1,Invoer!#REF!,\"\")","v":{"$error":"#REF!"}},{"$f":"VLOOKUP(A73,Invoer!#REF!,2,0)","v":{"$error":"#REF!"}},{"$f":"VLOOKUP(A73,Invoer!#REF!,3,0)","v":{"$error":"#REF!"}},{"$f":"VLOOKUP(A73,Invoer!#REF!,6,0)","v":{"$error":"#REF!"}},{"$f":"VLOOKUP(A73,Invoer!#REF!,5,0)","v":{"$error":"#REF!"}},{"$f":"VLOOKUP(A73,Invoer!#REF!,10,0)","v":{"$error":"#REF!"}},{"$f":"COUNTIF(Invoer!#REF!,A73)","v":{"$error":"#REF!"}},{"$f":"COUNTIFS(Invoer!#REF!,A73,Invoer!#REF!,\"z\")","v":{"$error":"#REF!"}},{"$f":"COUNTIFS(Invoer!#REF!,A73,Invoer!#REF!,\"a\")","v":{"$error":"#REF!"}},null,{"$f":"IF(COUNTIF(A$2:A73,A73)=1,A73,\"\")","v":""}]
[{"$f":"IF(COUNTIF(Invoer!#REF!,Invoer!#REF!)=1,Invoer!#REF!,\"\")","v":{"$error":"#REF!"}},{"$f":"VLOOKUP(A74,Invoer!#REF!,2,0)","v":{"$error":"#REF!"}},{"$f":"VLOOKUP(A74,Invoer!#REF!,3,0)","v":{"$error":"#REF!"}},{"$f":"VLOOKUP(A74,Invoer!#REF!,6,0)","v":{"$error":"#REF!"}},{"$f":"VLOOKUP(A74,Invoer!#REF!,5,0)","v":{"$error":"#REF!"}},{"$f":"VLOOKUP(A74,Invoer!#REF!,10,0)","v":{"$error":"#REF!"}},{"$f":"COUNTIF(Invoer!#REF!,A74)","v":{"$error":"#REF!"}},{"$f":"COUNTIFS(Invoer!#REF!,A74,Invoer!#REF!,\"z\")","v":{"$error":"#REF!"}},{"$f":"COUNTIFS(Invoer!#REF!,A74,Invoer!#REF!,\"a\")","v":{"$error":"#REF!"}},null,{"$f":"IF(COUNTIF(A$2:A74,A74)=1,A74,\"\")","v":""}]
[{"$f":"IF(COUNTIF(Invoer!#REF!,Invoer!#REF!)=1,Invoer!#REF!,\"\")","v":{"$error":"#REF!"}},{"$f":"VLOOKUP(A75,Invoer!#REF!,2,0)","v":{"$error":"#REF!"}},{"$f":"VLOOKUP(A75,Invoer!#REF!,3,0)","v":{"$error":"#REF!"}},{"$f":"VLOOKUP(A75,Invoer!#REF!,6,0)","v":{"$error":"#REF!"}},{"$f":"VLOOKUP(A75,Invoer!#REF!,5,0)","v":{"$error":"#REF!"}},{"$f":"VLOOKUP(A75,Invoer!#REF!,10,0)","v":{"$error":"#REF!"}},{"$f":"COUNTIF(Invoer!#REF!,A75)","v":{"$error":"#REF!"}},{"$f":"COUNTIFS(Invoer!#REF!,A75,Invoer!#REF!,\"z\")","v":{"$error":"#REF!"}},{"$f":"COUNTIFS(Invoer!#REF!,A75,Invoer!#REF!,\"a\")","v":{"$error":"#REF!"}},null,{"$f":"IF(COUNTIF(A$2:A75,A75)=1,A75,\"\")","v":""}]
[{"$f":"IF(COUNTIF(Invoer!#REF!,Invoer!#REF!)=1,Invoer!#REF!,\"\")","v":{"$error":"#REF!"}},{"$f":"VLOOKUP(A76,Invoer!#REF!,2,0)","v":{"$error":"#REF!"}},{"$f":"VLOOKUP(A76,Invoer!#REF!,3,0)","v":{"$error":"#REF!"}},{"$f":"VLOOKUP(A76,Invoer!#REF!,6,0)","v":{"$error":"#REF!"}},{"$f":"VLOOKUP(A76,Invoer!#REF!,5,0)","v":{"$error":"#REF!"}},{"$f":"VLOOKUP(A76,Invoer!#REF!,10,0)","v":{"$error":"#REF!"}},{"$f":"COUNTIF(Invoer!#REF!,A76)","v":{"$error":"#REF!"}},{"$f":"COUNTIFS(Invoer!#REF!,A76,Invoer!#REF!,\"z\")","v":{"$error":"#REF!"}},{"$f":"COUNTIFS(Invoer!#REF!,A76,Invoer!#REF!,\"a\")","v":{"$error":"#REF!"}},null,{"$f":"IF(COUNTIF(A$2:A76,A76)=1,A76,\"\")","v":""}]
[{"$f":"IF(COUNTIF(Invoer!#REF!,Invoer!#REF!)=1,Invoer!#REF!,\"\")","v":{"$error":"#REF!"}},{"$f":"VLOOKUP(A77,Invoer!#REF!,2,0)","v":{"$error":"#REF!"}},{"$f":"VLOOKUP(A77,Invoer!#REF!,3,0)","v":{"$error":"#REF!"}},{"$f":"VLOOKUP(A77,Invoer!#REF!,6,0)","v":{"$error":"#REF!"}},{"$f":"VLOOKUP(A77,Invoer!#REF!,5,0)","v":{"$error":"#REF!"}},{"$f":"VLOOKUP(A77,Invoer!#REF!,10,0)","v":{"$error":"#REF!"}},{"$f":"COUNTIF(Invoer!#REF!,A77)","v":{"$error":"#REF!"}},{"$f":"COUNTIFS(Invoer!#REF!,A77,Invoer!#REF!,\"z\")","v":{"$error":"#REF!"}},{"$f":"COUNTIFS(Invoer!#REF!,A77,Invoer!#REF!,\"a\")","v":{"$error":"#REF!"}},null,{"$f":"IF(COUNTIF(A$2:A77,A77)=1,A77,\"\")","v":""}]
[{"$f":"IF(COUNTIF(Invoer!#REF!,Invoer!#REF!)=1,Invoer!#REF!,\"\")","v":{"$error":"#REF!"}},{"$f":"VLOOKUP(A78,Invoer!#REF!,2,0)","v":{"$error":"#REF!"}},{"$f":"VLOOKUP(A78,Invoer!#REF!,3,0)","v":{"$error":"#REF!"}},{"$f":"VLOOKUP(A78,Invoer!#REF!,6,0)","v":{"$error":"#REF!"}},{"$f":"VLOOKUP(A78,Invoer!#REF!,5,0)","v":{"$error":"#REF!"}},{"$f":"VLOOKUP(A78,Invoer!#REF!,10,0)","v":{"$error":"#REF!"}},{"$f":"COUNTIF(Invoer!#REF!,A78)","v":{"$error":"#REF!"}},{"$f":"COUNTIFS(Invoer!#REF!,A78,Invoer!#REF!,\"z\")","v":{"$error":"#REF!"}},{"$f":"COUNTIFS(Invoer!#REF!,A78,Invoer!#REF!,\"a\")","v":{"$error":"#REF!"}},null,{"$f":"IF(COUNTIF(A$2:A78,A78)=1,A78,\"\")","v":""}]
[{"$f":"IF(COUNTIF(Invoer!#REF!,Invoer!#REF!)=1,Invoer!#REF!,\"\")","v":{"$error":"#REF!"}},{"$f":"VLOOKUP(A79,Invoer!#REF!,2,0)","v":{"$error":"#REF!"}},{"$f":"VLOOKUP(A79,Invoer!#REF!,3,0)","v":{"$error":"#REF!"}},{"$f":"VLOOKUP(A79,Invoer!#REF!,6,0)","v":{"$error":"#REF!"}},{"$f":"VLOOKUP(A79,Invoer!#REF!,5,0)","v":{"$error":"#REF!"}},{"$f":"VLOOKUP(A79,Invoer!#REF!,10,0)","v":{"$error":"#REF!"}},{"$f":"COUNTIF(Invoer!#REF!,A79)","v":{"$error":"#REF!"}},{"$f":"COUNTIFS(Invoer!#REF!,A79,Invoer!#REF!,\"z\")","v":{"$error":"#REF!"}},{"$f":"COUNTIFS(Invoer!#REF!,A79,Invoer!#REF!,\"a\")","v":{"$error":"#REF!"}},null,{"$f":"IF(COUNTIF(A$2:A79,A79)=1,A79,\"\")","v":""}]
[{"$f":"IF(COUNTIF(Invoer!#REF!,Invoer!#REF!)=1,Invoer!#REF!,\"\")","v":{"$error":"#REF!"}},{"$f":"VLOOKUP(A80,Invoer!#REF!,2,0)","v":{"$error":"#REF!"}},{"$f":"VLOOKUP(A80,Invoer!#REF!,3,0)","v":{"$error":"#REF!"}},{"$f":"VLOOKUP(A80,Invoer!#REF!,6,0)","v":{"$error":"#REF!"}},{"$f":"VLOOKUP(A80,Invoer!#REF!,5,0)","v":{"$error":"#REF!"}},{"$f":"VLOOKUP(A80,Invoer!#REF!,10,0)","v":{"$error":"#REF!"}},{"$f":"COUNTIF(Invoer!#REF!,A80)","v":{"$error":"#REF!"}},{"$f":"COUNTIFS(Invoer!#REF!,A80,Invoer!#REF!,\"z\")","v":{"$error":"#REF!"}},{"$f":"COUNTIFS(Invoer!#REF!,A80,Invoer!#REF!,\"a\")","v":{"$error":"#REF!"}},null,{"$f":"IF(COUNTIF(A$2:A80,A80)=1,A80,\"\")","v":""}]
[{"$f":"IF(COUNTIF(Invoer!#REF!,Invoer!#REF!)=1,Invoer!#REF!,\"\")","v":{"$error":"#REF!"}},{"$f":"VLOOKUP(A81,Invoer!#REF!,2,0)","v":{"$error":"#REF!"}},{"$f":"VLOOKUP(A81,Invoer!#REF!,3,0)","v":{"$error":"#REF!"}},{"$f":"VLOOKUP(A81,Invoer!#REF!,6,0)","v":{"$error":"#REF!"}},{"$f":"VLOOKUP(A81,Invoer!#REF!,5,0)","v":{"$error":"#REF!"}},{"$f":"VLOOKUP(A81,Invoer!#REF!,10,0)","v":{"$error":"#REF!"}},{"$f":"COUNTIF(Invoer!#REF!,A81)","v":{"$error":"#REF!"}},{"$f":"COUNTIFS(Invoer!#REF!,A81,Invoer!#REF!,\"z\")","v":{"$error":"#REF!"}},{"$f":"COUNTIFS(Invoer!#REF!,A81,Invoer!#REF!,\"a\")","v":{"$error":"#REF!"}},null,{"$f":"IF(COUNTIF(A$2:A81,A81)=1,A81,\"\")","v":""}]
[{"$f":"IF(COUNTIF(Invoer!#REF!,Invoer!#REF!)=1,Invoer!#REF!,\"\")","v":{"$error":"#REF!"}},{"$f":"VLOOKUP(A82,Invoer!#REF!,2,0)","v":{"$error":"#REF!"}},{"$f":"VLOOKUP(A82,Invoer!#REF!,3,0)","v":{"$error":"#REF!"}},{"$f":"VLOOKUP(A82,Invoer!#REF!,6,0)","v":{"$error":"#REF!"}},{"$f":"VLOOKUP(A82,Invoer!#REF!,5,0)","v":{"$error":"#REF!"}},{"$f":"VLOOKUP(A82,Invoer!#REF!,10,0)","v":{"$error":"#REF!"}},{"$f":"COUNTIF(Invoer!#REF!,A82)","v":{"$error":"#REF!"}},{"$f":"COUNTIFS(Invoer!#REF!,A82,Invoer!#REF!,\"z\")","v":{"$error":"#REF!"}},{"$f":"COUNTIFS(Invoer!#REF!,A82,Invoer!#REF!,\"a\")","v":{"$error":"#REF!"}},null,{"$f":"IF(COUNTIF(A$2:A82,A82)=1,A82,\"\")","v":""}]
[{"$f":"IF(COUNTIF(Invoer!#REF!,Invoer!#REF!)=1,Invoer!#REF!,\"\")","v":{"$error":"#REF!"}},{"$f":"VLOOKUP(A83,Invoer!#REF!,2,0)","v":{"$error":"#REF!"}},{"$f":"VLOOKUP(A83,Invoer!#REF!,3,0)","v":{"$error":"#REF!"}},{"$f":"VLOOKUP(A83,Invoer!#REF!,6,0)","v":{"$error":"#REF!"}},{"$f":"VLOOKUP(A83,Invoer!#REF!,5,0)","v":{"$error":"#REF!"}},{"$f":"VLOOKUP(A83,Invoer!#REF!,10,0)","v":{"$error":"#REF!"}},{"$f":"COUNTIF(Invoer!#REF!,A83)","v":{"$error":"#REF!"}},{"$f":"COUNTIFS(Invoer!#REF!,A83,Invoer!#REF!,\"z\")","v":{"$error":"#REF!"}},{"$f":"COUNTIFS(Invoer!#REF!,A83,Invoer!#REF!,\"a\")","v":{"$error":"#REF!"}},null,{"$f":"IF(COUNTIF(A$2:A83,A83)=1,A83,\"\")","v":""}]
[{"$f":"IF(COUNTIF(Invoer!#REF!,Invoer!#REF!)=1,Invoer!#REF!,\"\")","v":{"$error":"#REF!"}},{"$f":"VLOOKUP(A84,Invoer!#REF!,2,0)","v":{"$error":"#REF!"}},{"$f":"VLOOKUP(A84,Invoer!#REF!,3,0)","v":{"$error":"#REF!"}},{"$f":"VLOOKUP(A84,Invoer!#REF!,6,0)","v":{"$error":"#REF!"}},{"$f":"VLOOKUP(A84,Invoer!#REF!,5,0)","v":{"$error":"#REF!"}},{"$f":"VLOOKUP(A84,Invoer!#REF!,10,0)","v":{"$error":"#REF!"}},{"$f":"COUNTIF(Invoer!#REF!,A84)","v":{"$error":"#REF!"}},{"$f":"COUNTIFS(Invoer!#REF!,A84,Invoer!#REF!,\"z\")","v":{"$error":"#REF!"}},{"$f":"COUNTIFS(Invoer!#REF!,A84,Invoer!#REF!,\"a\")","v":{"$error":"#REF!"}},null,{"$f":"IF(COUNTIF(A$2:A84,A84)=1,A84,\"\")","v":""}]
[{"$f":"IF(COUNTIF(Invoer!#REF!,Invoer!#REF!)=1,Invoer!#REF!,\"\")","v":{"$error":"#REF!"}},{"$f":"VLOOKUP(A85,Invoer!#REF!,2,0)","v":{"$error":"#REF!"}},{"$f":"VLOOKUP(A85,Invoer!#REF!,3,0)","v":{"$error":"#REF!"}},{"$f":"VLOOKUP(A85,Invoer!#REF!,6,0)","v":{"$error":"#REF!"}},{"$f":"VLOOKUP(A85,Invoer!#REF!,5,0)","v":{"$error":"#REF!"}},{"$f":"VLOOKUP(A85,Invoer!#REF!,10,0)","v":{"$error":"#REF!"}},{"$f":"COUNTIF(Invoer!#REF!,A85)","v":{"$error":"#REF!"}},{"$f":"COUNTIFS(Invoer!#REF!,A85,Invoer!#REF!,\"z\")","v":{"$error":"#REF!"}},{"$f":"COUNTIFS(Invoer!#REF!,A85,Invoer!#REF!,\"a\")","v":{"$error":"#REF!"}},null,{"$f":"IF(COUNTIF(A$2:A85,A85)=1,A85,\"\")","v":""}]
[{"$f":"IF(COUNTIF(Invoer!#REF!,Invoer!#REF!)=1,Invoer!#REF!,\"\")","v":{"$error":"#REF!"}},{"$f":"VLOOKUP(A86,Invoer!#REF!,2,0)","v":{"$error":"#REF!"}},{"$f":"VLOOKUP(A86,Invoer!#REF!,3,0)","v":{"$error":"#REF!"}},{"$f":"VLOOKUP(A86,Invoer!#REF!,6,0)","v":{"$error":"#REF!"}},{"$f":"VLOOKUP(A86,Invoer!#REF!,5,0)","v":{"$error":"#REF!"}},{"$f":"VLOOKUP(A86,Invoer!#REF!,10,0)","v":{"$error":"#REF!"}},{"$f":"COUNTIF(Invoer!#REF!,A86)","v":{"$error":"#REF!"}},{"$f":"COUNTIFS(Invoer!#REF!,A86,Invoer!#REF!,\"z\")","v":{"$error":"#REF!"}},{"$f":"COUNTIFS(Invoer!#REF!,A86,Invoer!#REF!,\"a\")","v":{"$error":"#REF!"}},null,{"$f":"IF(COUNTIF(A$2:A86,A86)=1,A86,\"\")","v":""}]
[{"$f":"IF(COUNTIF(Invoer!#REF!,Invoer!#REF!)=1,Invoer!#REF!,\"\")","v":{"$error":"#REF!"}},{"$f":"VLOOKUP(A87,Invoer!#REF!,2,0)","v":{"$error":"#REF!"}},{"$f":"VLOOKUP(A87,Invoer!#REF!,3,0)","v":{"$error":"#REF!"}},{"$f":"VLOOKUP(A87,Invoer!#REF!,6,0)","v":{"$error":"#REF!"}},{"$f":"VLOOKUP(A87,Invoer!#REF!,5,0)","v":{"$error":"#REF!"}},{"$f":"VLOOKUP(A87,Invoer!#REF!,10,0)","v":{"$error":"#REF!"}},{"$f":"COUNTIF(Invoer!#REF!,A87)","v":{"$error":"#REF!"}},{"$f":"COUNTIFS(Invoer!#REF!,A87,Invoer!#REF!,\"z\")","v":{"$error":"#REF!"}},{"$f":"COUNTIFS(Invoer!#REF!,A87,Invoer!#REF!,\"a\")","v":{"$error":"#REF!"}},null,{"$f":"IF(COUNTIF(A$2:A87,A87)=1,A87,\"\")","v":""}]
[{"$f":"IF(COUNTIF(Invoer!#REF!,Invoer!#REF!)=1,Invoer!#REF!,\"\")","v":{"$error":"#REF!"}},{"$f":"VLOOKUP(A88,Invoer!#REF!,2,0)","v":{"$error":"#REF!"}},{"$f":"VLOOKUP(A88,Invoer!#REF!,3,0)","v":{"$error":"#REF!"}},{"$f":"VLOOKUP(A88,Invoer!#REF!,6,0)","v":{"$error":"#REF!"}},{"$f":"VLOOKUP(A88,Invoer!#REF!,5,0)","v":{"$error":"#REF!"}},{"$f":"VLOOKUP(A88,Invoer!#REF!,10,0)","v":{"$error":"#REF!"}},{"$f":"COUNTIF(Invoer!#REF!,A88)","v":{"$error":"#REF!"}},{"$f":"COUNTIFS(Invoer!#REF!,A88,Invoer!#REF!,\"z\")","v":{"$error":"#REF!"}},{"$f":"COUNTIFS(Invoer!#REF!,A88,Invoer!#REF!,\"a\")","v":{"$error":"#REF!"}},null,{"$f":"IF(COUNTIF(A$2:A88,A88)=1,A88,\"\")","v":""}]
[{"$f":"IF(COUNTIF(Invoer!#REF!,Invoer!#REF!)=1,Invoer!#REF!,\"\")","v":{"$error":"#REF!"}},{"$f":"VLOOKUP(A89,Invoer!#REF!,2,0)","v":{"$error":"#REF!"}},{"$f":"VLOOKUP(A89,Invoer!#REF!,3,0)","v":{"$error":"#REF!"}},{"$f":"VLOOKUP(A89,Invoer!#REF!,6,0)","v":{"$error":"#REF!"}},{"$f":"VLOOKUP(A89,Invoer!#REF!,5,0)","v":{"$error":"#REF!"}},{"$f":"VLOOKUP(A89,Invoer!#REF!,10,0)","v":{"$error":"#REF!"}},{"$f":"COUNTIF(Invoer!#REF!,A89)","v":{"$error":"#REF!"}},{"$f":"COUNTIFS(Invoer!#REF!,A89,Invoer!#REF!,\"z\")","v":{"$error":"#REF!"}},{"$f":"COUNTIFS(Invoer!#REF!,A89,Invoer!#REF!,\"a\")","v":{"$error":"#REF!"}},null,{"$f":"IF(COUNTIF(A$2:A89,A89)=1,A89,\"\")","v":""}]
[{"$f":"IF(COUNTIF(Invoer!#REF!,Invoer!#REF!)=1,Invoer!#REF!,\"\")","v":{"$error":"#REF!"}},{"$f":"VLOOKUP(A90,Invoer!#REF!,2,0)","v":{"$error":"#REF!"}},{"$f":"VLOOKUP(A90,Invoer!#REF!,3,0)","v":{"$error":"#REF!"}},{"$f":"VLOOKUP(A90,Invoer!#REF!,6,0)","v":{"$error":"#REF!"}},{"$f":"VLOOKUP(A90,Invoer!#REF!,5,0)","v":{"$error":"#REF!"}},{"$f":"VLOOKUP(A90,Invoer!#REF!,10,0)","v":{"$error":"#REF!"}},{"$f":"COUNTIF(Invoer!#REF!,A90)","v":{"$error":"#REF!"}},{"$f":"COUNTIFS(Invoer!#REF!,A90,Invoer!#REF!,\"z\")","v":{"$error":"#REF!"}},{"$f":"COUNTIFS(Invoer!#REF!,A90,Invoer!#REF!,\"a\")","v":{"$error":"#REF!"}},null,{"$f":"IF(COUNTIF(A$2:A90,A90)=1,A90,\"\")","v":""}]
[{"$f":"IF(COUNTIF(Invoer!#REF!,Invoer!#REF!)=1,Invoer!#REF!,\"\")","v":{"$error":"#REF!"}},{"$f":"VLOOKUP(A91,Invoer!#REF!,2,0)","v":{"$error":"#REF!"}},{"$f":"VLOOKUP(A91,Invoer!#REF!,3,0)","v":{"$error":"#REF!"}},{"$f":"VLOOKUP(A91,Invoer!#REF!,6,0)","v":{"$error":"#REF!"}},{"$f":"VLOOKUP(A91,Invoer!#REF!,5,0)","v":{"$error":"#REF!"}},{"$f":"VLOOKUP(A91,Invoer!#REF!,10,0)","v":{"$error":"#REF!"}},{"$f":"COUNTIF(Invoer!#REF!,A91)","v":{"$error":"#REF!"}},{"$f":"COUNTIFS(Invoer!#REF!,A91,Invoer!#REF!,\"z\")","v":{"$error":"#REF!"}},{"$f":"COUNTIFS(Invoer!#REF!,A91,Invoer!#REF!,\"a\")","v":{"$error":"#REF!"}},null,{"$f":"IF(COUNTIF(A$2:A91,A91)=1,A91,\"\")","v":""}]
[{"$f":"IF(COUNTIF(Invoer!#REF!,Invoer!#REF!)=1,Invoer!#REF!,\"\")","v":{"$error":"#REF!"}},{"$f":"VLOOKUP(A92,Invoer!#REF!,2,0)","v":{"$error":"#REF!"}},{"$f":"VLOOKUP(A92,Invoer!#REF!,3,0)","v":{"$error":"#REF!"}},{"$f":"VLOOKUP(A92,Invoer!#REF!,6,0)","v":{"$error":"#REF!"}},{"$f":"VLOOKUP(A92,Invoer!#REF!,5,0)","v":{"$error":"#REF!"}},{"$f":"VLOOKUP(A92,Invoer!#REF!,10,0)","v":{"$error":"#REF!"}},{"$f":"COUNTIF(Invoer!#REF!,A92)","v":{"$error":"#REF!"}},{"$f":"COUNTIFS(Invoer!#REF!,A92,Invoer!#REF!,\"z\")","v":{"$error":"#REF!"}},{"$f":"COUNTIFS(Invoer!#REF!,A92,Invoer!#REF!,\"a\")","v":{"$error":"#REF!"}},null,{"$f":"IF(COUNTIF(A$2:A92,A92)=1,A92,\"\")","v":""}]
[{"$f":"IF(COUNTIF(Invoer!#REF!,Invoer!#REF!)=1,Invoer!#REF!,\"\")","v":{"$error":"#REF!"}},{"$f":"VLOOKUP(A93,Invoer!#REF!,2,0)","v":{"$error":"#REF!"}},{"$f":"VLOOKUP(A93,Invoer!#REF!,3,0)","v":{"$error":"#REF!"}},{"$f":"VLOOKUP(A93,Invoer!#REF!,6,0)","v":{"$error":"#REF!"}},{"$f":"VLOOKUP(A93,Invoer!#REF!,5,0)","v":{"$error":"#REF!"}},{"$f":"VLOOKUP(A93,Invoer!#REF!,10,0)","v":{"$error":"#REF!"}},{"$f":"COUNTIF(Invoer!#REF!,A93)","v":{"$error":"#REF!"}},{"$f":"COUNTIFS(Invoer!#REF!,A93,Invoer!#REF!,\"z\")","v":{"$error":"#REF!"}},{"$f":"COUNTIFS(Invoer!#REF!,A93,Invoer!#REF!,\"a\")","v":{"$error":"#REF!"}},null,{"$f":"IF(COUNTIF(A$2:A93,A93)=1,A93,\"\")","v":""}]
[{"$f":"IF(COUNTIF(Invoer!#REF!,Invoer!#REF!)=1,Invoer!#REF!,\"\")","v":{"$error":"#REF!"}},{"$f":"VLOOKUP(A94,Invoer!#REF!,2,0)","v":{"$error":"#REF!"}},{"$f":"VLOOKUP(A94,Invoer!#REF!,3,0)","v":{"$error":"#REF!"}},{"$f":"VLOOKUP(A94,Invoer!#REF!,6,0)","v":{"$error":"#REF!"}},{"$f":"VLOOKUP(A94,Invoer!#REF!,5,0)","v":{"$error":"#REF!"}},{"$f":"VLOOKUP(A94,Invoer!#REF!,10,0)","v":{"$error":"#REF!"}},{"$f":"COUNTIF(Invoer!#REF!,A94)","v":{"$error":"#REF!"}},{"$f":"COUNTIFS(Invoer!#REF!,A94,Invoer!#REF!,\"z\")","v":{"$error":"#REF!"}},{"$f":"COUNTIFS(Invoer!#REF!,A94,Invoer!#REF!,\"a\")","v":{"$error":"#REF!"}},null,{"$f":"IF(COUNTIF(A$2:A94,A94)=1,A94,\"\")","v":""}]
[{"$f":"IF(COUNTIF(Invoer!#REF!,Invoer!#REF!)=1,Invoer!#REF!,\"\")","v":{"$error":"#REF!"}},{"$f":"VLOOKUP(A95,Invoer!#REF!,2,0)","v":{"$error":"#REF!"}},{"$f":"VLOOKUP(A95,Invoer!#REF!,3,0)","v":{"$error":"#REF!"}},{"$f":"VLOOKUP(A95,Invoer!#REF!,6,0)","v":{"$error":"#REF!"}},{"$f":"VLOOKUP(A95,Invoer!#REF!,5,0)","v":{"$error":"#REF!"}},{"$f":"VLOOKUP(A95,Invoer!#REF!,10,0)","v":{"$error":"#REF!"}},{"$f":"COUNTIF(Invoer!#REF!,A95)","v":{"$error":"#REF!"}},{"$f":"COUNTIFS(Invoer!#REF!,A95,Invoer!#REF!,\"z\")","v":{"$error":"#REF!"}},{"$f":"COUNTIFS(Invoer!#REF!,A95,Invoer!#REF!,\"a\")","v":{"$error":"#REF!"}},null,{"$f":"IF(COUNTIF(A$2:A95,A95)=1,A95,\"\")","v":""}]
[{"$f":"IF(COUNTIF(Invoer!#REF!,Invoer!#REF!)=1,Invoer!#REF!,\"\")","v":{"$error":"#REF!"}},{"$f":"VLOOKUP(A96,Invoer!#REF!,2,0)","v":{"$error":"#REF!"}},{"$f":"VLOOKUP(A96,Invoer!#REF!,3,0)","v":{"$error":"#REF!"}},{"$f":"VLOOKUP(A96,Invoer!#REF!,6,0)","v":{"$error":"#REF!"}},{"$f":"VLOOKUP(A96,Invoer!#REF!,5,0)","v":{"$error":"#REF!"}},{"$f":"VLOOKUP(A96,Invoer!#REF!,10,0)","v":{"$error":"#REF!"}},{"$f":"COUNTIF(Invoer!#REF!,A96)","v":{"$error":"#REF!"}},{"$f":"COUNTIFS(Invoer!#REF!,A96,Invoer!#REF!,\"z\")","v":{"$error":"#REF!"}},{"$f":"COUNTIFS(Invoer!#REF!,A96,Invoer!#REF!,\"a\")","v":{"$error":"#REF!"}},null,{"$f":"IF(COUNTIF(A$2:A96,A96)=1,A96,\"\")","v":""}]
[{"$f":"IF(COUNTIF(Invoer!#REF!,Invoer!#REF!)=1,Invoer!#REF!,\"\")","v":{"$error":"#REF!"}},{"$f":"VLOOKUP(A97,Invoer!#REF!,2,0)","v":{"$error":"#REF!"}},{"$f":"VLOOKUP(A97,Invoer!#REF!,3,0)","v":{"$error":"#REF!"}},{"$f":"VLOOKUP(A97,Invoer!#REF!,6,0)","v":{"$error":"#REF!"}},{"$f":"VLOOKUP(A97,Invoer!#REF!,5,0)","v":{"$error":"#REF!"}},{"$f":"VLOOKUP(A97,Invoer!#REF!,10,0)","v":{"$error":"#REF!"}},{"$f":"COUNTIF(Invoer!#REF!,A97)","v":{"$error":"#REF!"}},{"$f":"COUNTIFS(Invoer!#REF!,A97,Invoer!#REF!,\"z\")","v":{"$error":"#REF!"}},{"$f":"COUNTIFS(Invoer!#REF!,A97,Invoer!#REF!,\"a\")","v":{"$error":"#REF!"}},null,{"$f":"IF(COUNTIF(A$2:A97,A97)=1,A97,\"\")","v":""}]
[{"$f":"IF(COUNTIF(Invoer!#REF!,Invoer!#REF!)=1,Invoer!#REF!,\"\")","v":{"$error":"#REF!"}},{"$f":"VLOOKUP(A98,Invoer!#REF!,2,0)","v":{"$error":"#REF!"}},{"$f":"VLOOKUP(A98,Invoer!#REF!,3,0)","v":{"$error":"#REF!"}},{"$f":"VLOOKUP(A98,Invoer!#REF!,6,0)","v":{"$error":"#REF!"}},{"$f":"VLOOKUP(A98,Invoer!#REF!,5,0)","v":{"$error":"#REF!"}},{"$f":"VLOOKUP(A98,Invoer!#REF!,10,0)","v":{"$error":"#REF!"}},{"$f":"COUNTIF(Invoer!#REF!,A98)","v":{"$error":"#REF!"}},{"$f":"COUNTIFS(Invoer!#REF!,A98,Invoer!#REF!,\"z\")","v":{"$error":"#REF!"}},{"$f":"COUNTIFS(Invoer!#REF!,A98,Invoer!#REF!,\"a\")","v":{"$error":"#REF!"}},null,{"$f":"IF(COUNTIF(A$2:A98,A98)=1,A98,\"\")","v":""}]
[{"$f":"IF(COUNTIF(Invoer!#REF!,Invoer!#REF!)=1,Invoer!#REF!,\"\")","v":{"$error":"#REF!"}},{"$f":"VLOOKUP(A99,Invoer!#REF!,2,0)","v":{"$error":"#REF!"}},{"$f":"VLOOKUP(A99,Invoer!#REF!,3,0)","v":{"$error":"#REF!"}},{"$f":"VLOOKUP(A99,Invoer!#REF!,6,0)","v":{"$error":"#REF!"}},{"$f":"VLOOKUP(A99,Invoer!#REF!,5,0)","v":{"$error":"#REF!"}},{"$f":"VLOOKUP(A99,Invoer!#REF!,10,0)","v":{"$error":"#REF!"}},{"$f":"COUNTIF(Invoer!#REF!,A99)","v":{"$error":"#REF!"}},{"$f":"COUNTIFS(Invoer!#REF!,A99,Invoer!#REF!,\"z\")","v":{"$error":"#REF!"}},{"$f":"COUNTIFS(Invoer!#REF!,A99,Invoer!#REF!,\"a\")","v":{"$error":"#REF!"}},null,{"$f":"IF(COUNTIF(A$2:A99,A99)=1,A99,\"\")","v":""}]
[{"$f":"IF(COUNTIF(Invoer!#REF!,Invoer!#REF!)=1,Invoer!#REF!,\"\")","v":{"$error":"#REF!"}},{"$f":"VLOOKUP(A100,Invoer!#REF!,2,0)","v":{"$error":"#REF!"}},{"$f":"VLOOKUP(A100,Invoer!#REF!,3,0)","v":{"$error":"#REF!"}},{"$f":"VLOOKUP(A100,Invoer!#REF!,6,0)","v":{"$error":"#REF!"}},{"$f":"VLOOKUP(A100,Invoer!#REF!,5,0)","v":{"$error":"#REF!"}},{"$f":"VLOOKUP(A100,Invoer!#REF!,10,0)","v":{"$error":"#REF!"}},{"$f":"COUNTIF(Invoer!#REF!,A100)","v":{"$error":"#REF!"}},{"$f":"COUNTIFS(Invoer!#REF!,A100,Invoer!#REF!,\"z\")","v":{"$error":"#REF!"}},{"$f":"COUNTIFS(Invoer!#REF!,A100,Invoer!#REF!,\"a\")","v":{"$error":"#REF!"}},null,{"$f":"IF(COUNTIF(A$2:A100,A100)=1,A100,\"\")","v":""}]
[{"$f":"IF(COUNTIF(Invoer!#REF!,Invoer!#REF!)=1,Invoer!#REF!,\"\")","v":{"$error":"#REF!"}},{"$f":"VLOOKUP(A101,Invoer!#REF!,2,0)","v":{"$error":"#REF!"}},{"$f":"VLOOKUP(A101,Invoer!#REF!,3,0)","v":{"$error":"#REF!"}},{"$f":"VLOOKUP(A101,Invoer!#REF!,6,0)","v":{"$error":"#REF!"}},{"$f":"VLOOKUP(A101,Invoer!#REF!,5,0)","v":{"$error":"#REF!"}},{"$f":"VLOOKUP(A101,Invoer!#REF!,10,0)","v":{"$error":"#REF!"}},{"$f":"COUNTIF(Invoer!#REF!,A101)","v":{"$error":"#REF!"}},{"$f":"COUNTIFS(Invoer!#REF!,A101,Invoer!#REF!,\"z\")","v":{"$error":"#REF!"}},{"$f":"COUNTIFS(Invoer!#REF!,A101,Invoer!#REF!,\"a\")","v":{"$error":"#REF!"}},null,{"$f":"IF(COUNTIF(A$2:A101,A101)=1,A101,\"\")","v":""}]
[{"$f":"IF(COUNTIF(Invoer!#REF!,Invoer!#REF!)=1,Invoer!#REF!,\"\")","v":{"$error":"#REF!"}},{"$f":"VLOOKUP(A102,Invoer!#REF!,2,0)","v":{"$error":"#REF!"}},{"$f":"VLOOKUP(A102,Invoer!#REF!,3,0)","v":{"$error":"#REF!"}},{"$f":"VLOOKUP(A102,Invoer!#REF!,6,0)","v":{"$error":"#REF!"}},{"$f":"VLOOKUP(A102,Invoer!#REF!,5,0)","v":{"$error":"#REF!"}},{"$f":"VLOOKUP(A102,Invoer!#REF!,10,0)","v":{"$error":"#REF!"}},{"$f":"COUNTIF(Invoer!#REF!,A102)","v":{"$error":"#REF!"}},{"$f":"COUNTIFS(Invoer!#REF!,A102,Invoer!#REF!,\"z\")","v":{"$error":"#REF!"}},{"$f":"COUNTIFS(Invoer!#REF!,A102,Invoer!#REF!,\"a\")","v":{"$error":"#REF!"}},null,{"$f":"IF(COUNTIF(A$2:A102,A102)=1,A102,\"\")","v":""}]
[{"$f":"IF(COUNTIF(Invoer!#REF!,Invoer!#REF!)=1,Invoer!#REF!,\"\")","v":{"$error":"#REF!"}},{"$f":"VLOOKUP(A103,Invoer!#REF!,2,0)","v":{"$error":"#REF!"}},{"$f":"VLOOKUP(A103,Invoer!#REF!,3,0)","v":{"$error":"#REF!"}},{"$f":"VLOOKUP(A103,Invoer!#REF!,6,0)","v":{"$error":"#REF!"}},{"$f":"VLOOKUP(A103,Invoer!#REF!,5,0)","v":{"$error":"#REF!"}},{"$f":"VLOOKUP(A103,Invoer!#REF!,10,0)","v":{"$error":"#REF!"}},{"$f":"COUNTIF(Invoer!#REF!,A103)","v":{"$error":"#REF!"}},{"$f":"COUNTIFS(Invoer!#REF!,A103,Invoer!#REF!,\"z\")","v":{"$error":"#REF!"}},{"$f":"COUNTIFS(Invoer!#REF!,A103,Invoer!#REF!,\"a\")","v":{"$error":"#REF!"}},null,{"$f":"IF(COUNTIF(A$2:A$2,A103)=1,A103,\"\")","v":{"$error":"#REF!"}}]
[{"$f":"IF(COUNTIF(Invoer!#REF!,Invoer!#REF!)=1,Invoer!#REF!,\"\")","v":{"$error":"#REF!"}},{"$f":"VLOOKUP(A104,Invoer!#REF!,2,0)","v":{"$error":"#REF!"}},{"$f":"VLOOKUP(A104,Invoer!#REF!,3,0)","v":{"$error":"#REF!"}},{"$f":"VLOOKUP(A104,Invoer!#REF!,6,0)","v":{"$error":"#REF!"}},{"$f":"VLOOKUP(A104,Invoer!#REF!,5,0)","v":{"$error":"#REF!"}},{"$f":"VLOOKUP(A104,Invoer!#REF!,10,0)","v":{"$error":"#REF!"}},{"$f":"COUNTIF(Invoer!#REF!,A104)","v":{"$error":"#REF!"}},{"$f":"COUNTIFS(Invoer!#REF!,A104,Invoer!#REF!,\"z\")","v":{"$error":"#REF!"}},{"$f":"COUNTIFS(Invoer!#REF!,A104,Invoer!#REF!,\"a\")","v":{"$error":"#REF!"}}]
[{"$f":"IF(COUNTIF(Invoer!#REF!,Invoer!#REF!)=1,Invoer!#REF!,\"\")","v":{"$error":"#REF!"}},{"$f":"VLOOKUP(A105,Invoer!#REF!,2,0)","v":{"$error":"#REF!"}},{"$f":"VLOOKUP(A105,Invoer!#REF!,3,0)","v":{"$error":"#REF!"}},{"$f":"VLOOKUP(A105,Invoer!#REF!,6,0)","v":{"$error":"#REF!"}},{"$f":"VLOOKUP(A105,Invoer!#REF!,5,0)","v":{"$error":"#REF!"}},{"$f":"VLOOKUP(A105,Invoer!#REF!,10,0)","v":{"$error":"#REF!"}},{"$f":"COUNTIF(Invoer!#REF!,A105)","v":{"$error":"#REF!"}},{"$f":"COUNTIFS(Invoer!#REF!,A105,Invoer!#REF!,\"z\")","v":{"$error":"#REF!"}},{"$f":"COUNTIFS(Invoer!#REF!,A105,Invoer!#REF!,\"a\")","v":{"$error":"#REF!"}}]
[{"$f":"IF(COUNTIF(Invoer!#REF!,Invoer!#REF!)=1,Invoer!#REF!,\"\")","v":{"$error":"#REF!"}},{"$f":"VLOOKUP(A106,Invoer!#REF!,2,0)","v":{"$error":"#REF!"}},{"$f":"VLOOKUP(A106,Invoer!#REF!,3,0)","v":{"$error":"#REF!"}},{"$f":"VLOOKUP(A106,Invoer!#REF!,6,0)","v":{"$error":"#REF!"}},{"$f":"VLOOKUP(A106,Invoer!#REF!,5,0)","v":{"$error":"#REF!"}},{"$f":"VLOOKUP(A106,Invoer!#REF!,10,0)","v":{"$error":"#REF!"}},{"$f":"COUNTIF(Invoer!#REF!,A106)","v":{"$error":"#REF!"}},{"$f":"COUNTIFS(Invoer!#REF!,A106,Invoer!#REF!,\"z\")","v":{"$error":"#REF!"}},{"$f":"COUNTIFS(Invoer!#REF!,A106,Invoer!#REF!,\"a\")","v":{"$error":"#REF!"}}]
[{"$f":"IF(COUNTIF(Invoer!#REF!,Invoer!#REF!)=1,Invoer!#REF!,\"\")","v":{"$error":"#REF!"}},{"$f":"VLOOKUP(A107,Invoer!#REF!,2,0)","v":{"$error":"#REF!"}},{"$f":"VLOOKUP(A107,Invoer!#REF!,3,0)","v":{"$error":"#REF!"}},{"$f":"VLOOKUP(A107,Invoer!#REF!,6,0)","v":{"$error":"#REF!"}},{"$f":"VLOOKUP(A107,Invoer!#REF!,5,0)","v":{"$error":"#REF!"}},{"$f":"VLOOKUP(A107,Invoer!#REF!,10,0)","v":{"$error":"#REF!"}},{"$f":"COUNTIF(Invoer!#REF!,A107)","v":{"$error":"#REF!"}},{"$f":"COUNTIFS(Invoer!#REF!,A107,Invoer!#REF!,\"z\")","v":{"$error":"#REF!"}},{"$f":"COUNTIFS(Invoer!#REF!,A107,Invoer!#REF!,\"a\")","v":{"$error":"#REF!"}}]
[{"$f":"IF(COUNTIF(Invoer!#REF!,Invoer!#REF!)=1,Invoer!#REF!,\"\")","v":{"$error":"#REF!"}},{"$f":"VLOOKUP(A108,Invoer!#REF!,2,0)","v":{"$error":"#REF!"}},{"$f":"VLOOKUP(A108,Invoer!#REF!,3,0)","v":{"$error":"#REF!"}},{"$f":"VLOOKUP(A108,Invoer!#REF!,6,0)","v":{"$error":"#REF!"}},{"$f":"VLOOKUP(A108,Invoer!#REF!,5,0)","v":{"$error":"#REF!"}},{"$f":"VLOOKUP(A108,Invoer!#REF!,10,0)","v":{"$error":"#REF!"}},{"$f":"COUNTIF(Invoer!#REF!,A108)","v":{"$error":"#REF!"}},{"$f":"COUNTIFS(Invoer!#REF!,A108,Invoer!#REF!,\"z\")","v":{"$error":"#REF!"}},{"$f":"COUNTIFS(Invoer!#REF!,A108,Invoer!#REF!,\"a\")","v":{"$error":"#REF!"}}]
[{"$f":"IF(COUNTIF(Invoer!#REF!,Invoer!#REF!)=1,Invoer!#REF!,\"\")","v":{"$error":"#REF!"}},{"$f":"VLOOKUP(A109,Invoer!#REF!,2,0)","v":{"$error":"#REF!"}},{"$f":"VLOOKUP(A109,Invoer!#REF!,3,0)","v":{"$error":"#REF!"}},{"$f":"VLOOKUP(A109,Invoer!#REF!,6,0)","v":{"$error":"#REF!"}},{"$f":"VLOOKUP(A109,Invoer!#REF!,5,0)","v":{"$error":"#REF!"}},{"$f":"VLOOKUP(A109,Invoer!#REF!,10,0)","v":{"$error":"#REF!"}},{"$f":"COUNTIF(Invoer!#REF!,A109)","v":{"$error":"#REF!"}},{"$f":"COUNTIFS(Invoer!#REF!,A109,Invoer!#REF!,\"z\")","v":{"$error":"#REF!"}},{"$f":"COUNTIFS(Invoer!#REF!,A109,Invoer!#REF!,\"a\")","v":{"$error":"#REF!"}}]
[{"$f":"IF(COUNTIF(Invoer!#REF!,Invoer!#REF!)=1,Invoer!#REF!,\"\")","v":{"$error":"#REF!"}},{"$f":"VLOOKUP(A110,Invoer!#REF!,2,0)","v":{"$error":"#REF!"}},{"$f":"VLOOKUP(A110,Invoer!#REF!,3,0)","v":{"$error":"#REF!"}},{"$f":"VLOOKUP(A110,Invoer!#REF!,6,0)","v":{"$error":"#REF!"}},{"$f":"VLOOKUP(A110,Invoer!#REF!,5,0)","v":{"$error":"#REF!"}},{"$f":"VLOOKUP(A110,Invoer!#REF!,10,0)","v":{"$error":"#REF!"}},{"$f":"COUNTIF(Invoer!#REF!,A110)","v":{"$error":"#REF!"}},{"$f":"COUNTIFS(Invoer!#REF!,A110,Invoer!#REF!,\"z\")","v":{"$error":"#REF!"}},{"$f":"COUNTIFS(Invoer!#REF!,A110,Invoer!#REF!,\"a\")","v":{"$error":"#REF!"}}]

{"sheet":"Constant","index":2,"n_rows":41,"n_cols":2,"rows_kept":41,"cut":false,"hidden":false,"merged":[[0,0,0,1]]}
["lijsten"]
["kleur","code"]
[1958,"heidebruin"]
[2914,"olijfglans"]
[3211,"diep paars"]
[3923,"revolvergrijs"]
[4208,"bloedrood"]
[4406,"diep oranje"]
[7311,"groen"]
[8412,"hemelsblauw"]
[8501,"ultramarijnblauw"]
[8811,"donker grauwblauw"]
[8902,"suedegrijs"]
[9084,"zeildoekgrijs"]
[9091,"tuinaarde bruin"]
[9104,"nerts"]
[9502,"donker kolengrijs"]
[9504,"staalgrijs"]
[9511,"donker legergroen"]
[9522,"donker matgrijs"]
[3118,"paars"]
[4307,"rood"]
[4407,"oranje"]
[7218,"donkergroen"]
[8208,"lichtblauw"]
[8508,"donkerblauw"]
[4301,"diep rood"]
[6117,"narcis"]
[6422,"vers mos"]
[8103,"algiers blauw"]
[8812,"blauw edelsteen"]
[9031,"grijszwart"]
[9032,"tin"]
[9092,"zwartolijf"]
[9096,"geelgrijs"]
[9107,"stof"]
[9505,"kalksteengrijs"]
[9523,"donkeragaatgrijs"]
[1348,"special"]
[1231,"special"]
[1352,"special"]