{"text_format":"1","workbook":"xlsx","n_sheets":3,"sheets":["Invoer","Orders","Constant"],"not_rendered":{"charts":0,"images":0,"macros":1,"external_links":0,"defined_names":10,"comments":0,"pivot_tables":0},"unopened":[],"bounds":{"document_bytes":16777216,"sheet_cells":100000,"rows_first":2000,"rows_last":500,"rows_between":2000,"halvings":0,"cell_chars":16384,"cell_head_chars":4096},"cells_cut":0,"cells_raw":0,"read":"whole","date_system":"1900"}

{"sheet":"Invoer","index":0,"n_rows":101,"n_cols":10,"rows_kept":101,"cut":false,"hidden":false,"merged":[]}
["Order","Datum","Soort","Zone","Aantal","Kleur","Rij","Boom","Probleem","Harde kleur"]
[330730,"2016-10-26","Pompelmoes",1,3952,9511,25,1,"a",{"$f":"VLOOKUP(Tabel146[[#This Row],[Kleur]],harde,2,0)","v":"donker legergroen"}]
[330730,"2016-10-26","Pompelmoes",1,3952,9511,25,2,"z",{"$f":"VLOOKUP(Tabel146[[#This Row],[Kleur]],harde,2,0)","v":"donker legergroen"}]
[330730,"2016-10-26","Pompelmoes",1,3952,9511,25,4,"e",{"$f":"VLOOKUP(Tabel146[[#This Row],[Kleur]],harde,2,0)","v":"donker legergroen"}]
[330730,"2016-10-26","Pompelmoes",1,3952,9511,25,10,"r",{"$f":"VLOOKUP(Tabel146[[#This Row],[Kleur]],harde,2,0)","v":"donker legergroen"}]
[330730,"2016-10-26","Pompelmoes",1,3952,9511,25,11,"g",{"$f":"VLOOKUP(Tabel146[[#This Row],[Kleur]],harde,2,0)","v":"donker legergroen"}]
[330730,"2016-10-26","Pompelmoes",1,3952,9511,25,11,"f",{"$f":"VLOOKUP(Tabel146[[#This Row],[Kleur]],harde,2,0)","v":"donker legergroen"}]
[330730,"2016-10-26","Pompelmoes",1,3952,9511,25,11,"d",{"$f":"VLOOKUP(Tabel146[[#This Row],[Kleur]],harde,2,0)","v":"donker legergroen"}]
[330730,"2016-10-26","Pompelmoes",1,3952,9511,25,11,"s",{"$f":"VLOOKUP(Tabel146[[#This Row],[Kleur]],harde,2,0)","v":"donker legergroen"}]
[330730,"2016-10-26","Pompelmoes",1,3952,9511,25,11,"z",{"$f":"VLOOKUP(Tabel146[[#This Row],[Kleur]],harde,2,0)","v":"donker legergroen"}]
[330731,"2016-10-26","Pompelmoes",2,3952,9511,25,2,"a",{"$f":"VLOOKUP(Tabel146[[#This Row],[Kleur]],harde,2,0)","v":"donker legergroen"}]
[330731,"2016-10-26","Pompelmoes",2,3952,9511,25,4,"d",{"$f":"VLOOKUP(Tabel146[[#This Row],[Kleur]],harde,2,0)","v":"donker legergroen"}]
[330731,"2016-10-26","Pompelmoes",2,3952,9511,25,6,"e",{"$f":"VLOOKUP(Tabel146[[#This Row],[Kleur]],harde,2,0)","v":"donker legergroen"}]
[330731,"2016-10-26","Pompelmoes",2,3952,9511,25,9,"e",{"$f":"VLOOKUP(Tabel146[[#This Row],[Kleur]],harde,2,0)","v":"donker legergroen"}]
[332389,"2016-10-27","Pompelmoes",1,2608,7218,25,2,"z",{"$f":"VLOOKUP(Tabel146[[#This Row],[Kleur]],harde,2,0)","v":"donkergroen"}]
[332389,"2016-10-27","Pompelmoes",1,2608,7218,25,4,"g",{"$f":"VLOOKUP(Tabel146[[#This Row],[Kleur]],harde,2,0)","v":"donkergroen"}]
[332389,"2016-10-27","Pompelmoes",1,2608,7218,25,5,"e",{"$f":"VLOOKUP(Tabel146[[#This Row],[Kleur]],harde,2,0)","v":"donkergroen"}]
[332389,"2016-10-27","Pompelmoes",1,2608,7218,25,6,"a",{"$f":"VLOOKUP(Tabel146[[#This Row],[Kleur]],harde,2,0)","v":"donkergroen"}]
[332390,"2016-10-27","Pompelmoes",2,2608,8208,25,3,"z",{"$f":"VLOOKUP(Tabel146[[#This Row],[Kleur]],harde,2,0)","v":"lichtblauw"}]
[332390,"2016-10-27","Pompelmoes",2,2608,8208,25,5,"d",{"$f":"VLOOKUP(Tabel146[[#This Row],[Kleur]],harde,2,0)","v":"lichtblauw"}]
[332390,"2016-10-27","Pompelmoes",2,2608,8208,25,6,"s",{"$f":"VLOOKUP(Tabel146[[#This Row],[Kleur]],harde,2,0)","v":"lichtblauw"}]
[331106,"2016-10-29","Pompelmoes",1,3952,9511,25,1,"z",{"$f":"VLOOKUP(Tabel146[[#This Row],[Kleur]],harde,2,0)","v":"donker legergroen"}]
[331106,"2016-10-29","Pompelmoes",1,3952,9511,25,2,"e",{"$f":"VLOOKUP(Tabel146[[#This Row],[Kleur]],harde,2,0)","v":"donker legergroen"}]
[331106,"2016-10-29","Pompelmoes",1,3952,9511,25,10,"r",{"$f":"VLOOKUP(Tabel146[[#This Row],[Kleur]],harde,2,0)","v":"donker legergroen"}]
[331107,"2016-10-29","Pompelmoes",2,3952,9511,25,7,"z",{"$f":"VLOOKUP(Tabel146[[#This Row],[Kleur]],harde,2,0)","v":"donker legergroen"}]
[331107,"2016-10-29","Pompelmoes",2,3952,9511,25,7,"a",{"$f":"VLOOKUP(Tabel146[[#This Row],[Kleur]],harde,2,0)","v":"donker legergroen"}]
[331107,"2016-10-29","Pompelmoes",2,3952,9511,25,10,"z",{"$f":"VLOOKUP(Tabel146[[#This Row],[Kleur]],harde,2,0)","v":"donker legergroen"}]
[331107,"2016-10-29","Pompelmoes",2,3952,9511,25,10,"e",{"$f":"VLOOKUP(Tabel146[[#This Row],[Kleur]],harde,2,0)","v":"donker legergroen"}]
[331107,"2016-10-29","Pompelmoes",2,3952,9511,25,11,"r",{"$f":"VLOOKUP(Tabel146[[#This Row],[Kleur]],harde,2,0)","v":"donker legergroen"}]
[330188,"2016-10-30","Appel",1,3322,4208,82,1,"z",{"$f":"VLOOKUP(Tabel146[[#This Row],[Kleur]],harde,2,0)","v":"bloedrood"}]
{"$rows_left_out":72}
{"sheet":"Orders","index":1,"n_rows":110,"n_cols":11,"rows_kept":110,"cut":false,"hidden":false,"merged":[]}
["Order","Datum","Soort","Kleur","Aantal","Harde kleur","totaal problemen","probleem \"z\"","problemen \"a\""]
[{"$f":"IF(COUNTIF(Invoer!#REF!,Invoer!#REF!)=1,Invoer!#REF!,\"\")","v":{"$error":"#REF!"}},{"$f":"VLOOKUP(A2,Invoer!#REF!,2,0)","v":{"$error":"#REF!"}},{"$f":"VLOOKUP(A2,Invoer!#REF!,3,0)","v":{"$error":"#REF!"}},{"$f":"VLOOKUP(A2,Invoer!#REF!,6,0)","v":{"$error":"#REF!"}},{"$f":"VLOOKUP(A2,Invoer!#REF!,5,0)","v":{"$error":"#REF!"}},{"$f":"VLOOKUP(A2,Invoer!#REF!,10,0)","v":{"$error":"#REF!"}},{"$f":"COUNTIF(Invoer!#REF!,A2)","v":{"$error":"#REF!"}},{"$f":"COUNTIFS(Invoer!#REF!,A2,Invoer!#REF!,\"z\")","v":{"$error":"#REF!"}},{"$f":"COUNTIFS(Invoer!#REF!,A2,Invoer!#REF!,\"a\")","v":{"$error":"#REF!"}},null,{"$f":"IF(COUNTIF(A$2:A2,A2)=1,A2,\"\")","v":{"$error":"#REF!"}}]
[{"$f":"IF(COUNTIF(Invoer!#REF!,Invoer!#REF!)=1,Invoer!#REF!,\"\")","v":{"$error":"#REF!"}},{"$f":"VLOOKUP(A3,Invoer!#REF!,2,0)","v":{"$error":"#REF!"}},{"$f":"VLOOKUP(A3,Invoer!#REF!,3,0)","v":{"$error":"#REF!"}},{"$f":"VLOOKUP(A3,Invoer!#REF!,6,0)","v":{"$error":"#REF!"}},{"$f":"VLOOKUP(A3,Invoer!#REF!,5,0)","v":{"$error":"#REF!"}},{"$f":"VLOOKUP(A3,Invoer!#REF!,10,0)","v":{"$error":"#REF!"}},{"$f":"COUNTIF(Invoer!#REF!,A3)","v":{"$error":"#REF!"}},{"$f":"COUNTIFS(Invoer!#REF!,A3,Invoer!#REF!,\"z\")","v":{"$error":"#REF!"}},{"$f":"COUNTIFS(Invoer!#REF!,A3,Invoer!#REF!,\"a\")","v":{"$error":"#REF!"}},null,{"$f":"IF(COUNTIF(A$2:A3,A3)=1,A3,\"\")","v":""}]
[{"$f":"IF(COUNTIF(Invoer!#REF!,Invoer!#REF!)=1,Invoer!#REF!,\"\")","v":{"$error":"#REF!"}},{"$f":"VLOOKUP(A4,Invoer!#REF!,2,0)","v":{"$error":"#REF!"}},{"$f":"VLOOKUP(A4,Invoer!#REF!,3,0)","v":{"$error":"#REF!"}},{"$f":"VLOOKUP(A4,Invoer!#REF!,6,0)","v":{"$error":"#REF!"}},{"$f":"VLOOKUP(A4,Invoer!#REF!,5,0)","v":{"$error":"#REF!"}},{"$f":"VLOOKUP(A4,Invoer!#REF!,10,0)","v":{"$error":"#REF!"}},{"$f":"COUNTIF(Invoer!#REF!,A4)","v":{"$error":"#REF!"}},{"$f":"COUNTIFS(Invoer!#REF!,A4,Invoer!#REF!,\"z\")","v":{"$error":"#REF!"}},{"$f":"COUNTIFS(Invoer!#REF!,A4,Invoer!#REF!,\"a\")","v":{"$error":"#REF!"}},null,{"$f":"IF(COUNTIF(A$2:A4,A4)=1,A4,\"\")","v":""}]
[{"$f":"IF(COUNTIF(Invoer!#REF!,Invoer!#REF!)=1,Invoer!#REF!,\"\")","v":{"$error":"#REF!"}},{"$f":"VLOOKUP(A5,Invoer!#REF!,2,0)","v":{"$error":"#REF!"}},{"$f":"VLOOKUP(A5,Invoer!#REF!,3,0)","v":{"$error":"#REF!"}},{"$f":"VLOOKUP(A5,Invoer!#REF!,6,0)","v":{"$error":"#REF!"}},{"$f":"VLOOKUP(A5,Invoer!#REF!,5,0)","v":{"$error":"#REF!"}},{"$f":"VLOOKUP(A5,Invoer!#REF!,10,0)","v":{"$error":"#REF!"}},{"$f":"COUNTIF(Invoer!#REF!,A5)","v":{"$error":"#REF!"}},{"$f":"COUNTIFS(Invoer!#REF!,A5,Invoer!#REF!,\"z\")","v":{"$error":"#REF!"}},{"$f":"COUNTIFS(Invoer!#REF!,A5,Invoer!#REF!,\"a\")","v":{"$error":"#REF!"}},null,{"$f":"IF(COUNTIF(A$2:A5,A5)=1,A5,\"\")","v":""}]
[{"$f":"IF(COUNTIF(Invoer!#REF!,Invoer!#REF!)=1,Invoer!#REF!,\"\")","v":{"$error":"#REF!"}},{"$f":"VLOOKUP(A6,Invoer!#REF!,2,0)","v":{"$error":"#REF!"}},{"$f":"VLOOKUP(A6,Invoer!#REF!,3,0)","v":{"$error":"#REF!"}},{"$f":"VLOOKUP(A6,Invoer!#REF!,6,0)","v":{"$error":"#REF!"}},{"$f":"VLOOKUP(A6,Invoer!#REF!,5,0)","v":{"$error":"#REF!"}},{"$f":"VLOOKUP(A6,Invoer!#REF!,10,0)","v":{"$error":"#REF!"}},{"$f":"COUNTIF(Invoer!#REF!,A6)","v":{"$error":"#REF!"}},{"$f":"COUNTIFS(Invoer!#REF!,A6,Invoer!#REF!,\"z\")","v":{"$error":"#REF!"}},{"$f":"COUNTIFS(Invoer!#REF!,A6,Invoer!#REF!,\"a\")","v":{"$error":"#REF!"}},null,{"$f":"IF(COUNTIF(A$2:A6,A6)=1,A6,\"\")","v":""}]
[{"$f":"IF(COUNTIF(Invoer!#REF!,Invoer!#REF!)=1,Invoer!#REF!,\"\")","v":{"$error":"#REF!"}},{"$f":"VLOOKUP(A7,Invoer!#REF!,2,0)","v":{"$error":"#REF!"}},{"$f":"VLOOKUP(A7,Invoer!#REF!,3,0)","v":{"$error":"#REF!"}},{"$f":"VLOOKUP(A7,Invoer!#REF!,6,0)","v":{"$error":"#REF!"}},{"$f":"VLOOKUP(A7,Invoer!#REF!,5,0)","v":{"$error":"#REF!"}},{"$f":"VLOOKUP(A7,Invoer!#REF!,10,0)","v":{"$error":"#REF!"}},{"$f":"COUNTIF(Invoer!#REF!,A7)","v":{"$error":"#REF!"}},{"$f":"COUNTIFS(Invoer!#REF!,A7,Invoer!#REF!,\"z\")","v":{"$error":"#REF!"}},{"$f":"COUNTIFS(Invoer!#REF!,A7,Invoer!#REF!,\"a\")","v":{"$error":"#REF!"}},null,{"$f":"IF(COUNTIF(A$2:A7,A7)=1,A7,\"\")","v":""}]
[{"$f":"IF(COUNTIF(Invoer!#REF!,Invoer!#REF!)=1,Invoer!#REF!,\"\")","v":{"$error":"#REF!"}},{"$f":"VLOOKUP(A8,Invoer!#REF!,2,0)","v":{"$error":"#REF!"}},{"$f":"VLOOKUP(A8,Invoer!#REF!,3,0)","v":{"$error":"#REF!"}},{"$f":"VLOOKUP(A8,Invoer!#REF!,6,0)","v":{"$error":"#REF!"}},{"$f":"VLOOKUP(A8,Invoer!#REF!,5,0)","v":{"$error":"#REF!"}},{"$f":"VLOOKUP(A8,Invoer!#REF!,10,0)","v":{"$error":"#REF!"}},{"$f":"COUNTIF(Invoer!#REF!,A8)","v":{"$error":"#REF!"}},{"$f":"COUNTIFS(Invoer!#REF!,A8,Invoer!#REF!,\"z\")","v":{"$error":"#REF!"}},{"$f":"COUNTIFS(Invoer!#REF!,A8,Invoer!#REF!,\"a\")","v":{"$error":"#REF!"}},null,{"$f":"IF(COUNTIF(A$2:A8,A8)=1,A8,\"\")","v":""}]
[{"$f":"IF(COUNTIF(Invoer!#REF!,Invoer!#REF!)=1,Invoer!#REF!,\"\")","v":{"$error":"#REF!"}},{"$f":"VLOOKUP(A9,Invoer!#REF!,2,0)","v":{"$error":"#REF!"}},{"$f":"VLOOKUP(A9,Invoer!#REF!,3,0)","v":{"$error":"#REF!"}},{"$f":"VLOOKUP(A9,Invoer!#REF!,6,0)","v":{"$error":"#REF!"}},{"$f":"VLOOKUP(A9,Invoer!#REF!,5,0)","v":{"$error":"#REF!"}},{"$f":"VLOOKUP(A9,Invoer!#REF!,10,0)","v":{"$error":"#REF!"}},{"$f":"COUNTIF(Invoer!#REF!,A9)","v":{"$error":"#REF!"}},{"$f":"COUNTIFS(Invoer!#REF!,A9,Invoer!#REF!,\"z\")","v":{"$error":"#REF!"}},{"$f":"COUNTIFS(Invoer!#REF!,A9,Invoer!#REF!,\"a\")","v":{"$error":"#REF!"}},null,{"$f":"IF(COUNTIF(A$2:A9,A9)=1,A9,\"\")","v":""}]
[{"$f":"IF(COUNTIF(Invoer!#REF!,Invoer!#REF!)=1,Invoer!#REF!,\"\")","v":{"$error":"#REF!"}},{"$f":"VLOOKUP(A10,Invoer!#REF!,2,0)","v":{"$error":"#REF!"}},{"$f":"VLOOKUP(A10,Invoer!#REF!,3,0)","v":{"$error":"#REF!"}},{"$f":"VLOOKUP(A10,Invoer!#REF!,6,0)","v":{"$error":"#REF!"}},{"$f":"VLOOKUP(A10,Invoer!#REF!,5,0)","v":{"$error":"#REF!"}},{"$f":"VLOOKUP(A10,Invoer!#REF!,10,0)","v":{"$error":"#REF!"}},{"$f":"COUNTIF(Invoer!#REF!,A10)","v":{"$error":"#REF!"}},{"$f":"COUNTIFS(Invoer!#REF!,A10,Invoer!#REF!,\"z\")","v":{"$error":"#REF!"}},{"$f":"COUNTIFS(Invoer!#REF!,A10,Invoer!#REF!,\"a\")","v":{"$error":"#REF!"}},null,{"$f":"IF(COUNTIF(A$2:A10,A10)=1,A10,\"\")","v":""}]
[{"$f":"IF(COUNTIF(Invoer!#REF!,Invoer!#REF!)=1,Invoer!#REF!,\"\")","v":{"$error":"#REF!"}},{"$f":"VLOOKUP(A11,Invoer!#REF!,2,0)","v":{"$error":"#REF!"}},{"$f":"VLOOKUP(A11,Invoer!#REF!,3,0)","v":{"$error":"#REF!"}},{"$f":"VLOOKUP(A11,Invoer!#REF!,6,0)","v":{"$error":"#REF!"}},{"$f":"VLOOKUP(A11,Invoer!#REF!,5,0)","v":{"$error":"#REF!"}},{"$f":"VLOOKUP(A11,Invoer!#REF!,10,0)","v":{"$error":"#REF!"}},{"$f":"COUNTIF(Invoer!#REF!,A11)","v":{"$error":"#REF!"}},{"$f":"COUNTIFS(Invoer!#REF!,A11,Invoer!#REF!,\"z\")","v":{"$error":"#REF!"}},{"$f":"COUNTIFS(Invoer!#REF!,A11,Invoer!#REF!,\"a\")","v":{"$error":"#REF!"}},null,{"$f":"IF(COUNTIF(A$2:A11,A11)=1,A11,\"\")","v":""}]
[{"$f":"IF(COUNTIF(Invoer!#REF!,Invoer!#REF!)=1,Invoer!#REF!,\"\")","v":{"$error":"#REF!"}},{"$f":"VLOOKUP(A12,Invoer!#REF!,2,0)","v":{"$error":"#REF!"}},{"$f":"VLOOKUP(A12,Invoer!#REF!,3,0)","v":{"$error":"#REF!"}},{"$f":"VLOOKUP(A12,Invoer!#REF!,6,0)","v":{"$error":"#REF!"}},{"$f":"VLOOKUP(A12,Invoer!#REF!,5,0)","v":{"$error":"#REF!"}},{"$f":"VLOOKUP(A12,Invoer!#REF!,10,0)","v":{"$error":"#REF!"}},{"$f":"COUNTIF(Invoer!#REF!,A12)","v":{"$error":"#REF!"}},{"$f":"COUNTIFS(Invoer!#REF!,A12,Invoer!#REF!,\"z\")","v":{"$error":"#REF!"}},{"$f":"COUNTIFS(Invoer!#REF!,A12,Invoer!#REF!,\"a\")","v":{"$error":"#REF!"}},null,{"$f":"IF(COUNTIF(A$2:A12,A12)=1,A12,\"\")","v":""}]
[{"$f":"IF(COUNTIF(Invoer!#REF!,Invoer!#REF!)=1,Invoer!#REF!,\"\")","v":{"$error":"#REF!"}},{"$f":"VLOOKUP(A13,Invoer!#REF!,2,0)","v":{"$error":"#REF!"}},{"$f":"VLOOKUP(A13,Invoer!#REF!,3,0)","v":{"$error":"#REF!"}},{"$f":"VLOOKUP(A13,Invoer!#REF!,6,0)","v":{"$error":"#REF!"}},{"$f":"VLOOKUP(A13,Invoer!#REF!,5,0)","v":{"$error":"#REF!"}},{"$f":"VLOOKUP(A13,Invoer!#REF!,10,0)","v":{"$error":"#REF!"}},{"$f":"COUNTIF(Invoer!#REF!,A13)","v":{"$error":"#REF!"}},{"$f":"COUNTIFS(Invoer!#REF!,A13,Invoer!#REF!,\"z\")","v":{"$error":"#REF!"}},{"$f":"COUNTIFS(Invoer!#REF!,A13,Invoer!#REF!,\"a\")","v":{"$error":"#REF!"}},null,{"$f":"IF(COUNTIF(A$2:A13,A13)=1,A13,\"\")","v":""}]
[{"$f":"IF(COUNTIF(Invoer!#REF!,Invoer!#REF!)=1,Invoer!#REF!,\"\")","v":{"$error":"#REF!"}},{"$f":"VLOOKUP(A14,Invoer!#REF!,2,0)","v":{"$error":"#REF!"}},{"$f":"VLOOKUP(A14,Invoer!#REF!,3,0)","v":{"$error":"#REF!"}},{"$f":"VLOOKUP(A14,Invoer!#REF!,6,0)","v":{"$error":"#REF!"}},{"$f":"VLOOKUP(A14,Invoer!#REF!,5,0)","v":{"$error":"#REF!"}},{"$f":"VLOOKUP(A14,Invoer!#REF!,10,0)","v":{"$error":"#REF!"}},{"$f":"COUNTIF(Invoer!#REF!,A14)","v":{"$error":"#REF!"}},{"$f":"COUNTIFS(Invoer!#REF!,A14,Invoer!#REF!,\"z\")","v":{"$error":"#REF!"}},{"$f":"COUNTIFS(Invoer!#REF!,A14,Invoer!#REF!,\"a\")","v":{"$error":"#REF!"}},null,{"$f":"IF(COUNTIF(A$2:A14,A14)=1,A14,\"\")","v":""}]
[{"$f":"IF(COUNTIF(Invoer!#REF!,Invoer!#REF!)=1,Invoer!#REF!,\"\")","v":{"$error":"#REF!"}},{"$f":"VLOOKUP(A15,Invoer!#REF!,2,0)","v":{"$error":"#REF!"}},{"$f":"VLOOKUP(A15,Invoer!#REF!,3,0)","v":{"$error":"#REF!"}},{"$f":"VLOOKUP(A15,Invoer!#REF!,6,0)","v":{"$error":"#REF!"}},{"$f":"VLOOKUP(A15,Invoer!#REF!,5,0)","v":{"$error":"#REF!"}},{"$f":"VLOOKUP(A15,Invoer!#REF!,10,0)","v":{"$error":"#REF!"}},{"$f":"COUNTIF(Invoer!#REF!,A15)","v":{"$error":"#REF!"}},{"$f":"COUNTIFS(Invoer!#REF!,A15,Invoer!#REF!,\"z\")","v":{"$error":"#REF!"}},{"$f":"COUNTIFS(Invoer!#REF!,A15,Invoer!#REF!,\"a\")","v":{"$error":"#REF!"}},null,{"$f":"IF(COUNTIF(A$2:A15,A15)=1,A15,\"\")","v":""}]
[{"$f":"IF(COUNTIF(Invoer!#REF!,Invoer!#REF!)=1,Invoer!#REF!,\"\")","v":{"$error":"#REF!"}},{"$f":"VLOOKUP(A16,Invoer!#REF!,2,0)","v":{"$error":"#REF!"}},{"$f":"VLOOKUP(A16,Invoer!#REF!,3,0)","v":{"$error":"#REF!"}},{"$f":"VLOOKUP(A16,Invoer!#REF!,6,0)","v":{"$error":"#REF!"}},{"$f":"VLOOKUP(A16,Invoer!#REF!,5,0)","v":{"$error":"#REF!"}},{"$f":"VLOOKUP(A16,Invoer!#REF!,10,0)","v":{"$error":"#REF!"}},{"$f":"COUNTIF(Invoer!#REF!,A16)","v":{"$error":"#REF!"}},{"$f":"COUNTIFS(Invoer!#REF!,A16,Invoer!#REF!,\"z\")","v":{"$error":"#REF!"}},{"$f":"COUNTIFS(Invoer!#REF!,A16,Invoer!#REF!,\"a\")","v":{"$error":"#REF!"}},null,{"$f":"IF(COUNTIF(A$2:A16,A16)=1,A16,\"\")","v":""}]
[{"$f":"IF(COUNTIF(Invoer!#REF!,Invoer!#REF!)=1,Invoer!#REF!,\"\")","v":{"$error":"#REF!"}},{"$f":"VLOOKUP(A17,Invoer!#REF!,2,0)","v":{"$error":"#REF!"}},{"$f":"VLOOKUP(A17,Invoer!#REF!,3,0)","v":{"$error":"#REF!"}},{"$f":"VLOOKUP(A17,Invoer!#REF!,6,0)","v":{"$error":"#REF!"}},{"$f":"VLOOKUP(A17,Invoer!#REF!,5,0)","v":{"$error":"#REF!"}},{"$f":"VLOOKUP(A17,Invoer!#REF!,10,0)","v":{"$error":"#REF!"}},{"$f":"COUNTIF(Invoer!#REF!,A17)","v":{"$error":"#REF!"}},{"$f":"COUNTIFS(Invoer!#REF!,A17,Invoer!#REF!,\"z\")","v":{"$error":"#REF!"}},{"$f":"COUNTIFS(Invoer!#REF!,A17,Invoer!#REF!,\"a\")","v":{"$error":"#REF!"}},null,{"$f":"IF(COUNTIF(A$2:A17,A17)=1,A17,\"\")","v":""}]
[{"$f":"IF(COUNTIF(Invoer!#REF!,Invoer!#REF!)=1,Invoer!#REF!,\"\")","v":{"$error":"#REF!"}},{"$f":"VLOOKUP(A18,Invoer!#REF!,2,0)","v":{"$error":"#REF!"}},{"$f":"VLOOKUP(A18,Invoer!#REF!,3,0)","v":{"$error":"#REF!"}},{"$f":"VLOOKUP(A18,Invoer!#REF!,6,0)","v":{"$error":"#REF!"}},{"$f":"VLOOKUP(A18,Invoer!#REF!,5,0)","v":{"$error":"#REF!"}},{"$f":"VLOOKUP(A18,Invoer!#REF!,10,0)","v":{"$error":"#REF!"}},{"$f":"COUNTIF(Invoer!#REF!,A18)","v":{"$error":"#REF!"}},{"$f":"COUNTIFS(Invoer!#REF!,A18,Invoer!#REF!,\"z\")","v":{"$error":"#REF!"}},{"$f":"COUNTIFS(Invoer!#REF!,A18,Invoer!#REF!,\"a\")","v":{"$error":"#REF!"}},null,{"$f":"IF(COUNTIF(A$2:A18,A18)=1,A18,\"\")","v":""}]
[{"$f":"IF(COUNTIF(Invoer!#REF!,Invoer!#REF!)=1,Invoer!#REF!,\"\")","v":{"$error":"#REF!"}},{"$f":"VLOOKUP(A19,Invoer!#REF!,2,0)","v":{"$error":"#REF!"}},{"$f":"VLOOKUP(A19,Invoer!#REF!,3,0)","v":{"$error":"#REF!"}},{"$f":"VLOOKUP(A19,Invoer!#REF!,6,0)","v":{"$error":"#REF!"}},{"$f":"VLOOKUP(A19,Invoer!#REF!,5,0)","v":{"$error":"#REF!"}},{"$f":"VLOOKUP(A19,Invoer!#REF!,10,0)","v":{"$error":"#REF!"}},{"$f":"COUNTIF(Invoer!#REF!,A19)","v":{"$error":"#REF!"}},{"$f":"COUNTIFS(Invoer!#REF!,A19,Invoer!#REF!,\"z\")","v":{"$error":"#REF!"}},{"$f":"COUNTIFS(Invoer!#REF!,A19,Invoer!#REF!,\"a\")","v":{"$error":"#REF!"}},null,{"$f":"IF(COUNTIF(A$2:A19,A19)=1,A19,\"\")","v":""}]
[{"$f":"IF(COUNTIF(Invoer!#REF!,Invoer!#REF!)=1,Invoer!#REF!,\"\")","v":{"$error":"#REF!"}},{"$f":"VLOOKUP(A20,Invoer!#REF!,2,0)","v":{"$error":"#REF!"}},{"$f":"VLOOKUP(A20,Invoer!#REF!,3,0)","v":{"$error":"#REF!"}},{"$f":"VLOOKUP(A20,Invoer!#REF!,6,0)","v":{"$error":"#REF!"}},{"$f":"VLOOKUP(A20,Invoer!#REF!,5,0)","v":{"$error":"#REF!"}},{"$f":"VLOOKUP(A20,Invoer!#REF!,10,0)","v":{"$error":"#REF!"}},{"$f":"COUNTIF(Invoer!#REF!,A20)","v":{"$error":"#REF!"}},{"$f":"COUNTIFS(Invoer!#REF!,A20,Invoer!#REF!,\"z\")","v":{"$error":"#REF!"}},{"$f":"COUNTIFS(Invoer!#REF!,A20,Invoer!#REF!,\"a\")","v":{"$error":"#REF!"}},null,{"$f":"IF(COUNTIF(A$2:A20,A20)=1,A20,\"\")","v":""}]
[{"$f":"IF(COUNTIF(Invoer!#REF!,Invoer!#REF!)=1,Invoer!#REF!,\"\")","v":{"$error":"#REF!"}},{"$f":"VLOOKUP(A21,Invoer!#REF!,2,0)","v":{"$error":"#REF!"}},{"$f":"VLOOKUP(A21,Invoer!#REF!,3,0)","v":{"$error":"#REF!"}},{"$f":"VLOOKUP(A21,Invoer!#REF!,6,0)","v":{"$error":"#REF!"}},{"$f":"VLOOKUP(A21,Invoer!#REF!,5,0)","v":{"$error":"#REF!"}},{"$f":"VLOOKUP(A21,Invoer!#REF!,10,0)","v":{"$error":"#REF!"}},{"$f":"COUNTIF(Invoer!#REF!,A21)","v":{"$error":"#REF!"}},{"$f":"COUNTIFS(Invoer!#REF!,A21,Invoer!#REF!,\"z\")","v":{"$error":"#REF!"}},{"$f":"COUNTIFS(Invoer!#REF!,A21,Invoer!#REF!,\"a\")","v":{"$error":"#REF!"}},null,{"$f":"IF(COUNTIF(A$2:A21,A21)=1,A21,\"\")","v":""}]
[{"$f":"IF(COUNTIF(Invoer!#REF!,Invoer!#REF!)=1,Invoer!#REF!,\"\")","v":{"$error":"#REF!"}},{"$f":"VLOOKUP(A22,Invoer!#REF!,2,0)","v":{"$error":"#REF!"}},{"$f":"VLOOKUP(A22,Invoer!#REF!,3,0)","v":{"$error":"#REF!"}},{"$f":"VLOOKUP(A22,Invoer!#REF!,6,0)","v":{"$error":"#REF!"}},{"$f":"VLOOKUP(A22,Invoer!#REF!,5,0)","v":{"$error":"#REF!"}},{"$f":"VLOOKUP(A22,Invoer!#REF!,10,0)","v":{"$error":"#REF!"}},{"$f":"COUNTIF(Invoer!#REF!,A22)","v":{"$error":"#REF!"}},{"$f":"COUNTIFS(Invoer!#REF!,A22,Invoer!#REF!,\"z\")","v":{"$error":"#REF!"}},{"$f":"COUNTIFS(Invoer!#REF!,A22,Invoer!#REF!,\"a\")","v":{"$error":"#REF!"}},null,{"$f":"IF(COUNTIF(A$2:A22,A22)=1,A22,\"\")","v":""}]
[{"$f":"IF(COUNTIF(Invoer!#REF!,Invoer!#REF!)=1,Invoer!#REF!,\"\")","v":{"$error":"#REF!"}},{"$f":"VLOOKUP(A23,Invoer!#REF!,2,0)","v":{"$error":"#REF!"}},{"$f":"VLOOKUP(A23,Invoer!#REF!,3,0)","v":{"$error":"#REF!"}},{"$f":"VLOOKUP(A23,Invoer!#REF!,6,0)","v":{"$error":"#REF!"}},{"$f":"VLOOKUP(A23,Invoer!#REF!,5,0)","v":{"$error":"#REF!"}},{"$f":"VLOOKUP(A23,Invoer!#REF!,10,0)","v":{"$error":"#REF!"}},{"$f":"COUNTIF(Invoer!#REF!,A23)","v":{"$error":"#REF!"}},{"$f":"COUNTIFS(Invoer!#REF!,A23,Invoer!#REF!,\"z\")","v":{"$error":"#REF!"}},{"$f":"COUNTIFS(Invoer!#REF!,A23,Invoer!#REF!,\"a\")","v":{"$error":"#REF!"}},null,{"$f":"IF(COUNTIF(A$2:A23,A23)=1,A23,\"\")","v":""}]
[{"$f":"IF(COUNTIF(Invoer!#REF!,Invoer!#REF!)=1,Invoer!#REF!,\"\")","v":{"$error":"#REF!"}},{"$f":"VLOOKUP(A24,Invoer!#REF!,2,0)","v":{"$error":"#REF!"}},{"$f":"VLOOKUP(A24,Invoer!#REF!,3,0)","v":{"$error":"#REF!"}},{"$f":"VLOOKUP(A24,Invoer!#REF!,6,0)","v":{"$error":"#REF!"}},{"$f":"VLOOKUP(A24,Invoer!#REF!,5,0)","v":{"$error":"#REF!"}},{"$f":"VLOOKUP(A24,Invoer!#REF!,10,0)","v":{"$error":"#REF!"}},{"$f":"COUNTIF(Invoer!#REF!,A24)","v":{"$error":"#REF!"}},{"$f":"COUNTIFS(Invoer!#REF!,A24,Invoer!#REF!,\"z\")","v":{"$error":"#REF!"}},{"$f":"COUNTIFS(Invoer!#REF!,A24,Invoer!#REF!,\"a\")","v":{"$error":"#REF!"}},null,{"$f":"IF(COUNTIF(A$2:A24,A24)=1,A24,\"\")","v":""}]
[{"$f":"IF(COUNTIF(Invoer!#REF!,Invoer!#REF!)=1,Invoer!#REF!,\"\")","v":{"$error":"#REF!"}},{"$f":"VLOOKUP(A25,Invoer!#REF!,2,0)","v":{"$error":"#REF!"}},{"$f":"VLOOKUP(A25,Invoer!#REF!,3,0)","v":{"$error":"#REF!"}},{"$f":"VLOOKUP(A25,Invoer!#REF!,6,0)","v":{"$error":"#REF!"}},{"$f":"VLOOKUP(A25,Invoer!#REF!,5,0)","v":{"$error":"#REF!"}},{"$f":"VLOOKUP(A25,Invoer!#REF!,10,0)","v":{"$error":"#REF!"}},{"$f":"COUNTIF(Invoer!#REF!,A25)","v":{"$error":"#REF!"}},{"$f":"COUNTIFS(Invoer!#REF!,A25,Invoer!#REF!,\"z\")","v":{"$error":"#REF!"}},{"$f":"COUNTIFS(Invoer!#REF!,A25,Invoer!#REF!,\"a\")","v":{"$error":"#REF!"}},null,{"$f":"IF(COUNTIF(A$2:A25,A25)=1,A25,\"\")","v":""}]
[{"$f":"IF(COUNTIF(Invoer!#REF!,Invoer!#REF!)=1,Invoer!#REF!,\"\")","v":{"$error":"#REF!"}},{"$f":"VLOOKUP(A26,Invoer!#REF!,2,0)","v":{"$error":"#REF!"}},{"$f":"VLOOKUP(A26,Invoer!#REF!,3,0)","v":{"$error":"#REF!"}},{"$f":"VLOOKUP(A26,Invoer!#REF!,6,0)","v":{"$error":"#REF!"}},{"$f":"VLOOKUP(A26,Invoer!#REF!,5,0)","v":{"$error":"#REF!"}},{"$f":"VLOOKUP(A26,Invoer!#REF!,10,0)","v":{"$error":"#REF!"}},{"$f":"COUNTIF(Invoer!#REF!,A26)","v":{"$error":"#REF!"}},{"$f":"COUNTIFS(Invoer!#REF!,A26,Invoer!#REF!,\"z\")","v":{"$error":"#REF!"}},{"$f":"COUNTIFS(Invoer!#REF!,A26,Invoer!#REF!,\"a\")","v":{"$error":"#REF!"}},null,{"$f":"IF(COUNTIF(A$2:A26,A26)=1,A26,\"\")","v":""}]
[{"$f":"IF(COUNTIF(Invoer!#REF!,Invoer!#REF!)=1,Invoer!#REF!,\"\")","v":{"$error":"#REF!"}},{"$f":"VLOOKUP(A27,Invoer!#REF!,2,0)","v":{"$error":"#REF!"}},{"$f":"VLOOKUP(A27,Invoer!#REF!,3,0)","v":{"$error":"#REF!"}},{"$f":"VLOOKUP(A27,Invoer!#REF!,6,0)","v":{"$error":"#REF!"}},{"$f":"VLOOKUP(A27,Invoer!#REF!,5,0)","v":{"$error":"#REF!"}},{"$f":"VLOOKUP(A27,Invoer!#REF!,10,0)","v":{"$error":"#REF!"}},{"$f":"COUNTIF(Invoer!#REF!,A27)","v":{"$error":"#REF!"}},{"$f":"COUNTIFS(Invoer!#REF!,A27,Invoer!#REF!,\"z\")","v":{"$error":"#REF!"}},{"$f":"COUNTIFS(Invoer!#REF!,A27,Invoer!#REF!,\"a\")","v":{"$error":"#REF!"}},null,{"$f":"IF(COUNTIF(A$2:A27,A27)=1,A27,\"\")","v":""}]
[{"$f":"IF(COUNTIF(Invoer!#REF!,Invoer!#REF!)=1,Invoer!#REF!,\"\")","v":{"$error":"#REF!"}},{"$f":"VLOOKUP(A28,Invoer!#REF!,2,0)","v":{"$error":"#REF!"}},{"$f":"VLOOKUP(A28,Invoer!#REF!,3,0)","v":{"$error":"#REF!"}},{"$f":"VLOOKUP(A28,Invoer!#REF!,6,0)","v":{"$error":"#REF!"}},{"$f":"VLOOKUP(A28,Invoer!#REF!,5,0)","v":{"$error":"#REF!"}},{"$f":"VLOOKUP(A28,Invoer!#REF!,10,0)","v":{"$error":"#REF!"}},{"$f":"COUNTIF(Invoer!#REF!,A28)","v":{"$error":"#REF!"}},{"$f":"COUNTIFS(Invoer!#REF!,A28,Invoer!#REF!,\"z\")","v":{"$error":"#REF!"}},{"$f":"COUNTIFS(Invoer!#REF!,A28,Invoer!#REF!,\"a\")","v":{"$error":"#REF!"}},null,{"$f":"IF(COUNTIF(A$2:A28,A28)=1,A28,\"\")","v":""}]
[{"$f":"IF(COUNTIF(Invoer!#REF!,Invoer!#REF!)=1,Invoer!#REF!,\"\")","v":{"$error":"#REF!"}},{"$f":"VLOOKUP(A29,Invoer!#REF!,2,0)","v":{"$error":"#REF!"}},{"$f":"VLOOKUP(A29,Invoer!#REF!,3,0)","v":{"$error":"#REF!"}},{"$f":"VLOOKUP(A29,Invoer!#REF!,6,0)","v":{"$error":"#REF!"}},{"$f":"VLOOKUP(A29,Invoer!#REF!,5,0)","v":{"$error":"#REF!"}},{"$f":"VLOOKUP(A29,Invoer!#REF!,10,0)","v":{"$error":"#REF!"}},{"$f":"COUNTIF(Invoer!#REF!,A29)","v":{"$error":"#REF!"}},{"$f":"COUNTIFS(Invoer!#REF!,A29,Invoer!#REF!,\"z\")","v":{"$error":"#REF!"}},{"$f":"COUNTIFS(Invoer!#REF!,A29,Invoer!#REF!,\"a\")","v":{"$error":"#REF!"}},null,{"$f":"IF(COUNTIF(A$2:A29,A29)=1,A29,\"\")","v":""}]
[{"$f":"IF(COUNTIF(Invoer!#REF!,Invoer!#REF!)=1,Invoer!#REF!,\"\")","v":{"$error":"#REF!"}},{"$f":"VLOOKUP(A30,Invoer!#REF!,2,0)","v":{"$error":"#REF!"}},{"$f":"VLOOKUP(A30,Invoer!#REF!,3,0)","v":{"$error":"#REF!"}},{"$f":"VLOOKUP(A30,Invoer!#REF!,6,0)","v":{"$error":"#REF!"}},{"$f":"VLOOKUP(A30,Invoer!#REF!,5,0)","v":{"$error":"#REF!"}},{"$f":"VLOOKUP(A30,Invoer!#REF!,10,0)","v":{"$error":"#REF!"}},{"$f":"COUNTIF(Invoer!#REF!,A30)","v":{"$error":"#REF!"}},{"$f":"COUNTIFS(Invoer!#REF!,A30,Invoer!#REF!,\"z\")","v":{"$error":"#REF!"}},{"$f":"COUNTIFS(Invoer!#REF!,A30,Invoer!#REF!,\"a\")","v":{"$error":"#REF!"}},null,{"$f":"IF(COUNTIF(A$2:A30,A30)=1,A30,\"\")","v":""}]
{"$rows_left_out":81}
{"sheet":"Constant","index":2,"n_rows":41,"n_cols":2,"rows_kept":41,"cut":false,"hidden":false,"merged":[[0,0,0,1]]}
["lijsten"]
["kleur","code"]
[1958,"heidebruin"]
[2914,"olijfglans"]
[3211,"diep paars"]
[3923,"revolvergrijs"]
[4208,"bloedrood"]
[4406,"diep oranje"]
[7311,"groen"]
[8412,"hemelsblauw"]
[8501,"ultramarijnblauw"]
[8811,"donker grauwblauw"]
[8902,"suedegrijs"]
[9084,"zeildoekgrijs"]
[9091,"tuinaarde bruin"]
[9104,"nerts"]
[9502,"donker kolengrijs"]
[9504,"staalgrijs"]
[9511,"donker legergroen"]
[9522,"donker matgrijs"]
[3118,"paars"]
[4307,"rood"]
[4407,"oranje"]
[7218,"donkergroen"]
[8208,"lichtblauw"]
[8508,"donkerblauw"]
[4301,"diep rood"]
[6117,"narcis"]
[6422,"vers mos"]
[8103,"algiers blauw"]
{"$rows_left_out":11}