{"text_format":"1","workbook":"xlsx","n_sheets":3,"sheets":["Blad1","Blad2","Blad3"],"not_rendered":{"charts":0,"images":0,"macros":1,"external_links":0,"defined_names":4,"comments":0,"pivot_tables":0},"unopened":[],"bounds":{"document_bytes":16777216,"sheet_cells":100000,"rows_first":2000,"rows_last":500,"rows_between":2000,"halvings":0,"cell_chars":16384,"cell_head_chars":4096},"cells_cut":0,"cells_raw":0,"read":"whole","date_system":"1900"}

{"sheet":"Blad1","index":0,"n_rows":19,"n_cols":5,"rows_kept":19,"cut":false,"hidden":false,"merged":[]}
[]
["klant 1","Tekening 1","Machine1","Machine2"]
["klant 2","Tekening 2","Machine4","Machine5","Machine7"]
["klant 3","Tekening 3","Machine6"]
[]
[]
[]
[]
[]
[]
[]
["Klant","klant 1"]
["Machine","Machine1"]
[null,null,1]
[null,{"$f":"IFERROR(IF(C14=2,\"\",VLOOKUP(B12,Blad1!$A$2:$C$4,2,0)),\"\")","v":"Tekening 1"}]
[1,{"$f":"IF($C$14=1,INDEX(Blad2!$D$1:$D$500,MATCH($B$13&A16,Blad2!$B$1:$B$500&Blad2!$C$1:$C$500,0)),INDEX(Blad2!$D$1:$D$500,MATCH($D$15&A16,Blad2!$A$1:$A$500&Blad2!$C$1:$C$500,0)))","v":"toolssl"}]
[2,{"$f":"IF($C$14=1,INDEX(Blad2!$D$1:$D$500,MATCH($B$13&A17,Blad2!$B$1:$B$500&Blad2!$C$1:$C$500,0)),INDEX(Blad2!$D$1:$D$500,MATCH($D$15&A17,Blad2!$A$1:$A$500&Blad2!$C$1:$C$500,0)))","v":"toolssl11"}]
[3,{"$f":"IF($C$14=1,INDEX(Blad2!$D$1:$D$500,MATCH($B$13&A18,Blad2!$B$1:$B$500&Blad2!$C$1:$C$500,0)),INDEX(Blad2!$D$1:$D$500,MATCH($D$15&A18,Blad2!$A$1:$A$500&Blad2!$C$1:$C$500,0)))","v":{"$error":"#N/A"}}]
[4,{"$f":"IF($C$14=1,INDEX(Blad2!$D$1:$D$500,MATCH($B$13&A19,Blad2!$B$1:$B$500&Blad2!$C$1:$C$500,0)),INDEX(Blad2!$D$1:$D$500,MATCH($D$15&A19,Blad2!$A$1:$A$500&Blad2!$C$1:$C$500,0)))","v":{"$error":"#N/A"}}]

{"sheet":"Blad2","index":1,"n_rows":11,"n_cols":14,"rows_kept":11,"cut":false,"hidden":false,"merged":[]}
["Tekening","Machine","Tabel","artikel1","Pos","Aantal",null,null,null,null,"Machine","Tekening"]
["Tekening 2","Machine6",1,"tool",2,5,null,null,null,null,"Machine1","Tekening 1"]
["Tekening 2","Machine6",2,"Tool1",3,1,null,null,null,null,"Machine2","Tekening 1"]
["Tekening 2","Machine6",3,"tool2","as2",9,null,null,null,null,"Machine3"]
["Tekening 2","Machine6",4,"tool3","w1",2,null,null,null,null,"Machine4","Tekening 2"]
["Tekening 3","Machine5",1,"tools",2,5,null,null,null,null,"Machine5","Tekening 2"]
[null,null,null,null,null,null,null,null,null,null,"Machine6","Tekening 3","Tekening 1","Tekening 2"]
["Tekening 3","Machine5",3,"tools22","as2",9,null,null,null,null,"Machine7","Tekening 2"]
["Tekening 3","Machine5",4,"tools33","w1",2]
["Tekening 1","Machine1",1,"toolssl",2,5]
["Tekening 1","Machine1",2,"toolssl11",3,1]

{"sheet":"Blad3","index":2,"n_rows":0,"n_cols":0,"rows_kept":0,"cut":false,"hidden":false,"merged":[]}