{"text_format":"1","workbook":"xlsx","n_sheets":3,"sheets":["Lijst","Adres Barcode stickers","Brief Ades"],"not_rendered":{"charts":0,"images":7,"macros":1,"external_links":0,"defined_names":2,"comments":0,"pivot_tables":0},"unopened":[],"bounds":{"document_bytes":16777216,"sheet_cells":100000,"rows_first":2000,"rows_last":500,"rows_between":2000,"halvings":0,"cell_chars":16384,"cell_head_chars":4096},"cells_cut":0,"cells_raw":0,"read":"whole","date_system":"1900"}

{"sheet":"Lijst","index":0,"n_rows":213,"n_cols":23,"rows_kept":213,"cut":false,"hidden":false,"merged":[[1,13,2,13],[1,0,2,0],[1,16,2,16],[0,0,0,8],[0,9,0,13],[1,1,2,1],[1,2,2,2],[1,3,2,3],[1,7,2,7],[1,9,2,9],[1,10,2,10],[1,4,3,4],[1,11,2,11],[1,12,2,12],[1,5,3,6]]}
["Gastenlijst Meista Assa 05 mei 2018",null,null,null,null,null,null,null,null,"Komt wel of niet. Uiterst bevestigen voor 01 april met hoeveel personen"]
["Gast nr","Achternaam","Roepnaam","Straat","Nr.","Post code",null,"Plaats",null,"To taal","Op komst","WEL","NIET","Mis schien","",null,"EAN39"]
[null,null,null,null,null,null,null,null,null,null,null,null,null,null,{"$f":"VLOOKUP(O2,gastenlijst[[AdresCode]:[Rijnummer]],5,0)","v":{"$error":"#N/A"}}]
[null,null,null,null,null,null,null,null,"Hp nummer",{"$f":"SUM(J6:J213)","v":10},{"$f":"SUM(K6:K213)","v":0},{"$f":"SUM(L9:L213)","v":0},{"$f":"SUM(M9:M213)","v":0},{"$f":"SUM(N9:N213)","v":0},"SCAN HIER de barcode"]
["Gast nr.","Achternaam","Roepnaam","Straat","Huisnr","Post","Code","Plaats","HP nummer","Aantal","Ada","Yes","No","Maby","E-mailadres","GastNr.","ean39","AdresCode","Kolom1","Ja","Kolom2","Rijnummer","Geprint"]
["002","Excel","Forum","Forumstraat",1,4321,"BA","Excelstad",null,3,null,1,null,null," ",{"$f":"5518&gastenlijst[[#This Row],[Gast nr.]]","v":"5518002"},{"$f":"gastenlijst[[#This Row],[Kolom1]]","v":"*00243211*"},{"$f":"CONCATENATE(gastenlijst[[#This Row],[Gast nr.]],gastenlijst[[#This Row],[Post]],gastenlijst[[#This Row],[Yes]])","v":"00243211"},{"$f":"\"*\"&gastenlijst[[#This Row],[AdresCode]]&\"*\"","v":"*00243211*"},{"$f":"IF(gastenlijst[[#This Row],[Yes]]>0,\"ja\",\"\")","v":"ja"},{"$f":"MATCH(O2,gastenlijst[[AdresCode]:[Kolom1]],0)","v":{"$error":"#N/A"}},{"$f":"ROW()","v":6},0]
["001","Forum","Excel","Excelstraat",1,1234,"AB","Forumstad",null,2,null,2,null,null," ",{"$f":"5518&gastenlijst[[#This Row],[Gast nr.]]","v":"5518001"},{"$f":"gastenlijst[[#This Row],[Kolom1]]","v":"*00112342*"},{"$f":"CONCATENATE(gastenlijst[[#This Row],[Gast nr.]],gastenlijst[[#This Row],[Post]],gastenlijst[[#This Row],[Yes]])","v":"00112342"},{"$f":"\"*\"&gastenlijst[[#This Row],[AdresCode]]&\"*\"","v":"*00112342*"},{"$f":"IF(gastenlijst[[#This Row],[Yes]]>0,\"ja\",\"\")","v":"ja"},{"$f":"MATCH(O3,gastenlijst[[AdresCode]:[Kolom2]],0)","v":{"$error":"#N/A"}},{"$f":"ROW()","v":7},1]
["003","Wachten","Geduld","Geduldstraat",1,7879,"WW","Geduldstad",null,5,null,5,null,null," ",{"$f":"5518&gastenlijst[[#This Row],[Gast nr.]]","v":"5518003"},{"$f":"gastenlijst[[#This Row],[Kolom1]]","v":"*00378795*"},{"$f":"CONCATENATE(gastenlijst[[#This Row],[Gast nr.]],gastenlijst[[#This Row],[Post]],gastenlijst[[#This Row],[Yes]])","v":"00378795"},{"$f":"\"*\"&gastenlijst[[#This Row],[AdresCode]]&\"*\"","v":"*00378795*"},{"$f":"IF(gastenlijst[[#This Row],[Yes]]>0,\"ja\",\"\")","v":"ja"},{"$f":"MATCH(O4,gastenlijst[[AdresCode]:[Kolom1]],0)","v":{"$error":"#N/A"}},{"$f":"ROW()","v":8},0]
["004",null,null,null,null,null,null,null,null,null,null,null,null,null," ",{"$f":"5518&gastenlijst[[#This Row],[Gast nr.]]","v":"5518004"},{"$f":"gastenlijst[[#This Row],[Kolom1]]","v":"*004*"},{"$f":"CONCATENATE(gastenlijst[[#This Row],[Gast nr.]],gastenlijst[[#This Row],[Post]],gastenlijst[[#This Row],[Yes]])","v":"004"},{"$f":"\"*\"&gastenlijst[[#This Row],[AdresCode]]&\"*\"","v":"*004*"},{"$f":"IF(gastenlijst[[#This Row],[Yes]]>0,\"ja\",\"\")","v":""},{"$f":"MATCH(O5,gastenlijst[[AdresCode]:[Kolom1]],0)","v":{"$error":"#N/A"}},{"$f":"ROW()","v":9},0]
["005",null,null,null,null,null,null,null,null,null,null,null,null,null," ",{"$f":"5518&gastenlijst[[#This Row],[Gast nr.]]","v":"5518005"},{"$f":"gastenlijst[[#This Row],[Kolom1]]","v":"*005*"},{"$f":"CONCATENATE(gastenlijst[[#This Row],[Gast nr.]],gastenlijst[[#This Row],[Post]],gastenlijst[[#This Row],[Yes]])","v":"005"},{"$f":"\"*\"&gastenlijst[[#This Row],[AdresCode]]&\"*\"","v":"*005*"},{"$f":"IF(gastenlijst[[#This Row],[Yes]]>0,\"ja\",\"\")","v":""},{"$f":"MATCH(O6,gastenlijst[[AdresCode]:[Kolom1]],0)","v":{"$error":"#N/A"}},{"$f":"ROW()","v":10},0]
["006",null,null,null,null,null,null,null,null,null,null,null,null,null," ",{"$f":"5518&gastenlijst[[#This Row],[Gast nr.]]","v":"5518006"},{"$f":"gastenlijst[[#This Row],[Kolom1]]","v":"*006*"},{"$f":"CONCATENATE(gastenlijst[[#This Row],[Gast nr.]],gastenlijst[[#This Row],[Post]],gastenlijst[[#This Row],[Yes]])","v":"006"},{"$f":"\"*\"&gastenlijst[[#This Row],[AdresCode]]&\"*\"","v":"*006*"},{"$f":"IF(gastenlijst[[#This Row],[Yes]]>0,\"ja\",\"\")","v":""},{"$f":"MATCH(O7,gastenlijst[[AdresCode]:[Kolom1]],0)","v":{"$error":"#N/A"}},{"$f":"ROW()","v":11},0]
["007",null,null,null,null,null,null,null,null,null,null,null,null,null," ",{"$f":"5518&gastenlijst[[#This Row],[Gast nr.]]","v":"5518007"},{"$f":"gastenlijst[[#This Row],[Kolom1]]","v":"*007*"},{"$f":"CONCATENATE(gastenlijst[[#This Row],[Gast nr.]],gastenlijst[[#This Row],[Post]],gastenlijst[[#This Row],[Yes]])","v":"007"},{"$f":"\"*\"&gastenlijst[[#This Row],[AdresCode]]&\"*\"","v":"*007*"},{"$f":"IF(gastenlijst[[#This Row],[Yes]]>0,\"ja\",\"\")","v":""},{"$f":"MATCH(O8,gastenlijst[[AdresCode]:[Kolom1]],0)","v":{"$error":"#N/A"}},{"$f":"ROW()","v":12},0]
["008",null,null,null,null,null,null,null,null,null,null,null,null,null," ",{"$f":"5518&gastenlijst[[#This Row],[Gast nr.]]","v":"5518008"},{"$f":"gastenlijst[[#This Row],[Kolom1]]","v":"*008*"},{"$f":"CONCATENATE(gastenlijst[[#This Row],[Gast nr.]],gastenlijst[[#This Row],[Post]],gastenlijst[[#This Row],[Yes]])","v":"008"},{"$f":"\"*\"&gastenlijst[[#This Row],[AdresCode]]&\"*\"","v":"*008*"},{"$f":"IF(gastenlijst[[#This Row],[Yes]]>0,\"ja\",\"\")","v":""},{"$f":"MATCH(O9,gastenlijst[[AdresCode]:[Kolom1]],0)","v":{"$error":"#N/A"}},{"$f":"ROW()","v":13},0]
["009",null,null,null,null,null,null,null,null,null,null,null,null,null," ",{"$f":"5518&gastenlijst[[#This Row],[Gast nr.]]","v":"5518009"},{"$f":"gastenlijst[[#This Row],[Kolom1]]","v":"*009*"},{"$f":"CONCATENATE(gastenlijst[[#This Row],[Gast nr.]],gastenlijst[[#This Row],[Post]],gastenlijst[[#This Row],[Yes]])","v":"009"},{"$f":"\"*\"&gastenlijst[[#This Row],[AdresCode]]&\"*\"","v":"*009*"},{"$f":"IF(gastenlijst[[#This Row],[Yes]]>0,\"ja\",\"\")","v":""},{"$f":"MATCH(O10,gastenlijst[[AdresCode]:[Kolom1]],0)","v":{"$error":"#N/A"}},{"$f":"ROW()","v":14},0]
["010",null,null,null,null,null,null,null,null,null,null,null,null,null," ",{"$f":"5518&gastenlijst[[#This Row],[Gast nr.]]","v":"5518010"},{"$f":"gastenlijst[[#This Row],[Kolom1]]","v":"*010*"},{"$f":"CONCATENATE(gastenlijst[[#This Row],[Gast nr.]],gastenlijst[[#This Row],[Post]],gastenlijst[[#This Row],[Yes]])","v":"010"},{"$f":"\"*\"&gastenlijst[[#This Row],[AdresCode]]&\"*\"","v":"*010*"},{"$f":"IF(gastenlijst[[#This Row],[Yes]]>0,\"ja\",\"\")","v":""},{"$f":"MATCH(O11,gastenlijst[[AdresCode]:[Kolom1]],0)","v":{"$error":"#N/A"}},{"$f":"ROW()","v":15},0]
["011",null,null,null,null,null,null,null,null,null,null,null,null,null," ",{"$f":"5518&gastenlijst[[#This Row],[Gast nr.]]","v":"5518011"},{"$f":"gastenlijst[[#This Row],[Kolom1]]","v":"*011*"},{"$f":"CONCATENATE(gastenlijst[[#This Row],[Gast nr.]],gastenlijst[[#This Row],[Post]],gastenlijst[[#This Row],[Yes]])","v":"011"},{"$f":"\"*\"&gastenlijst[[#This Row],[AdresCode]]&\"*\"","v":"*011*"},{"$f":"IF(gastenlijst[[#This Row],[Yes]]>0,\"ja\",\"\")","v":""},{"$f":"MATCH(O12,gastenlijst[[AdresCode]:[Kolom1]],0)","v":{"$error":"#N/A"}},{"$f":"ROW()","v":16},0]
["012",null,null,null,null,null,null,null,null,null,null,null,null,null," ",{"$f":"5518&gastenlijst[[#This Row],[Gast nr.]]","v":"5518012"},{"$f":"gastenlijst[[#This Row],[Kolom1]]","v":"*012*"},{"$f":"CONCATENATE(gastenlijst[[#This Row],[Gast nr.]],gastenlijst[[#This Row],[Post]],gastenlijst[[#This Row],[Yes]])","v":"012"},{"$f":"\"*\"&gastenlijst[[#This Row],[AdresCode]]&\"*\"","v":"*012*"},{"$f":"IF(gastenlijst[[#This Row],[Yes]]>0,\"ja\",\"\")","v":""},{"$f":"MATCH(O13,gastenlijst[[AdresCode]:[Kolom1]],0)","v":{"$error":"#N/A"}},{"$f":"ROW()","v":17},0]
["013",null,null,null,null,null,null,null,null,null,null,null,null,null," ",{"$f":"5518&gastenlijst[[#This Row],[Gast nr.]]","v":"5518013"},{"$f":"gastenlijst[[#This Row],[Kolom1]]","v":"*013*"},{"$f":"CONCATENATE(gastenlijst[[#This Row],[Gast nr.]],gastenlijst[[#This Row],[Post]],gastenlijst[[#This Row],[Yes]])","v":"013"},{"$f":"\"*\"&gastenlijst[[#This Row],[AdresCode]]&\"*\"","v":"*013*"},{"$f":"IF(gastenlijst[[#This Row],[Yes]]>0,\"ja\",\"\")","v":""},{"$f":"MATCH(O14,gastenlijst[[AdresCode]:[Kolom1]],0)","v":{"$error":"#N/A"}},{"$f":"ROW()","v":18},0]
["014",null,null,null,null,null,null,null,null,null,null,null,null,null," ",{"$f":"5518&gastenlijst[[#This Row],[Gast nr.]]","v":"5518014"},{"$f":"gastenlijst[[#This Row],[Kolom1]]","v":"*014*"},{"$f":"CONCATENATE(gastenlijst[[#This Row],[Gast nr.]],gastenlijst[[#This Row],[Post]],gastenlijst[[#This Row],[Yes]])","v":"014"},{"$f":"\"*\"&gastenlijst[[#This Row],[AdresCode]]&\"*\"","v":"*014*"},{"$f":"IF(gastenlijst[[#This Row],[Yes]]>0,\"ja\",\"\")","v":""},{"$f":"MATCH(O15,gastenlijst[[AdresCode]:[Kolom1]],0)","v":{"$error":"#N/A"}},{"$f":"ROW()","v":19},0]
["015",null,null,null,null,null,null,null,null,null,null,null,null,null," ",{"$f":"5518&gastenlijst[[#This Row],[Gast nr.]]","v":"5518015"},{"$f":"gastenlijst[[#This Row],[Kolom1]]","v":"*015*"},{"$f":"CONCATENATE(gastenlijst[[#This Row],[Gast nr.]],gastenlijst[[#This Row],[Post]],gastenlijst[[#This Row],[Yes]])","v":"015"},{"$f":"\"*\"&gastenlijst[[#This Row],[AdresCode]]&\"*\"","v":"*015*"},{"$f":"IF(gastenlijst[[#This Row],[Yes]]>0,\"ja\",\"\")","v":""},{"$f":"MATCH(O16,gastenlijst[[AdresCode]:[Kolom1]],0)","v":{"$error":"#N/A"}},{"$f":"ROW()","v":20},0]
["016",null,null,null,null,null,null,null,null,null,null,null,null,null," ",{"$f":"5518&gastenlijst[[#This Row],[Gast nr.]]","v":"5518016"},{"$f":"gastenlijst[[#This Row],[Kolom1]]","v":"*016*"},{"$f":"CONCATENATE(gastenlijst[[#This Row],[Gast nr.]],gastenlijst[[#This Row],[Post]],gastenlijst[[#This Row],[Yes]])","v":"016"},{"$f":"\"*\"&gastenlijst[[#This Row],[AdresCode]]&\"*\"","v":"*016*"},{"$f":"IF(gastenlijst[[#This Row],[Yes]]>0,\"ja\",\"\")","v":""},{"$f":"MATCH(O17,gastenlijst[[AdresCode]:[Kolom1]],0)","v":{"$error":"#N/A"}},{"$f":"ROW()","v":21},0]
["017",null,null,null,null,null,null,null,null,null,null,null,null,null," ",{"$f":"5518&gastenlijst[[#This Row],[Gast nr.]]","v":"5518017"},{"$f":"gastenlijst[[#This Row],[Kolom1]]","v":"*017*"},{"$f":"CONCATENATE(gastenlijst[[#This Row],[Gast nr.]],gastenlijst[[#This Row],[Post]],gastenlijst[[#This Row],[Yes]])","v":"017"},{"$f":"\"*\"&gastenlijst[[#This Row],[AdresCode]]&\"*\"","v":"*017*"},{"$f":"IF(gastenlijst[[#This Row],[Yes]]>0,\"ja\",\"\")","v":""},{"$f":"MATCH(O18,gastenlijst[[AdresCode]:[Kolom1]],0)","v":{"$error":"#N/A"}},{"$f":"ROW()","v":22},0]
["018",null,null,null,null,null,null,null,null,null,null,null,null,null," ",{"$f":"5518&gastenlijst[[#This Row],[Gast nr.]]","v":"5518018"},{"$f":"gastenlijst[[#This Row],[Kolom1]]","v":"*018*"},{"$f":"CONCATENATE(gastenlijst[[#This Row],[Gast nr.]],gastenlijst[[#This Row],[Post]],gastenlijst[[#This Row],[Yes]])","v":"018"},{"$f":"\"*\"&gastenlijst[[#This Row],[AdresCode]]&\"*\"","v":"*018*"},{"$f":"IF(gastenlijst[[#This Row],[Yes]]>0,\"ja\",\"\")","v":""},{"$f":"MATCH(O19,gastenlijst[[AdresCode]:[Kolom1]],0)","v":{"$error":"#N/A"}},{"$f":"ROW()","v":23},0]
["019",null,null,null,null,null,null,null,null,null,null,null,null,null," ",{"$f":"5518&gastenlijst[[#This Row],[Gast nr.]]","v":"5518019"},{"$f":"gastenlijst[[#This Row],[Kolom1]]","v":"*019*"},{"$f":"CONCATENATE(gastenlijst[[#This Row],[Gast nr.]],gastenlijst[[#This Row],[Post]],gastenlijst[[#This Row],[Yes]])","v":"019"},{"$f":"\"*\"&gastenlijst[[#This Row],[AdresCode]]&\"*\"","v":"*019*"},{"$f":"IF(gastenlijst[[#This Row],[Yes]]>0,\"ja\",\"\")","v":""},{"$f":"MATCH(O20,gastenlijst[[AdresCode]:[Kolom1]],0)","v":{"$error":"#N/A"}},{"$f":"ROW()","v":24},0]
["020",null,null,null,null,null,null,null,null,null,null,null,null,null," ",{"$f":"5518&gastenlijst[[#This Row],[Gast nr.]]","v":"5518020"},{"$f":"gastenlijst[[#This Row],[Kolom1]]","v":"*020*"},{"$f":"CONCATENATE(gastenlijst[[#This Row],[Gast nr.]],gastenlijst[[#This Row],[Post]],gastenlijst[[#This Row],[Yes]])","v":"020"},{"$f":"\"*\"&gastenlijst[[#This Row],[AdresCode]]&\"*\"","v":"*020*"},{"$f":"IF(gastenlijst[[#This Row],[Yes]]>0,\"ja\",\"\")","v":""},{"$f":"MATCH(O21,gastenlijst[[AdresCode]:[Kolom1]],0)","v":{"$error":"#N/A"}},{"$f":"ROW()","v":25},0]
["021",null,null,null,null,null,null,null,null,null,null,null,null,null," ",{"$f":"5518&gastenlijst[[#This Row],[Gast nr.]]","v":"5518021"},{"$f":"gastenlijst[[#This Row],[Kolom1]]","v":"*021*"},{"$f":"CONCATENATE(gastenlijst[[#This Row],[Gast nr.]],gastenlijst[[#This Row],[Post]],gastenlijst[[#This Row],[Yes]])","v":"021"},{"$f":"\"*\"&gastenlijst[[#This Row],[AdresCode]]&\"*\"","v":"*021*"},{"$f":"IF(gastenlijst[[#This Row],[Yes]]>0,\"ja\",\"\")","v":""},{"$f":"MATCH(O22,gastenlijst[[AdresCode]:[Kolom1]],0)","v":{"$error":"#N/A"}},{"$f":"ROW()","v":26},0]
["022",null,null,null,null,null,null,null,null,null,null,null,null,null," ",{"$f":"5518&gastenlijst[[#This Row],[Gast nr.]]","v":"5518022"},{"$f":"gastenlijst[[#This Row],[Kolom1]]","v":"*022*"},{"$f":"CONCATENATE(gastenlijst[[#This Row],[Gast nr.]],gastenlijst[[#This Row],[Post]],gastenlijst[[#This Row],[Yes]])","v":"022"},{"$f":"\"*\"&gastenlijst[[#This Row],[AdresCode]]&\"*\"","v":"*022*"},{"$f":"IF(gastenlijst[[#This Row],[Yes]]>0,\"ja\",\"\")","v":""},{"$f":"MATCH(O23,gastenlijst[[AdresCode]:[Kolom1]],0)","v":{"$error":"#N/A"}},{"$f":"ROW()","v":27},0]
["023",null,null,null,null,null,null,null,null,null,null,null,null,null," ",{"$f":"5518&gastenlijst[[#This Row],[Gast nr.]]","v":"5518023"},{"$f":"gastenlijst[[#This Row],[Kolom1]]","v":"*023*"},{"$f":"CONCATENATE(gastenlijst[[#This Row],[Gast nr.]],gastenlijst[[#This Row],[Post]],gastenlijst[[#This Row],[Yes]])","v":"023"},{"$f":"\"*\"&gastenlijst[[#This Row],[AdresCode]]&\"*\"","v":"*023*"},{"$f":"IF(gastenlijst[[#This Row],[Yes]]>0,\"ja\",\"\")","v":""},{"$f":"MATCH(O24,gastenlijst[[AdresCode]:[Kolom1]],0)","v":{"$error":"#N/A"}},{"$f":"ROW()","v":28},0]
["024",null,null,null,null,null,null,null,null,null,null,null,null,null," ",{"$f":"5518&gastenlijst[[#This Row],[Gast nr.]]","v":"5518024"},{"$f":"gastenlijst[[#This Row],[Kolom1]]","v":"*024*"},{"$f":"CONCATENATE(gastenlijst[[#This Row],[Gast nr.]],gastenlijst[[#This Row],[Post]],gastenlijst[[#This Row],[Yes]])","v":"024"},{"$f":"\"*\"&gastenlijst[[#This Row],[AdresCode]]&\"*\"","v":"*024*"},{"$f":"IF(gastenlijst[[#This Row],[Yes]]>0,\"ja\",\"\")","v":""},{"$f":"MATCH(O25,gastenlijst[[AdresCode]:[Kolom1]],0)","v":{"$error":"#N/A"}},{"$f":"ROW()","v":29},0]
["025",null,null,null,null,null,null,null,null,null,null,null,null,null," ",{"$f":"5518&gastenlijst[[#This Row],[Gast nr.]]","v":"5518025"},{"$f":"gastenlijst[[#This Row],[Kolom1]]","v":"*025*"},{"$f":"CONCATENATE(gastenlijst[[#This Row],[Gast nr.]],gastenlijst[[#This Row],[Post]],gastenlijst[[#This Row],[Yes]])","v":"025"},{"$f":"\"*\"&gastenlijst[[#This Row],[AdresCode]]&\"*\"","v":"*025*"},{"$f":"IF(gastenlijst[[#This Row],[Yes]]>0,\"ja\",\"\")","v":""},{"$f":"MATCH(O26,gastenlijst[[AdresCode]:[Kolom1]],0)","v":{"$error":"#N/A"}},{"$f":"ROW()","v":30},0]
["026",null,null,null,null,null,null,null,null,null,null,null,null,null," ",{"$f":"5518&gastenlijst[[#This Row],[Gast nr.]]","v":"5518026"},{"$f":"gastenlijst[[#This Row],[Kolom1]]","v":"*026*"},{"$f":"CONCATENATE(gastenlijst[[#This Row],[Gast nr.]],gastenlijst[[#This Row],[Post]],gastenlijst[[#This Row],[Yes]])","v":"026"},{"$f":"\"*\"&gastenlijst[[#This Row],[AdresCode]]&\"*\"","v":"*026*"},{"$f":"IF(gastenlijst[[#This Row],[Yes]]>0,\"ja\",\"\")","v":""},{"$f":"MATCH(O27,gastenlijst[[AdresCode]:[Kolom1]],0)","v":{"$error":"#N/A"}},{"$f":"ROW()","v":31},0]
["027",null,null,null,null,null,null,null,null,null,null,null,null,null," ",{"$f":"5518&gastenlijst[[#This Row],[Gast nr.]]","v":"5518027"},{"$f":"gastenlijst[[#This Row],[Kolom1]]","v":"*027*"},{"$f":"CONCATENATE(gastenlijst[[#This Row],[Gast nr.]],gastenlijst[[#This Row],[Post]],gastenlijst[[#This Row],[Yes]])","v":"027"},{"$f":"\"*\"&gastenlijst[[#This Row],[AdresCode]]&\"*\"","v":"*027*"},{"$f":"IF(gastenlijst[[#This Row],[Yes]]>0,\"ja\",\"\")","v":""},{"$f":"MATCH(O28,gastenlijst[[AdresCode]:[Kolom1]],0)","v":{"$error":"#N/A"}},{"$f":"ROW()","v":32},0]
["028",null,null,null,null,null,null,null,null,null,null,null,null,null," ",{"$f":"5518&gastenlijst[[#This Row],[Gast nr.]]","v":"5518028"},{"$f":"gastenlijst[[#This Row],[Kolom1]]","v":"*028*"},{"$f":"CONCATENATE(gastenlijst[[#This Row],[Gast nr.]],gastenlijst[[#This Row],[Post]],gastenlijst[[#This Row],[Yes]])","v":"028"},{"$f":"\"*\"&gastenlijst[[#This Row],[AdresCode]]&\"*\"","v":"*028*"},{"$f":"IF(gastenlijst[[#This Row],[Yes]]>0,\"ja\",\"\")","v":""},{"$f":"MATCH(O29,gastenlijst[[AdresCode]:[Kolom1]],0)","v":{"$error":"#N/A"}},{"$f":"ROW()","v":33},0]
["029",null,null,null,null,null,null,null,null,null,null,null,null,null," ",{"$f":"5518&gastenlijst[[#This Row],[Gast nr.]]","v":"5518029"},{"$f":"gastenlijst[[#This Row],[Kolom1]]","v":"*029*"},{"$f":"CONCATENATE(gastenlijst[[#This Row],[Gast nr.]],gastenlijst[[#This Row],[Post]],gastenlijst[[#This Row],[Yes]])","v":"029"},{"$f":"\"*\"&gastenlijst[[#This Row],[AdresCode]]&\"*\"","v":"*029*"},{"$f":"IF(gastenlijst[[#This Row],[Yes]]>0,\"ja\",\"\")","v":""},{"$f":"MATCH(O30,gastenlijst[[AdresCode]:[Kolom1]],0)","v":{"$error":"#N/A"}},{"$f":"ROW()","v":34},0]
["030",null,null,null,null,null,null,null,null,null,null,null,null,null," ",{"$f":"5518&gastenlijst[[#This Row],[Gast nr.]]","v":"5518030"},{"$f":"gastenlijst[[#This Row],[Kolom1]]","v":"*030*"},{"$f":"CONCATENATE(gastenlijst[[#This Row],[Gast nr.]],gastenlijst[[#This Row],[Post]],gastenlijst[[#This Row],[Yes]])","v":"030"},{"$f":"\"*\"&gastenlijst[[#This Row],[AdresCode]]&\"*\"","v":"*030*"},{"$f":"IF(gastenlijst[[#This Row],[Yes]]>0,\"ja\",\"\")","v":""},{"$f":"MATCH(O31,gastenlijst[[AdresCode]:[Kolom1]],0)","v":{"$error":"#N/A"}},{"$f":"ROW()","v":35},0]
["031",null,null,null,null,null,null,null,null,null,null,null,null,null," ",{"$f":"5518&gastenlijst[[#This Row],[Gast nr.]]","v":"5518031"},{"$f":"gastenlijst[[#This Row],[Kolom1]]","v":"*031*"},{"$f":"CONCATENATE(gastenlijst[[#This Row],[Gast nr.]],gastenlijst[[#This Row],[Post]],gastenlijst[[#This Row],[Yes]])","v":"031"},{"$f":"\"*\"&gastenlijst[[#This Row],[AdresCode]]&\"*\"","v":"*031*"},{"$f":"IF(gastenlijst[[#This Row],[Yes]]>0,\"ja\",\"\")","v":""},{"$f":"MATCH(O32,gastenlijst[[AdresCode]:[Kolom1]],0)","v":{"$error":"#N/A"}},{"$f":"ROW()","v":36},0]
["032",null,null,null,null,null,null,null,null,null,null,null,null,null," ",{"$f":"5518&gastenlijst[[#This Row],[Gast nr.]]","v":"5518032"},{"$f":"gastenlijst[[#This Row],[Kolom1]]","v":"*032*"},{"$f":"CONCATENATE(gastenlijst[[#This Row],[Gast nr.]],gastenlijst[[#This Row],[Post]],gastenlijst[[#This Row],[Yes]])","v":"032"},{"$f":"\"*\"&gastenlijst[[#This Row],[AdresCode]]&\"*\"","v":"*032*"},{"$f":"IF(gastenlijst[[#This Row],[Yes]]>0,\"ja\",\"\")","v":""},{"$f":"MATCH(O33,gastenlijst[[AdresCode]:[Kolom1]],0)","v":{"$error":"#N/A"}},{"$f":"ROW()","v":37},0]
["033",null,null,null,null,null,null,null,null,null,null,null,null,null," ",{"$f":"5518&gastenlijst[[#This Row],[Gast nr.]]","v":"5518033"},{"$f":"gastenlijst[[#This Row],[Kolom1]]","v":"*033*"},{"$f":"CONCATENATE(gastenlijst[[#This Row],[Gast nr.]],gastenlijst[[#This Row],[Post]],gastenlijst[[#This Row],[Yes]])","v":"033"},{"$f":"\"*\"&gastenlijst[[#This Row],[AdresCode]]&\"*\"","v":"*033*"},{"$f":"IF(gastenlijst[[#This Row],[Yes]]>0,\"ja\",\"\")","v":""},{"$f":"MATCH(O34,gastenlijst[[AdresCode]:[Kolom1]],0)","v":{"$error":"#N/A"}},{"$f":"ROW()","v":38},0]
["034",null,null,null,null,null,null,null,null,null,null,null,null,null," ",{"$f":"5518&gastenlijst[[#This Row],[Gast nr.]]","v":"5518034"},{"$f":"gastenlijst[[#This Row],[Kolom1]]","v":"*034*"},{"$f":"CONCATENATE(gastenlijst[[#This Row],[Gast nr.]],gastenlijst[[#This Row],[Post]],gastenlijst[[#This Row],[Yes]])","v":"034"},{"$f":"\"*\"&gastenlijst[[#This Row],[AdresCode]]&\"*\"","v":"*034*"},{"$f":"IF(gastenlijst[[#This Row],[Yes]]>0,\"ja\",\"\")","v":""},{"$f":"MATCH(O35,gastenlijst[[AdresCode]:[Kolom1]],0)","v":{"$error":"#N/A"}},{"$f":"ROW()","v":39},0]
["035",null,null,null,null,null,null,null,null,null,null,null,null,null," ",{"$f":"5518&gastenlijst[[#This Row],[Gast nr.]]","v":"5518035"},{"$f":"gastenlijst[[#This Row],[Kolom1]]","v":"*035*"},{"$f":"CONCATENATE(gastenlijst[[#This Row],[Gast nr.]],gastenlijst[[#This Row],[Post]],gastenlijst[[#This Row],[Yes]])","v":"035"},{"$f":"\"*\"&gastenlijst[[#This Row],[AdresCode]]&\"*\"","v":"*035*"},{"$f":"IF(gastenlijst[[#This Row],[Yes]]>0,\"ja\",\"\")","v":""},{"$f":"MATCH(O36,gastenlijst[[AdresCode]:[Kolom1]],0)","v":{"$error":"#N/A"}},{"$f":"ROW()","v":40},0]
["036",null,null,null,null,null,null,null,null,null,null,null,null,null," ",{"$f":"5518&gastenlijst[[#This Row],[Gast nr.]]","v":"5518036"},{"$f":"gastenlijst[[#This Row],[Kolom1]]","v":"*036*"},{"$f":"CONCATENATE(gastenlijst[[#This Row],[Gast nr.]],gastenlijst[[#This Row],[Post]],gastenlijst[[#This Row],[Yes]])","v":"036"},{"$f":"\"*\"&gastenlijst[[#This Row],[AdresCode]]&\"*\"","v":"*036*"},{"$f":"IF(gastenlijst[[#This Row],[Yes]]>0,\"ja\",\"\")","v":""},{"$f":"MATCH(O37,gastenlijst[[AdresCode]:[Kolom1]],0)","v":{"$error":"#N/A"}},{"$f":"ROW()","v":41},0]
["037",null,null,null,null,null,null,null,null,null,null,null,null,null," ",{"$f":"5518&gastenlijst[[#This Row],[Gast nr.]]","v":"5518037"},{"$f":"gastenlijst[[#This Row],[Kolom1]]","v":"*037*"},{"$f":"CONCATENATE(gastenlijst[[#This Row],[Gast nr.]],gastenlijst[[#This Row],[Post]],gastenlijst[[#This Row],[Yes]])","v":"037"},{"$f":"\"*\"&gastenlijst[[#This Row],[AdresCode]]&\"*\"","v":"*037*"},{"$f":"IF(gastenlijst[[#This Row],[Yes]]>0,\"ja\",\"\")","v":""},{"$f":"MATCH(O38,gastenlijst[[AdresCode]:[Kolom1]],0)","v":{"$error":"#N/A"}},{"$f":"ROW()","v":42},0]
["038",null,null,null,null,null,null,null,null,null,null,null,null,null," ",{"$f":"5518&gastenlijst[[#This Row],[Gast nr.]]","v":"5518038"},{"$f":"gastenlijst[[#This Row],[Kolom1]]","v":"*038*"},{"$f":"CONCATENATE(gastenlijst[[#This Row],[Gast nr.]],gastenlijst[[#This Row],[Post]],gastenlijst[[#This Row],[Yes]])","v":"038"},{"$f":"\"*\"&gastenlijst[[#This Row],[AdresCode]]&\"*\"","v":"*038*"},{"$f":"IF(gastenlijst[[#This Row],[Yes]]>0,\"ja\",\"\")","v":""},{"$f":"MATCH(O39,gastenlijst[[AdresCode]:[Kolom1]],0)","v":{"$error":"#N/A"}},{"$f":"ROW()","v":43},0]
["039",null,null,null,null,null,null,null,null,null,null,null,null,null," ",{"$f":"5518&gastenlijst[[#This Row],[Gast nr.]]","v":"5518039"},{"$f":"gastenlijst[[#This Row],[Kolom1]]","v":"*039*"},{"$f":"CONCATENATE(gastenlijst[[#This Row],[Gast nr.]],gastenlijst[[#This Row],[Post]],gastenlijst[[#This Row],[Yes]])","v":"039"},{"$f":"\"*\"&gastenlijst[[#This Row],[AdresCode]]&\"*\"","v":"*039*"},{"$f":"IF(gastenlijst[[#This Row],[Yes]]>0,\"ja\",\"\")","v":""},{"$f":"MATCH(O40,gastenlijst[[AdresCode]:[Kolom1]],0)","v":{"$error":"#N/A"}},{"$f":"ROW()","v":44},0]
["040",null,null,null,null,null,null,null,null,null,null,null,null,null," ",{"$f":"5518&gastenlijst[[#This Row],[Gast nr.]]","v":"5518040"},{"$f":"gastenlijst[[#This Row],[Kolom1]]","v":"*040*"},{"$f":"CONCATENATE(gastenlijst[[#This Row],[Gast nr.]],gastenlijst[[#This Row],[Post]],gastenlijst[[#This Row],[Yes]])","v":"040"},{"$f":"\"*\"&gastenlijst[[#This Row],[AdresCode]]&\"*\"","v":"*040*"},{"$f":"IF(gastenlijst[[#This Row],[Yes]]>0,\"ja\",\"\")","v":""},{"$f":"MATCH(O41,gastenlijst[[AdresCode]:[Kolom1]],0)","v":{"$error":"#N/A"}},{"$f":"ROW()","v":45},0]
["041",null,null,null,null,null,null,null,null,null,null,null,null,null," ",{"$f":"5518&gastenlijst[[#This Row],[Gast nr.]]","v":"5518041"},{"$f":"gastenlijst[[#This Row],[Kolom1]]","v":"*041*"},{"$f":"CONCATENATE(gastenlijst[[#This Row],[Gast nr.]],gastenlijst[[#This Row],[Post]],gastenlijst[[#This Row],[Yes]])","v":"041"},{"$f":"\"*\"&gastenlijst[[#This Row],[AdresCode]]&\"*\"","v":"*041*"},{"$f":"IF(gastenlijst[[#This Row],[Yes]]>0,\"ja\",\"\")","v":""},{"$f":"MATCH(O42,gastenlijst[[AdresCode]:[Kolom1]],0)","v":{"$error":"#N/A"}},{"$f":"ROW()","v":46},0]
["042",null,null,null,null,null,null,null,null,null,null,null,null,null," ",{"$f":"5518&gastenlijst[[#This Row],[Gast nr.]]","v":"5518042"},{"$f":"gastenlijst[[#This Row],[Kolom1]]","v":"*042*"},{"$f":"CONCATENATE(gastenlijst[[#This Row],[Gast nr.]],gastenlijst[[#This Row],[Post]],gastenlijst[[#This Row],[Yes]])","v":"042"},{"$f":"\"*\"&gastenlijst[[#This Row],[AdresCode]]&\"*\"","v":"*042*"},{"$f":"IF(gastenlijst[[#This Row],[Yes]]>0,\"ja\",\"\")","v":""},{"$f":"MATCH(O43,gastenlijst[[AdresCode]:[Kolom1]],0)","v":{"$error":"#N/A"}},{"$f":"ROW()","v":47},0]
["043",null,null,null,null,null,null,null,null,null,null,null,null,null," ",{"$f":"5518&gastenlijst[[#This Row],[Gast nr.]]","v":"5518043"},{"$f":"gastenlijst[[#This Row],[Kolom1]]","v":"*043*"},{"$f":"CONCATENATE(gastenlijst[[#This Row],[Gast nr.]],gastenlijst[[#This Row],[Post]],gastenlijst[[#This Row],[Yes]])","v":"043"},{"$f":"\"*\"&gastenlijst[[#This Row],[AdresCode]]&\"*\"","v":"*043*"},{"$f":"IF(gastenlijst[[#This Row],[Yes]]>0,\"ja\",\"\")","v":""},{"$f":"MATCH(O44,gastenlijst[[AdresCode]:[Kolom1]],0)","v":{"$error":"#N/A"}},{"$f":"ROW()","v":48},0]
["044",null,null,null,null,null,null,null,null,null,null,null,null,null," ",{"$f":"5518&gastenlijst[[#This Row],[Gast nr.]]","v":"5518044"},{"$f":"gastenlijst[[#This Row],[Kolom1]]","v":"*044*"},{"$f":"CONCATENATE(gastenlijst[[#This Row],[Gast nr.]],gastenlijst[[#This Row],[Post]],gastenlijst[[#This Row],[Yes]])","v":"044"},{"$f":"\"*\"&gastenlijst[[#This Row],[AdresCode]]&\"*\"","v":"*044*"},{"$f":"IF(gastenlijst[[#This Row],[Yes]]>0,\"ja\",\"\")","v":""},{"$f":"MATCH(O45,gastenlijst[[AdresCode]:[Kolom1]],0)","v":{"$error":"#N/A"}},{"$f":"ROW()","v":49},0]
["045",null,null,null,null,null,null,null,null,null,null,null,null,null," ",{"$f":"5518&gastenlijst[[#This Row],[Gast nr.]]","v":"5518045"},{"$f":"gastenlijst[[#This Row],[Kolom1]]","v":"*045*"},{"$f":"CONCATENATE(gastenlijst[[#This Row],[Gast nr.]],gastenlijst[[#This Row],[Post]],gastenlijst[[#This Row],[Yes]])","v":"045"},{"$f":"\"*\"&gastenlijst[[#This Row],[AdresCode]]&\"*\"","v":"*045*"},{"$f":"IF(gastenlijst[[#This Row],[Yes]]>0,\"ja\",\"\")","v":""},{"$f":"MATCH(O46,gastenlijst[[AdresCode]:[Kolom1]],0)","v":{"$error":"#N/A"}},{"$f":"ROW()","v":50},0]
["046",null,null,null,null,null,null,null,null,null,null,null,null,null," ",{"$f":"5518&gastenlijst[[#This Row],[Gast nr.]]","v":"5518046"},{"$f":"gastenlijst[[#This Row],[Kolom1]]","v":"*046*"},{"$f":"CONCATENATE(gastenlijst[[#This Row],[Gast nr.]],gastenlijst[[#This Row],[Post]],gastenlijst[[#This Row],[Yes]])","v":"046"},{"$f":"\"*\"&gastenlijst[[#This Row],[AdresCode]]&\"*\"","v":"*046*"},{"$f":"IF(gastenlijst[[#This Row],[Yes]]>0,\"ja\",\"\")","v":""},{"$f":"MATCH(O47,gastenlijst[[AdresCode]:[Kolom1]],0)","v":{"$error":"#N/A"}},{"$f":"ROW()","v":51},0]
["047",null,null,null,null,null,null,null,null,null,null,null,null,null," ",{"$f":"5518&gastenlijst[[#This Row],[Gast nr.]]","v":"5518047"},{"$f":"gastenlijst[[#This Row],[Kolom1]]","v":"*047*"},{"$f":"CONCATENATE(gastenlijst[[#This Row],[Gast nr.]],gastenlijst[[#This Row],[Post]],gastenlijst[[#This Row],[Yes]])","v":"047"},{"$f":"\"*\"&gastenlijst[[#This Row],[AdresCode]]&\"*\"","v":"*047*"},{"$f":"IF(gastenlijst[[#This Row],[Yes]]>0,\"ja\",\"\")","v":""},{"$f":"MATCH(O48,gastenlijst[[AdresCode]:[Kolom1]],0)","v":{"$error":"#N/A"}},{"$f":"ROW()","v":52},0]
["048",null,null,null,null,null,null,null,null,null,null,null,null,null," ",{"$f":"5518&gastenlijst[[#This Row],[Gast nr.]]","v":"5518048"},{"$f":"gastenlijst[[#This Row],[Kolom1]]","v":"*048*"},{"$f":"CONCATENATE(gastenlijst[[#This Row],[Gast nr.]],gastenlijst[[#This Row],[Post]],gastenlijst[[#This Row],[Yes]])","v":"048"},{"$f":"\"*\"&gastenlijst[[#This Row],[AdresCode]]&\"*\"","v":"*048*"},{"$f":"IF(gastenlijst[[#This Row],[Yes]]>0,\"ja\",\"\")","v":""},{"$f":"MATCH(O49,gastenlijst[[AdresCode]:[Kolom1]],0)","v":{"$error":"#N/A"}},{"$f":"ROW()","v":53},0]
["049",null,null,null,null,null,null,null,null,null,null,null,null,null," ",{"$f":"5518&gastenlijst[[#This Row],[Gast nr.]]","v":"5518049"},{"$f":"gastenlijst[[#This Row],[Kolom1]]","v":"*049*"},{"$f":"CONCATENATE(gastenlijst[[#This Row],[Gast nr.]],gastenlijst[[#This Row],[Post]],gastenlijst[[#This Row],[Yes]])","v":"049"},{"$f":"\"*\"&gastenlijst[[#This Row],[AdresCode]]&\"*\"","v":"*049*"},{"$f":"IF(gastenlijst[[#This Row],[Yes]]>0,\"ja\",\"\")","v":""},{"$f":"MATCH(O50,gastenlijst[[AdresCode]:[Kolom1]],0)","v":{"$error":"#N/A"}},{"$f":"ROW()","v":54},0]
["050",null,null,null,null,null,null,null,null,null,null,null,null,null," ",{"$f":"5518&gastenlijst[[#This Row],[Gast nr.]]","v":"5518050"},{"$f":"gastenlijst[[#This Row],[Kolom1]]","v":"*050*"},{"$f":"CONCATENATE(gastenlijst[[#This Row],[Gast nr.]],gastenlijst[[#This Row],[Post]],gastenlijst[[#This Row],[Yes]])","v":"050"},{"$f":"\"*\"&gastenlijst[[#This Row],[AdresCode]]&\"*\"","v":"*050*"},{"$f":"IF(gastenlijst[[#This Row],[Yes]]>0,\"ja\",\"\")","v":""},{"$f":"MATCH(O51,gastenlijst[[AdresCode]:[Kolom1]],0)","v":{"$error":"#N/A"}},{"$f":"ROW()","v":55},0]
["051",null,null,null,null,null,null,null,null,null,null,null,null,null," ",{"$f":"5518&gastenlijst[[#This Row],[Gast nr.]]","v":"5518051"},{"$f":"gastenlijst[[#This Row],[Kolom1]]","v":"*051*"},{"$f":"CONCATENATE(gastenlijst[[#This Row],[Gast nr.]],gastenlijst[[#This Row],[Post]],gastenlijst[[#This Row],[Yes]])","v":"051"},{"$f":"\"*\"&gastenlijst[[#This Row],[AdresCode]]&\"*\"","v":"*051*"},{"$f":"IF(gastenlijst[[#This Row],[Yes]]>0,\"ja\",\"\")","v":""},{"$f":"MATCH(O52,gastenlijst[[AdresCode]:[Kolom1]],0)","v":{"$error":"#N/A"}},{"$f":"ROW()","v":56},0]
["052",null,null,null,null,null,null,null,null,null,null,null,null,null," ",{"$f":"5518&gastenlijst[[#This Row],[Gast nr.]]","v":"5518052"},{"$f":"gastenlijst[[#This Row],[Kolom1]]","v":"*052*"},{"$f":"CONCATENATE(gastenlijst[[#This Row],[Gast nr.]],gastenlijst[[#This Row],[Post]],gastenlijst[[#This Row],[Yes]])","v":"052"},{"$f":"\"*\"&gastenlijst[[#This Row],[AdresCode]]&\"*\"","v":"*052*"},{"$f":"IF(gastenlijst[[#This Row],[Yes]]>0,\"ja\",\"\")","v":""},{"$f":"MATCH(O53,gastenlijst[[AdresCode]:[Kolom1]],0)","v":{"$error":"#N/A"}},{"$f":"ROW()","v":57},0]
["053",null,null,null,null,null,null,null,null,null,null,null,null,null," ",{"$f":"5518&gastenlijst[[#This Row],[Gast nr.]]","v":"5518053"},{"$f":"gastenlijst[[#This Row],[Kolom1]]","v":"*053*"},{"$f":"CONCATENATE(gastenlijst[[#This Row],[Gast nr.]],gastenlijst[[#This Row],[Post]],gastenlijst[[#This Row],[Yes]])","v":"053"},{"$f":"\"*\"&gastenlijst[[#This Row],[AdresCode]]&\"*\"","v":"*053*"},{"$f":"IF(gastenlijst[[#This Row],[Yes]]>0,\"ja\",\"\")","v":""},{"$f":"MATCH(O54,gastenlijst[[AdresCode]:[Kolom1]],0)","v":{"$error":"#N/A"}},{"$f":"ROW()","v":58},0]
["054",null,null,null,null,null,null,null,null,null,null,null,null,null," ",{"$f":"5518&gastenlijst[[#This Row],[Gast nr.]]","v":"5518054"},{"$f":"gastenlijst[[#This Row],[Kolom1]]","v":"*054*"},{"$f":"CONCATENATE(gastenlijst[[#This Row],[Gast nr.]],gastenlijst[[#This Row],[Post]],gastenlijst[[#This Row],[Yes]])","v":"054"},{"$f":"\"*\"&gastenlijst[[#This Row],[AdresCode]]&\"*\"","v":"*054*"},{"$f":"IF(gastenlijst[[#This Row],[Yes]]>0,\"ja\",\"\")","v":""},{"$f":"MATCH(O55,gastenlijst[[AdresCode]:[Kolom1]],0)","v":{"$error":"#N/A"}},{"$f":"ROW()","v":59},0]
["055",null,null,null,null,null,null,null,null,null,null,null,null,null," ",{"$f":"5518&gastenlijst[[#This Row],[Gast nr.]]","v":"5518055"},{"$f":"gastenlijst[[#This Row],[Kolom1]]","v":"*055*"},{"$f":"CONCATENATE(gastenlijst[[#This Row],[Gast nr.]],gastenlijst[[#This Row],[Post]],gastenlijst[[#This Row],[Yes]])","v":"055"},{"$f":"\"*\"&gastenlijst[[#This Row],[AdresCode]]&\"*\"","v":"*055*"},{"$f":"IF(gastenlijst[[#This Row],[Yes]]>0,\"ja\",\"\")","v":""},{"$f":"MATCH(O56,gastenlijst[[AdresCode]:[Kolom1]],0)","v":{"$error":"#N/A"}},{"$f":"ROW()","v":60},0]
["056",null,null,null,null,null,null,null,null,null,null,null,null,null," ",{"$f":"5518&gastenlijst[[#This Row],[Gast nr.]]","v":"5518056"},{"$f":"gastenlijst[[#This Row],[Kolom1]]","v":"*056*"},{"$f":"CONCATENATE(gastenlijst[[#This Row],[Gast nr.]],gastenlijst[[#This Row],[Post]],gastenlijst[[#This Row],[Yes]])","v":"056"},{"$f":"\"*\"&gastenlijst[[#This Row],[AdresCode]]&\"*\"","v":"*056*"},{"$f":"IF(gastenlijst[[#This Row],[Yes]]>0,\"ja\",\"\")","v":""},{"$f":"MATCH(O57,gastenlijst[[AdresCode]:[Kolom1]],0)","v":{"$error":"#N/A"}},{"$f":"ROW()","v":61},0]
["057",null,null,null,null,null,null,null,null,null,null,null,null,null," ",{"$f":"5518&gastenlijst[[#This Row],[Gast nr.]]","v":"5518057"},{"$f":"gastenlijst[[#This Row],[Kolom1]]","v":"*057*"},{"$f":"CONCATENATE(gastenlijst[[#This Row],[Gast nr.]],gastenlijst[[#This Row],[Post]],gastenlijst[[#This Row],[Yes]])","v":"057"},{"$f":"\"*\"&gastenlijst[[#This Row],[AdresCode]]&\"*\"","v":"*057*"},{"$f":"IF(gastenlijst[[#This Row],[Yes]]>0,\"ja\",\"\")","v":""},{"$f":"MATCH(O58,gastenlijst[[AdresCode]:[Kolom1]],0)","v":{"$error":"#N/A"}},{"$f":"ROW()","v":62},0]
["058",null,null,null,null,null,null,null,null,null,null,null,null,null," ",{"$f":"5518&gastenlijst[[#This Row],[Gast nr.]]","v":"5518058"},{"$f":"gastenlijst[[#This Row],[Kolom1]]","v":"*058*"},{"$f":"CONCATENATE(gastenlijst[[#This Row],[Gast nr.]],gastenlijst[[#This Row],[Post]],gastenlijst[[#This Row],[Yes]])","v":"058"},{"$f":"\"*\"&gastenlijst[[#This Row],[AdresCode]]&\"*\"","v":"*058*"},{"$f":"IF(gastenlijst[[#This Row],[Yes]]>0,\"ja\",\"\")","v":""},{"$f":"MATCH(O59,gastenlijst[[AdresCode]:[Kolom1]],0)","v":{"$error":"#N/A"}},{"$f":"ROW()","v":63},0]
["059",null,null,null,null,null,null,null,null,null,null,null,null,null," ",{"$f":"5518&gastenlijst[[#This Row],[Gast nr.]]","v":"5518059"},{"$f":"gastenlijst[[#This Row],[Kolom1]]","v":"*059*"},{"$f":"CONCATENATE(gastenlijst[[#This Row],[Gast nr.]],gastenlijst[[#This Row],[Post]],gastenlijst[[#This Row],[Yes]])","v":"059"},{"$f":"\"*\"&gastenlijst[[#This Row],[AdresCode]]&\"*\"","v":"*059*"},{"$f":"IF(gastenlijst[[#This Row],[Yes]]>0,\"ja\",\"\")","v":""},{"$f":"MATCH(O60,gastenlijst[[AdresCode]:[Kolom1]],0)","v":{"$error":"#N/A"}},{"$f":"ROW()","v":64},0]
["060",null,null,null,null,null,null,null,null,null,null,null,null,null," ",{"$f":"5518&gastenlijst[[#This Row],[Gast nr.]]","v":"5518060"},{"$f":"gastenlijst[[#This Row],[Kolom1]]","v":"*060*"},{"$f":"CONCATENATE(gastenlijst[[#This Row],[Gast nr.]],gastenlijst[[#This Row],[Post]],gastenlijst[[#This Row],[Yes]])","v":"060"},{"$f":"\"*\"&gastenlijst[[#This Row],[AdresCode]]&\"*\"","v":"*060*"},{"$f":"IF(gastenlijst[[#This Row],[Yes]]>0,\"ja\",\"\")","v":""},{"$f":"MATCH(O61,gastenlijst[[AdresCode]:[Kolom1]],0)","v":{"$error":"#N/A"}},{"$f":"ROW()","v":65},0]
["061",null,null,null,null,null,null,null,null,null,null,null,null,null," ",{"$f":"5518&gastenlijst[[#This Row],[Gast nr.]]","v":"5518061"},{"$f":"gastenlijst[[#This Row],[Kolom1]]","v":"*061*"},{"$f":"CONCATENATE(gastenlijst[[#This Row],[Gast nr.]],gastenlijst[[#This Row],[Post]],gastenlijst[[#This Row],[Yes]])","v":"061"},{"$f":"\"*\"&gastenlijst[[#This Row],[AdresCode]]&\"*\"","v":"*061*"},{"$f":"IF(gastenlijst[[#This Row],[Yes]]>0,\"ja\",\"\")","v":""},{"$f":"MATCH(O62,gastenlijst[[AdresCode]:[Kolom1]],0)","v":{"$error":"#N/A"}},{"$f":"ROW()","v":66},0]
["062",null,null,null,null,null,null,null,null,null,null,null,null,null," ",{"$f":"5518&gastenlijst[[#This Row],[Gast nr.]]","v":"5518062"},{"$f":"gastenlijst[[#This Row],[Kolom1]]","v":"*062*"},{"$f":"CONCATENATE(gastenlijst[[#This Row],[Gast nr.]],gastenlijst[[#This Row],[Post]],gastenlijst[[#This Row],[Yes]])","v":"062"},{"$f":"\"*\"&gastenlijst[[#This Row],[AdresCode]]&\"*\"","v":"*062*"},{"$f":"IF(gastenlijst[[#This Row],[Yes]]>0,\"ja\",\"\")","v":""},{"$f":"MATCH(O63,gastenlijst[[AdresCode]:[Kolom1]],0)","v":{"$error":"#N/A"}},{"$f":"ROW()","v":67},0]
["063",null,null,null,null,null,null,null,null,null,null,null,null,null," ",{"$f":"5518&gastenlijst[[#This Row],[Gast nr.]]","v":"5518063"},{"$f":"gastenlijst[[#This Row],[Kolom1]]","v":"*063*"},{"$f":"CONCATENATE(gastenlijst[[#This Row],[Gast nr.]],gastenlijst[[#This Row],[Post]],gastenlijst[[#This Row],[Yes]])","v":"063"},{"$f":"\"*\"&gastenlijst[[#This Row],[AdresCode]]&\"*\"","v":"*063*"},{"$f":"IF(gastenlijst[[#This Row],[Yes]]>0,\"ja\",\"\")","v":""},{"$f":"MATCH(O64,gastenlijst[[AdresCode]:[Kolom1]],0)","v":{"$error":"#N/A"}},{"$f":"ROW()","v":68},0]
["064",null,null,null,null,null,null,null,null,null,null,null,null,null," ",{"$f":"5518&gastenlijst[[#This Row],[Gast nr.]]","v":"5518064"},{"$f":"gastenlijst[[#This Row],[Kolom1]]","v":"*064*"},{"$f":"CONCATENATE(gastenlijst[[#This Row],[Gast nr.]],gastenlijst[[#This Row],[Post]],gastenlijst[[#This Row],[Yes]])","v":"064"},{"$f":"\"*\"&gastenlijst[[#This Row],[AdresCode]]&\"*\"","v":"*064*"},{"$f":"IF(gastenlijst[[#This Row],[Yes]]>0,\"ja\",\"\")","v":""},{"$f":"MATCH(O65,gastenlijst[[AdresCode]:[Kolom1]],0)","v":{"$error":"#N/A"}},{"$f":"ROW()","v":69},0]
["065",null,null,null,null,null,null,null,null,null,null,null,null,null," ",{"$f":"5518&gastenlijst[[#This Row],[Gast nr.]]","v":"5518065"},{"$f":"gastenlijst[[#This Row],[Kolom1]]","v":"*065*"},{"$f":"CONCATENATE(gastenlijst[[#This Row],[Gast nr.]],gastenlijst[[#This Row],[Post]],gastenlijst[[#This Row],[Yes]])","v":"065"},{"$f":"\"*\"&gastenlijst[[#This Row],[AdresCode]]&\"*\"","v":"*065*"},{"$f":"IF(gastenlijst[[#This Row],[Yes]]>0,\"ja\",\"\")","v":""},{"$f":"MATCH(O66,gastenlijst[[AdresCode]:[Kolom1]],0)","v":{"$error":"#N/A"}},{"$f":"ROW()","v":70},0]
["066",null,null,null,null,null,null,null,null,null,null,null,null,null," ",{"$f":"5518&gastenlijst[[#This Row],[Gast nr.]]","v":"5518066"},{"$f":"gastenlijst[[#This Row],[Kolom1]]","v":"*066*"},{"$f":"CONCATENATE(gastenlijst[[#This Row],[Gast nr.]],gastenlijst[[#This Row],[Post]],gastenlijst[[#This Row],[Yes]])","v":"066"},{"$f":"\"*\"&gastenlijst[[#This Row],[AdresCode]]&\"*\"","v":"*066*"},{"$f":"IF(gastenlijst[[#This Row],[Yes]]>0,\"ja\",\"\")","v":""},{"$f":"MATCH(O67,gastenlijst[[AdresCode]:[Kolom1]],0)","v":{"$error":"#N/A"}},{"$f":"ROW()","v":71},0]
["067",null,null,null,null,null,null,null,null,null,null,null,null,null," ",{"$f":"5518&gastenlijst[[#This Row],[Gast nr.]]","v":"5518067"},{"$f":"gastenlijst[[#This Row],[Kolom1]]","v":"*067*"},{"$f":"CONCATENATE(gastenlijst[[#This Row],[Gast nr.]],gastenlijst[[#This Row],[Post]],gastenlijst[[#This Row],[Yes]])","v":"067"},{"$f":"\"*\"&gastenlijst[[#This Row],[AdresCode]]&\"*\"","v":"*067*"},{"$f":"IF(gastenlijst[[#This Row],[Yes]]>0,\"ja\",\"\")","v":""},{"$f":"MATCH(O68,gastenlijst[[AdresCode]:[Kolom1]],0)","v":{"$error":"#N/A"}},{"$f":"ROW()","v":72},0]
["068",null,null,null,null,null,null,null,null,null,null,null,null,null," ",{"$f":"5518&gastenlijst[[#This Row],[Gast nr.]]","v":"5518068"},{"$f":"gastenlijst[[#This Row],[Kolom1]]","v":"*068*"},{"$f":"CONCATENATE(gastenlijst[[#This Row],[Gast nr.]],gastenlijst[[#This Row],[Post]],gastenlijst[[#This Row],[Yes]])","v":"068"},{"$f":"\"*\"&gastenlijst[[#This Row],[AdresCode]]&\"*\"","v":"*068*"},{"$f":"IF(gastenlijst[[#This Row],[Yes]]>0,\"ja\",\"\")","v":""},{"$f":"MATCH(O69,gastenlijst[[AdresCode]:[Kolom1]],0)","v":{"$error":"#N/A"}},{"$f":"ROW()","v":73},0]
["069",null,null,null,null,null,null,null,null,null,null,null,null,null," ",{"$f":"5518&gastenlijst[[#This Row],[Gast nr.]]","v":"5518069"},{"$f":"gastenlijst[[#This Row],[Kolom1]]","v":"*069*"},{"$f":"CONCATENATE(gastenlijst[[#This Row],[Gast nr.]],gastenlijst[[#This Row],[Post]],gastenlijst[[#This Row],[Yes]])","v":"069"},{"$f":"\"*\"&gastenlijst[[#This Row],[AdresCode]]&\"*\"","v":"*069*"},{"$f":"IF(gastenlijst[[#This Row],[Yes]]>0,\"ja\",\"\")","v":""},{"$f":"MATCH(O70,gastenlijst[[AdresCode]:[Kolom1]],0)","v":{"$error":"#N/A"}},{"$f":"ROW()","v":74},0]
["070",null,null,null,null,null,null,null,null,null,null,null,null,null," ",{"$f":"5518&gastenlijst[[#This Row],[Gast nr.]]","v":"5518070"},{"$f":"gastenlijst[[#This Row],[Kolom1]]","v":"*070*"},{"$f":"CONCATENATE(gastenlijst[[#This Row],[Gast nr.]],gastenlijst[[#This Row],[Post]],gastenlijst[[#This Row],[Yes]])","v":"070"},{"$f":"\"*\"&gastenlijst[[#This Row],[AdresCode]]&\"*\"","v":"*070*"},{"$f":"IF(gastenlijst[[#This Row],[Yes]]>0,\"ja\",\"\")","v":""},{"$f":"MATCH(O71,gastenlijst[[AdresCode]:[Kolom1]],0)","v":{"$error":"#N/A"}},{"$f":"ROW()","v":75},0]
["071",null,null,null,null,null,null,null,null,null,null,null,null,null," ",{"$f":"5518&gastenlijst[[#This Row],[Gast nr.]]","v":"5518071"},{"$f":"gastenlijst[[#This Row],[Kolom1]]","v":"*071*"},{"$f":"CONCATENATE(gastenlijst[[#This Row],[Gast nr.]],gastenlijst[[#This Row],[Post]],gastenlijst[[#This Row],[Yes]])","v":"071"},{"$f":"\"*\"&gastenlijst[[#This Row],[AdresCode]]&\"*\"","v":"*071*"},{"$f":"IF(gastenlijst[[#This Row],[Yes]]>0,\"ja\",\"\")","v":""},{"$f":"MATCH(O72,gastenlijst[[AdresCode]:[Kolom1]],0)","v":{"$error":"#N/A"}},{"$f":"ROW()","v":76},0]
["072",null,null,null,null,null,null,null,null,null,null,null,null,null," ",{"$f":"5518&gastenlijst[[#This Row],[Gast nr.]]","v":"5518072"},{"$f":"gastenlijst[[#This Row],[Kolom1]]","v":"*072*"},{"$f":"CONCATENATE(gastenlijst[[#This Row],[Gast nr.]],gastenlijst[[#This Row],[Post]],gastenlijst[[#This Row],[Yes]])","v":"072"},{"$f":"\"*\"&gastenlijst[[#This Row],[AdresCode]]&\"*\"","v":"*072*"},{"$f":"IF(gastenlijst[[#This Row],[Yes]]>0,\"ja\",\"\")","v":""},{"$f":"MATCH(O73,gastenlijst[[AdresCode]:[Kolom1]],0)","v":{"$error":"#N/A"}},{"$f":"ROW()","v":77},0]
["073",null,null,null,null,null,null,null,null,null,null,null,null,null," ",{"$f":"5518&gastenlijst[[#This Row],[Gast nr.]]","v":"5518073"},{"$f":"gastenlijst[[#This Row],[Kolom1]]","v":"*073*"},{"$f":"CONCATENATE(gastenlijst[[#This Row],[Gast nr.]],gastenlijst[[#This Row],[Post]],gastenlijst[[#This Row],[Yes]])","v":"073"},{"$f":"\"*\"&gastenlijst[[#This Row],[AdresCode]]&\"*\"","v":"*073*"},{"$f":"IF(gastenlijst[[#This Row],[Yes]]>0,\"ja\",\"\")","v":""},{"$f":"MATCH(O74,gastenlijst[[AdresCode]:[Kolom1]],0)","v":{"$error":"#N/A"}},{"$f":"ROW()","v":78},0]
["074",null,null,null,null,null,null,null,null,null,null,null,null,null," ",{"$f":"5518&gastenlijst[[#This Row],[Gast nr.]]","v":"5518074"},{"$f":"gastenlijst[[#This Row],[Kolom1]]","v":"*074*"},{"$f":"CONCATENATE(gastenlijst[[#This Row],[Gast nr.]],gastenlijst[[#This Row],[Post]],gastenlijst[[#This Row],[Yes]])","v":"074"},{"$f":"\"*\"&gastenlijst[[#This Row],[AdresCode]]&\"*\"","v":"*074*"},{"$f":"IF(gastenlijst[[#This Row],[Yes]]>0,\"ja\",\"\")","v":""},{"$f":"MATCH(O75,gastenlijst[[AdresCode]:[Kolom1]],0)","v":{"$error":"#N/A"}},{"$f":"ROW()","v":79},0]
["075",null,null,null,null,null,null,null,null,null,null,null,null,null," ",{"$f":"5518&gastenlijst[[#This Row],[Gast nr.]]","v":"5518075"},{"$f":"gastenlijst[[#This Row],[Kolom1]]","v":"*075*"},{"$f":"CONCATENATE(gastenlijst[[#This Row],[Gast nr.]],gastenlijst[[#This Row],[Post]],gastenlijst[[#This Row],[Yes]])","v":"075"},{"$f":"\"*\"&gastenlijst[[#This Row],[AdresCode]]&\"*\"","v":"*075*"},{"$f":"IF(gastenlijst[[#This Row],[Yes]]>0,\"ja\",\"\")","v":""},{"$f":"MATCH(O76,gastenlijst[[AdresCode]:[Kolom1]],0)","v":{"$error":"#N/A"}},{"$f":"ROW()","v":80},0]
["076",null,null,null,null,null,null,null,null,null,null,null,null,null," ",{"$f":"5518&gastenlijst[[#This Row],[Gast nr.]]","v":"5518076"},{"$f":"gastenlijst[[#This Row],[Kolom1]]","v":"*076*"},{"$f":"CONCATENATE(gastenlijst[[#This Row],[Gast nr.]],gastenlijst[[#This Row],[Post]],gastenlijst[[#This Row],[Yes]])","v":"076"},{"$f":"\"*\"&gastenlijst[[#This Row],[AdresCode]]&\"*\"","v":"*076*"},{"$f":"IF(gastenlijst[[#This Row],[Yes]]>0,\"ja\",\"\")","v":""},{"$f":"MATCH(O77,gastenlijst[[AdresCode]:[Kolom1]],0)","v":{"$error":"#N/A"}},{"$f":"ROW()","v":81},0]
["077",null,null,null,null,null,null,null,null,null,null,null,null,null," ",{"$f":"5518&gastenlijst[[#This Row],[Gast nr.]]","v":"5518077"},{"$f":"gastenlijst[[#This Row],[Kolom1]]","v":"*077*"},{"$f":"CONCATENATE(gastenlijst[[#This Row],[Gast nr.]],gastenlijst[[#This Row],[Post]],gastenlijst[[#This Row],[Yes]])","v":"077"},{"$f":"\"*\"&gastenlijst[[#This Row],[AdresCode]]&\"*\"","v":"*077*"},{"$f":"IF(gastenlijst[[#This Row],[Yes]]>0,\"ja\",\"\")","v":""},{"$f":"MATCH(O78,gastenlijst[[AdresCode]:[Kolom1]],0)","v":{"$error":"#N/A"}},{"$f":"ROW()","v":82},0]
["078",null,null,null,null,null,null,null,null,null,null,null,null,null," ",{"$f":"5518&gastenlijst[[#This Row],[Gast nr.]]","v":"5518078"},{"$f":"gastenlijst[[#This Row],[Kolom1]]","v":"*078*"},{"$f":"CONCATENATE(gastenlijst[[#This Row],[Gast nr.]],gastenlijst[[#This Row],[Post]],gastenlijst[[#This Row],[Yes]])","v":"078"},{"$f":"\"*\"&gastenlijst[[#This Row],[AdresCode]]&\"*\"","v":"*078*"},{"$f":"IF(gastenlijst[[#This Row],[Yes]]>0,\"ja\",\"\")","v":""},{"$f":"MATCH(O79,gastenlijst[[AdresCode]:[Kolom1]],0)","v":{"$error":"#N/A"}},{"$f":"ROW()","v":83},0]
["079",null,null,null,null,null,null,null,null,null,null,null,null,null," ",{"$f":"5518&gastenlijst[[#This Row],[Gast nr.]]","v":"5518079"},{"$f":"gastenlijst[[#This Row],[Kolom1]]","v":"*079*"},{"$f":"CONCATENATE(gastenlijst[[#This Row],[Gast nr.]],gastenlijst[[#This Row],[Post]],gastenlijst[[#This Row],[Yes]])","v":"079"},{"$f":"\"*\"&gastenlijst[[#This Row],[AdresCode]]&\"*\"","v":"*079*"},{"$f":"IF(gastenlijst[[#This Row],[Yes]]>0,\"ja\",\"\")","v":""},{"$f":"MATCH(O80,gastenlijst[[AdresCode]:[Kolom1]],0)","v":{"$error":"#N/A"}},{"$f":"ROW()","v":84},0]
["080",null,null,null,null,null,null,null,null,null,null,null,null,null," ",{"$f":"5518&gastenlijst[[#This Row],[Gast nr.]]","v":"5518080"},{"$f":"gastenlijst[[#This Row],[Kolom1]]","v":"*080*"},{"$f":"CONCATENATE(gastenlijst[[#This Row],[Gast nr.]],gastenlijst[[#This Row],[Post]],gastenlijst[[#This Row],[Yes]])","v":"080"},{"$f":"\"*\"&gastenlijst[[#This Row],[AdresCode]]&\"*\"","v":"*080*"},{"$f":"IF(gastenlijst[[#This Row],[Yes]]>0,\"ja\",\"\")","v":""},{"$f":"MATCH(O81,gastenlijst[[AdresCode]:[Kolom1]],0)","v":{"$error":"#N/A"}},{"$f":"ROW()","v":85},0]
["081",null,null,null,null,null,null,null,null,null,null,null,null,null," ",{"$f":"5518&gastenlijst[[#This Row],[Gast nr.]]","v":"5518081"},{"$f":"gastenlijst[[#This Row],[Kolom1]]","v":"*081*"},{"$f":"CONCATENATE(gastenlijst[[#This Row],[Gast nr.]],gastenlijst[[#This Row],[Post]],gastenlijst[[#This Row],[Yes]])","v":"081"},{"$f":"\"*\"&gastenlijst[[#This Row],[AdresCode]]&\"*\"","v":"*081*"},{"$f":"IF(gastenlijst[[#This Row],[Yes]]>0,\"ja\",\"\")","v":""},{"$f":"MATCH(O82,gastenlijst[[AdresCode]:[Kolom1]],0)","v":{"$error":"#N/A"}},{"$f":"ROW()","v":86},0]
["082",null,null,null,null,null,null,null,null,null,null,null,null,null," ",{"$f":"5518&gastenlijst[[#This Row],[Gast nr.]]","v":"5518082"},{"$f":"gastenlijst[[#This Row],[Kolom1]]","v":"*082*"},{"$f":"CONCATENATE(gastenlijst[[#This Row],[Gast nr.]],gastenlijst[[#This Row],[Post]],gastenlijst[[#This Row],[Yes]])","v":"082"},{"$f":"\"*\"&gastenlijst[[#This Row],[AdresCode]]&\"*\"","v":"*082*"},{"$f":"IF(gastenlijst[[#This Row],[Yes]]>0,\"ja\",\"\")","v":""},{"$f":"MATCH(O83,gastenlijst[[AdresCode]:[Kolom1]],0)","v":{"$error":"#N/A"}},{"$f":"ROW()","v":87},0]
["083",null,null,null,null,null,null,null,null,null,null,null,null,null," ",{"$f":"5518&gastenlijst[[#This Row],[Gast nr.]]","v":"5518083"},{"$f":"gastenlijst[[#This Row],[Kolom1]]","v":"*083*"},{"$f":"CONCATENATE(gastenlijst[[#This Row],[Gast nr.]],gastenlijst[[#This Row],[Post]],gastenlijst[[#This Row],[Yes]])","v":"083"},{"$f":"\"*\"&gastenlijst[[#This Row],[AdresCode]]&\"*\"","v":"*083*"},{"$f":"IF(gastenlijst[[#This Row],[Yes]]>0,\"ja\",\"\")","v":""},{"$f":"MATCH(O84,gastenlijst[[AdresCode]:[Kolom1]],0)","v":{"$error":"#N/A"}},{"$f":"ROW()","v":88},0]
["084",null,null,null,null,null,null,null,null,null,null,null,null,null," ",{"$f":"5518&gastenlijst[[#This Row],[Gast nr.]]","v":"5518084"},{"$f":"gastenlijst[[#This Row],[Kolom1]]","v":"*084*"},{"$f":"CONCATENATE(gastenlijst[[#This Row],[Gast nr.]],gastenlijst[[#This Row],[Post]],gastenlijst[[#This Row],[Yes]])","v":"084"},{"$f":"\"*\"&gastenlijst[[#This Row],[AdresCode]]&\"*\"","v":"*084*"},{"$f":"IF(gastenlijst[[#This Row],[Yes]]>0,\"ja\",\"\")","v":""},{"$f":"MATCH(O85,gastenlijst[[AdresCode]:[Kolom1]],0)","v":{"$error":"#N/A"}},{"$f":"ROW()","v":89},0]
["085",null,null,null,null,null,null,null,null,null,null,null,null,null," ",{"$f":"5518&gastenlijst[[#This Row],[Gast nr.]]","v":"5518085"},{"$f":"gastenlijst[[#This Row],[Kolom1]]","v":"*085*"},{"$f":"CONCATENATE(gastenlijst[[#This Row],[Gast nr.]],gastenlijst[[#This Row],[Post]],gastenlijst[[#This Row],[Yes]])","v":"085"},{"$f":"\"*\"&gastenlijst[[#This Row],[AdresCode]]&\"*\"","v":"*085*"},{"$f":"IF(gastenlijst[[#This Row],[Yes]]>0,\"ja\",\"\")","v":""},{"$f":"MATCH(O86,gastenlijst[[AdresCode]:[Kolom1]],0)","v":{"$error":"#N/A"}},{"$f":"ROW()","v":90},0]
["086",null,null,null,null,null,null,null,null,null,null,null,null,null," ",{"$f":"5518&gastenlijst[[#This Row],[Gast nr.]]","v":"5518086"},{"$f":"gastenlijst[[#This Row],[Kolom1]]","v":"*086*"},{"$f":"CONCATENATE(gastenlijst[[#This Row],[Gast nr.]],gastenlijst[[#This Row],[Post]],gastenlijst[[#This Row],[Yes]])","v":"086"},{"$f":"\"*\"&gastenlijst[[#This Row],[AdresCode]]&\"*\"","v":"*086*"},{"$f":"IF(gastenlijst[[#This Row],[Yes]]>0,\"ja\",\"\")","v":""},{"$f":"MATCH(O87,gastenlijst[[AdresCode]:[Kolom1]],0)","v":{"$error":"#N/A"}},{"$f":"ROW()","v":91},0]
["087",null,null,null,null,null,null,null,null,null,null,null,null,null," ",{"$f":"5518&gastenlijst[[#This Row],[Gast nr.]]","v":"5518087"},{"$f":"gastenlijst[[#This Row],[Kolom1]]","v":"*087*"},{"$f":"CONCATENATE(gastenlijst[[#This Row],[Gast nr.]],gastenlijst[[#This Row],[Post]],gastenlijst[[#This Row],[Yes]])","v":"087"},{"$f":"\"*\"&gastenlijst[[#This Row],[AdresCode]]&\"*\"","v":"*087*"},{"$f":"IF(gastenlijst[[#This Row],[Yes]]>0,\"ja\",\"\")","v":""},{"$f":"MATCH(O88,gastenlijst[[AdresCode]:[Kolom1]],0)","v":{"$error":"#N/A"}},{"$f":"ROW()","v":92},0]
["088",null,null,null,null,null,null,null,null,null,null,null,null,null," ",{"$f":"5518&gastenlijst[[#This Row],[Gast nr.]]","v":"5518088"},{"$f":"gastenlijst[[#This Row],[Kolom1]]","v":"*088*"},{"$f":"CONCATENATE(gastenlijst[[#This Row],[Gast nr.]],gastenlijst[[#This Row],[Post]],gastenlijst[[#This Row],[Yes]])","v":"088"},{"$f":"\"*\"&gastenlijst[[#This Row],[AdresCode]]&\"*\"","v":"*088*"},{"$f":"IF(gastenlijst[[#This Row],[Yes]]>0,\"ja\",\"\")","v":""},{"$f":"MATCH(O89,gastenlijst[[AdresCode]:[Kolom1]],0)","v":{"$error":"#N/A"}},{"$f":"ROW()","v":93},0]
["089",null,null,null,null,null,null,null,null,null,null,null,null,null," ",{"$f":"5518&gastenlijst[[#This Row],[Gast nr.]]","v":"5518089"},{"$f":"gastenlijst[[#This Row],[Kolom1]]","v":"*089*"},{"$f":"CONCATENATE(gastenlijst[[#This Row],[Gast nr.]],gastenlijst[[#This Row],[Post]],gastenlijst[[#This Row],[Yes]])","v":"089"},{"$f":"\"*\"&gastenlijst[[#This Row],[AdresCode]]&\"*\"","v":"*089*"},{"$f":"IF(gastenlijst[[#This Row],[Yes]]>0,\"ja\",\"\")","v":""},{"$f":"MATCH(O90,gastenlijst[[AdresCode]:[Kolom1]],0)","v":{"$error":"#N/A"}},{"$f":"ROW()","v":94},0]
["090",null,null,null,null,null,null,null,null,null,null,null,null,null," ",{"$f":"5518&gastenlijst[[#This Row],[Gast nr.]]","v":"5518090"},{"$f":"gastenlijst[[#This Row],[Kolom1]]","v":"*090*"},{"$f":"CONCATENATE(gastenlijst[[#This Row],[Gast nr.]],gastenlijst[[#This Row],[Post]],gastenlijst[[#This Row],[Yes]])","v":"090"},{"$f":"\"*\"&gastenlijst[[#This Row],[AdresCode]]&\"*\"","v":"*090*"},{"$f":"IF(gastenlijst[[#This Row],[Yes]]>0,\"ja\",\"\")","v":""},{"$f":"MATCH(O91,gastenlijst[[AdresCode]:[Kolom1]],0)","v":{"$error":"#N/A"}},{"$f":"ROW()","v":95},0]
["091",null,null,null,null,null,null,null,null,null,null,null,null,null," ",{"$f":"5518&gastenlijst[[#This Row],[Gast nr.]]","v":"5518091"},{"$f":"gastenlijst[[#This Row],[Kolom1]]","v":"*091*"},{"$f":"CONCATENATE(gastenlijst[[#This Row],[Gast nr.]],gastenlijst[[#This Row],[Post]],gastenlijst[[#This Row],[Yes]])","v":"091"},{"$f":"\"*\"&gastenlijst[[#This Row],[AdresCode]]&\"*\"","v":"*091*"},{"$f":"IF(gastenlijst[[#This Row],[Yes]]>0,\"ja\",\"\")","v":""},{"$f":"MATCH(O92,gastenlijst[[AdresCode]:[Kolom1]],0)","v":{"$error":"#N/A"}},{"$f":"ROW()","v":96},0]
["092",null,null,null,null,null,null,null,null,null,null,null,null,null," ",{"$f":"5518&gastenlijst[[#This Row],[Gast nr.]]","v":"5518092"},{"$f":"gastenlijst[[#This Row],[Kolom1]]","v":"*092*"},{"$f":"CONCATENATE(gastenlijst[[#This Row],[Gast nr.]],gastenlijst[[#This Row],[Post]],gastenlijst[[#This Row],[Yes]])","v":"092"},{"$f":"\"*\"&gastenlijst[[#This Row],[AdresCode]]&\"*\"","v":"*092*"},{"$f":"IF(gastenlijst[[#This Row],[Yes]]>0,\"ja\",\"\")","v":""},{"$f":"MATCH(O93,gastenlijst[[AdresCode]:[Kolom1]],0)","v":{"$error":"#N/A"}},{"$f":"ROW()","v":97},0]
["093",null,null,null,null,null,null,null,null,null,null,null,null,null," ",{"$f":"5518&gastenlijst[[#This Row],[Gast nr.]]","v":"5518093"},{"$f":"gastenlijst[[#This Row],[Kolom1]]","v":"*093*"},{"$f":"CONCATENATE(gastenlijst[[#This Row],[Gast nr.]],gastenlijst[[#This Row],[Post]],gastenlijst[[#This Row],[Yes]])","v":"093"},{"$f":"\"*\"&gastenlijst[[#This Row],[AdresCode]]&\"*\"","v":"*093*"},{"$f":"IF(gastenlijst[[#This Row],[Yes]]>0,\"ja\",\"\")","v":""},{"$f":"MATCH(O94,gastenlijst[[AdresCode]:[Kolom1]],0)","v":{"$error":"#N/A"}},{"$f":"ROW()","v":98},0]
["094",null,null,null,null,null,null,null,null,null,null,null,null,null," ",{"$f":"5518&gastenlijst[[#This Row],[Gast nr.]]","v":"5518094"},{"$f":"gastenlijst[[#This Row],[Kolom1]]","v":"*094*"},{"$f":"CONCATENATE(gastenlijst[[#This Row],[Gast nr.]],gastenlijst[[#This Row],[Post]],gastenlijst[[#This Row],[Yes]])","v":"094"},{"$f":"\"*\"&gastenlijst[[#This Row],[AdresCode]]&\"*\"","v":"*094*"},{"$f":"IF(gastenlijst[[#This Row],[Yes]]>0,\"ja\",\"\")","v":""},{"$f":"MATCH(O95,gastenlijst[[AdresCode]:[Kolom1]],0)","v":{"$error":"#N/A"}},{"$f":"ROW()","v":99},0]
["095",null,null,null,null,null,null,null,null,null,null,null,null,null," ",{"$f":"5518&gastenlijst[[#This Row],[Gast nr.]]","v":"5518095"},{"$f":"gastenlijst[[#This Row],[Kolom1]]","v":"*095*"},{"$f":"CONCATENATE(gastenlijst[[#This Row],[Gast nr.]],gastenlijst[[#This Row],[Post]],gastenlijst[[#This Row],[Yes]])","v":"095"},{"$f":"\"*\"&gastenlijst[[#This Row],[AdresCode]]&\"*\"","v":"*095*"},{"$f":"IF(gastenlijst[[#This Row],[Yes]]>0,\"ja\",\"\")","v":""},{"$f":"MATCH(O96,gastenlijst[[AdresCode]:[Kolom1]],0)","v":{"$error":"#N/A"}},{"$f":"ROW()","v":100},0]
["096",null,null,null,null,null,null,null,null,null,null,null,null,null," ",{"$f":"5518&gastenlijst[[#This Row],[Gast nr.]]","v":"5518096"},{"$f":"gastenlijst[[#This Row],[Kolom1]]","v":"*096*"},{"$f":"CONCATENATE(gastenlijst[[#This Row],[Gast nr.]],gastenlijst[[#This Row],[Post]],gastenlijst[[#This Row],[Yes]])","v":"096"},{"$f":"\"*\"&gastenlijst[[#This Row],[AdresCode]]&\"*\"","v":"*096*"},{"$f":"IF(gastenlijst[[#This Row],[Yes]]>0,\"ja\",\"\")","v":""},{"$f":"MATCH(O97,gastenlijst[[AdresCode]:[Kolom1]],0)","v":{"$error":"#N/A"}},{"$f":"ROW()","v":101},0]
["097",null,null,null,null,null,null,null,null,null,null,null,null,null," ",{"$f":"5518&gastenlijst[[#This Row],[Gast nr.]]","v":"5518097"},{"$f":"gastenlijst[[#This Row],[Kolom1]]","v":"*097*"},{"$f":"CONCATENATE(gastenlijst[[#This Row],[Gast nr.]],gastenlijst[[#This Row],[Post]],gastenlijst[[#This Row],[Yes]])","v":"097"},{"$f":"\"*\"&gastenlijst[[#This Row],[AdresCode]]&\"*\"","v":"*097*"},{"$f":"IF(gastenlijst[[#This Row],[Yes]]>0,\"ja\",\"\")","v":""},{"$f":"MATCH(O98,gastenlijst[[AdresCode]:[Kolom1]],0)","v":{"$error":"#N/A"}},{"$f":"ROW()","v":102},0]
["098",null,null,null,null,null,null,null,null,null,null,null,null,null," ",{"$f":"5518&gastenlijst[[#This Row],[Gast nr.]]","v":"5518098"},{"$f":"gastenlijst[[#This Row],[Kolom1]]","v":"*098*"},{"$f":"CONCATENATE(gastenlijst[[#This Row],[Gast nr.]],gastenlijst[[#This Row],[Post]],gastenlijst[[#This Row],[Yes]])","v":"098"},{"$f":"\"*\"&gastenlijst[[#This Row],[AdresCode]]&\"*\"","v":"*098*"},{"$f":"IF(gastenlijst[[#This Row],[Yes]]>0,\"ja\",\"\")","v":""},{"$f":"MATCH(O99,gastenlijst[[AdresCode]:[Kolom1]],0)","v":{"$error":"#N/A"}},{"$f":"ROW()","v":103},0]
["099",null,null,null,null,null,null,null,null,null,null,null,null,null," ",{"$f":"5518&gastenlijst[[#This Row],[Gast nr.]]","v":"5518099"},{"$f":"gastenlijst[[#This Row],[Kolom1]]","v":"*099*"},{"$f":"CONCATENATE(gastenlijst[[#This Row],[Gast nr.]],gastenlijst[[#This Row],[Post]],gastenlijst[[#This Row],[Yes]])","v":"099"},{"$f":"\"*\"&gastenlijst[[#This Row],[AdresCode]]&\"*\"","v":"*099*"},{"$f":"IF(gastenlijst[[#This Row],[Yes]]>0,\"ja\",\"\")","v":""},{"$f":"MATCH(O100,gastenlijst[[AdresCode]:[Kolom1]],0)","v":{"$error":"#N/A"}},{"$f":"ROW()","v":104},0]
["100",null,null,null,null,null,null,null,null,null,null,null,null,null," ",{"$f":"5518&gastenlijst[[#This Row],[Gast nr.]]","v":"5518100"},{"$f":"gastenlijst[[#This Row],[Kolom1]]","v":"*100*"},{"$f":"CONCATENATE(gastenlijst[[#This Row],[Gast nr.]],gastenlijst[[#This Row],[Post]],gastenlijst[[#This Row],[Yes]])","v":"100"},{"$f":"\"*\"&gastenlijst[[#This Row],[AdresCode]]&\"*\"","v":"*100*"},{"$f":"IF(gastenlijst[[#This Row],[Yes]]>0,\"ja\",\"\")","v":""},{"$f":"MATCH(O101,gastenlijst[[AdresCode]:[Kolom1]],0)","v":{"$error":"#N/A"}},{"$f":"ROW()","v":105},0]
["101",null,null,null,null,null,null,null,null,null,null,null,null,null," ",{"$f":"5518&gastenlijst[[#This Row],[Gast nr.]]","v":"5518101"},{"$f":"gastenlijst[[#This Row],[Kolom1]]","v":"*101*"},{"$f":"CONCATENATE(gastenlijst[[#This Row],[Gast nr.]],gastenlijst[[#This Row],[Post]],gastenlijst[[#This Row],[Yes]])","v":"101"},{"$f":"\"*\"&gastenlijst[[#This Row],[AdresCode]]&\"*\"","v":"*101*"},{"$f":"IF(gastenlijst[[#This Row],[Yes]]>0,\"ja\",\"\")","v":""},{"$f":"MATCH(O102,gastenlijst[[AdresCode]:[Kolom1]],0)","v":{"$error":"#N/A"}},{"$f":"ROW()","v":106},0]
["102",null,null,null,null,null,null,null,null,null,null,null,null,null," ",{"$f":"5518&gastenlijst[[#This Row],[Gast nr.]]","v":"5518102"},{"$f":"gastenlijst[[#This Row],[Kolom1]]","v":"*102*"},{"$f":"CONCATENATE(gastenlijst[[#This Row],[Gast nr.]],gastenlijst[[#This Row],[Post]],gastenlijst[[#This Row],[Yes]])","v":"102"},{"$f":"\"*\"&gastenlijst[[#This Row],[AdresCode]]&\"*\"","v":"*102*"},{"$f":"IF(gastenlijst[[#This Row],[Yes]]>0,\"ja\",\"\")","v":""},{"$f":"MATCH(O103,gastenlijst[[AdresCode]:[Kolom1]],0)","v":{"$error":"#N/A"}},{"$f":"ROW()","v":107},0]
["103",null,null,null,null,null,null,null,null,null,null,null,null,null," ",{"$f":"5518&gastenlijst[[#This Row],[Gast nr.]]","v":"5518103"},{"$f":"gastenlijst[[#This Row],[Kolom1]]","v":"*103*"},{"$f":"CONCATENATE(gastenlijst[[#This Row],[Gast nr.]],gastenlijst[[#This Row],[Post]],gastenlijst[[#This Row],[Yes]])","v":"103"},{"$f":"\"*\"&gastenlijst[[#This Row],[AdresCode]]&\"*\"","v":"*103*"},{"$f":"IF(gastenlijst[[#This Row],[Yes]]>0,\"ja\",\"\")","v":""},{"$f":"MATCH(O104,gastenlijst[[AdresCode]:[Kolom1]],0)","v":{"$error":"#N/A"}},{"$f":"ROW()","v":108},0]
["104",null,null,null,null,null,null,null,null,null,null,null,null,null," ",{"$f":"5518&gastenlijst[[#This Row],[Gast nr.]]","v":"5518104"},{"$f":"gastenlijst[[#This Row],[Kolom1]]","v":"*104*"},{"$f":"CONCATENATE(gastenlijst[[#This Row],[Gast nr.]],gastenlijst[[#This Row],[Post]],gastenlijst[[#This Row],[Yes]])","v":"104"},{"$f":"\"*\"&gastenlijst[[#This Row],[AdresCode]]&\"*\"","v":"*104*"},{"$f":"IF(gastenlijst[[#This Row],[Yes]]>0,\"ja\",\"\")","v":""},{"$f":"MATCH(O105,gastenlijst[[AdresCode]:[Kolom1]],0)","v":{"$error":"#N/A"}},{"$f":"ROW()","v":109},0]
["105",null,null,null,null,null,null,null,null,null,null,null,null,null," ",{"$f":"5518&gastenlijst[[#This Row],[Gast nr.]]","v":"5518105"},{"$f":"gastenlijst[[#This Row],[Kolom1]]","v":"*105*"},{"$f":"CONCATENATE(gastenlijst[[#This Row],[Gast nr.]],gastenlijst[[#This Row],[Post]],gastenlijst[[#This Row],[Yes]])","v":"105"},{"$f":"\"*\"&gastenlijst[[#This Row],[AdresCode]]&\"*\"","v":"*105*"},{"$f":"IF(gastenlijst[[#This Row],[Yes]]>0,\"ja\",\"\")","v":""},{"$f":"MATCH(O106,gastenlijst[[AdresCode]:[Kolom1]],0)","v":{"$error":"#N/A"}},{"$f":"ROW()","v":110},0]
["106",null,null,null,null,null,null,null,null,null,null,null,null,null," ",{"$f":"5518&gastenlijst[[#This Row],[Gast nr.]]","v":"5518106"},{"$f":"gastenlijst[[#This Row],[Kolom1]]","v":"*106*"},{"$f":"CONCATENATE(gastenlijst[[#This Row],[Gast nr.]],gastenlijst[[#This Row],[Post]],gastenlijst[[#This Row],[Yes]])","v":"106"},{"$f":"\"*\"&gastenlijst[[#This Row],[AdresCode]]&\"*\"","v":"*106*"},{"$f":"IF(gastenlijst[[#This Row],[Yes]]>0,\"ja\",\"\")","v":""},{"$f":"MATCH(O107,gastenlijst[[AdresCode]:[Kolom1]],0)","v":{"$error":"#N/A"}},{"$f":"ROW()","v":111},0]
["107",null,null,null,null,null,null,null,null,null,null,null,null,null," ",{"$f":"5518&gastenlijst[[#This Row],[Gast nr.]]","v":"5518107"},{"$f":"gastenlijst[[#This Row],[Kolom1]]","v":"*107*"},{"$f":"CONCATENATE(gastenlijst[[#This Row],[Gast nr.]],gastenlijst[[#This Row],[Post]],gastenlijst[[#This Row],[Yes]])","v":"107"},{"$f":"\"*\"&gastenlijst[[#This Row],[AdresCode]]&\"*\"","v":"*107*"},{"$f":"IF(gastenlijst[[#This Row],[Yes]]>0,\"ja\",\"\")","v":""},{"$f":"MATCH(O108,gastenlijst[[AdresCode]:[Kolom1]],0)","v":{"$error":"#N/A"}},{"$f":"ROW()","v":112},0]
["108",null,null,null,null,null,null,null,null,null,null,null,null,null," ",{"$f":"5518&gastenlijst[[#This Row],[Gast nr.]]","v":"5518108"},{"$f":"gastenlijst[[#This Row],[Kolom1]]","v":"*108*"},{"$f":"CONCATENATE(gastenlijst[[#This Row],[Gast nr.]],gastenlijst[[#This Row],[Post]],gastenlijst[[#This Row],[Yes]])","v":"108"},{"$f":"\"*\"&gastenlijst[[#This Row],[AdresCode]]&\"*\"","v":"*108*"},{"$f":"IF(gastenlijst[[#This Row],[Yes]]>0,\"ja\",\"\")","v":""},{"$f":"MATCH(O109,gastenlijst[[AdresCode]:[Kolom1]],0)","v":{"$error":"#N/A"}},{"$f":"ROW()","v":113},0]
["109",null,null,null,null,null,null,null,null,null,null,null,null,null," ",{"$f":"5518&gastenlijst[[#This Row],[Gast nr.]]","v":"5518109"},{"$f":"gastenlijst[[#This Row],[Kolom1]]","v":"*109*"},{"$f":"CONCATENATE(gastenlijst[[#This Row],[Gast nr.]],gastenlijst[[#This Row],[Post]],gastenlijst[[#This Row],[Yes]])","v":"109"},{"$f":"\"*\"&gastenlijst[[#This Row],[AdresCode]]&\"*\"","v":"*109*"},{"$f":"IF(gastenlijst[[#This Row],[Yes]]>0,\"ja\",\"\")","v":""},{"$f":"MATCH(O110,gastenlijst[[AdresCode]:[Kolom1]],0)","v":{"$error":"#N/A"}},{"$f":"ROW()","v":114},0]
["110",null,null,null,null,null,null,null,null,null,null,null,null,null," ",{"$f":"5518&gastenlijst[[#This Row],[Gast nr.]]","v":"5518110"},{"$f":"gastenlijst[[#This Row],[Kolom1]]","v":"*110*"},{"$f":"CONCATENATE(gastenlijst[[#This Row],[Gast nr.]],gastenlijst[[#This Row],[Post]],gastenlijst[[#This Row],[Yes]])","v":"110"},{"$f":"\"*\"&gastenlijst[[#This Row],[AdresCode]]&\"*\"","v":"*110*"},{"$f":"IF(gastenlijst[[#This Row],[Yes]]>0,\"ja\",\"\")","v":""},{"$f":"MATCH(O111,gastenlijst[[AdresCode]:[Kolom1]],0)","v":{"$error":"#N/A"}},{"$f":"ROW()","v":115},0]
["111",null,null,null,null,null,null,null,null,null,null,null,null,null," ",{"$f":"5518&gastenlijst[[#This Row],[Gast nr.]]","v":"5518111"},{"$f":"gastenlijst[[#This Row],[Kolom1]]","v":"*111*"},{"$f":"CONCATENATE(gastenlijst[[#This Row],[Gast nr.]],gastenlijst[[#This Row],[Post]],gastenlijst[[#This Row],[Yes]])","v":"111"},{"$f":"\"*\"&gastenlijst[[#This Row],[AdresCode]]&\"*\"","v":"*111*"},{"$f":"IF(gastenlijst[[#This Row],[Yes]]>0,\"ja\",\"\")","v":""},{"$f":"MATCH(O112,gastenlijst[[AdresCode]:[Kolom1]],0)","v":{"$error":"#N/A"}},{"$f":"ROW()","v":116},0]
["112",null,null,null,null,null,null,null,null,null,null,null,null,null," ",{"$f":"5518&gastenlijst[[#This Row],[Gast nr.]]","v":"5518112"},{"$f":"gastenlijst[[#This Row],[Kolom1]]","v":"*112*"},{"$f":"CONCATENATE(gastenlijst[[#This Row],[Gast nr.]],gastenlijst[[#This Row],[Post]],gastenlijst[[#This Row],[Yes]])","v":"112"},{"$f":"\"*\"&gastenlijst[[#This Row],[AdresCode]]&\"*\"","v":"*112*"},{"$f":"IF(gastenlijst[[#This Row],[Yes]]>0,\"ja\",\"\")","v":""},{"$f":"MATCH(O113,gastenlijst[[AdresCode]:[Kolom1]],0)","v":{"$error":"#N/A"}},{"$f":"ROW()","v":117},0]
["113",null,null,null,null,null,null,null,null,null,null,null,null,null," ",{"$f":"5518&gastenlijst[[#This Row],[Gast nr.]]","v":"5518113"},{"$f":"gastenlijst[[#This Row],[Kolom1]]","v":"*113*"},{"$f":"CONCATENATE(gastenlijst[[#This Row],[Gast nr.]],gastenlijst[[#This Row],[Post]],gastenlijst[[#This Row],[Yes]])","v":"113"},{"$f":"\"*\"&gastenlijst[[#This Row],[AdresCode]]&\"*\"","v":"*113*"},{"$f":"IF(gastenlijst[[#This Row],[Yes]]>0,\"ja\",\"\")","v":""},{"$f":"MATCH(O114,gastenlijst[[AdresCode]:[Kolom1]],0)","v":{"$error":"#N/A"}},{"$f":"ROW()","v":118},0]
["114",null,null,null,null,null,null,null,null,null,null,null,null,null," ",{"$f":"5518&gastenlijst[[#This Row],[Gast nr.]]","v":"5518114"},{"$f":"gastenlijst[[#This Row],[Kolom1]]","v":"*114*"},{"$f":"CONCATENATE(gastenlijst[[#This Row],[Gast nr.]],gastenlijst[[#This Row],[Post]],gastenlijst[[#This Row],[Yes]])","v":"114"},{"$f":"\"*\"&gastenlijst[[#This Row],[AdresCode]]&\"*\"","v":"*114*"},{"$f":"IF(gastenlijst[[#This Row],[Yes]]>0,\"ja\",\"\")","v":""},{"$f":"MATCH(O115,gastenlijst[[AdresCode]:[Kolom1]],0)","v":{"$error":"#N/A"}},{"$f":"ROW()","v":119},0]
["115",null,null,null,null,null,null,null,null,null,null,null,null,null," ",{"$f":"5518&gastenlijst[[#This Row],[Gast nr.]]","v":"5518115"},{"$f":"gastenlijst[[#This Row],[Kolom1]]","v":"*115*"},{"$f":"CONCATENATE(gastenlijst[[#This Row],[Gast nr.]],gastenlijst[[#This Row],[Post]],gastenlijst[[#This Row],[Yes]])","v":"115"},{"$f":"\"*\"&gastenlijst[[#This Row],[AdresCode]]&\"*\"","v":"*115*"},{"$f":"IF(gastenlijst[[#This Row],[Yes]]>0,\"ja\",\"\")","v":""},{"$f":"MATCH(O116,gastenlijst[[AdresCode]:[Kolom1]],0)","v":{"$error":"#N/A"}},{"$f":"ROW()","v":120},0]
["116",null,null,null,null,null,null,null,null,null,null,null,null,null," ",{"$f":"5518&gastenlijst[[#This Row],[Gast nr.]]","v":"5518116"},{"$f":"gastenlijst[[#This Row],[Kolom1]]","v":"*116*"},{"$f":"CONCATENATE(gastenlijst[[#This Row],[Gast nr.]],gastenlijst[[#This Row],[Post]],gastenlijst[[#This Row],[Yes]])","v":"116"},{"$f":"\"*\"&gastenlijst[[#This Row],[AdresCode]]&\"*\"","v":"*116*"},{"$f":"IF(gastenlijst[[#This Row],[Yes]]>0,\"ja\",\"\")","v":""},{"$f":"MATCH(O117,gastenlijst[[AdresCode]:[Kolom1]],0)","v":{"$error":"#N/A"}},{"$f":"ROW()","v":121},0]
["117",null,null,null,null,null,null,null,null,null,null,null,null,null," ",{"$f":"5518&gastenlijst[[#This Row],[Gast nr.]]","v":"5518117"},{"$f":"gastenlijst[[#This Row],[Kolom1]]","v":"*117*"},{"$f":"CONCATENATE(gastenlijst[[#This Row],[Gast nr.]],gastenlijst[[#This Row],[Post]],gastenlijst[[#This Row],[Yes]])","v":"117"},{"$f":"\"*\"&gastenlijst[[#This Row],[AdresCode]]&\"*\"","v":"*117*"},{"$f":"IF(gastenlijst[[#This Row],[Yes]]>0,\"ja\",\"\")","v":""},{"$f":"MATCH(O118,gastenlijst[[AdresCode]:[Kolom1]],0)","v":{"$error":"#N/A"}},{"$f":"ROW()","v":122},0]
["118",null,null,null,null,null,null,null,null,null,null,null,null,null," ",{"$f":"5518&gastenlijst[[#This Row],[Gast nr.]]","v":"5518118"},{"$f":"gastenlijst[[#This Row],[Kolom1]]","v":"*118*"},{"$f":"CONCATENATE(gastenlijst[[#This Row],[Gast nr.]],gastenlijst[[#This Row],[Post]],gastenlijst[[#This Row],[Yes]])","v":"118"},{"$f":"\"*\"&gastenlijst[[#This Row],[AdresCode]]&\"*\"","v":"*118*"},{"$f":"IF(gastenlijst[[#This Row],[Yes]]>0,\"ja\",\"\")","v":""},{"$f":"MATCH(O119,gastenlijst[[AdresCode]:[Kolom1]],0)","v":{"$error":"#N/A"}},{"$f":"ROW()","v":123},0]
["119",null,null,null,null,null,null,null,null,null,null,null,null,null," ",{"$f":"5518&gastenlijst[[#This Row],[Gast nr.]]","v":"5518119"},{"$f":"gastenlijst[[#This Row],[Kolom1]]","v":"*119*"},{"$f":"CONCATENATE(gastenlijst[[#This Row],[Gast nr.]],gastenlijst[[#This Row],[Post]],gastenlijst[[#This Row],[Yes]])","v":"119"},{"$f":"\"*\"&gastenlijst[[#This Row],[AdresCode]]&\"*\"","v":"*119*"},{"$f":"IF(gastenlijst[[#This Row],[Yes]]>0,\"ja\",\"\")","v":""},{"$f":"MATCH(O120,gastenlijst[[AdresCode]:[Kolom1]],0)","v":{"$error":"#N/A"}},{"$f":"ROW()","v":124},0]
["120",null,null,null,null,null,null,null,null,null,null,null,null,null," ",{"$f":"5518&gastenlijst[[#This Row],[Gast nr.]]","v":"5518120"},{"$f":"gastenlijst[[#This Row],[Kolom1]]","v":"*120*"},{"$f":"CONCATENATE(gastenlijst[[#This Row],[Gast nr.]],gastenlijst[[#This Row],[Post]],gastenlijst[[#This Row],[Yes]])","v":"120"},{"$f":"\"*\"&gastenlijst[[#This Row],[AdresCode]]&\"*\"","v":"*120*"},{"$f":"IF(gastenlijst[[#This Row],[Yes]]>0,\"ja\",\"\")","v":""},{"$f":"MATCH(O121,gastenlijst[[AdresCode]:[Kolom1]],0)","v":{"$error":"#N/A"}},{"$f":"ROW()","v":125},0]
["121",null,null,null,null,null,null,null,null,null,null,null,null,null," ",{"$f":"5518&gastenlijst[[#This Row],[Gast nr.]]","v":"5518121"},{"$f":"gastenlijst[[#This Row],[Kolom1]]","v":"*121*"},{"$f":"CONCATENATE(gastenlijst[[#This Row],[Gast nr.]],gastenlijst[[#This Row],[Post]],gastenlijst[[#This Row],[Yes]])","v":"121"},{"$f":"\"*\"&gastenlijst[[#This Row],[AdresCode]]&\"*\"","v":"*121*"},{"$f":"IF(gastenlijst[[#This Row],[Yes]]>0,\"ja\",\"\")","v":""},{"$f":"MATCH(O122,gastenlijst[[AdresCode]:[Kolom1]],0)","v":{"$error":"#N/A"}},{"$f":"ROW()","v":126},0]
["122",null,null,null,null,null,null,null,null,null,null,null,null,null," ",{"$f":"5518&gastenlijst[[#This Row],[Gast nr.]]","v":"5518122"},{"$f":"gastenlijst[[#This Row],[Kolom1]]","v":"*122*"},{"$f":"CONCATENATE(gastenlijst[[#This Row],[Gast nr.]],gastenlijst[[#This Row],[Post]],gastenlijst[[#This Row],[Yes]])","v":"122"},{"$f":"\"*\"&gastenlijst[[#This Row],[AdresCode]]&\"*\"","v":"*122*"},{"$f":"IF(gastenlijst[[#This Row],[Yes]]>0,\"ja\",\"\")","v":""},{"$f":"MATCH(O123,gastenlijst[[AdresCode]:[Kolom1]],0)","v":{"$error":"#N/A"}},{"$f":"ROW()","v":127},0]
["123",null,null,null,null,null,null,null,null,null,null,null,null,null," ",{"$f":"5518&gastenlijst[[#This Row],[Gast nr.]]","v":"5518123"},{"$f":"gastenlijst[[#This Row],[Kolom1]]","v":"*123*"},{"$f":"CONCATENATE(gastenlijst[[#This Row],[Gast nr.]],gastenlijst[[#This Row],[Post]],gastenlijst[[#This Row],[Yes]])","v":"123"},{"$f":"\"*\"&gastenlijst[[#This Row],[AdresCode]]&\"*\"","v":"*123*"},{"$f":"IF(gastenlijst[[#This Row],[Yes]]>0,\"ja\",\"\")","v":""},{"$f":"MATCH(O124,gastenlijst[[AdresCode]:[Kolom1]],0)","v":{"$error":"#N/A"}},{"$f":"ROW()","v":128},0]
["124",null,null,null,null,null,null,null,null,null,null,null,null,null," ",{"$f":"5518&gastenlijst[[#This Row],[Gast nr.]]","v":"5518124"},{"$f":"gastenlijst[[#This Row],[Kolom1]]","v":"*124*"},{"$f":"CONCATENATE(gastenlijst[[#This Row],[Gast nr.]],gastenlijst[[#This Row],[Post]],gastenlijst[[#This Row],[Yes]])","v":"124"},{"$f":"\"*\"&gastenlijst[[#This Row],[AdresCode]]&\"*\"","v":"*124*"},{"$f":"IF(gastenlijst[[#This Row],[Yes]]>0,\"ja\",\"\")","v":""},{"$f":"MATCH(O125,gastenlijst[[AdresCode]:[Kolom1]],0)","v":{"$error":"#N/A"}},{"$f":"ROW()","v":129},0]
["125",null,null,null,null,null,null,null,null,null,null,null,null,null," ",{"$f":"5518&gastenlijst[[#This Row],[Gast nr.]]","v":"5518125"},{"$f":"gastenlijst[[#This Row],[Kolom1]]","v":"*125*"},{"$f":"CONCATENATE(gastenlijst[[#This Row],[Gast nr.]],gastenlijst[[#This Row],[Post]],gastenlijst[[#This Row],[Yes]])","v":"125"},{"$f":"\"*\"&gastenlijst[[#This Row],[AdresCode]]&\"*\"","v":"*125*"},{"$f":"IF(gastenlijst[[#This Row],[Yes]]>0,\"ja\",\"\")","v":""},{"$f":"MATCH(O126,gastenlijst[[AdresCode]:[Kolom1]],0)","v":{"$error":"#N/A"}},{"$f":"ROW()","v":130},0]
["126",null,null,null,null,null,null,null,null,null,null,null,null,null," ",{"$f":"5518&gastenlijst[[#This Row],[Gast nr.]]","v":"5518126"},{"$f":"gastenlijst[[#This Row],[Kolom1]]","v":"*126*"},{"$f":"CONCATENATE(gastenlijst[[#This Row],[Gast nr.]],gastenlijst[[#This Row],[Post]],gastenlijst[[#This Row],[Yes]])","v":"126"},{"$f":"\"*\"&gastenlijst[[#This Row],[AdresCode]]&\"*\"","v":"*126*"},{"$f":"IF(gastenlijst[[#This Row],[Yes]]>0,\"ja\",\"\")","v":""},{"$f":"MATCH(O127,gastenlijst[[AdresCode]:[Kolom1]],0)","v":{"$error":"#N/A"}},{"$f":"ROW()","v":131},0]
["127",null,null,null,null,null,null,null,null,null,null,null,null,null," ",{"$f":"5518&gastenlijst[[#This Row],[Gast nr.]]","v":"5518127"},{"$f":"gastenlijst[[#This Row],[Kolom1]]","v":"*127*"},{"$f":"CONCATENATE(gastenlijst[[#This Row],[Gast nr.]],gastenlijst[[#This Row],[Post]],gastenlijst[[#This Row],[Yes]])","v":"127"},{"$f":"\"*\"&gastenlijst[[#This Row],[AdresCode]]&\"*\"","v":"*127*"},{"$f":"IF(gastenlijst[[#This Row],[Yes]]>0,\"ja\",\"\")","v":""},{"$f":"MATCH(O128,gastenlijst[[AdresCode]:[Kolom1]],0)","v":{"$error":"#N/A"}},{"$f":"ROW()","v":132},0]
["128",null,null,null,null,null,null,null,null,null,null,null,null,null," ",{"$f":"5518&gastenlijst[[#This Row],[Gast nr.]]","v":"5518128"},{"$f":"gastenlijst[[#This Row],[Kolom1]]","v":"*128*"},{"$f":"CONCATENATE(gastenlijst[[#This Row],[Gast nr.]],gastenlijst[[#This Row],[Post]],gastenlijst[[#This Row],[Yes]])","v":"128"},{"$f":"\"*\"&gastenlijst[[#This Row],[AdresCode]]&\"*\"","v":"*128*"},{"$f":"IF(gastenlijst[[#This Row],[Yes]]>0,\"ja\",\"\")","v":""},{"$f":"MATCH(O129,gastenlijst[[AdresCode]:[Kolom1]],0)","v":{"$error":"#N/A"}},{"$f":"ROW()","v":133},0]
["129",null,null,null,null,null,null,null,null,null,null,null,null,null," ",{"$f":"5518&gastenlijst[[#This Row],[Gast nr.]]","v":"5518129"},{"$f":"gastenlijst[[#This Row],[Kolom1]]","v":"*129*"},{"$f":"CONCATENATE(gastenlijst[[#This Row],[Gast nr.]],gastenlijst[[#This Row],[Post]],gastenlijst[[#This Row],[Yes]])","v":"129"},{"$f":"\"*\"&gastenlijst[[#This Row],[AdresCode]]&\"*\"","v":"*129*"},{"$f":"IF(gastenlijst[[#This Row],[Yes]]>0,\"ja\",\"\")","v":""},{"$f":"MATCH(O130,gastenlijst[[AdresCode]:[Kolom1]],0)","v":{"$error":"#N/A"}},{"$f":"ROW()","v":134},0]
["130",null,null,null,null,null,null,null,null,null,null,null,null,null," ",{"$f":"5518&gastenlijst[[#This Row],[Gast nr.]]","v":"5518130"},{"$f":"gastenlijst[[#This Row],[Kolom1]]","v":"*130*"},{"$f":"CONCATENATE(gastenlijst[[#This Row],[Gast nr.]],gastenlijst[[#This Row],[Post]],gastenlijst[[#This Row],[Yes]])","v":"130"},{"$f":"\"*\"&gastenlijst[[#This Row],[AdresCode]]&\"*\"","v":"*130*"},{"$f":"IF(gastenlijst[[#This Row],[Yes]]>0,\"ja\",\"\")","v":""},{"$f":"MATCH(O131,gastenlijst[[AdresCode]:[Kolom1]],0)","v":{"$error":"#N/A"}},{"$f":"ROW()","v":135},0]
["131",null,null,null,null,null,null,null,null,null,null,null,null,null," ",{"$f":"5518&gastenlijst[[#This Row],[Gast nr.]]","v":"5518131"},{"$f":"gastenlijst[[#This Row],[Kolom1]]","v":"*131*"},{"$f":"CONCATENATE(gastenlijst[[#This Row],[Gast nr.]],gastenlijst[[#This Row],[Post]],gastenlijst[[#This Row],[Yes]])","v":"131"},{"$f":"\"*\"&gastenlijst[[#This Row],[AdresCode]]&\"*\"","v":"*131*"},{"$f":"IF(gastenlijst[[#This Row],[Yes]]>0,\"ja\",\"\")","v":""},{"$f":"MATCH(O132,gastenlijst[[AdresCode]:[Kolom1]],0)","v":{"$error":"#N/A"}},{"$f":"ROW()","v":136},0]
["132",null,null,null,null,null,null,null,null,null,null,null,null,null," ",{"$f":"5518&gastenlijst[[#This Row],[Gast nr.]]","v":"5518132"},{"$f":"gastenlijst[[#This Row],[Kolom1]]","v":"*132*"},{"$f":"CONCATENATE(gastenlijst[[#This Row],[Gast nr.]],gastenlijst[[#This Row],[Post]],gastenlijst[[#This Row],[Yes]])","v":"132"},{"$f":"\"*\"&gastenlijst[[#This Row],[AdresCode]]&\"*\"","v":"*132*"},{"$f":"IF(gastenlijst[[#This Row],[Yes]]>0,\"ja\",\"\")","v":""},{"$f":"MATCH(O133,gastenlijst[[AdresCode]:[Kolom1]],0)","v":{"$error":"#N/A"}},{"$f":"ROW()","v":137},0]
["133",null,null,null,null,null,null,null,null,null,null,null,null,null," ",{"$f":"5518&gastenlijst[[#This Row],[Gast nr.]]","v":"5518133"},{"$f":"gastenlijst[[#This Row],[Kolom1]]","v":"*133*"},{"$f":"CONCATENATE(gastenlijst[[#This Row],[Gast nr.]],gastenlijst[[#This Row],[Post]],gastenlijst[[#This Row],[Yes]])","v":"133"},{"$f":"\"*\"&gastenlijst[[#This Row],[AdresCode]]&\"*\"","v":"*133*"},{"$f":"IF(gastenlijst[[#This Row],[Yes]]>0,\"ja\",\"\")","v":""},{"$f":"MATCH(O134,gastenlijst[[AdresCode]:[Kolom1]],0)","v":{"$error":"#N/A"}},{"$f":"ROW()","v":138},0]
["134",null,null,null,null,null,null,null,null,null,null,null,null,null," ",{"$f":"5518&gastenlijst[[#This Row],[Gast nr.]]","v":"5518134"},{"$f":"gastenlijst[[#This Row],[Kolom1]]","v":"*134*"},{"$f":"CONCATENATE(gastenlijst[[#This Row],[Gast nr.]],gastenlijst[[#This Row],[Post]],gastenlijst[[#This Row],[Yes]])","v":"134"},{"$f":"\"*\"&gastenlijst[[#This Row],[AdresCode]]&\"*\"","v":"*134*"},{"$f":"IF(gastenlijst[[#This Row],[Yes]]>0,\"ja\",\"\")","v":""},{"$f":"MATCH(O135,gastenlijst[[AdresCode]:[Kolom1]],0)","v":{"$error":"#N/A"}},{"$f":"ROW()","v":139},0]
["135",null,null,null,null,null,null,null,null,null,null,null,null,null," ",{"$f":"5518&gastenlijst[[#This Row],[Gast nr.]]","v":"5518135"},{"$f":"gastenlijst[[#This Row],[Kolom1]]","v":"*135*"},{"$f":"CONCATENATE(gastenlijst[[#This Row],[Gast nr.]],gastenlijst[[#This Row],[Post]],gastenlijst[[#This Row],[Yes]])","v":"135"},{"$f":"\"*\"&gastenlijst[[#This Row],[AdresCode]]&\"*\"","v":"*135*"},{"$f":"IF(gastenlijst[[#This Row],[Yes]]>0,\"ja\",\"\")","v":""},{"$f":"MATCH(O136,gastenlijst[[AdresCode]:[Kolom1]],0)","v":{"$error":"#N/A"}},{"$f":"ROW()","v":140},0]
["136",null,null,null,null,null,null,null,null,null,null,null,null,null," ",{"$f":"5518&gastenlijst[[#This Row],[Gast nr.]]","v":"5518136"},{"$f":"gastenlijst[[#This Row],[Kolom1]]","v":"*136*"},{"$f":"CONCATENATE(gastenlijst[[#This Row],[Gast nr.]],gastenlijst[[#This Row],[Post]],gastenlijst[[#This Row],[Yes]])","v":"136"},{"$f":"\"*\"&gastenlijst[[#This Row],[AdresCode]]&\"*\"","v":"*136*"},{"$f":"IF(gastenlijst[[#This Row],[Yes]]>0,\"ja\",\"\")","v":""},{"$f":"MATCH(O137,gastenlijst[[AdresCode]:[Kolom1]],0)","v":{"$error":"#N/A"}},{"$f":"ROW()","v":141},0]
["137",null,null,null,null,null,null,null,null,null,null,null,null,null," ",{"$f":"5518&gastenlijst[[#This Row],[Gast nr.]]","v":"5518137"},{"$f":"gastenlijst[[#This Row],[Kolom1]]","v":"*137*"},{"$f":"CONCATENATE(gastenlijst[[#This Row],[Gast nr.]],gastenlijst[[#This Row],[Post]],gastenlijst[[#This Row],[Yes]])","v":"137"},{"$f":"\"*\"&gastenlijst[[#This Row],[AdresCode]]&\"*\"","v":"*137*"},{"$f":"IF(gastenlijst[[#This Row],[Yes]]>0,\"ja\",\"\")","v":""},{"$f":"MATCH(O138,gastenlijst[[AdresCode]:[Kolom1]],0)","v":{"$error":"#N/A"}},{"$f":"ROW()","v":142},0]
["138",null,null,null,null,null,null,null,null,null,null,null,null,null," ",{"$f":"5518&gastenlijst[[#This Row],[Gast nr.]]","v":"5518138"},{"$f":"gastenlijst[[#This Row],[Kolom1]]","v":"*138*"},{"$f":"CONCATENATE(gastenlijst[[#This Row],[Gast nr.]],gastenlijst[[#This Row],[Post]],gastenlijst[[#This Row],[Yes]])","v":"138"},{"$f":"\"*\"&gastenlijst[[#This Row],[AdresCode]]&\"*\"","v":"*138*"},{"$f":"IF(gastenlijst[[#This Row],[Yes]]>0,\"ja\",\"\")","v":""},{"$f":"MATCH(O139,gastenlijst[[AdresCode]:[Kolom1]],0)","v":{"$error":"#N/A"}},{"$f":"ROW()","v":143},0]
["139",null,null,null,null,null,null,null,null,null,null,null,null,null," ",{"$f":"5518&gastenlijst[[#This Row],[Gast nr.]]","v":"5518139"},{"$f":"gastenlijst[[#This Row],[Kolom1]]","v":"*139*"},{"$f":"CONCATENATE(gastenlijst[[#This Row],[Gast nr.]],gastenlijst[[#This Row],[Post]],gastenlijst[[#This Row],[Yes]])","v":"139"},{"$f":"\"*\"&gastenlijst[[#This Row],[AdresCode]]&\"*\"","v":"*139*"},{"$f":"IF(gastenlijst[[#This Row],[Yes]]>0,\"ja\",\"\")","v":""},{"$f":"MATCH(O140,gastenlijst[[AdresCode]:[Kolom1]],0)","v":{"$error":"#N/A"}},{"$f":"ROW()","v":144},0]
["140",null,null,null,null,null,null,null,null,null,null,null,null,null," ",{"$f":"5518&gastenlijst[[#This Row],[Gast nr.]]","v":"5518140"},{"$f":"gastenlijst[[#This Row],[Kolom1]]","v":"*140*"},{"$f":"CONCATENATE(gastenlijst[[#This Row],[Gast nr.]],gastenlijst[[#This Row],[Post]],gastenlijst[[#This Row],[Yes]])","v":"140"},{"$f":"\"*\"&gastenlijst[[#This Row],[AdresCode]]&\"*\"","v":"*140*"},{"$f":"IF(gastenlijst[[#This Row],[Yes]]>0,\"ja\",\"\")","v":""},{"$f":"MATCH(O141,gastenlijst[[AdresCode]:[Kolom1]],0)","v":{"$error":"#N/A"}},{"$f":"ROW()","v":145},0]
["141",null,null,null,null,null,null,null,null,null,null,null,null,null," ",{"$f":"5518&gastenlijst[[#This Row],[Gast nr.]]","v":"5518141"},{"$f":"gastenlijst[[#This Row],[Kolom1]]","v":"*141*"},{"$f":"CONCATENATE(gastenlijst[[#This Row],[Gast nr.]],gastenlijst[[#This Row],[Post]],gastenlijst[[#This Row],[Yes]])","v":"141"},{"$f":"\"*\"&gastenlijst[[#This Row],[AdresCode]]&\"*\"","v":"*141*"},{"$f":"IF(gastenlijst[[#This Row],[Yes]]>0,\"ja\",\"\")","v":""},{"$f":"MATCH(O142,gastenlijst[[AdresCode]:[Kolom1]],0)","v":{"$error":"#N/A"}},{"$f":"ROW()","v":146},0]
["142",null,null,null,null,null,null,null,null,null,null,null,null,null," ",{"$f":"5518&gastenlijst[[#This Row],[Gast nr.]]","v":"5518142"},{"$f":"gastenlijst[[#This Row],[Kolom1]]","v":"*142*"},{"$f":"CONCATENATE(gastenlijst[[#This Row],[Gast nr.]],gastenlijst[[#This Row],[Post]],gastenlijst[[#This Row],[Yes]])","v":"142"},{"$f":"\"*\"&gastenlijst[[#This Row],[AdresCode]]&\"*\"","v":"*142*"},{"$f":"IF(gastenlijst[[#This Row],[Yes]]>0,\"ja\",\"\")","v":""},{"$f":"MATCH(O143,gastenlijst[[AdresCode]:[Kolom1]],0)","v":{"$error":"#N/A"}},{"$f":"ROW()","v":147},0]
["143",null,null,null,null,null,null,null,null,null,null,null,null,null," ",{"$f":"5518&gastenlijst[[#This Row],[Gast nr.]]","v":"5518143"},{"$f":"gastenlijst[[#This Row],[Kolom1]]","v":"*143*"},{"$f":"CONCATENATE(gastenlijst[[#This Row],[Gast nr.]],gastenlijst[[#This Row],[Post]],gastenlijst[[#This Row],[Yes]])","v":"143"},{"$f":"\"*\"&gastenlijst[[#This Row],[AdresCode]]&\"*\"","v":"*143*"},{"$f":"IF(gastenlijst[[#This Row],[Yes]]>0,\"ja\",\"\")","v":""},{"$f":"MATCH(O144,gastenlijst[[AdresCode]:[Kolom1]],0)","v":{"$error":"#N/A"}},{"$f":"ROW()","v":148},0]
["144",null,null,null,null,null,null,null,null,null,null,null,null,null," ",{"$f":"5518&gastenlijst[[#This Row],[Gast nr.]]","v":"5518144"},{"$f":"gastenlijst[[#This Row],[Kolom1]]","v":"*144*"},{"$f":"CONCATENATE(gastenlijst[[#This Row],[Gast nr.]],gastenlijst[[#This Row],[Post]],gastenlijst[[#This Row],[Yes]])","v":"144"},{"$f":"\"*\"&gastenlijst[[#This Row],[AdresCode]]&\"*\"","v":"*144*"},{"$f":"IF(gastenlijst[[#This Row],[Yes]]>0,\"ja\",\"\")","v":""},{"$f":"MATCH(O145,gastenlijst[[AdresCode]:[Kolom1]],0)","v":{"$error":"#N/A"}},{"$f":"ROW()","v":149},0]
["145",null,null,null,null,null,null,null,null,null,null,null,null,null," ",{"$f":"5518&gastenlijst[[#This Row],[Gast nr.]]","v":"5518145"},{"$f":"gastenlijst[[#This Row],[Kolom1]]","v":"*145*"},{"$f":"CONCATENATE(gastenlijst[[#This Row],[Gast nr.]],gastenlijst[[#This Row],[Post]],gastenlijst[[#This Row],[Yes]])","v":"145"},{"$f":"\"*\"&gastenlijst[[#This Row],[AdresCode]]&\"*\"","v":"*145*"},{"$f":"IF(gastenlijst[[#This Row],[Yes]]>0,\"ja\",\"\")","v":""},{"$f":"MATCH(O146,gastenlijst[[AdresCode]:[Kolom1]],0)","v":{"$error":"#N/A"}},{"$f":"ROW()","v":150},0]
["146",null,null,null,null,null,null,null,null,null,null,null,null,null," ",{"$f":"5518&gastenlijst[[#This Row],[Gast nr.]]","v":"5518146"},{"$f":"gastenlijst[[#This Row],[Kolom1]]","v":"*146*"},{"$f":"CONCATENATE(gastenlijst[[#This Row],[Gast nr.]],gastenlijst[[#This Row],[Post]],gastenlijst[[#This Row],[Yes]])","v":"146"},{"$f":"\"*\"&gastenlijst[[#This Row],[AdresCode]]&\"*\"","v":"*146*"},{"$f":"IF(gastenlijst[[#This Row],[Yes]]>0,\"ja\",\"\")","v":""},{"$f":"MATCH(O147,gastenlijst[[AdresCode]:[Kolom1]],0)","v":{"$error":"#N/A"}},{"$f":"ROW()","v":151},0]
["147",null,null,null,null,null,null,null,null,null,null,null,null,null," ",{"$f":"5518&gastenlijst[[#This Row],[Gast nr.]]","v":"5518147"},{"$f":"gastenlijst[[#This Row],[Kolom1]]","v":"*147*"},{"$f":"CONCATENATE(gastenlijst[[#This Row],[Gast nr.]],gastenlijst[[#This Row],[Post]],gastenlijst[[#This Row],[Yes]])","v":"147"},{"$f":"\"*\"&gastenlijst[[#This Row],[AdresCode]]&\"*\"","v":"*147*"},{"$f":"IF(gastenlijst[[#This Row],[Yes]]>0,\"ja\",\"\")","v":""},{"$f":"MATCH(O148,gastenlijst[[AdresCode]:[Kolom1]],0)","v":{"$error":"#N/A"}},{"$f":"ROW()","v":152},0]
["148",null,null,null,null,null,null,null,null,null,null,null,null,null," ",{"$f":"5518&gastenlijst[[#This Row],[Gast nr.]]","v":"5518148"},{"$f":"gastenlijst[[#This Row],[Kolom1]]","v":"*148*"},{"$f":"CONCATENATE(gastenlijst[[#This Row],[Gast nr.]],gastenlijst[[#This Row],[Post]],gastenlijst[[#This Row],[Yes]])","v":"148"},{"$f":"\"*\"&gastenlijst[[#This Row],[AdresCode]]&\"*\"","v":"*148*"},{"$f":"IF(gastenlijst[[#This Row],[Yes]]>0,\"ja\",\"\")","v":""},{"$f":"MATCH(O149,gastenlijst[[AdresCode]:[Kolom1]],0)","v":{"$error":"#N/A"}},{"$f":"ROW()","v":153},0]
["149",null,null,null,null,null,null,null,null,null,null,null,null,null," ",{"$f":"5518&gastenlijst[[#This Row],[Gast nr.]]","v":"5518149"},{"$f":"gastenlijst[[#This Row],[Kolom1]]","v":"*149*"},{"$f":"CONCATENATE(gastenlijst[[#This Row],[Gast nr.]],gastenlijst[[#This Row],[Post]],gastenlijst[[#This Row],[Yes]])","v":"149"},{"$f":"\"*\"&gastenlijst[[#This Row],[AdresCode]]&\"*\"","v":"*149*"},{"$f":"IF(gastenlijst[[#This Row],[Yes]]>0,\"ja\",\"\")","v":""},{"$f":"MATCH(O150,gastenlijst[[AdresCode]:[Kolom1]],0)","v":{"$error":"#N/A"}},{"$f":"ROW()","v":154},0]
["150",null,null,null,null,null,null,null,null,null,null,null,null,null," ",{"$f":"5518&gastenlijst[[#This Row],[Gast nr.]]","v":"5518150"},{"$f":"gastenlijst[[#This Row],[Kolom1]]","v":"*150*"},{"$f":"CONCATENATE(gastenlijst[[#This Row],[Gast nr.]],gastenlijst[[#This Row],[Post]],gastenlijst[[#This Row],[Yes]])","v":"150"},{"$f":"\"*\"&gastenlijst[[#This Row],[AdresCode]]&\"*\"","v":"*150*"},{"$f":"IF(gastenlijst[[#This Row],[Yes]]>0,\"ja\",\"\")","v":""},{"$f":"MATCH(O151,gastenlijst[[AdresCode]:[Kolom1]],0)","v":{"$error":"#N/A"}},{"$f":"ROW()","v":155},0]
["151",null,null,null,null,null,null,null,null,null,null,null,null,null," ",{"$f":"5518&gastenlijst[[#This Row],[Gast nr.]]","v":"5518151"},{"$f":"gastenlijst[[#This Row],[Kolom1]]","v":"*151*"},{"$f":"CONCATENATE(gastenlijst[[#This Row],[Gast nr.]],gastenlijst[[#This Row],[Post]],gastenlijst[[#This Row],[Yes]])","v":"151"},{"$f":"\"*\"&gastenlijst[[#This Row],[AdresCode]]&\"*\"","v":"*151*"},{"$f":"IF(gastenlijst[[#This Row],[Yes]]>0,\"ja\",\"\")","v":""},{"$f":"MATCH(O152,gastenlijst[[AdresCode]:[Kolom1]],0)","v":{"$error":"#N/A"}},{"$f":"ROW()","v":156},0]
["152",null,null,null,null,null,null,null,null,null,null,null,null,null," ",{"$f":"5518&gastenlijst[[#This Row],[Gast nr.]]","v":"5518152"},{"$f":"gastenlijst[[#This Row],[Kolom1]]","v":"*152*"},{"$f":"CONCATENATE(gastenlijst[[#This Row],[Gast nr.]],gastenlijst[[#This Row],[Post]],gastenlijst[[#This Row],[Yes]])","v":"152"},{"$f":"\"*\"&gastenlijst[[#This Row],[AdresCode]]&\"*\"","v":"*152*"},{"$f":"IF(gastenlijst[[#This Row],[Yes]]>0,\"ja\",\"\")","v":""},{"$f":"MATCH(O153,gastenlijst[[AdresCode]:[Kolom1]],0)","v":{"$error":"#N/A"}},{"$f":"ROW()","v":157},0]
["153",null,null,null,null,null,null,null,null,null,null,null,null,null," ",{"$f":"5518&gastenlijst[[#This Row],[Gast nr.]]","v":"5518153"},{"$f":"gastenlijst[[#This Row],[Kolom1]]","v":"*153*"},{"$f":"CONCATENATE(gastenlijst[[#This Row],[Gast nr.]],gastenlijst[[#This Row],[Post]],gastenlijst[[#This Row],[Yes]])","v":"153"},{"$f":"\"*\"&gastenlijst[[#This Row],[AdresCode]]&\"*\"","v":"*153*"},{"$f":"IF(gastenlijst[[#This Row],[Yes]]>0,\"ja\",\"\")","v":""},{"$f":"MATCH(O154,gastenlijst[[AdresCode]:[Kolom1]],0)","v":{"$error":"#N/A"}},{"$f":"ROW()","v":158},0]
["154",null,null,null,null,null,null,null,null,null,null,null,null,null," ",{"$f":"5518&gastenlijst[[#This Row],[Gast nr.]]","v":"5518154"},{"$f":"gastenlijst[[#This Row],[Kolom1]]","v":"*154*"},{"$f":"CONCATENATE(gastenlijst[[#This Row],[Gast nr.]],gastenlijst[[#This Row],[Post]],gastenlijst[[#This Row],[Yes]])","v":"154"},{"$f":"\"*\"&gastenlijst[[#This Row],[AdresCode]]&\"*\"","v":"*154*"},{"$f":"IF(gastenlijst[[#This Row],[Yes]]>0,\"ja\",\"\")","v":""},{"$f":"MATCH(O155,gastenlijst[[AdresCode]:[Kolom1]],0)","v":{"$error":"#N/A"}},{"$f":"ROW()","v":159},0]
["155",null,null,null,null,null,null,null,null,null,null,null,null,null," ",{"$f":"5518&gastenlijst[[#This Row],[Gast nr.]]","v":"5518155"},{"$f":"gastenlijst[[#This Row],[Kolom1]]","v":"*155*"},{"$f":"CONCATENATE(gastenlijst[[#This Row],[Gast nr.]],gastenlijst[[#This Row],[Post]],gastenlijst[[#This Row],[Yes]])","v":"155"},{"$f":"\"*\"&gastenlijst[[#This Row],[AdresCode]]&\"*\"","v":"*155*"},{"$f":"IF(gastenlijst[[#This Row],[Yes]]>0,\"ja\",\"\")","v":""},{"$f":"MATCH(O156,gastenlijst[[AdresCode]:[Kolom1]],0)","v":{"$error":"#N/A"}},{"$f":"ROW()","v":160},0]
["156",null,null,null,null,null,null,null,null,null,null,null,null,null," ",{"$f":"5518&gastenlijst[[#This Row],[Gast nr.]]","v":"5518156"},{"$f":"gastenlijst[[#This Row],[Kolom1]]","v":"*156*"},{"$f":"CONCATENATE(gastenlijst[[#This Row],[Gast nr.]],gastenlijst[[#This Row],[Post]],gastenlijst[[#This Row],[Yes]])","v":"156"},{"$f":"\"*\"&gastenlijst[[#This Row],[AdresCode]]&\"*\"","v":"*156*"},{"$f":"IF(gastenlijst[[#This Row],[Yes]]>0,\"ja\",\"\")","v":""},{"$f":"MATCH(O157,gastenlijst[[AdresCode]:[Kolom1]],0)","v":{"$error":"#N/A"}},{"$f":"ROW()","v":161},0]
["157",null,null,null,null,null,null,null,null,null,null,null,null,null," ",{"$f":"5518&gastenlijst[[#This Row],[Gast nr.]]","v":"5518157"},{"$f":"gastenlijst[[#This Row],[Kolom1]]","v":"*157*"},{"$f":"CONCATENATE(gastenlijst[[#This Row],[Gast nr.]],gastenlijst[[#This Row],[Post]],gastenlijst[[#This Row],[Yes]])","v":"157"},{"$f":"\"*\"&gastenlijst[[#This Row],[AdresCode]]&\"*\"","v":"*157*"},{"$f":"IF(gastenlijst[[#This Row],[Yes]]>0,\"ja\",\"\")","v":""},{"$f":"MATCH(O158,gastenlijst[[AdresCode]:[Kolom1]],0)","v":{"$error":"#N/A"}},{"$f":"ROW()","v":162},0]
["158",null,null,null,null,null,null,null,null,null,null,null,null,null," ",{"$f":"5518&gastenlijst[[#This Row],[Gast nr.]]","v":"5518158"},{"$f":"gastenlijst[[#This Row],[Kolom1]]","v":"*158*"},{"$f":"CONCATENATE(gastenlijst[[#This Row],[Gast nr.]],gastenlijst[[#This Row],[Post]],gastenlijst[[#This Row],[Yes]])","v":"158"},{"$f":"\"*\"&gastenlijst[[#This Row],[AdresCode]]&\"*\"","v":"*158*"},{"$f":"IF(gastenlijst[[#This Row],[Yes]]>0,\"ja\",\"\")","v":""},{"$f":"MATCH(O159,gastenlijst[[AdresCode]:[Kolom1]],0)","v":{"$error":"#N/A"}},{"$f":"ROW()","v":163},0]
["159",null,null,null,null,null,null,null,null,null,null,null,null,null," ",{"$f":"5518&gastenlijst[[#This Row],[Gast nr.]]","v":"5518159"},{"$f":"gastenlijst[[#This Row],[Kolom1]]","v":"*159*"},{"$f":"CONCATENATE(gastenlijst[[#This Row],[Gast nr.]],gastenlijst[[#This Row],[Post]],gastenlijst[[#This Row],[Yes]])","v":"159"},{"$f":"\"*\"&gastenlijst[[#This Row],[AdresCode]]&\"*\"","v":"*159*"},{"$f":"IF(gastenlijst[[#This Row],[Yes]]>0,\"ja\",\"\")","v":""},{"$f":"MATCH(O160,gastenlijst[[AdresCode]:[Kolom1]],0)","v":{"$error":"#N/A"}},{"$f":"ROW()","v":164},0]
["160",null,null,null,null,null,null,null,null,null,null,null,null,null," ",{"$f":"5518&gastenlijst[[#This Row],[Gast nr.]]","v":"5518160"},{"$f":"gastenlijst[[#This Row],[Kolom1]]","v":"*160*"},{"$f":"CONCATENATE(gastenlijst[[#This Row],[Gast nr.]],gastenlijst[[#This Row],[Post]],gastenlijst[[#This Row],[Yes]])","v":"160"},{"$f":"\"*\"&gastenlijst[[#This Row],[AdresCode]]&\"*\"","v":"*160*"},{"$f":"IF(gastenlijst[[#This Row],[Yes]]>0,\"ja\",\"\")","v":""},{"$f":"MATCH(O161,gastenlijst[[AdresCode]:[Kolom1]],0)","v":{"$error":"#N/A"}},{"$f":"ROW()","v":165},0]
["161",null,null,null,null,null,null,null,null,null,null,null,null,null," ",{"$f":"5518&gastenlijst[[#This Row],[Gast nr.]]","v":"5518161"},{"$f":"gastenlijst[[#This Row],[Kolom1]]","v":"*161*"},{"$f":"CONCATENATE(gastenlijst[[#This Row],[Gast nr.]],gastenlijst[[#This Row],[Post]],gastenlijst[[#This Row],[Yes]])","v":"161"},{"$f":"\"*\"&gastenlijst[[#This Row],[AdresCode]]&\"*\"","v":"*161*"},{"$f":"IF(gastenlijst[[#This Row],[Yes]]>0,\"ja\",\"\")","v":""},{"$f":"MATCH(O162,gastenlijst[[AdresCode]:[Kolom1]],0)","v":{"$error":"#N/A"}},{"$f":"ROW()","v":166},0]
["162",null,null,null,null,null,null,null,null,null,null,null,null,null," ",{"$f":"5518&gastenlijst[[#This Row],[Gast nr.]]","v":"5518162"},{"$f":"gastenlijst[[#This Row],[Kolom1]]","v":"*162*"},{"$f":"CONCATENATE(gastenlijst[[#This Row],[Gast nr.]],gastenlijst[[#This Row],[Post]],gastenlijst[[#This Row],[Yes]])","v":"162"},{"$f":"\"*\"&gastenlijst[[#This Row],[AdresCode]]&\"*\"","v":"*162*"},{"$f":"IF(gastenlijst[[#This Row],[Yes]]>0,\"ja\",\"\")","v":""},{"$f":"MATCH(O163,gastenlijst[[AdresCode]:[Kolom1]],0)","v":{"$error":"#N/A"}},{"$f":"ROW()","v":167},0]
["163",null,null,null,null,null,null,null,null,null,null,null,null,null," ",{"$f":"5518&gastenlijst[[#This Row],[Gast nr.]]","v":"5518163"},{"$f":"gastenlijst[[#This Row],[Kolom1]]","v":"*163*"},{"$f":"CONCATENATE(gastenlijst[[#This Row],[Gast nr.]],gastenlijst[[#This Row],[Post]],gastenlijst[[#This Row],[Yes]])","v":"163"},{"$f":"\"*\"&gastenlijst[[#This Row],[AdresCode]]&\"*\"","v":"*163*"},{"$f":"IF(gastenlijst[[#This Row],[Yes]]>0,\"ja\",\"\")","v":""},{"$f":"MATCH(O164,gastenlijst[[AdresCode]:[Kolom1]],0)","v":{"$error":"#N/A"}},{"$f":"ROW()","v":168},0]
["164",null,null,null,null,null,null,null,null,null,null,null,null,null," ",{"$f":"5518&gastenlijst[[#This Row],[Gast nr.]]","v":"5518164"},{"$f":"gastenlijst[[#This Row],[Kolom1]]","v":"*164*"},{"$f":"CONCATENATE(gastenlijst[[#This Row],[Gast nr.]],gastenlijst[[#This Row],[Post]],gastenlijst[[#This Row],[Yes]])","v":"164"},{"$f":"\"*\"&gastenlijst[[#This Row],[AdresCode]]&\"*\"","v":"*164*"},{"$f":"IF(gastenlijst[[#This Row],[Yes]]>0,\"ja\",\"\")","v":""},{"$f":"MATCH(O165,gastenlijst[[AdresCode]:[Kolom1]],0)","v":{"$error":"#N/A"}},{"$f":"ROW()","v":169},0]
["165",null,null,null,null,null,null,null,null,null,null,null,null,null," ",{"$f":"5518&gastenlijst[[#This Row],[Gast nr.]]","v":"5518165"},{"$f":"gastenlijst[[#This Row],[Kolom1]]","v":"*165*"},{"$f":"CONCATENATE(gastenlijst[[#This Row],[Gast nr.]],gastenlijst[[#This Row],[Post]],gastenlijst[[#This Row],[Yes]])","v":"165"},{"$f":"\"*\"&gastenlijst[[#This Row],[AdresCode]]&\"*\"","v":"*165*"},{"$f":"IF(gastenlijst[[#This Row],[Yes]]>0,\"ja\",\"\")","v":""},{"$f":"MATCH(O166,gastenlijst[[AdresCode]:[Kolom1]],0)","v":{"$error":"#N/A"}},{"$f":"ROW()","v":170},0]
["166",null,null,null,null,null,null,null,null,null,null,null,null,null," ",{"$f":"5518&gastenlijst[[#This Row],[Gast nr.]]","v":"5518166"},{"$f":"gastenlijst[[#This Row],[Kolom1]]","v":"*166*"},{"$f":"CONCATENATE(gastenlijst[[#This Row],[Gast nr.]],gastenlijst[[#This Row],[Post]],gastenlijst[[#This Row],[Yes]])","v":"166"},{"$f":"\"*\"&gastenlijst[[#This Row],[AdresCode]]&\"*\"","v":"*166*"},{"$f":"IF(gastenlijst[[#This Row],[Yes]]>0,\"ja\",\"\")","v":""},{"$f":"MATCH(O167,gastenlijst[[AdresCode]:[Kolom1]],0)","v":{"$error":"#N/A"}},{"$f":"ROW()","v":171},0]
["167",null,null,null,null,null,null,null,null,null,null,null,null,null," ",{"$f":"5518&gastenlijst[[#This Row],[Gast nr.]]","v":"5518167"},{"$f":"gastenlijst[[#This Row],[Kolom1]]","v":"*167*"},{"$f":"CONCATENATE(gastenlijst[[#This Row],[Gast nr.]],gastenlijst[[#This Row],[Post]],gastenlijst[[#This Row],[Yes]])","v":"167"},{"$f":"\"*\"&gastenlijst[[#This Row],[AdresCode]]&\"*\"","v":"*167*"},{"$f":"IF(gastenlijst[[#This Row],[Yes]]>0,\"ja\",\"\")","v":""},{"$f":"MATCH(O168,gastenlijst[[AdresCode]:[Kolom1]],0)","v":{"$error":"#N/A"}},{"$f":"ROW()","v":172},0]
["168",null,null,null,null,null,null,null,null,null,null,null,null,null," ",{"$f":"5518&gastenlijst[[#This Row],[Gast nr.]]","v":"5518168"},{"$f":"gastenlijst[[#This Row],[Kolom1]]","v":"*168*"},{"$f":"CONCATENATE(gastenlijst[[#This Row],[Gast nr.]],gastenlijst[[#This Row],[Post]],gastenlijst[[#This Row],[Yes]])","v":"168"},{"$f":"\"*\"&gastenlijst[[#This Row],[AdresCode]]&\"*\"","v":"*168*"},{"$f":"IF(gastenlijst[[#This Row],[Yes]]>0,\"ja\",\"\")","v":""},{"$f":"MATCH(O169,gastenlijst[[AdresCode]:[Kolom1]],0)","v":{"$error":"#N/A"}},{"$f":"ROW()","v":173},0]
["169",null,null,null,null,null,null,null,null,null,null,null,null,null," ",{"$f":"5518&gastenlijst[[#This Row],[Gast nr.]]","v":"5518169"},{"$f":"gastenlijst[[#This Row],[Kolom1]]","v":"*169*"},{"$f":"CONCATENATE(gastenlijst[[#This Row],[Gast nr.]],gastenlijst[[#This Row],[Post]],gastenlijst[[#This Row],[Yes]])","v":"169"},{"$f":"\"*\"&gastenlijst[[#This Row],[AdresCode]]&\"*\"","v":"*169*"},{"$f":"IF(gastenlijst[[#This Row],[Yes]]>0,\"ja\",\"\")","v":""},{"$f":"MATCH(O170,gastenlijst[[AdresCode]:[Kolom1]],0)","v":{"$error":"#N/A"}},{"$f":"ROW()","v":174},0]
["170",null,null,null,null,null,null,null,null,null,null,null,null,null," ",{"$f":"5518&gastenlijst[[#This Row],[Gast nr.]]","v":"5518170"},{"$f":"gastenlijst[[#This Row],[Kolom1]]","v":"*170*"},{"$f":"CONCATENATE(gastenlijst[[#This Row],[Gast nr.]],gastenlijst[[#This Row],[Post]],gastenlijst[[#This Row],[Yes]])","v":"170"},{"$f":"\"*\"&gastenlijst[[#This Row],[AdresCode]]&\"*\"","v":"*170*"},{"$f":"IF(gastenlijst[[#This Row],[Yes]]>0,\"ja\",\"\")","v":""},{"$f":"MATCH(O171,gastenlijst[[AdresCode]:[Kolom1]],0)","v":{"$error":"#N/A"}},{"$f":"ROW()","v":175},0]
["171",null,null,null,null,null,null,null,null,null,null,null,null,null," ",{"$f":"5518&gastenlijst[[#This Row],[Gast nr.]]","v":"5518171"},{"$f":"gastenlijst[[#This Row],[Kolom1]]","v":"*171*"},{"$f":"CONCATENATE(gastenlijst[[#This Row],[Gast nr.]],gastenlijst[[#This Row],[Post]],gastenlijst[[#This Row],[Yes]])","v":"171"},{"$f":"\"*\"&gastenlijst[[#This Row],[AdresCode]]&\"*\"","v":"*171*"},{"$f":"IF(gastenlijst[[#This Row],[Yes]]>0,\"ja\",\"\")","v":""},{"$f":"MATCH(O172,gastenlijst[[AdresCode]:[Kolom1]],0)","v":{"$error":"#N/A"}},{"$f":"ROW()","v":176},0]
["172",null,null,null,null,null,null,null,null,null,null,null,null,null," ",{"$f":"5518&gastenlijst[[#This Row],[Gast nr.]]","v":"5518172"},{"$f":"gastenlijst[[#This Row],[Kolom1]]","v":"*172*"},{"$f":"CONCATENATE(gastenlijst[[#This Row],[Gast nr.]],gastenlijst[[#This Row],[Post]],gastenlijst[[#This Row],[Yes]])","v":"172"},{"$f":"\"*\"&gastenlijst[[#This Row],[AdresCode]]&\"*\"","v":"*172*"},{"$f":"IF(gastenlijst[[#This Row],[Yes]]>0,\"ja\",\"\")","v":""},{"$f":"MATCH(O173,gastenlijst[[AdresCode]:[Kolom1]],0)","v":{"$error":"#N/A"}},{"$f":"ROW()","v":177},0]
["173",null,null,null,null,null,null,null,null,null,null,null,null,null," ",{"$f":"5518&gastenlijst[[#This Row],[Gast nr.]]","v":"5518173"},{"$f":"gastenlijst[[#This Row],[Kolom1]]","v":"*173*"},{"$f":"CONCATENATE(gastenlijst[[#This Row],[Gast nr.]],gastenlijst[[#This Row],[Post]],gastenlijst[[#This Row],[Yes]])","v":"173"},{"$f":"\"*\"&gastenlijst[[#This Row],[AdresCode]]&\"*\"","v":"*173*"},{"$f":"IF(gastenlijst[[#This Row],[Yes]]>0,\"ja\",\"\")","v":""},{"$f":"MATCH(O174,gastenlijst[[AdresCode]:[Kolom1]],0)","v":{"$error":"#N/A"}},{"$f":"ROW()","v":178},0]
["174",null,null,null,null,null,null,null,null,null,null,null,null,null," ",{"$f":"5518&gastenlijst[[#This Row],[Gast nr.]]","v":"5518174"},{"$f":"gastenlijst[[#This Row],[Kolom1]]","v":"*174*"},{"$f":"CONCATENATE(gastenlijst[[#This Row],[Gast nr.]],gastenlijst[[#This Row],[Post]],gastenlijst[[#This Row],[Yes]])","v":"174"},{"$f":"\"*\"&gastenlijst[[#This Row],[AdresCode]]&\"*\"","v":"*174*"},{"$f":"IF(gastenlijst[[#This Row],[Yes]]>0,\"ja\",\"\")","v":""},{"$f":"MATCH(O175,gastenlijst[[AdresCode]:[Kolom1]],0)","v":{"$error":"#N/A"}},{"$f":"ROW()","v":179},0]
["175",null,null,null,null,null,null,null,null,null,null,null,null,null," ",{"$f":"5518&gastenlijst[[#This Row],[Gast nr.]]","v":"5518175"},{"$f":"gastenlijst[[#This Row],[Kolom1]]","v":"*175*"},{"$f":"CONCATENATE(gastenlijst[[#This Row],[Gast nr.]],gastenlijst[[#This Row],[Post]],gastenlijst[[#This Row],[Yes]])","v":"175"},{"$f":"\"*\"&gastenlijst[[#This Row],[AdresCode]]&\"*\"","v":"*175*"},{"$f":"IF(gastenlijst[[#This Row],[Yes]]>0,\"ja\",\"\")","v":""},{"$f":"MATCH(O176,gastenlijst[[AdresCode]:[Kolom1]],0)","v":{"$error":"#N/A"}},{"$f":"ROW()","v":180},0]
["176",null,null,null,null,null,null,null,null,null,null,null,null,null," ",{"$f":"5518&gastenlijst[[#This Row],[Gast nr.]]","v":"5518176"},{"$f":"gastenlijst[[#This Row],[Kolom1]]","v":"*176*"},{"$f":"CONCATENATE(gastenlijst[[#This Row],[Gast nr.]],gastenlijst[[#This Row],[Post]],gastenlijst[[#This Row],[Yes]])","v":"176"},{"$f":"\"*\"&gastenlijst[[#This Row],[AdresCode]]&\"*\"","v":"*176*"},{"$f":"IF(gastenlijst[[#This Row],[Yes]]>0,\"ja\",\"\")","v":""},{"$f":"MATCH(O177,gastenlijst[[AdresCode]:[Kolom1]],0)","v":{"$error":"#N/A"}},{"$f":"ROW()","v":181},0]
["177",null,null,null,null,null,null,null,null,null,null,null,null,null," ",{"$f":"5518&gastenlijst[[#This Row],[Gast nr.]]","v":"5518177"},{"$f":"gastenlijst[[#This Row],[Kolom1]]","v":"*177*"},{"$f":"CONCATENATE(gastenlijst[[#This Row],[Gast nr.]],gastenlijst[[#This Row],[Post]],gastenlijst[[#This Row],[Yes]])","v":"177"},{"$f":"\"*\"&gastenlijst[[#This Row],[AdresCode]]&\"*\"","v":"*177*"},{"$f":"IF(gastenlijst[[#This Row],[Yes]]>0,\"ja\",\"\")","v":""},{"$f":"MATCH(O178,gastenlijst[[AdresCode]:[Kolom1]],0)","v":{"$error":"#N/A"}},{"$f":"ROW()","v":182},0]
["178",null,null,null,null,null,null,null,null,null,null,null,null,null," ",{"$f":"5518&gastenlijst[[#This Row],[Gast nr.]]","v":"5518178"},{"$f":"gastenlijst[[#This Row],[Kolom1]]","v":"*178*"},{"$f":"CONCATENATE(gastenlijst[[#This Row],[Gast nr.]],gastenlijst[[#This Row],[Post]],gastenlijst[[#This Row],[Yes]])","v":"178"},{"$f":"\"*\"&gastenlijst[[#This Row],[AdresCode]]&\"*\"","v":"*178*"},{"$f":"IF(gastenlijst[[#This Row],[Yes]]>0,\"ja\",\"\")","v":""},{"$f":"MATCH(O179,gastenlijst[[AdresCode]:[Kolom1]],0)","v":{"$error":"#N/A"}},{"$f":"ROW()","v":183},0]
["179",null,null,null,null,null,null,null,null,null,null,null,null,null," ",{"$f":"5518&gastenlijst[[#This Row],[Gast nr.]]","v":"5518179"},{"$f":"gastenlijst[[#This Row],[Kolom1]]","v":"*179*"},{"$f":"CONCATENATE(gastenlijst[[#This Row],[Gast nr.]],gastenlijst[[#This Row],[Post]],gastenlijst[[#This Row],[Yes]])","v":"179"},{"$f":"\"*\"&gastenlijst[[#This Row],[AdresCode]]&\"*\"","v":"*179*"},{"$f":"IF(gastenlijst[[#This Row],[Yes]]>0,\"ja\",\"\")","v":""},{"$f":"MATCH(O180,gastenlijst[[AdresCode]:[Kolom1]],0)","v":{"$error":"#N/A"}},{"$f":"ROW()","v":184},0]
["180",null,null,null,null,null,null,null,null,null,null,null,null,null," ",{"$f":"5518&gastenlijst[[#This Row],[Gast nr.]]","v":"5518180"},{"$f":"gastenlijst[[#This Row],[Kolom1]]","v":"*180*"},{"$f":"CONCATENATE(gastenlijst[[#This Row],[Gast nr.]],gastenlijst[[#This Row],[Post]],gastenlijst[[#This Row],[Yes]])","v":"180"},{"$f":"\"*\"&gastenlijst[[#This Row],[AdresCode]]&\"*\"","v":"*180*"},{"$f":"IF(gastenlijst[[#This Row],[Yes]]>0,\"ja\",\"\")","v":""},{"$f":"MATCH(O181,gastenlijst[[AdresCode]:[Kolom1]],0)","v":{"$error":"#N/A"}},{"$f":"ROW()","v":185},0]
["181",null,null,null,null,null,null,null,null,null,null,null,null,null," ",{"$f":"5518&gastenlijst[[#This Row],[Gast nr.]]","v":"5518181"},{"$f":"gastenlijst[[#This Row],[Kolom1]]","v":"*181*"},{"$f":"CONCATENATE(gastenlijst[[#This Row],[Gast nr.]],gastenlijst[[#This Row],[Post]],gastenlijst[[#This Row],[Yes]])","v":"181"},{"$f":"\"*\"&gastenlijst[[#This Row],[AdresCode]]&\"*\"","v":"*181*"},{"$f":"IF(gastenlijst[[#This Row],[Yes]]>0,\"ja\",\"\")","v":""},{"$f":"MATCH(O182,gastenlijst[[AdresCode]:[Kolom1]],0)","v":{"$error":"#N/A"}},{"$f":"ROW()","v":186},0]
["182",null,null,null,null,null,null,null,null,null,null,null,null,null," ",{"$f":"5518&gastenlijst[[#This Row],[Gast nr.]]","v":"5518182"},{"$f":"gastenlijst[[#This Row],[Kolom1]]","v":"*182*"},{"$f":"CONCATENATE(gastenlijst[[#This Row],[Gast nr.]],gastenlijst[[#This Row],[Post]],gastenlijst[[#This Row],[Yes]])","v":"182"},{"$f":"\"*\"&gastenlijst[[#This Row],[AdresCode]]&\"*\"","v":"*182*"},{"$f":"IF(gastenlijst[[#This Row],[Yes]]>0,\"ja\",\"\")","v":""},{"$f":"MATCH(O183,gastenlijst[[AdresCode]:[Kolom1]],0)","v":{"$error":"#N/A"}},{"$f":"ROW()","v":187},0]
["183",null,null,null,null,null,null,null,null,null,null,null,null,null," ",{"$f":"5518&gastenlijst[[#This Row],[Gast nr.]]","v":"5518183"},{"$f":"gastenlijst[[#This Row],[Kolom1]]","v":"*183*"},{"$f":"CONCATENATE(gastenlijst[[#This Row],[Gast nr.]],gastenlijst[[#This Row],[Post]],gastenlijst[[#This Row],[Yes]])","v":"183"},{"$f":"\"*\"&gastenlijst[[#This Row],[AdresCode]]&\"*\"","v":"*183*"},{"$f":"IF(gastenlijst[[#This Row],[Yes]]>0,\"ja\",\"\")","v":""},{"$f":"MATCH(O184,gastenlijst[[AdresCode]:[Kolom1]],0)","v":{"$error":"#N/A"}},{"$f":"ROW()","v":188},0]
["184",null,null,null,null,null,null,null,null,null,null,null,null,null," ",{"$f":"5518&gastenlijst[[#This Row],[Gast nr.]]","v":"5518184"},{"$f":"gastenlijst[[#This Row],[Kolom1]]","v":"*184*"},{"$f":"CONCATENATE(gastenlijst[[#This Row],[Gast nr.]],gastenlijst[[#This Row],[Post]],gastenlijst[[#This Row],[Yes]])","v":"184"},{"$f":"\"*\"&gastenlijst[[#This Row],[AdresCode]]&\"*\"","v":"*184*"},{"$f":"IF(gastenlijst[[#This Row],[Yes]]>0,\"ja\",\"\")","v":""},{"$f":"MATCH(O185,gastenlijst[[AdresCode]:[Kolom1]],0)","v":{"$error":"#N/A"}},{"$f":"ROW()","v":189},0]
["185",null,null,null,null,null,null,null,null,null,null,null,null,null," ",{"$f":"5518&gastenlijst[[#This Row],[Gast nr.]]","v":"5518185"},{"$f":"gastenlijst[[#This Row],[Kolom1]]","v":"*185*"},{"$f":"CONCATENATE(gastenlijst[[#This Row],[Gast nr.]],gastenlijst[[#This Row],[Post]],gastenlijst[[#This Row],[Yes]])","v":"185"},{"$f":"\"*\"&gastenlijst[[#This Row],[AdresCode]]&\"*\"","v":"*185*"},{"$f":"IF(gastenlijst[[#This Row],[Yes]]>0,\"ja\",\"\")","v":""},{"$f":"MATCH(O186,gastenlijst[[AdresCode]:[Kolom1]],0)","v":{"$error":"#N/A"}},{"$f":"ROW()","v":190},0]
["186",null,null,null,null,null,null,null,null,null,null,null,null,null," ",{"$f":"5518&gastenlijst[[#This Row],[Gast nr.]]","v":"5518186"},{"$f":"gastenlijst[[#This Row],[Kolom1]]","v":"*186*"},{"$f":"CONCATENATE(gastenlijst[[#This Row],[Gast nr.]],gastenlijst[[#This Row],[Post]],gastenlijst[[#This Row],[Yes]])","v":"186"},{"$f":"\"*\"&gastenlijst[[#This Row],[AdresCode]]&\"*\"","v":"*186*"},{"$f":"IF(gastenlijst[[#This Row],[Yes]]>0,\"ja\",\"\")","v":""},{"$f":"MATCH(O187,gastenlijst[[AdresCode]:[Kolom1]],0)","v":{"$error":"#N/A"}},{"$f":"ROW()","v":191},0]
["187",null,null,null,null,null,null,null,null,null,null,null,null,null," ",{"$f":"5518&gastenlijst[[#This Row],[Gast nr.]]","v":"5518187"},{"$f":"gastenlijst[[#This Row],[Kolom1]]","v":"*187*"},{"$f":"CONCATENATE(gastenlijst[[#This Row],[Gast nr.]],gastenlijst[[#This Row],[Post]],gastenlijst[[#This Row],[Yes]])","v":"187"},{"$f":"\"*\"&gastenlijst[[#This Row],[AdresCode]]&\"*\"","v":"*187*"},{"$f":"IF(gastenlijst[[#This Row],[Yes]]>0,\"ja\",\"\")","v":""},{"$f":"MATCH(O188,gastenlijst[[AdresCode]:[Kolom1]],0)","v":{"$error":"#N/A"}},{"$f":"ROW()","v":192},0]
["188",null,null,null,null,null,null,null,null,null,null,null,null,null," ",{"$f":"5518&gastenlijst[[#This Row],[Gast nr.]]","v":"5518188"},{"$f":"gastenlijst[[#This Row],[Kolom1]]","v":"*188*"},{"$f":"CONCATENATE(gastenlijst[[#This Row],[Gast nr.]],gastenlijst[[#This Row],[Post]],gastenlijst[[#This Row],[Yes]])","v":"188"},{"$f":"\"*\"&gastenlijst[[#This Row],[AdresCode]]&\"*\"","v":"*188*"},{"$f":"IF(gastenlijst[[#This Row],[Yes]]>0,\"ja\",\"\")","v":""},{"$f":"MATCH(O189,gastenlijst[[AdresCode]:[Kolom1]],0)","v":{"$error":"#N/A"}},{"$f":"ROW()","v":193},0]
["189",null,null,null,null,null,null,null,null,null,null,null,null,null," ",{"$f":"5518&gastenlijst[[#This Row],[Gast nr.]]","v":"5518189"},{"$f":"gastenlijst[[#This Row],[Kolom1]]","v":"*189*"},{"$f":"CONCATENATE(gastenlijst[[#This Row],[Gast nr.]],gastenlijst[[#This Row],[Post]],gastenlijst[[#This Row],[Yes]])","v":"189"},{"$f":"\"*\"&gastenlijst[[#This Row],[AdresCode]]&\"*\"","v":"*189*"},{"$f":"IF(gastenlijst[[#This Row],[Yes]]>0,\"ja\",\"\")","v":""},{"$f":"MATCH(O190,gastenlijst[[AdresCode]:[Kolom1]],0)","v":{"$error":"#N/A"}},{"$f":"ROW()","v":194},0]
["190",null,null,null,null,null,null,null,null,null,null,null,null,null," ",{"$f":"5518&gastenlijst[[#This Row],[Gast nr.]]","v":"5518190"},{"$f":"gastenlijst[[#This Row],[Kolom1]]","v":"*190*"},{"$f":"CONCATENATE(gastenlijst[[#This Row],[Gast nr.]],gastenlijst[[#This Row],[Post]],gastenlijst[[#This Row],[Yes]])","v":"190"},{"$f":"\"*\"&gastenlijst[[#This Row],[AdresCode]]&\"*\"","v":"*190*"},{"$f":"IF(gastenlijst[[#This Row],[Yes]]>0,\"ja\",\"\")","v":""},{"$f":"MATCH(O191,gastenlijst[[AdresCode]:[Kolom1]],0)","v":{"$error":"#N/A"}},{"$f":"ROW()","v":195},0]
["191",null,null,null,null,null,null,null,null,null,null,null,null,null," ",{"$f":"5518&gastenlijst[[#This Row],[Gast nr.]]","v":"5518191"},{"$f":"gastenlijst[[#This Row],[Kolom1]]","v":"*191*"},{"$f":"CONCATENATE(gastenlijst[[#This Row],[Gast nr.]],gastenlijst[[#This Row],[Post]],gastenlijst[[#This Row],[Yes]])","v":"191"},{"$f":"\"*\"&gastenlijst[[#This Row],[AdresCode]]&\"*\"","v":"*191*"},{"$f":"IF(gastenlijst[[#This Row],[Yes]]>0,\"ja\",\"\")","v":""},{"$f":"MATCH(O192,gastenlijst[[AdresCode]:[Kolom1]],0)","v":{"$error":"#N/A"}},{"$f":"ROW()","v":196},0]
["192",null,null,null,null,null,null,null,null,null,null,null,null,null," ",{"$f":"5518&gastenlijst[[#This Row],[Gast nr.]]","v":"5518192"},{"$f":"gastenlijst[[#This Row],[Kolom1]]","v":"*192*"},{"$f":"CONCATENATE(gastenlijst[[#This Row],[Gast nr.]],gastenlijst[[#This Row],[Post]],gastenlijst[[#This Row],[Yes]])","v":"192"},{"$f":"\"*\"&gastenlijst[[#This Row],[AdresCode]]&\"*\"","v":"*192*"},{"$f":"IF(gastenlijst[[#This Row],[Yes]]>0,\"ja\",\"\")","v":""},{"$f":"MATCH(O193,gastenlijst[[AdresCode]:[Kolom1]],0)","v":{"$error":"#N/A"}},{"$f":"ROW()","v":197},0]
["193",null,null,null,null,null,null,null,null,null,null,null,null,null," ",{"$f":"5518&gastenlijst[[#This Row],[Gast nr.]]","v":"5518193"},{"$f":"gastenlijst[[#This Row],[Kolom1]]","v":"*193*"},{"$f":"CONCATENATE(gastenlijst[[#This Row],[Gast nr.]],gastenlijst[[#This Row],[Post]],gastenlijst[[#This Row],[Yes]])","v":"193"},{"$f":"\"*\"&gastenlijst[[#This Row],[AdresCode]]&\"*\"","v":"*193*"},{"$f":"IF(gastenlijst[[#This Row],[Yes]]>0,\"ja\",\"\")","v":""},{"$f":"MATCH(O194,gastenlijst[[AdresCode]:[Kolom1]],0)","v":{"$error":"#N/A"}},{"$f":"ROW()","v":198},0]
["194",null,null,null,null,null,null,null,null,null,null,null,null,null," ",{"$f":"5518&gastenlijst[[#This Row],[Gast nr.]]","v":"5518194"},{"$f":"gastenlijst[[#This Row],[Kolom1]]","v":"*194*"},{"$f":"CONCATENATE(gastenlijst[[#This Row],[Gast nr.]],gastenlijst[[#This Row],[Post]],gastenlijst[[#This Row],[Yes]])","v":"194"},{"$f":"\"*\"&gastenlijst[[#This Row],[AdresCode]]&\"*\"","v":"*194*"},{"$f":"IF(gastenlijst[[#This Row],[Yes]]>0,\"ja\",\"\")","v":""},{"$f":"MATCH(O195,gastenlijst[[AdresCode]:[Kolom1]],0)","v":{"$error":"#N/A"}},{"$f":"ROW()","v":199},0]
["195",null,null,null,null,null,null,null,null,null,null,null,null,null," ",{"$f":"5518&gastenlijst[[#This Row],[Gast nr.]]","v":"5518195"},{"$f":"gastenlijst[[#This Row],[Kolom1]]","v":"*195*"},{"$f":"CONCATENATE(gastenlijst[[#This Row],[Gast nr.]],gastenlijst[[#This Row],[Post]],gastenlijst[[#This Row],[Yes]])","v":"195"},{"$f":"\"*\"&gastenlijst[[#This Row],[AdresCode]]&\"*\"","v":"*195*"},{"$f":"IF(gastenlijst[[#This Row],[Yes]]>0,\"ja\",\"\")","v":""},{"$f":"MATCH(O196,gastenlijst[[AdresCode]:[Kolom1]],0)","v":{"$error":"#N/A"}},{"$f":"ROW()","v":200},0]
["196",null,null,null,null,null,null,null,null,null,null,null,null,null," ",{"$f":"5518&gastenlijst[[#This Row],[Gast nr.]]","v":"5518196"},{"$f":"gastenlijst[[#This Row],[Kolom1]]","v":"*196*"},{"$f":"CONCATENATE(gastenlijst[[#This Row],[Gast nr.]],gastenlijst[[#This Row],[Post]],gastenlijst[[#This Row],[Yes]])","v":"196"},{"$f":"\"*\"&gastenlijst[[#This Row],[AdresCode]]&\"*\"","v":"*196*"},{"$f":"IF(gastenlijst[[#This Row],[Yes]]>0,\"ja\",\"\")","v":""},{"$f":"MATCH(O197,gastenlijst[[AdresCode]:[Kolom1]],0)","v":{"$error":"#N/A"}},{"$f":"ROW()","v":201},0]
["197",null,null,null,null,null,null,null,null,null,null,null,null,null," ",{"$f":"5518&gastenlijst[[#This Row],[Gast nr.]]","v":"5518197"},{"$f":"gastenlijst[[#This Row],[Kolom1]]","v":"*197*"},{"$f":"CONCATENATE(gastenlijst[[#This Row],[Gast nr.]],gastenlijst[[#This Row],[Post]],gastenlijst[[#This Row],[Yes]])","v":"197"},{"$f":"\"*\"&gastenlijst[[#This Row],[AdresCode]]&\"*\"","v":"*197*"},{"$f":"IF(gastenlijst[[#This Row],[Yes]]>0,\"ja\",\"\")","v":""},{"$f":"MATCH(O198,gastenlijst[[AdresCode]:[Kolom1]],0)","v":{"$error":"#N/A"}},{"$f":"ROW()","v":202},0]
["198",null,null,null,null,null,null,null,null,null,null,null,null,null," ",{"$f":"5518&gastenlijst[[#This Row],[Gast nr.]]","v":"5518198"},{"$f":"gastenlijst[[#This Row],[Kolom1]]","v":"*198*"},{"$f":"CONCATENATE(gastenlijst[[#This Row],[Gast nr.]],gastenlijst[[#This Row],[Post]],gastenlijst[[#This Row],[Yes]])","v":"198"},{"$f":"\"*\"&gastenlijst[[#This Row],[AdresCode]]&\"*\"","v":"*198*"},{"$f":"IF(gastenlijst[[#This Row],[Yes]]>0,\"ja\",\"\")","v":""},{"$f":"MATCH(O199,gastenlijst[[AdresCode]:[Kolom1]],0)","v":{"$error":"#N/A"}},{"$f":"ROW()","v":203},0]
["199",null,null,null,null,null,null,null,null,null,null,null,null,null," ",{"$f":"5518&gastenlijst[[#This Row],[Gast nr.]]","v":"5518199"},{"$f":"gastenlijst[[#This Row],[Kolom1]]","v":"*199*"},{"$f":"CONCATENATE(gastenlijst[[#This Row],[Gast nr.]],gastenlijst[[#This Row],[Post]],gastenlijst[[#This Row],[Yes]])","v":"199"},{"$f":"\"*\"&gastenlijst[[#This Row],[AdresCode]]&\"*\"","v":"*199*"},{"$f":"IF(gastenlijst[[#This Row],[Yes]]>0,\"ja\",\"\")","v":""},{"$f":"MATCH(O200,gastenlijst[[AdresCode]:[Kolom1]],0)","v":{"$error":"#N/A"}},{"$f":"ROW()","v":204},0]
["200",null,null,null,null,null,null,null,null,null,null,null,null,null," ",{"$f":"5518&gastenlijst[[#This Row],[Gast nr.]]","v":"5518200"},{"$f":"gastenlijst[[#This Row],[Kolom1]]","v":"*200*"},{"$f":"CONCATENATE(gastenlijst[[#This Row],[Gast nr.]],gastenlijst[[#This Row],[Post]],gastenlijst[[#This Row],[Yes]])","v":"200"},{"$f":"\"*\"&gastenlijst[[#This Row],[AdresCode]]&\"*\"","v":"*200*"},{"$f":"IF(gastenlijst[[#This Row],[Yes]]>0,\"ja\",\"\")","v":""},{"$f":"MATCH(O201,gastenlijst[[AdresCode]:[Kolom1]],0)","v":{"$error":"#N/A"}},{"$f":"ROW()","v":205},0]
["201",null,null,null,null,null,null,null,null,null,null,null,null,null," ",{"$f":"5518&gastenlijst[[#This Row],[Gast nr.]]","v":"5518201"},{"$f":"gastenlijst[[#This Row],[Kolom1]]","v":"*201*"},{"$f":"CONCATENATE(gastenlijst[[#This Row],[Gast nr.]],gastenlijst[[#This Row],[Post]],gastenlijst[[#This Row],[Yes]])","v":"201"},{"$f":"\"*\"&gastenlijst[[#This Row],[AdresCode]]&\"*\"","v":"*201*"},{"$f":"IF(gastenlijst[[#This Row],[Yes]]>0,\"ja\",\"\")","v":""},{"$f":"MATCH(O202,gastenlijst[[AdresCode]:[Kolom1]],0)","v":{"$error":"#N/A"}},{"$f":"ROW()","v":206},0]
["202",null,null,null,null,null,null,null,null,null,null,null,null,null," ",{"$f":"5518&gastenlijst[[#This Row],[Gast nr.]]","v":"5518202"},{"$f":"gastenlijst[[#This Row],[Kolom1]]","v":"*202*"},{"$f":"CONCATENATE(gastenlijst[[#This Row],[Gast nr.]],gastenlijst[[#This Row],[Post]],gastenlijst[[#This Row],[Yes]])","v":"202"},{"$f":"\"*\"&gastenlijst[[#This Row],[AdresCode]]&\"*\"","v":"*202*"},{"$f":"IF(gastenlijst[[#This Row],[Yes]]>0,\"ja\",\"\")","v":""},{"$f":"MATCH(O203,gastenlijst[[AdresCode]:[Kolom1]],0)","v":{"$error":"#N/A"}},{"$f":"ROW()","v":207},0]
["203",null,null,null,null,null,null,null,null,null,null,null,null,null," ",{"$f":"5518&gastenlijst[[#This Row],[Gast nr.]]","v":"5518203"},{"$f":"gastenlijst[[#This Row],[Kolom1]]","v":"*203*"},{"$f":"CONCATENATE(gastenlijst[[#This Row],[Gast nr.]],gastenlijst[[#This Row],[Post]],gastenlijst[[#This Row],[Yes]])","v":"203"},{"$f":"\"*\"&gastenlijst[[#This Row],[AdresCode]]&\"*\"","v":"*203*"},{"$f":"IF(gastenlijst[[#This Row],[Yes]]>0,\"ja\",\"\")","v":""},{"$f":"MATCH(O204,gastenlijst[[AdresCode]:[Kolom1]],0)","v":{"$error":"#N/A"}},{"$f":"ROW()","v":208},0]
["204",null,null,null,null,null,null,null,null,null,null,null,null,null," ",{"$f":"5518&gastenlijst[[#This Row],[Gast nr.]]","v":"5518204"},{"$f":"gastenlijst[[#This Row],[Kolom1]]","v":"*204*"},{"$f":"CONCATENATE(gastenlijst[[#This Row],[Gast nr.]],gastenlijst[[#This Row],[Post]],gastenlijst[[#This Row],[Yes]])","v":"204"},{"$f":"\"*\"&gastenlijst[[#This Row],[AdresCode]]&\"*\"","v":"*204*"},{"$f":"IF(gastenlijst[[#This Row],[Yes]]>0,\"ja\",\"\")","v":""},{"$f":"MATCH(O205,gastenlijst[[AdresCode]:[Kolom1]],0)","v":{"$error":"#N/A"}},{"$f":"ROW()","v":209},0]
["205",null,null,null,null,null,null,null,null,null,null,null,null,null," ",{"$f":"5518&gastenlijst[[#This Row],[Gast nr.]]","v":"5518205"},{"$f":"gastenlijst[[#This Row],[Kolom1]]","v":"*205*"},{"$f":"CONCATENATE(gastenlijst[[#This Row],[Gast nr.]],gastenlijst[[#This Row],[Post]],gastenlijst[[#This Row],[Yes]])","v":"205"},{"$f":"\"*\"&gastenlijst[[#This Row],[AdresCode]]&\"*\"","v":"*205*"},{"$f":"IF(gastenlijst[[#This Row],[Yes]]>0,\"ja\",\"\")","v":""},{"$f":"MATCH(O206,gastenlijst[[AdresCode]:[Kolom1]],0)","v":{"$error":"#N/A"}},{"$f":"ROW()","v":210},0]
["206",null,null,null,null,null,null,null,null,null,null,null,null,null," ",{"$f":"5518&gastenlijst[[#This Row],[Gast nr.]]","v":"5518206"},{"$f":"gastenlijst[[#This Row],[Kolom1]]","v":"*206*"},{"$f":"CONCATENATE(gastenlijst[[#This Row],[Gast nr.]],gastenlijst[[#This Row],[Post]],gastenlijst[[#This Row],[Yes]])","v":"206"},{"$f":"\"*\"&gastenlijst[[#This Row],[AdresCode]]&\"*\"","v":"*206*"},{"$f":"IF(gastenlijst[[#This Row],[Yes]]>0,\"ja\",\"\")","v":""},{"$f":"MATCH(O207,gastenlijst[[AdresCode]:[Kolom1]],0)","v":{"$error":"#N/A"}},{"$f":"ROW()","v":211},0]
["207",null,null,null,null,null,null,null,null,null,null,null,null,null," ",{"$f":"5518&gastenlijst[[#This Row],[Gast nr.]]","v":"5518207"},{"$f":"gastenlijst[[#This Row],[Kolom1]]","v":"*207*"},{"$f":"CONCATENATE(gastenlijst[[#This Row],[Gast nr.]],gastenlijst[[#This Row],[Post]],gastenlijst[[#This Row],[Yes]])","v":"207"},{"$f":"\"*\"&gastenlijst[[#This Row],[AdresCode]]&\"*\"","v":"*207*"},{"$f":"IF(gastenlijst[[#This Row],[Yes]]>0,\"ja\",\"\")","v":""},{"$f":"MATCH(O208,gastenlijst[[AdresCode]:[Kolom1]],0)","v":{"$error":"#N/A"}},{"$f":"ROW()","v":212},0]
["208",null,null,null,null,null,null,null,null,null,null,null,null,null," ",{"$f":"5518&gastenlijst[[#This Row],[Gast nr.]]","v":"5518208"},{"$f":"gastenlijst[[#This Row],[Kolom1]]","v":"*208*"},{"$f":"CONCATENATE(gastenlijst[[#This Row],[Gast nr.]],gastenlijst[[#This Row],[Post]],gastenlijst[[#This Row],[Yes]])","v":"208"},{"$f":"\"*\"&gastenlijst[[#This Row],[AdresCode]]&\"*\"","v":"*208*"},{"$f":"IF(gastenlijst[[#This Row],[Yes]]>0,\"ja\",\"\")","v":""},{"$f":"MATCH(O209,gastenlijst[[AdresCode]:[Kolom1]],0)","v":{"$error":"#N/A"}},{"$f":"ROW()","v":213},0]

{"sheet":"Adres Barcode stickers","index":1,"n_rows":26,"n_cols":20,"rows_kept":26,"cut":false,"hidden":false,"merged":[]}
[{"$f":"IF(AND(Lijst!L6>0,Lijst!W6=0),Lijst!$C6&\" \"&Lijst!$B6&CHAR(10)&Lijst!$D6&\" \"&Lijst!$E6&CHAR(10)&Lijst!$F6&\" \"&Lijst!$G6&\" \"&Lijst!$H6,\"\")","v":"Forum Excel\nForumstraat 1\n4321 BA Excelstad"},null,{"$f":"IF(Lijst!L15>0,Lijst!$C15&\" \"&Lijst!$B15&CHAR(10)&Lijst!$D15&\" \"&Lijst!$E15&CHAR(10)&Lijst!$F15&\" \"&Lijst!$G15&\" \"&Lijst!$H15,\"\")","v":""},null,{"$f":"IF(Lijst!L24>0,Lijst!$C24&\" \"&Lijst!$B24&CHAR(10)&Lijst!$D24&\" \"&Lijst!$E24&CHAR(10)&Lijst!$F24&\" \"&Lijst!$G24&\" \"&Lijst!$H24,\"\")","v":""},{"$f":"IF(Lijst!L33>0,Lijst!$C33&\" \"&Lijst!$B33&CHAR(10)&Lijst!$D33&\" \"&Lijst!$E33&CHAR(10)&Lijst!$F33&\" \"&Lijst!$G33&\" \"&Lijst!$H33,\"\")","v":""},null,{"$f":"IF(Lijst!L42>0,Lijst!$C42&\" \"&Lijst!$B42&CHAR(10)&Lijst!$D42&\" \"&Lijst!$E42&CHAR(10)&Lijst!$F42&\" \"&Lijst!$G42&\" \"&Lijst!$H42,\"\")","v":""},null,{"$f":"IF(Lijst!L51>0,Lijst!$C51&\" \"&Lijst!$B51&CHAR(10)&Lijst!$D51&\" \"&Lijst!$E51&CHAR(10)&Lijst!$F51&\" \"&Lijst!$G51&\" \"&Lijst!$H51,\"\")","v":""},{"$f":"IF(Lijst!L60>0,Lijst!$C60&\" \"&Lijst!$B60&CHAR(10)&Lijst!$D60&\" \"&Lijst!$E60&CHAR(10)&Lijst!$F60&\" \"&Lijst!$G60&\" \"&Lijst!$H60,\"\")","v":""},null,{"$f":"IF(Lijst!L69>0,Lijst!$C69&\" \"&Lijst!$B69&CHAR(10)&Lijst!$D69&\" \"&Lijst!$E69&CHAR(10)&Lijst!$F69&\" \"&Lijst!$G69&\" \"&Lijst!$H69,\"\")","v":""},null,{"$f":"IF(Lijst!$L78>0,Lijst!$C78&\" \"&Lijst!$B78&CHAR(10)&Lijst!$D78&\" \"&Lijst!$E78&CHAR(10)&Lijst!$F78&\" \"&Lijst!$G78&\" \"&Lijst!$H78,\"\")","v":""},{"$f":"IF(Lijst!$L87>0,Lijst!$C87&\" \"&Lijst!$B87&CHAR(10)&Lijst!$D87&\" \"&Lijst!$E87&CHAR(10)&Lijst!$F87&\" \"&Lijst!$G87&\" \"&Lijst!$H87,\"\")","v":""},null,{"$f":"IF(Lijst!$L96>0,Lijst!$C96&\" \"&Lijst!$B96&CHAR(10)&Lijst!$D96&\" \"&Lijst!$E96&CHAR(10)&Lijst!$F96&\" \"&Lijst!$G96&\" \"&Lijst!$H96,\"\")","v":""},null,{"$f":"IF(Lijst!$L105>0,Lijst!$C105&\" \"&Lijst!$B105&CHAR(10)&Lijst!$D105&\" \"&Lijst!$E105&CHAR(10)&Lijst!$F105&\" \"&Lijst!$G105&\" \"&Lijst!$H105,\"\")","v":""}]
[{"$f":"IF(AND(Lijst!$L6<>\"\",Lijst!W6=0),Lijst!$Q6,\"\")","v":"*00243211*"},null,{"$f":"IF(Lijst!$L15<>\"\",Lijst!$Q15,\"\")","v":""},null,{"$f":"IF(Lijst!$L24<>\"\",Lijst!$Q24,\"\")","v":""},{"$f":"IF(Lijst!$L33<>\"\",Lijst!$Q33,\"\")","v":""},null,{"$f":"IF(Lijst!$L42<>\"\",Lijst!$Q42,\"\")","v":""},null,{"$f":"IF(Lijst!$L51<>\"\",Lijst!$Q51,\"\")","v":""},{"$f":"IF(Lijst!$L60<>\"\",Lijst!$Q60,\"\")","v":""},null,{"$f":"IF(Lijst!$L69<>\"\",Lijst!$Q69,\"\")","v":""},null,{"$f":"IF(Lijst!$L78<>\"\",Lijst!$Q78,\"\")","v":""},{"$f":"IF(Lijst!$L87<>\"\",Lijst!$Q87,\"\")","v":""},null,{"$f":"IF(Lijst!$L96<>\"\",Lijst!$Q96,\"\")","v":""},null,{"$f":"IF(Lijst!$L105<>\"\",Lijst!$Q105,\"\")","v":""}]
[]
[{"$f":"IF(AND(Lijst!L7>0,Lijst!W7=0),Lijst!$C7&\" \"&Lijst!$B7&CHAR(10)&Lijst!$D7&\" \"&Lijst!$E7&CHAR(10)&Lijst!$F7&\" \"&Lijst!$G7&\" \"&Lijst!$H7,\"\")","v":""},null,{"$f":"IF(Lijst!L16>0,Lijst!$C16&\" \"&Lijst!$B16&CHAR(10)&Lijst!$D16&\" \"&Lijst!$E16&CHAR(10)&Lijst!$F16&\" \"&Lijst!$G16&\" \"&Lijst!$H16,\"\")","v":""},null,{"$f":"IF(Lijst!L25>0,Lijst!$C25&\" \"&Lijst!$B25&CHAR(10)&Lijst!$D25&\" \"&Lijst!$E25&CHAR(10)&Lijst!$F25&\" \"&Lijst!$G25&\" \"&Lijst!$H25,\"\")","v":""},{"$f":"IF(Lijst!L34>0,Lijst!$C34&\" \"&Lijst!$B34&CHAR(10)&Lijst!$D34&\" \"&Lijst!$E34&CHAR(10)&Lijst!$F34&\" \"&Lijst!$G34&\" \"&Lijst!$H34,\"\")","v":""},null,{"$f":"IF(Lijst!L43>0,Lijst!$C43&\" \"&Lijst!$B43&CHAR(10)&Lijst!$D43&\" \"&Lijst!$E43&CHAR(10)&Lijst!$F43&\" \"&Lijst!$G43&\" \"&Lijst!$H43,\"\")","v":""},null,{"$f":"IF(Lijst!L52>0,Lijst!$C52&\" \"&Lijst!$B52&CHAR(10)&Lijst!$D52&\" \"&Lijst!$E52&CHAR(10)&Lijst!$F52&\" \"&Lijst!$G52&\" \"&Lijst!$H52,\"\")","v":""},{"$f":"IF(Lijst!L61>0,Lijst!$C61&\" \"&Lijst!$B61&CHAR(10)&Lijst!$D61&\" \"&Lijst!$E61&CHAR(10)&Lijst!$F61&\" \"&Lijst!$G61&\" \"&Lijst!$H61,\"\")","v":""},null,{"$f":"IF(Lijst!L70>0,Lijst!$C70&\" \"&Lijst!$B70&CHAR(10)&Lijst!$D70&\" \"&Lijst!$E70&CHAR(10)&Lijst!$F70&\" \"&Lijst!$G70&\" \"&Lijst!$H70,\"\")","v":""},null,{"$f":"IF(Lijst!L79>0,Lijst!$C79&\" \"&Lijst!$B79&CHAR(10)&Lijst!$D79&\" \"&Lijst!$E79&CHAR(10)&Lijst!$F79&\" \"&Lijst!$G79&\" \"&Lijst!$H79,\"\")","v":""},{"$f":"IF(Lijst!$L88>0,Lijst!$C88&\" \"&Lijst!$B88&CHAR(10)&Lijst!$D88&\" \"&Lijst!$E88&CHAR(10)&Lijst!$F88&\" \"&Lijst!$G88&\" \"&Lijst!$H88,\"\")","v":""},null,{"$f":"IF(Lijst!$L97>0,Lijst!$C97&\" \"&Lijst!$B97&CHAR(10)&Lijst!$D97&\" \"&Lijst!$E97&CHAR(10)&Lijst!$F97&\" \"&Lijst!$G97&\" \"&Lijst!$H97,\"\")","v":""},null,{"$f":"IF(Lijst!$L106>0,Lijst!$C106&\" \"&Lijst!$B106&CHAR(10)&Lijst!$D106&\" \"&Lijst!$E106&CHAR(10)&Lijst!$F106&\" \"&Lijst!$G106&\" \"&Lijst!$H106,\"\")","v":""}]
[{"$f":"IF(AND(Lijst!L7<>\"\",Lijst!W7=0),Lijst!$Q7,\"\")","v":""},null,{"$f":"IF(Lijst!$L16<>\"\",Lijst!$Q16,\"\")","v":""},null,{"$f":"IF(Lijst!$L25<>\"\",Lijst!$Q25,\"\")","v":""},{"$f":"IF(Lijst!$L34<>\"\",Lijst!$Q34,\"\")","v":""},null,{"$f":"IF(Lijst!$L43<>\"\",Lijst!$Q43,\"\")","v":""},null,{"$f":"IF(Lijst!$L52<>\"\",Lijst!$Q52,\"\")","v":""},{"$f":"IF(Lijst!$L61<>\"\",Lijst!$Q61,\"\")","v":""},null,{"$f":"IF(Lijst!$L70<>\"\",Lijst!$Q70,\"\")","v":""},null,{"$f":"IF(Lijst!$L79<>\"\",Lijst!$Q79,\"\")","v":""},{"$f":"IF(Lijst!$L88<>\"\",Lijst!$Q88,\"\")","v":""},null,{"$f":"IF(Lijst!$L97<>\"\",Lijst!$Q97,\"\")","v":""},null,{"$f":"IF(Lijst!$L106<>\"\",Lijst!$Q106,\"\")","v":""}]
[]
[{"$f":"IF(Lijst!L8>0,Lijst!$C8&\" \"&Lijst!$B8&CHAR(10)&Lijst!$D8&\" \"&Lijst!$E8&CHAR(10)&Lijst!$F8&\" \"&Lijst!$G8&\" \"&Lijst!$H8,\"\")","v":"Geduld Wachten\nGeduldstraat 1\n7879 WW Geduldstad"},null,{"$f":"IF(Lijst!L17>0,Lijst!$C17&\" \"&Lijst!$B17&CHAR(10)&Lijst!$D17&\" \"&Lijst!$E17&CHAR(10)&Lijst!$F17&\" \"&Lijst!$G17&\" \"&Lijst!$H17,\"\")","v":""},null,{"$f":"IF(Lijst!L26>0,Lijst!$C26&\" \"&Lijst!$B26&CHAR(10)&Lijst!$D26&\" \"&Lijst!$E26&CHAR(10)&Lijst!$F26&\" \"&Lijst!$G26&\" \"&Lijst!$H26,\"\")","v":""},{"$f":"IF(Lijst!L35>0,Lijst!$C35&\" \"&Lijst!$B35&CHAR(10)&Lijst!$D35&\" \"&Lijst!$E35&CHAR(10)&Lijst!$F35&\" \"&Lijst!$G35&\" \"&Lijst!$H35,\"\")","v":""},null,{"$f":"IF(Lijst!L44>0,Lijst!$C44&\" \"&Lijst!$B44&CHAR(10)&Lijst!$D44&\" \"&Lijst!$E44&CHAR(10)&Lijst!$F44&\" \"&Lijst!$G44&\" \"&Lijst!$H44,\"\")","v":""},null,{"$f":"IF(Lijst!L53>0,Lijst!$C53&\" \"&Lijst!$B53&CHAR(10)&Lijst!$D53&\" \"&Lijst!$E53&CHAR(10)&Lijst!$F53&\" \"&Lijst!$G53&\" \"&Lijst!$H53,\"\")","v":""},{"$f":"IF(Lijst!L62>0,Lijst!$C62&\" \"&Lijst!$B62&CHAR(10)&Lijst!$D62&\" \"&Lijst!$E62&CHAR(10)&Lijst!$F62&\" \"&Lijst!$G62&\" \"&Lijst!$H62,\"\")","v":""},null,{"$f":"IF(Lijst!L71>0,Lijst!$C71&\" \"&Lijst!$B71&CHAR(10)&Lijst!$D71&\" \"&Lijst!$E71&CHAR(10)&Lijst!$F71&\" \"&Lijst!$G71&\" \"&Lijst!$H71,\"\")","v":""},null,{"$f":"IF(Lijst!L80>0,Lijst!$C80&\" \"&Lijst!$B80&CHAR(10)&Lijst!$D80&\" \"&Lijst!$E80&CHAR(10)&Lijst!$F80&\" \"&Lijst!$G80&\" \"&Lijst!$H80,\"\")","v":""},{"$f":"IF(Lijst!$L89>0,Lijst!$C89&\" \"&Lijst!$B89&CHAR(10)&Lijst!$D89&\" \"&Lijst!$E89&CHAR(10)&Lijst!$F89&\" \"&Lijst!$G89&\" \"&Lijst!$H89,\"\")","v":""},null,{"$f":"IF(Lijst!$L98>0,Lijst!$C98&\" \"&Lijst!$B98&CHAR(10)&Lijst!$D98&\" \"&Lijst!$E98&CHAR(10)&Lijst!$F98&\" \"&Lijst!$G98&\" \"&Lijst!$H98,\"\")","v":""},null,{"$f":"IF(Lijst!$L107>0,Lijst!$C107&\" \"&Lijst!$B107&CHAR(10)&Lijst!$D107&\" \"&Lijst!$E107&CHAR(10)&Lijst!$F107&\" \"&Lijst!$G107&\" \"&Lijst!$H107,\"\")","v":""}]
[{"$f":"IF(Lijst!L8<>\"\",Lijst!$Q8,\"\")","v":"*00378795*"},null,{"$f":"IF(Lijst!$L17<>\"\",Lijst!$Q17,\"\")","v":""},null,{"$f":"IF(Lijst!$L26<>\"\",Lijst!$Q26,\"\")","v":""},{"$f":"IF(Lijst!$L35<>\"\",Lijst!$Q35,\"\")","v":""},null,{"$f":"IF(Lijst!$L42<>\"\",Lijst!$Q44,\"\")","v":""},null,{"$f":"IF(Lijst!$L53<>\"\",Lijst!$Q53,\"\")","v":""},{"$f":"IF(Lijst!$L62<>\"\",Lijst!$Q62,\"\")","v":""},null,{"$f":"IF(Lijst!$L71<>\"\",Lijst!$Q71,\"\")","v":""},null,{"$f":"IF(Lijst!$L80<>\"\",Lijst!$Q80,\"\")","v":""},{"$f":"IF(Lijst!$L89<>\"\",Lijst!$Q89,\"\")","v":""},null,{"$f":"IF(Lijst!$L98<>\"\",Lijst!$Q98,\"\")","v":""},null,{"$f":"IF(Lijst!$L107<>\"\",Lijst!$Q107,\"\")","v":""}]
[]
[{"$f":"IF(Lijst!L9>0,Lijst!$C9&\" \"&Lijst!$B9&CHAR(10)&Lijst!$D9&\" \"&Lijst!$E9&CHAR(10)&Lijst!$F9&\" \"&Lijst!$G9&\" \"&Lijst!$H9,\"\")","v":""},null,{"$f":"IF(Lijst!L18>0,Lijst!$C18&\" \"&Lijst!$B18&CHAR(10)&Lijst!$D18&\" \"&Lijst!$E18&CHAR(10)&Lijst!$F18&\" \"&Lijst!$G18&\" \"&Lijst!$H18,\"\")","v":""},null,{"$f":"IF(Lijst!L27>0,Lijst!$C27&\" \"&Lijst!$B27&CHAR(10)&Lijst!$D27&\" \"&Lijst!$E27&CHAR(10)&Lijst!$F27&\" \"&Lijst!$G27&\" \"&Lijst!$H27,\"\")","v":""},{"$f":"IF(Lijst!L36>0,Lijst!$C36&\" \"&Lijst!$B36&CHAR(10)&Lijst!$D36&\" \"&Lijst!$E36&CHAR(10)&Lijst!$F36&\" \"&Lijst!$G36&\" \"&Lijst!$H36,\"\")","v":""},null,{"$f":"IF(Lijst!L45>0,Lijst!$C45&\" \"&Lijst!$B45&CHAR(10)&Lijst!$D45&\" \"&Lijst!$E45&CHAR(10)&Lijst!$F45&\" \"&Lijst!$G45&\" \"&Lijst!$H45,\"\")","v":""},null,{"$f":"IF(Lijst!L54>0,Lijst!$C54&\" \"&Lijst!$B54&CHAR(10)&Lijst!$D54&\" \"&Lijst!$E54&CHAR(10)&Lijst!$F54&\" \"&Lijst!$G54&\" \"&Lijst!$H54,\"\")","v":""},{"$f":"IF(Lijst!L63>0,Lijst!$C63&\" \"&Lijst!$B63&CHAR(10)&Lijst!$D63&\" \"&Lijst!$E63&CHAR(10)&Lijst!$F63&\" \"&Lijst!$G63&\" \"&Lijst!$H63,\"\")","v":""},null,{"$f":"IF(Lijst!L72>0,Lijst!$C72&\" \"&Lijst!$B72&CHAR(10)&Lijst!$D72&\" \"&Lijst!$E72&CHAR(10)&Lijst!$F72&\" \"&Lijst!$G72&\" \"&Lijst!$H72,\"\")","v":""},null,{"$f":"IF(Lijst!L81>0,Lijst!$C81&\" \"&Lijst!$B81&CHAR(10)&Lijst!$D81&\" \"&Lijst!$E81&CHAR(10)&Lijst!$F81&\" \"&Lijst!$G81&\" \"&Lijst!$H81,\"\")","v":""},{"$f":"IF(Lijst!$L90>0,Lijst!$C90&\" \"&Lijst!$B90&CHAR(10)&Lijst!$D90&\" \"&Lijst!$E90&CHAR(10)&Lijst!$F90&\" \"&Lijst!$G90&\" \"&Lijst!$H90,\"\")","v":""},null,{"$f":"IF(Lijst!$L99>0,Lijst!$C99&\" \"&Lijst!$B99&CHAR(10)&Lijst!$D99&\" \"&Lijst!$E99&CHAR(10)&Lijst!$F99&\" \"&Lijst!$G99&\" \"&Lijst!$H99,\"\")","v":""},null,{"$f":"IF(Lijst!$L108>0,Lijst!$C108&\" \"&Lijst!$B108&CHAR(10)&Lijst!$D108&\" \"&Lijst!$E108&CHAR(10)&Lijst!$F108&\" \"&Lijst!$G108&\" \"&Lijst!$H108,\"\")","v":""}]
[{"$f":"IF(Lijst!L9<>\"\",Lijst!$Q9,\"\")","v":""},null,{"$f":"IF(Lijst!$L18<>\"\",Lijst!$Q18,\"\")","v":""},null,{"$f":"IF(Lijst!$L27<>\"\",Lijst!$Q27,\"\")","v":""},{"$f":"IF(Lijst!$L36<>\"\",Lijst!$Q36,\"\")","v":""},null,{"$f":"IF(Lijst!$L45<>\"\",Lijst!$Q45,\"\")","v":""},null,{"$f":"IF(Lijst!$L54<>\"\",Lijst!$Q54,\"\")","v":""},{"$f":"IF(Lijst!$L63<>\"\",Lijst!$Q63,\"\")","v":""},null,{"$f":"IF(Lijst!$L72<>\"\",Lijst!$Q72,\"\")","v":""},null,{"$f":"IF(Lijst!$L81<>\"\",Lijst!$Q81,\"\")","v":""},{"$f":"IF(Lijst!$L90<>\"\",Lijst!$Q90,\"\")","v":""},null,{"$f":"IF(Lijst!$L87<>\"\",Lijst!$Q99,\"\")","v":""},null,{"$f":"IF(Lijst!$L108<>\"\",Lijst!$Q108,\"\")","v":""}]
[]
[{"$f":"IF(Lijst!L10>0,Lijst!$C10&\" \"&Lijst!$B10&CHAR(10)&Lijst!$D10&\" \"&Lijst!$E10&CHAR(10)&Lijst!$F10&\" \"&Lijst!$G10&\" \"&Lijst!$H10,\"\")","v":""},null,{"$f":"IF(Lijst!L19>0,Lijst!$C19&\" \"&Lijst!$B19&CHAR(10)&Lijst!$D19&\" \"&Lijst!$E19&CHAR(10)&Lijst!$F19&\" \"&Lijst!$G19&\" \"&Lijst!$H19,\"\")","v":""},null,{"$f":"IF(Lijst!L28>0,Lijst!$C28&\" \"&Lijst!$B28&CHAR(10)&Lijst!$D28&\" \"&Lijst!$E28&CHAR(10)&Lijst!$F28&\" \"&Lijst!$G28&\" \"&Lijst!$H28,\"\")","v":""},{"$f":"IF(Lijst!L37>0,Lijst!$C37&\" \"&Lijst!$B37&CHAR(10)&Lijst!$D37&\" \"&Lijst!$E37&CHAR(10)&Lijst!$F37&\" \"&Lijst!$G37&\" \"&Lijst!$H37,\"\")","v":""},null,{"$f":"IF(Lijst!L46>0,Lijst!$C46&\" \"&Lijst!$B46&CHAR(10)&Lijst!$D46&\" \"&Lijst!$E46&CHAR(10)&Lijst!$F46&\" \"&Lijst!$G46&\" \"&Lijst!$H46,\"\")","v":""},null,{"$f":"IF(Lijst!L55>0,Lijst!$C55&\" \"&Lijst!$B55&CHAR(10)&Lijst!$D55&\" \"&Lijst!$E55&CHAR(10)&Lijst!$F55&\" \"&Lijst!$G55&\" \"&Lijst!$H55,\"\")","v":""},{"$f":"IF(Lijst!L64>0,Lijst!$C64&\" \"&Lijst!$B64&CHAR(10)&Lijst!$D64&\" \"&Lijst!$E64&CHAR(10)&Lijst!$F64&\" \"&Lijst!$G64&\" \"&Lijst!$H64,\"\")","v":""},null,{"$f":"IF(Lijst!L73>0,Lijst!$C73&\" \"&Lijst!$B73&CHAR(10)&Lijst!$D73&\" \"&Lijst!$E73&CHAR(10)&Lijst!$F73&\" \"&Lijst!$G73&\" \"&Lijst!$H73,\"\")","v":""},null,{"$f":"IF(Lijst!L82>0,Lijst!$C82&\" \"&Lijst!$B82&CHAR(10)&Lijst!$D82&\" \"&Lijst!$E82&CHAR(10)&Lijst!$F82&\" \"&Lijst!$G82&\" \"&Lijst!$H82,\"\")","v":""},{"$f":"IF(Lijst!$L90>0,Lijst!$C91&\" \"&Lijst!$B91&CHAR(10)&Lijst!$D91&\" \"&Lijst!$E91&CHAR(10)&Lijst!$F91&\" \"&Lijst!$G91&\" \"&Lijst!$H91,\"\")","v":""},null,{"$f":"IF(Lijst!$L100>0,Lijst!$C100&\" \"&Lijst!$B100&CHAR(10)&Lijst!$D100&\" \"&Lijst!$E100&CHAR(10)&Lijst!$F100&\" \"&Lijst!$G100&\" \"&Lijst!$H100,\"\")","v":""},null,{"$f":"IF(Lijst!$L109>0,Lijst!$C109&\" \"&Lijst!$B109&CHAR(10)&Lijst!$D109&\" \"&Lijst!$E109&CHAR(10)&Lijst!$F109&\" \"&Lijst!$G109&\" \"&Lijst!$H109,\"\")","v":""}]
[{"$f":"IF(Lijst!L10<>\"\",Lijst!$Q10,\"\")","v":""},null,{"$f":"IF(Lijst!$L19<>\"\",Lijst!$Q19,\"\")","v":""},null,{"$f":"IF(Lijst!$L28<>\"\",Lijst!$Q28,\"\")","v":""},{"$f":"IF(Lijst!$L37<>\"\",Lijst!$Q37,\"\")","v":""},null,{"$f":"IF(Lijst!$L46<>\"\",Lijst!$Q46,\"\")","v":""},null,{"$f":"IF(Lijst!$L55<>\"\",Lijst!$Q55,\"\")","v":""},{"$f":"IF(Lijst!$L64<>\"\",Lijst!$Q64,\"\")","v":""},null,{"$f":"IF(Lijst!$L73<>\"\",Lijst!$Q73,\"\")","v":""},null,{"$f":"IF(Lijst!$L82<>\"\",Lijst!$Q82,\"\")","v":""},{"$f":"IF(Lijst!$L91<>\"\",Lijst!$Q91,\"\")","v":""},null,{"$f":"IF(Lijst!$L100<>\"\",Lijst!$Q100,\"\")","v":""},null,{"$f":"IF(Lijst!$L109<>\"\",Lijst!$Q109,\"\")","v":""}]
[]
[{"$f":"IF(Lijst!L11,Lijst!$C11&\" \"&Lijst!$B11&CHAR(10)&Lijst!$D11&\" \"&Lijst!$E11&CHAR(10)&Lijst!$F11&\" \"&Lijst!$G11&\" \"&Lijst!$H11,\"\")","v":""},null,{"$f":"IF(Lijst!L20>0,Lijst!$C20&\" \"&Lijst!$B20&CHAR(10)&Lijst!$D20&\" \"&Lijst!$E20&CHAR(10)&Lijst!$F20&\" \"&Lijst!$G20&\" \"&Lijst!$H20,\"\")","v":""},null,{"$f":"IF(Lijst!L29>0,Lijst!$C29&\" \"&Lijst!$B29&CHAR(10)&Lijst!$D29&\" \"&Lijst!$E29&CHAR(10)&Lijst!$F29&\" \"&Lijst!$G29&\" \"&Lijst!$H29,\"\")","v":""},{"$f":"IF(Lijst!L38>0,Lijst!$C38&\" \"&Lijst!$B38&CHAR(10)&Lijst!$D38&\" \"&Lijst!$E38&CHAR(10)&Lijst!$F38&\" \"&Lijst!$G38&\" \"&Lijst!$H38,\"\")","v":""},null,{"$f":"IF(Lijst!L47>0,Lijst!$C47&\" \"&Lijst!$B47&CHAR(10)&Lijst!$D47&\" \"&Lijst!$E47&CHAR(10)&Lijst!$F47&\" \"&Lijst!$G47&\" \"&Lijst!$H47,\"\")","v":""},null,{"$f":"IF(Lijst!L56>0,Lijst!$C56&\" \"&Lijst!$B56&CHAR(10)&Lijst!$D56&\" \"&Lijst!$E56&CHAR(10)&Lijst!$F56&\" \"&Lijst!$G56&\" \"&Lijst!$H56,\"\")","v":""},{"$f":"IF(Lijst!L65>0,Lijst!$C65&\" \"&Lijst!$B65&CHAR(10)&Lijst!$D65&\" \"&Lijst!$E65&CHAR(10)&Lijst!$F65&\" \"&Lijst!$G65&\" \"&Lijst!$H65,\"\")","v":""},null,{"$f":"IF(Lijst!L74>0,Lijst!$C74&\" \"&Lijst!$B74&CHAR(10)&Lijst!$D74&\" \"&Lijst!$E74&CHAR(10)&Lijst!$F74&\" \"&Lijst!$G74&\" \"&Lijst!$H74,\"\")","v":""},null,{"$f":"IF(Lijst!L83>0,Lijst!$C83&\" \"&Lijst!$B83&CHAR(10)&Lijst!$D83&\" \"&Lijst!$E83&CHAR(10)&Lijst!$F83&\" \"&Lijst!$G83&\" \"&Lijst!$H83,\"\")","v":""},{"$f":"IF(Lijst!$L92>0,Lijst!$C92&\" \"&Lijst!$B92&CHAR(10)&Lijst!$D92&\" \"&Lijst!$E92&CHAR(10)&Lijst!$F92&\" \"&Lijst!$G92&\" \"&Lijst!$H92,\"\")","v":""},null,{"$f":"IF(Lijst!$L101>0,Lijst!$C101&\" \"&Lijst!$B101&CHAR(10)&Lijst!$D101&\" \"&Lijst!$E101&CHAR(10)&Lijst!$F101&\" \"&Lijst!$G101&\" \"&Lijst!$H101,\"\")","v":""},null,{"$f":"IF(Lijst!$L110>0,Lijst!$C110&\" \"&Lijst!$B110&CHAR(10)&Lijst!$D110&\" \"&Lijst!$E110&CHAR(10)&Lijst!$F110&\" \"&Lijst!$G110&\" \"&Lijst!$H110,\"\")","v":""}]
[{"$f":"IF(Lijst!L11<>\"\",Lijst!$Q11,\"\")","v":""},null,{"$f":"IF(Lijst!$L20<>\"\",Lijst!$Q20,\"\")","v":""},null,{"$f":"IF(Lijst!$L29<>\"\",Lijst!$Q29,\"\")","v":""},{"$f":"IF(Lijst!$L38<>\"\",Lijst!$Q38,\"\")","v":""},null,{"$f":"IF(Lijst!$L47<>\"\",Lijst!$Q47,\"\")","v":""},null,{"$f":"IF(Lijst!$L56<>\"\",Lijst!$Q56,\"\")","v":""},{"$f":"IF(Lijst!$L65<>\"\",Lijst!$Q65,\"\")","v":""},null,{"$f":"IF(Lijst!$L74<>\"\",Lijst!$Q74,\"\")","v":""},null,{"$f":"IF(Lijst!$L83<>\"\",Lijst!$Q83,\"\")","v":""},{"$f":"IF(Lijst!$L92<>\"\",Lijst!$Q92,\"\")","v":""},null,{"$f":"IF(Lijst!$L101<>\"\",Lijst!$Q101,\"\")","v":""},null,{"$f":"IF(Lijst!$L110<>\"\",Lijst!$Q110,\"\")","v":""}]
[]
[{"$f":"IF(Lijst!L12>0,Lijst!$C12&\" \"&Lijst!$B12&CHAR(10)&Lijst!$D12&\" \"&Lijst!$E12&CHAR(10)&Lijst!$F12&\" \"&Lijst!$G12&\" \"&Lijst!$H12,\"\")","v":""},null,{"$f":"IF(Lijst!L21>0,Lijst!$C21&\" \"&Lijst!$B21&CHAR(10)&Lijst!$D21&\" \"&Lijst!$E21&CHAR(10)&Lijst!$F21&\" \"&Lijst!$G21&\" \"&Lijst!$H21,\"\")","v":""},null,{"$f":"IF(Lijst!L30>0,Lijst!$C30&\" \"&Lijst!$B30&CHAR(10)&Lijst!$D30&\" \"&Lijst!$E30&CHAR(10)&Lijst!$F30&\" \"&Lijst!$G30&\" \"&Lijst!$H30,\"\")","v":""},{"$f":"IF(Lijst!L39>0,Lijst!$C39&\" \"&Lijst!$B39&CHAR(10)&Lijst!$D39&\" \"&Lijst!$E39&CHAR(10)&Lijst!$F39&\" \"&Lijst!$G39&\" \"&Lijst!$H39,\"\")","v":""},null,{"$f":"IF(Lijst!L48>0,Lijst!$C48&\" \"&Lijst!$B48&CHAR(10)&Lijst!$D48&\" \"&Lijst!$E48&CHAR(10)&Lijst!$F48&\" \"&Lijst!$G48&\" \"&Lijst!$H48,\"\")","v":""},null,{"$f":"IF(Lijst!L57>0,Lijst!$C57&\" \"&Lijst!$B57&CHAR(10)&Lijst!$D57&\" \"&Lijst!$E57&CHAR(10)&Lijst!$F57&\" \"&Lijst!$G57&\" \"&Lijst!$H57,\"\")","v":""},{"$f":"IF(Lijst!L66>0,Lijst!$C66&\" \"&Lijst!$B66&CHAR(10)&Lijst!$D66&\" \"&Lijst!$E66&CHAR(10)&Lijst!$F66&\" \"&Lijst!$G66&\" \"&Lijst!$H66,\"\")","v":""},null,{"$f":"IF(Lijst!L75>0,Lijst!$C75&\" \"&Lijst!$B75&CHAR(10)&Lijst!$D75&\" \"&Lijst!$E75&CHAR(10)&Lijst!$F75&\" \"&Lijst!$G75&\" \"&Lijst!$H75,\"\")","v":""},null,{"$f":"IF(Lijst!L84>0,Lijst!$C84&\" \"&Lijst!$B84&CHAR(10)&Lijst!$D84&\" \"&Lijst!$E84&CHAR(10)&Lijst!$F84&\" \"&Lijst!$G84&\" \"&Lijst!$H84,\"\")","v":""},{"$f":"IF(Lijst!$L93>0,Lijst!$C93&\" \"&Lijst!$B93&CHAR(10)&Lijst!$D93&\" \"&Lijst!$E93&CHAR(10)&Lijst!$F93&\" \"&Lijst!$G93&\" \"&Lijst!$H93,\"\")","v":""},null,{"$f":"IF(Lijst!$L102>0,Lijst!$C102&\" \"&Lijst!$B102&CHAR(10)&Lijst!$D102&\" \"&Lijst!$E102&CHAR(10)&Lijst!$F102&\" \"&Lijst!$G102&\" \"&Lijst!$H102,\"\")","v":""},null,{"$f":"IF(Lijst!$L111>0,Lijst!$C111&\" \"&Lijst!$B111&CHAR(10)&Lijst!$D111&\" \"&Lijst!$E111&CHAR(10)&Lijst!$F111&\" \"&Lijst!$G111&\" \"&Lijst!$H111,\"\")","v":""}]
[{"$f":"IF(Lijst!L12<>\"\",Lijst!$Q12,\"\")","v":""},null,{"$f":"IF(Lijst!$L21<>\"\",Lijst!$Q21,\"\")","v":""},null,{"$f":"IF(Lijst!$L30<>\"\",Lijst!$Q30,\"\")","v":""},{"$f":"IF(Lijst!$L39<>\"\",Lijst!$Q39,\"\")","v":""},null,{"$f":"IF(Lijst!$L48<>\"\",Lijst!$Q48,\"\")","v":""},null,{"$f":"IF(Lijst!$L57<>\"\",Lijst!$Q57,\"\")","v":""},{"$f":"IF(Lijst!$L66<>\"\",Lijst!$Q66,\"\")","v":""},null,{"$f":"IF(Lijst!$L75<>\"\",Lijst!$Q75,\"\")","v":""},null,{"$f":"IF(Lijst!$L84<>\"\",Lijst!$Q84,\"\")","v":""},{"$f":"IF(Lijst!$L93<>\"\",Lijst!$Q93,\"\")","v":""},null,{"$f":"IF(Lijst!$L102<>\"\",Lijst!$Q102,\"\")","v":""},null,{"$f":"IF(Lijst!$L111<>\"\",Lijst!$Q111,\"\")","v":""}]
[]
[{"$f":"IF(Lijst!L13>0,Lijst!$C13&\" \"&Lijst!$B13&CHAR(10)&Lijst!$D13&\" \"&Lijst!$E13&CHAR(10)&Lijst!$F13&\" \"&Lijst!$G13&\" \"&Lijst!$H13,\"\")","v":""},null,{"$f":"IF(Lijst!L22>0,Lijst!$C22&\" \"&Lijst!$B22&CHAR(10)&Lijst!$D22&\" \"&Lijst!$E22&CHAR(10)&Lijst!$F22&\" \"&Lijst!$G22&\" \"&Lijst!$H22,\"\")","v":""},null,{"$f":"IF(Lijst!L31>0,Lijst!$C31&\" \"&Lijst!$B31&CHAR(10)&Lijst!$D31&\" \"&Lijst!$E31&CHAR(10)&Lijst!$F31&\" \"&Lijst!$G31&\" \"&Lijst!$H31,\"\")","v":""},{"$f":"IF(Lijst!L40>0,Lijst!$C40&\" \"&Lijst!$B40&CHAR(10)&Lijst!$D40&\" \"&Lijst!$E40&CHAR(10)&Lijst!$F40&\" \"&Lijst!$G40&\" \"&Lijst!$H40,\"\")","v":""},null,{"$f":"IF(Lijst!L49>0,Lijst!$C49&\" \"&Lijst!$B49&CHAR(10)&Lijst!$D49&\" \"&Lijst!$E49&CHAR(10)&Lijst!$F49&\" \"&Lijst!$G49&\" \"&Lijst!$H49,\"\")","v":""},null,{"$f":"IF(Lijst!L58>0,Lijst!$C58&\" \"&Lijst!$B58&CHAR(10)&Lijst!$D58&\" \"&Lijst!$E58&CHAR(10)&Lijst!$F58&\" \"&Lijst!$G58&\" \"&Lijst!$H358,\"\")","v":""},{"$f":"IF(Lijst!L67>0,Lijst!$C67&\" \"&Lijst!$B67&CHAR(10)&Lijst!$D67&\" \"&Lijst!$E67&CHAR(10)&Lijst!$F67&\" \"&Lijst!$G67&\" \"&Lijst!$H67,\"\")","v":""},null,{"$f":"IF(Lijst!L76>0,Lijst!$C76&\" \"&Lijst!$B76&CHAR(10)&Lijst!$D76&\" \"&Lijst!$E76&CHAR(10)&Lijst!$F76&\" \"&Lijst!$G76&\" \"&Lijst!$H76,\"\")","v":""},null,{"$f":"IF(Lijst!L85>0,Lijst!$C85&\" \"&Lijst!$B85&CHAR(10)&Lijst!$D85&\" \"&Lijst!$E85&CHAR(10)&Lijst!$F85&\" \"&Lijst!$G85&\" \"&Lijst!$H85,\"\")","v":""},{"$f":"IF(Lijst!$L94>0,Lijst!$C94&\" \"&Lijst!$B94&CHAR(10)&Lijst!$D94&\" \"&Lijst!$E94&CHAR(10)&Lijst!$F94&\" \"&Lijst!$G94&\" \"&Lijst!$H94,\"\")","v":""},null,{"$f":"IF(Lijst!$L103>0,Lijst!$C103&\" \"&Lijst!$B103&CHAR(10)&Lijst!$D103&\" \"&Lijst!$E103&CHAR(10)&Lijst!$F103&\" \"&Lijst!$G103&\" \"&Lijst!$H103,\"\")","v":""},null,{"$f":"IF(Lijst!$L112>0,Lijst!$C112&\" \"&Lijst!$B112&CHAR(10)&Lijst!$D112&\" \"&Lijst!$E112&CHAR(10)&Lijst!$F112&\" \"&Lijst!$G112&\" \"&Lijst!$H112,\"\")","v":""}]
[{"$f":"IF(Lijst!L13<>\"\",Lijst!$Q13,\"\")","v":""},null,{"$f":"IF(Lijst!$L22<>\"\",Lijst!$Q22,\"\")","v":""},null,{"$f":"IF(Lijst!$L31<>\"\",Lijst!$Q31,\"\")","v":""},{"$f":"IF(Lijst!$L40<>\"\",Lijst!$Q40,\"\")","v":""},null,{"$f":"IF(Lijst!$L49<>\"\",Lijst!$Q49,\"\")","v":""},null,{"$f":"IF(Lijst!$L58<>\"\",Lijst!$Q58,\"\")","v":""},{"$f":"IF(Lijst!$L67<>\"\",Lijst!$Q67,\"\")","v":""},null,{"$f":"IF(Lijst!$L76<>\"\",Lijst!$Q76,\"\")","v":""},null,{"$f":"IF(Lijst!$L85<>\"\",Lijst!$Q85,\"\")","v":""},{"$f":"IF(Lijst!$L94<>\"\",Lijst!$Q94,\"\")","v":""},null,{"$f":"IF(Lijst!$L103<>\"\",Lijst!$Q103,\"\")","v":""},null,{"$f":"IF(Lijst!$L112<>\"\",Lijst!$Q112,\"\")","v":""}]
[]
[{"$f":"IF(Lijst!L14>0,Lijst!$C14&\" \"&Lijst!$B14&CHAR(10)&Lijst!$D14&\" \"&Lijst!$E14&CHAR(10)&Lijst!$F14&\" \"&Lijst!$G14&\" \"&Lijst!$H14,\"\")","v":""},null,{"$f":"IF(Lijst!L23>0,Lijst!$C23&\" \"&Lijst!$B23&CHAR(10)&Lijst!$D23&\" \"&Lijst!$E23&CHAR(10)&Lijst!$F23&\" \"&Lijst!$G23&\" \"&Lijst!$H23,\"\")","v":""},null,{"$f":"IF(Lijst!L32>0,Lijst!$C32&\" \"&Lijst!$B32&CHAR(10)&Lijst!$D32&\" \"&Lijst!$E32&CHAR(10)&Lijst!$F32&\" \"&Lijst!$G32&\" \"&Lijst!$H32,\"\")","v":""},{"$f":"IF(Lijst!L41>0,Lijst!$C41&\" \"&Lijst!$B41&CHAR(10)&Lijst!$D41&\" \"&Lijst!$E41&CHAR(10)&Lijst!$F41&\" \"&Lijst!$G41&\" \"&Lijst!$H41,\"\")","v":""},null,{"$f":"IF(Lijst!L50>0,Lijst!$C50&\" \"&Lijst!$B50&CHAR(10)&Lijst!$D50&\" \"&Lijst!$E50&CHAR(10)&Lijst!$F50&\" \"&Lijst!$G50&\" \"&Lijst!$H50,\"\")","v":""},null,{"$f":"IF(Lijst!L59>0,Lijst!$C59&\" \"&Lijst!$B59&CHAR(10)&Lijst!$D59&\" \"&Lijst!$E59&CHAR(10)&Lijst!$F59&\" \"&Lijst!$G59&\" \"&Lijst!$H59,\"\")","v":""},{"$f":"IF(Lijst!L68>0,Lijst!$C68&\" \"&Lijst!$B68&CHAR(10)&Lijst!$D68&\" \"&Lijst!$E68&CHAR(10)&Lijst!$F68&\" \"&Lijst!$G68&\" \"&Lijst!$H68,\"\")","v":""},null,{"$f":"IF(Lijst!L77>0,Lijst!$C77&\" \"&Lijst!$B77&CHAR(10)&Lijst!$D77&\" \"&Lijst!$E77&CHAR(10)&Lijst!$F77&\" \"&Lijst!$G77&\" \"&Lijst!$H77,\"\")","v":""},null,{"$f":"IF(Lijst!L86>0,Lijst!$C86&\" \"&Lijst!$B86&CHAR(10)&Lijst!$D86&\" \"&Lijst!$E86&CHAR(10)&Lijst!$F86&\" \"&Lijst!$G86&\" \"&Lijst!$H86,\"\")","v":""},{"$f":"IF(Lijst!$L95>0,Lijst!$C95&\" \"&Lijst!$B95&CHAR(10)&Lijst!$D95&\" \"&Lijst!$E95&CHAR(10)&Lijst!$F95&\" \"&Lijst!$G95&\" \"&Lijst!$H95,\"\")","v":""},null,{"$f":"IF(Lijst!$L104>0,Lijst!$C104&\" \"&Lijst!$B104&CHAR(10)&Lijst!$D104&\" \"&Lijst!$E104&CHAR(10)&Lijst!$F104&\" \"&Lijst!$G104&\" \"&Lijst!$H104,\"\")","v":""},null,{"$f":"IF(Lijst!$L113>0,Lijst!$C113&\" \"&Lijst!$B113&CHAR(10)&Lijst!$D113&\" \"&Lijst!$E113&CHAR(10)&Lijst!$F113&\" \"&Lijst!$G113&\" \"&Lijst!$H113,\"\")","v":""}]
[{"$f":"IF(Lijst!L14<>\"\",Lijst!$Q14,\"\")","v":""},null,{"$f":"IF(Lijst!$L23<>\"\",Lijst!$Q23,\"\")","v":""},null,{"$f":"IF(Lijst!$L32<>\"\",Lijst!$Q32,\"\")","v":""},{"$f":"IF(Lijst!$L41<>\"\",Lijst!$Q41,\"\")","v":""},null,{"$f":"IF(Lijst!$L50<>\"\",Lijst!$Q50,\"\")","v":""},null,{"$f":"IF(Lijst!$L59<>\"\",Lijst!$Q59,\"\")","v":""},{"$f":"IF(Lijst!$L68<>\"\",Lijst!$Q68,\"\")","v":""},null,{"$f":"IF(Lijst!$L77<>\"\",Lijst!$Q77,\"\")","v":""},null,{"$f":"IF(Lijst!$L86<>\"\",Lijst!$Q86,\"\")","v":""},{"$f":"IF(Lijst!$L95<>\"\",Lijst!$Q95,\"\")","v":""},null,{"$f":"IF(Lijst!$L104<>\"\",Lijst!$Q104,\"\")","v":""},null,{"$f":"IF(Lijst!$L113<>\"\",Lijst!$Q113,\"\")","v":""}]

{"sheet":"Brief Ades","index":2,"n_rows":32,"n_cols":11,"rows_kept":32,"cut":false,"hidden":false,"merged":[[24,10,27,13],[28,10,30,13]]}
[6,{"$f":"A32+1","v":38},70,102,134,166,198,230]
[{"$f":"A1+1","v":7},39,71,103,135,167,199,231]
[{"$f":"A2+1","v":8},{"$f":"B2+1","v":40},72,104,136,168,200,232]
[9,41,73,105,137,169,201,233]
[10,42,74,106,138,170,202,234]
[11,43,75,107,139,171,203,235]
[12,44,76,108,140,172,204,236]
[13,45,77,109,141,173,205,237]
[14,46,78,110,142,174,206,238]
[15,47,79,111,143,175,207,239]
[16,48,80,112,144,176,208,240]
[17,49,81,113,145,177,209,241]
[18,50,82,114,146,178,210,242]
[19,51,83,115,147,179,211,243]
[20,52,84,116,148,180,212,244]
[21,53,85,117,149,181,213,245]
[22,54,86,118,150,182,214,246]
[23,55,87,119,151,183,215,247]
[24,56,88,120,152,184,216,248]
[25,57,89,121,153,185,217,249]
[26,58,90,122,154,186,218,250]
[27,59,91,123,155,187,219,251]
[28,60,92,124,156,188,220,252]
[29,61,93,125,157,189,221,253]
[30,62,94,126,158,190,222,254,null,null,{"$f":"IF(Lijst!L6>0,Lijst!$C6&\" \"&Lijst!$B6&CHAR(10)&Lijst!$D6&\" \"&Lijst!$E6&CHAR(10)&Lijst!$F6&\" \"&Lijst!$G6&\" \"&Lijst!$H6,\"\")","v":"Forum Excel\nForumstraat 1\n4321 BA Excelstad"}]
[31,63,95,127,159,191,223,255]
[32,64,96,128,160,192,224,256]
[33,65,97,129,161,193,225,257]
[34,66,98,130,162,194,226,258,null,null,{"$f":"IF(Lijst!$L6<>\"\",Lijst!$Q6,\"\")","v":"*00243211*"}]
[35,67,99,131,163,195,227,259]
[36,68,100,132,164,196,228,260]
[37,69,101,133,165,197,229,261]