{"text_format":"1","workbook":"xlsx","n_sheets":5,"sheets":["sjabloon","Voorblad","Home","merel","Aalscholver"],"not_rendered":{"charts":0,"images":32,"macros":1,"external_links":2,"defined_names":17,"comments":0,"pivot_tables":0},"unopened":[],"bounds":{"document_bytes":16777216,"sheet_cells":100000,"rows_first":2000,"rows_last":500,"rows_between":2000,"halvings":0,"cell_chars":16384,"cell_head_chars":4096},"cells_cut":0,"cells_raw":0,"read":"whole","date_system":"1900"}

{"sheet":"sjabloon","index":0,"n_rows":145,"n_cols":25,"rows_kept":145,"cut":false,"hidden":true,"merged":[[0,0,0,1],[29,0,29,4],[30,1,43,3],[44,0,46,0],[44,3,46,3],[44,4,46,4],[72,0,72,4],[73,0,73,4],[74,0,74,4],[75,0,75,1],[75,2,75,4],[47,0,51,0],[47,3,51,3],[47,4,51,4],[56,0,61,0],[56,1,63,3],[79,0,79,1],[79,2,79,5],[80,0,80,1],[80,2,80,4],[81,0,81,4],[76,0,76,1],[76,2,76,4],[77,0,77,1],[77,2,77,4],[78,0,78,1],[78,2,78,4],[85,0,85,1],[85,2,85,4],[86,0,86,1],[86,2,86,4],[87,0,87,1],[87,2,87,4],[82,0,82,1],[82,2,82,4],[83,0,83,1],[83,2,83,4],[84,0,84,1],[84,2,84,4],[91,0,91,1],[91,2,91,4],[92,0,92,1],[92,2,92,4],[93,0,93,1],[93,2,93,4],[88,0,88,1],[88,2,88,4],[89,0,89,1],[89,2,89,4],[90,0,90,4],[96,5,99,5],[100,0,100,4],[101,0,101,1],[101,3,101,5],[102,3,102,5],[94,0,94,1],[94,2,94,4],[95,0,95,1],[95,2,95,4],[96,0,99,1],[108,0,108,1],[108,2,108,4],[109,2,109,4],[110,2,110,4],[111,2,111,4],[103,3,103,5],[104,3,104,5],[105,3,105,5],[106,0,106,4],[107,0,107,1],[107,2,107,4],[116,0,116,2],[116,3,116,5],[117,0,117,2],[117,3,117,5],[124,0,124,1],[124,2,124,4],[112,2,112,4],[113,0,113,5],[114,0,114,2],[114,3,114,5],[115,0,115,2],[115,3,115,5],[131,0,134,0],[131,1,131,4],[132,2,132,3],[133,2,133,3],[134,2,134,3],[125,0,125,3],[126,1,126,4],[127,0,130,0],[127,1,127,4],[128,2,128,3],[129,2,129,3],[130,2,130,3],[144,1,144,3],[139,1,139,3],[140,1,140,3],[141,1,141,3],[142,1,142,3],[143,1,143,3],[135,2,135,3],[136,0,137,0],[136,2,136,3],[137,2,137,3],[138,0,138,3]]}
["Persoonsgegevens"]
["Bedrijf","zelfstandig"]
["Naam"]
["Voornaam"]
["Rijksregisternummer"]
["Geslacht"]
["Geboortedatum"]
["Leeftijd"]
["Taalkkeuze"]
["Straat + nummer"]
["postcode + gemeente"]
["Emailadres"]
["Tel/GSM nummer"]
["Land"]
["Huisarts"]
[]
[]
[]
[]
[]
[]
[]
[]
[]
[]
[]
[]
[]
[]
["MCU",null,null,null,null,null,null,null,null,null,"beweging"]
["Naam",null,null,null,{"$f":"sjabloon!B32","v":0}]
["Voornaam",null,null,null,{"$f":"sjabloon!B33","v":0},null,null,null,null,null,"ja"]
["Geslacht",null,null,null,{"$f":"sjabloon!B35","v":0},null,null,null,null,null,"nee"]
["Geboortedatum",null,null,null,{"$f":"sjabloon!B36","v":"00:00:00"}]
["Leeftijd",null,null,null,{"$f":"sjabloon!B37","v":0},null,null,null,null,null,"voeding"]
["Leeftijdscategorie",null,null,null,{"$f":"IF(E35<31,\"cat 20-30\",IF(E35<41,\"cat 30-40\",IF(E35<51,\"cat 40-50\",IF(E35<61,\"cat 50-60\",IF(E35<71,\"cat 60-70\")))))","v":"cat 20-30"}]
["Lengte",null,null,null,{"$f":"#REF!","v":{"$error":"#REF!"}},"dagelijks",null,null,"80 watt + 40 watt/2 min",null,null,null,161,61,null,null,null,null,11]
["Gewicht",null,null,null,{"$f":"#REF!","v":{"$error":"#REF!"}},"wekelijks",null,null,"100 watt + 30 watt/2 min",null,"ja",null,162,62,null,null,null,null,12]
["BMI",null,null,null,{"$f":"IF(F39<18.5,\"te laag\",IF(F39>25,\"te hoog\",\"normaal\"))","v":{"$error":"#REF!"}},{"$f":"#REF!","v":{"$error":"#REF!"}},null,null,null,null,"nee"]
["Buikomtrek",null,null,null,{"$f":"#REF!","v":{"$error":"#REF!"}},null,null,null,null,null,null,null,164,64,null,null,null,null,14]
["Vetpercentage",null,null,null,{"$f":"#REF!","v":{"$error":"#REF!"}},null,null,null,"8u",null,"dagelijks",null,165,65,null,null,null,null,15]
["Spiermassa",null,null,null,{"$f":"#REF!","v":{"$error":"#REF!"}},null,null,null,"9u",null,"wekelijks",null,166,66,null,null,null,null,16]
["Visceraal vet",null,null,null,{"$f":"IF(F43<10,\"laag risico\",IF(F43<15,\"verhoogd risico\",IF(F43<50,\"sterk verhoogd risico\")))","v":{"$error":"#REF!"}},{"$f":"#REF!","v":{"$error":"#REF!"}},null,null,"10u",null,"zelden",null,167,67,null,null,null,null,17]
["Bloeddruk",null,null,null,{"$f":"IF(F44>\"140/80\",\"te hoog\",\"normaal\")","v":{"$error":"#REF!"}},{"$f":"#REF!","v":{"$error":"#REF!"}},null,null,"11u",null,null,null,null,68,null,null,null,null,18]
["Beweging",null,{"$f":"IF(B45=\"ja\",\"1\",\"0\")","v":"0"},{"$f":"C45+C46+C47","v":0},{"$f":"IF(D45=3,\"zeer goed\",IF(D45=2,\"goed\",IF(D45=1,\"kan beter\",IF(D45=0,\"niet goed\"))))","v":"niet goed"},null,null,null,null,null,"alcohol",null,"ja"]
[null,null,{"$f":"IF(B46=\"ja\",\"1\",\"0\")","v":"0"},null,null,null,null,null,null,null,null,null,"nee"]
[null,null,{"$f":"IF(B47=\"ja\",\"1\",\"0\")","v":"0"},null,null,null,null,null,null,null,"nooit"]
["Voeding",null,{"$f":"IF(B48=\"ja\",\"1\",\"0\")","v":"0"},{"$f":"C48+C49+C50+C51+C52","v":0},{"$f":"IF(D48=7,\"uitstekend\",IF(D48=6,\"zeer goed\",IF(D48=5,\"goed\",IF(D48=4,\"matig\",IF(D48=3,\"zeer matig\",IF(D48=2,\"slecht\",IF(D48=1,\"zeer slecht\",IF(D48=0,\"zeer slecht\"))))))))","v":"zeer slecht"},null,null,null,null,null,"minder dan maandelijks"]
[null,null,{"$f":"IF(B49=\"ja\",\"1\",\"0\")","v":"0"},null,null,null,null,null,null,null,"maandelijks"]
[null,null,{"$f":"IF(B50=\"zelden\",\"2\",IF(B50=\"wekelijks\",\"1\",IF(B50=\"dagelijks\",\"0\")))","v":false},null,null,null,null,null,null,null,"wekelijks"]
[null,null,{"$f":"IF(B51=\"zelden\",\"2\",IF(B51=\"wekelijks\",\"1\",IF(B51=\"dagelijks\",\"0\")))","v":false},null,null,null,null,null,null,null,"dagelijks of bijna dagelijks"]
[null,null,{"$f":"IF(B52=\"ja\",\"1\",\"0\")","v":"0"}]
["Alcohol",null,{"$f":"IF(B53=\"nooit\",\"5\",IF(B53=\"minder dan maandelijks\",\"4\",IF(B53=\"maandelijks\",\"3\",IF(B53=\"wekelijks\",\"2\",IF(B53=\"dagelijks of bijna dagelijks\",\"1\")))))","v":false},{"$f":"C53","v":false},{"$f":"IF(D53=\"5\",\"uitstekend\",IF(D53=\"4\",\"zeer goed\",IF(D53=\"3\",\"goed\",IF(D53=\"2\",\"kan beter\",IF(D53=\"1\",\"niet goed\")))))","v":false},null,null,null,null,null,"doelen"]
["Roken",null,{"$f":"IF(B54=\"nee\",\"1\",\"0\")","v":"0"},{"$f":"C54","v":"0"},{"$f":"IF(D54=\"1\",\"goed\",\"niet goed\")","v":"niet goed"}]
["Slapen",null,{"$f":"IF(B55=\"nee\",\"1\",\"0\")","v":"0"},{"$f":"C55","v":"0"},{"$f":"IF(D55=\"1\",\"goed\",\"niet goed\")","v":"niet goed"},null,null,"nooit","voeding",null,"voeding",null,173,73,null,null,null,null,23]
["Stress",null,{"$f":"IF(B56=\"nee\",\"1\",\"0\")","v":"0"},{"$f":"C56","v":"0"},{"$f":"IF(D56=\"1\",\"goed\",\"niet goed\")","v":"niet goed"},null,null,null,null,null,"beweging"]
["Doelen",null,null,null,null,null,null,"maandelijks","alcohol",null,"roken"]
[null,null,null,null,null,null,null,null,null,null,"alcohol"]
[null,null,null,null,null,null,null,null,null,null,"stressniveau"]
[null,null,null,null,null,null,null,null,null,null,"slapen"]
[null,null,null,null,null,null,null,null,null,null,"ik wil niets veranderen"]
[]
["watt/kg",null,null,null,{"$f":"#REF!","v":{"$error":"#REF!"}}]
["Vo2 max",null,null,null,{"$f":"#REF!","v":{"$error":"#REF!"}},null,null,null,null,null,"roken"]
["Voornaam","Naam","m/v","leeftijd","lft categ","beweging","roken","alcohol","voeding","slapen","stress","doelen","doelen","doelen","doelen","doelen","doelen","bmi","buikomtrek","vet%","spiermassa","visc vet","bloeddruk","watt/kg","VO2"]
[{"$f":"sjabloon!B33","v":0},{"$f":"sjabloon!B32","v":0},{"$f":"E33","v":0},{"$f":"E35","v":0},{"$f":"E36","v":"cat 20-30"},{"$f":"E45","v":"niet goed"},{"$f":"E54","v":"niet goed"},{"$f":"E53","v":false},{"$f":"E48","v":"zeer slecht"},{"$f":"E55","v":"niet goed"},{"$f":"E56","v":"niet goed"},{"$f":"E57","v":0},{"$f":"E58","v":0},{"$f":"E59","v":0},{"$f":"E60","v":0},{"$f":"E61","v":0},{"$f":"E62","v":0},{"$f":"E39","v":{"$error":"#REF!"}},{"$f":"E40","v":{"$error":"#REF!"}},{"$f":"E41","v":{"$error":"#REF!"}},{"$f":"E42","v":{"$error":"#REF!"}},{"$f":"E43","v":{"$error":"#REF!"}},{"$f":"E44","v":{"$error":"#REF!"}},{"$f":"E63","v":{"$error":"#REF!"}},{"$f":"E64","v":{"$error":"#REF!"}}]
[]
[]
[]
[]
[]
[]
["Arts"]
["Datum onderzoek"]
["Anamnese",null,null,null,null,"Opmerkingen"]
["Medische antecedenten"]
["Roken"]
["Cardiale vragenlijst"]
["Medicatie"]
["Sportanamnese"]
["Overmatige stress"]
["Antropometrie",null,null,null,null,"Opmerkingen"]
["Lengte"]
["Gewicht"]
["BMI"]
["Vetpercentage"]
["Spiermassa"]
["Buikomtrek"]
["Basaal metabolisme"]
["Viscerale vetmassa"]
["Medisch onderzoek",null,null,null,null,"Opmerkingen"]
["Bloeddruk"]
["Klinisch onderzoek"]
["Rust ECG"]
["Inspannings ECG"]
["Evaluatie rust en stress ECG"]
["Longtesten",null,"FVC",null,"%"]
[null,null,"FEV1",null,"%"]
[null,null,"PEF",null,"%"]
[null,null,"FEV1/FVC",{"$f":"(D98/D97)*100","v":{"$error":"#DIV/0!"}}]
["Evaluatie longtesten"]
["Cardiovascualair risico",null,null,{"$f":"IF(C102<5%,\"normaal\",IF(C102<10%,\"licht gestegen risico\",IF(C102<100%,\"sterk gestegen risico\")))","v":"normaal"}]
[null,null,"leeftijd",{"$f":"sjabloon!B80","v":0}]
[null,null,"bloeddruk",{"$f":"C92","v":0}]
[null,null,"roker",{"$f":"C77","v":0}]
[null,null,"cholesterol",{"$f":"C112","v":0}]
["Labo",null,null,null,null,"Opmerkingen"]
["Stoelgang"]
["Urine"]
["Bloed ","glucose"]
[null,"vitamine D"]
[null,"cholesterol"]
[null,"andere"]
["Verwijsbrieven "]
["Reden van doorverwijzing",null,null,"Conclusie onderzoek"]
[]
[]
[]
[]
[]
[]
[]
[]
[]
["Assistent"]
["Oogtesten",null,null,null,"Opmerkingen"]
["Correcties/Oogaandoeningen"]
["Test veraf"]
[null,"re"]
[null,"li"]
[null,"Beide kanten"]
["Test dichtbij"]
[null,"re"]
[null,"li"]
[null,"Beide kanten"]
["Campi test","Aantal fouten"]
["Oogdruk test","Rechts"]
[null,"Links"]
["Inspanningstest",null,null,null,"Opmerkingen"]
["Max watt"]
["Watt/kg",{"$f":"B140/#REF!","v":{"$error":"#REF!"}}]
["VO2 max"]
["HF max"]
["Reden stop test"]
["Evaluatie"]

{"sheet":"Voorblad","index":1,"n_rows":33,"n_cols":3,"rows_kept":33,"cut":false,"hidden":true,"merged":[[3,5,3,7],[15,0,16,8],[18,0,22,8],[23,0,27,8],[32,2,34,6],[4,5,4,7],[5,5,5,7],[6,5,6,7]]}
[]
[]
[]
[]
[]
[]
[]
[]
[]
[]
[]
[]
[]
[]
[]
[]
[]
[]
["Medische Check Up"]
[]
[]
[]
[]
[{"$f":"CONCATENATE(sjabloon!B3,\"  \",sjabloon!B4)","v":"  "}]
[]
[]
[]
[]
[]
[]
[]
[]
[null,null,{"$f":"NOW()","v":"2018-12-27T15:52:57.520"}]

{"sheet":"Home","index":2,"n_rows":23,"n_cols":2,"rows_kept":23,"cut":false,"hidden":false,"merged":[]}
["klanten"]
["sjabloon"]
["Voorblad"]
["Home"]
["Aalscholver",{"$f":"IF(A5<>\"\",INDIRECT(A5&\"!$B$12\"),\"\")","v":"aalscholver@adres.be"}]
["merel",{"$f":"IF(A6<>\"\",INDIRECT(A6&\"!$B$12\"),\"\")","v":"merel@adres.be"}]
[null,{"$f":"IF(A7<>\"\",INDIRECT(A7&\"!$B$12\"),\"\")","v":""}]
[null,""]
[null,""]
[null,""]
[null,""]
[null,""]
[null,""]
[null,""]
[null,""]
[null,""]
[null,""]
[null,""]
[null,""]
[null,""]
[null,""]
[null,""]
[null,""]

{"sheet":"merel","index":3,"n_rows":145,"n_cols":25,"rows_kept":145,"cut":false,"hidden":false,"merged":[[141,1,141,3],[142,1,142,3],[143,1,143,3],[144,1,144,3],[136,0,137,0],[136,2,136,3],[137,2,137,3],[138,0,138,3],[139,1,139,3],[140,1,140,3],[131,0,134,0],[131,1,131,4],[132,2,132,3],[133,2,133,3],[134,2,134,3],[135,2,135,3],[124,0,124,1],[124,2,124,4],[125,0,125,3],[126,1,126,4],[127,0,130,0],[127,1,127,4],[128,2,128,3],[129,2,129,3],[130,2,130,3],[115,0,115,2],[115,3,115,5],[116,0,116,2],[116,3,116,5],[117,0,117,2],[117,3,117,5],[109,2,109,4],[110,2,110,4],[111,2,111,4],[112,2,112,4],[113,0,113,5],[114,0,114,2],[114,3,114,5],[105,3,105,5],[106,0,106,4],[107,0,107,1],[107,2,107,4],[108,0,108,1],[108,2,108,4],[100,0,100,4],[101,0,101,1],[101,3,101,5],[102,3,102,5],[103,3,103,5],[104,3,104,5],[94,0,94,1],[94,2,94,4],[95,0,95,1],[95,2,95,4],[96,0,99,1],[96,5,99,5],[90,0,90,4],[91,0,91,1],[91,2,91,4],[92,0,92,1],[92,2,92,4],[93,0,93,1],[93,2,93,4],[87,0,87,1],[87,2,87,4],[88,0,88,1],[88,2,88,4],[89,0,89,1],[89,2,89,4],[84,0,84,1],[84,2,84,4],[85,0,85,1],[85,2,85,4],[86,0,86,1],[86,2,86,4],[80,0,80,1],[80,2,80,4],[81,0,81,4],[82,0,82,1],[82,2,82,4],[83,0,83,1],[83,2,83,4],[77,0,77,1],[77,2,77,4],[78,0,78,1],[78,2,78,4],[79,0,79,1],[79,2,79,5],[73,0,73,4],[74,0,74,4],[75,0,75,1],[75,2,75,4],[76,0,76,1],[76,2,76,4],[47,0,51,0],[47,3,51,3],[47,4,51,4],[56,0,61,0],[56,1,63,3],[72,0,72,4],[0,0,0,1],[29,0,29,4],[30,1,43,3],[44,0,46,0],[44,3,46,3],[44,4,46,4]]}
["Persoonsgegevens"]
["Bedrijf","zelfstandig"]
["Naam","merel"]
["Voornaam"]
["Rijksregisternummer"]
["Geslacht"]
["Geboortedatum"]
["Leeftijd"]
["Taalkkeuze"]
["Straat + nummer"]
["postcode + gemeente"]
["Emailadres","merel@adres.be"]
["Tel/GSM nummer"]
["Land"]
["Huisarts"]
[]
[]
[]
[]
[]
[]
[]
[]
[]
[]
[]
[]
[]
[]
["MCU",null,null,null,null,null,null,null,null,null,"beweging"]
["Naam",null,null,null,{"$f":"merel!B32","v":0}]
["Voornaam",null,null,null,{"$f":"merel!B33","v":0},null,null,null,null,null,"ja"]
["Geslacht",null,null,null,{"$f":"merel!B35","v":0},null,null,null,null,null,"nee"]
["Geboortedatum",null,null,null,{"$f":"merel!B36","v":"00:00:00"}]
["Leeftijd",null,null,null,{"$f":"merel!B37","v":0},null,null,null,null,null,"voeding"]
["Leeftijdscategorie",null,null,null,{"$f":"IF(E35<31,\"cat 20-30\",IF(E35<41,\"cat 30-40\",IF(E35<51,\"cat 40-50\",IF(E35<61,\"cat 50-60\",IF(E35<71,\"cat 60-70\")))))","v":"cat 20-30"}]
["Lengte",null,null,null,{"$f":"#REF!","v":{"$error":"#REF!"}},"dagelijks",null,null,"80 watt + 40 watt/2 min",null,null,null,161,61,null,null,null,null,11]
["Gewicht",null,null,null,{"$f":"#REF!","v":{"$error":"#REF!"}},"wekelijks",null,null,"100 watt + 30 watt/2 min",null,"ja",null,162,62,null,null,null,null,12]
["BMI",null,null,null,{"$f":"IF(F39<18.5,\"te laag\",IF(F39>25,\"te hoog\",\"normaal\"))","v":{"$error":"#REF!"}},{"$f":"#REF!","v":{"$error":"#REF!"}},null,null,null,null,"nee"]
["Buikomtrek",null,null,null,{"$f":"#REF!","v":{"$error":"#REF!"}},null,null,null,null,null,null,null,164,64,null,null,null,null,14]
["Vetpercentage",null,null,null,{"$f":"#REF!","v":{"$error":"#REF!"}},null,null,null,"8u",null,"dagelijks",null,165,65,null,null,null,null,15]
["Spiermassa",null,null,null,{"$f":"#REF!","v":{"$error":"#REF!"}},null,null,null,"9u",null,"wekelijks",null,166,66,null,null,null,null,16]
["Visceraal vet",null,null,null,{"$f":"IF(F43<10,\"laag risico\",IF(F43<15,\"verhoogd risico\",IF(F43<50,\"sterk verhoogd risico\")))","v":{"$error":"#REF!"}},{"$f":"#REF!","v":{"$error":"#REF!"}},null,null,"10u",null,"zelden",null,167,67,null,null,null,null,17]
["Bloeddruk",null,null,null,{"$f":"IF(F44>\"140/80\",\"te hoog\",\"normaal\")","v":{"$error":"#REF!"}},{"$f":"#REF!","v":{"$error":"#REF!"}},null,null,"11u",null,null,null,null,68,null,null,null,null,18]
["Beweging",null,{"$f":"IF(B45=\"ja\",\"1\",\"0\")","v":"0"},{"$f":"C45+C46+C47","v":0},{"$f":"IF(D45=3,\"zeer goed\",IF(D45=2,\"goed\",IF(D45=1,\"kan beter\",IF(D45=0,\"niet goed\"))))","v":"niet goed"},null,null,null,null,null,"alcohol",null,"ja"]
[null,null,{"$f":"IF(B46=\"ja\",\"1\",\"0\")","v":"0"},null,null,null,null,null,null,null,null,null,"nee"]
[null,null,{"$f":"IF(B47=\"ja\",\"1\",\"0\")","v":"0"},null,null,null,null,null,null,null,"nooit"]
["Voeding",null,{"$f":"IF(B48=\"ja\",\"1\",\"0\")","v":"0"},{"$f":"C48+C49+C50+C51+C52","v":0},{"$f":"IF(D48=7,\"uitstekend\",IF(D48=6,\"zeer goed\",IF(D48=5,\"goed\",IF(D48=4,\"matig\",IF(D48=3,\"zeer matig\",IF(D48=2,\"slecht\",IF(D48=1,\"zeer slecht\",IF(D48=0,\"zeer slecht\"))))))))","v":"zeer slecht"},null,null,null,null,null,"minder dan maandelijks"]
[null,null,{"$f":"IF(B49=\"ja\",\"1\",\"0\")","v":"0"},null,null,null,null,null,null,null,"maandelijks"]
[null,null,{"$f":"IF(B50=\"zelden\",\"2\",IF(B50=\"wekelijks\",\"1\",IF(B50=\"dagelijks\",\"0\")))","v":false},null,null,null,null,null,null,null,"wekelijks"]
[null,null,{"$f":"IF(B51=\"zelden\",\"2\",IF(B51=\"wekelijks\",\"1\",IF(B51=\"dagelijks\",\"0\")))","v":false},null,null,null,null,null,null,null,"dagelijks of bijna dagelijks"]
[null,null,{"$f":"IF(B52=\"ja\",\"1\",\"0\")","v":"0"}]
["Alcohol",null,{"$f":"IF(B53=\"nooit\",\"5\",IF(B53=\"minder dan maandelijks\",\"4\",IF(B53=\"maandelijks\",\"3\",IF(B53=\"wekelijks\",\"2\",IF(B53=\"dagelijks of bijna dagelijks\",\"1\")))))","v":false},{"$f":"C53","v":false},{"$f":"IF(D53=\"5\",\"uitstekend\",IF(D53=\"4\",\"zeer goed\",IF(D53=\"3\",\"goed\",IF(D53=\"2\",\"kan beter\",IF(D53=\"1\",\"niet goed\")))))","v":false},null,null,null,null,null,"doelen"]
["Roken",null,{"$f":"IF(B54=\"nee\",\"1\",\"0\")","v":"0"},{"$f":"C54","v":"0"},{"$f":"IF(D54=\"1\",\"goed\",\"niet goed\")","v":"niet goed"}]
["Slapen",null,{"$f":"IF(B55=\"nee\",\"1\",\"0\")","v":"0"},{"$f":"C55","v":"0"},{"$f":"IF(D55=\"1\",\"goed\",\"niet goed\")","v":"niet goed"},null,null,"nooit","voeding",null,"voeding",null,173,73,null,null,null,null,23]
["Stress",null,{"$f":"IF(B56=\"nee\",\"1\",\"0\")","v":"0"},{"$f":"C56","v":"0"},{"$f":"IF(D56=\"1\",\"goed\",\"niet goed\")","v":"niet goed"},null,null,null,null,null,"beweging"]
["Doelen",null,null,null,null,null,null,"maandelijks","alcohol",null,"roken"]
[null,null,null,null,null,null,null,null,null,null,"alcohol"]
[null,null,null,null,null,null,null,null,null,null,"stressniveau"]
[null,null,null,null,null,null,null,null,null,null,"slapen"]
[null,null,null,null,null,null,null,null,null,null,"ik wil niets veranderen"]
[]
["watt/kg",null,null,null,{"$f":"#REF!","v":{"$error":"#REF!"}}]
["Vo2 max",null,null,null,{"$f":"#REF!","v":{"$error":"#REF!"}},null,null,null,null,null,"roken"]
["Voornaam","Naam","m/v","leeftijd","lft categ","beweging","roken","alcohol","voeding","slapen","stress","doelen","doelen","doelen","doelen","doelen","doelen","bmi","buikomtrek","vet%","spiermassa","visc vet","bloeddruk","watt/kg","VO2"]
[{"$f":"merel!B33","v":0},{"$f":"merel!B32","v":0},{"$f":"E33","v":0},{"$f":"E35","v":0},{"$f":"E36","v":"cat 20-30"},{"$f":"E45","v":"niet goed"},{"$f":"E54","v":"niet goed"},{"$f":"E53","v":false},{"$f":"E48","v":"zeer slecht"},{"$f":"E55","v":"niet goed"},{"$f":"E56","v":"niet goed"},{"$f":"E57","v":0},{"$f":"E58","v":0},{"$f":"E59","v":0},{"$f":"E60","v":0},{"$f":"E61","v":0},{"$f":"E62","v":0},{"$f":"E39","v":{"$error":"#REF!"}},{"$f":"E40","v":{"$error":"#REF!"}},{"$f":"E41","v":{"$error":"#REF!"}},{"$f":"E42","v":{"$error":"#REF!"}},{"$f":"E43","v":{"$error":"#REF!"}},{"$f":"E44","v":{"$error":"#REF!"}},{"$f":"E63","v":{"$error":"#REF!"}},{"$f":"E64","v":{"$error":"#REF!"}}]
[]
[]
[]
[]
[]
[]
["Arts"]
["Datum onderzoek"]
["Anamnese",null,null,null,null,"Opmerkingen"]
["Medische antecedenten"]
["Roken"]
["Cardiale vragenlijst"]
["Medicatie"]
["Sportanamnese"]
["Overmatige stress"]
["Antropometrie",null,null,null,null,"Opmerkingen"]
["Lengte"]
["Gewicht"]
["BMI"]
["Vetpercentage"]
["Spiermassa"]
["Buikomtrek"]
["Basaal metabolisme"]
["Viscerale vetmassa"]
["Medisch onderzoek",null,null,null,null,"Opmerkingen"]
["Bloeddruk"]
["Klinisch onderzoek"]
["Rust ECG"]
["Inspannings ECG"]
["Evaluatie rust en stress ECG"]
["Longtesten",null,"FVC",null,"%"]
[null,null,"FEV1",null,"%"]
[null,null,"PEF",null,"%"]
[null,null,"FEV1/FVC",{"$f":"(D98/D97)*100","v":{"$error":"#DIV/0!"}}]
["Evaluatie longtesten"]
["Cardiovascualair risico",null,null,{"$f":"IF(C102<5%,\"normaal\",IF(C102<10%,\"licht gestegen risico\",IF(C102<100%,\"sterk gestegen risico\")))","v":"normaal"}]
[null,null,"leeftijd",{"$f":"merel!B80","v":0}]
[null,null,"bloeddruk",{"$f":"C92","v":0}]
[null,null,"roker",{"$f":"C77","v":0}]
[null,null,"cholesterol",{"$f":"C112","v":0}]
["Labo",null,null,null,null,"Opmerkingen"]
["Stoelgang"]
["Urine"]
["Bloed ","glucose"]
[null,"vitamine D"]
[null,"cholesterol"]
[null,"andere"]
["Verwijsbrieven "]
["Reden van doorverwijzing",null,null,"Conclusie onderzoek"]
[]
[]
[]
[]
[]
[]
[]
[]
[]
["Assistent"]
["Oogtesten",null,null,null,"Opmerkingen"]
["Correcties/Oogaandoeningen"]
["Test veraf"]
[null,"re"]
[null,"li"]
[null,"Beide kanten"]
["Test dichtbij"]
[null,"re"]
[null,"li"]
[null,"Beide kanten"]
["Campi test","Aantal fouten"]
["Oogdruk test","Rechts"]
[null,"Links"]
["Inspanningstest",null,null,null,"Opmerkingen"]
["Max watt"]
["Watt/kg",{"$f":"B140/#REF!","v":{"$error":"#REF!"}}]
["VO2 max"]
["HF max"]
["Reden stop test"]
["Evaluatie"]

{"sheet":"Aalscholver","index":4,"n_rows":145,"n_cols":25,"rows_kept":145,"cut":false,"hidden":false,"merged":[[141,1,141,3],[142,1,142,3],[143,1,143,3],[144,1,144,3],[136,0,137,0],[136,2,136,3],[137,2,137,3],[138,0,138,3],[139,1,139,3],[140,1,140,3],[131,0,134,0],[131,1,131,4],[132,2,132,3],[133,2,133,3],[134,2,134,3],[135,2,135,3],[124,0,124,1],[124,2,124,4],[125,0,125,3],[126,1,126,4],[127,0,130,0],[127,1,127,4],[128,2,128,3],[129,2,129,3],[130,2,130,3],[115,0,115,2],[115,3,115,5],[116,0,116,2],[116,3,116,5],[117,0,117,2],[117,3,117,5],[109,2,109,4],[110,2,110,4],[111,2,111,4],[112,2,112,4],[113,0,113,5],[114,0,114,2],[114,3,114,5],[105,3,105,5],[106,0,106,4],[107,0,107,1],[107,2,107,4],[108,0,108,1],[108,2,108,4],[100,0,100,4],[101,0,101,1],[101,3,101,5],[102,3,102,5],[103,3,103,5],[104,3,104,5],[94,0,94,1],[94,2,94,4],[95,0,95,1],[95,2,95,4],[96,0,99,1],[96,5,99,5],[90,0,90,4],[91,0,91,1],[91,2,91,4],[92,0,92,1],[92,2,92,4],[93,0,93,1],[93,2,93,4],[87,0,87,1],[87,2,87,4],[88,0,88,1],[88,2,88,4],[89,0,89,1],[89,2,89,4],[84,0,84,1],[84,2,84,4],[85,0,85,1],[85,2,85,4],[86,0,86,1],[86,2,86,4],[80,0,80,1],[80,2,80,4],[81,0,81,4],[82,0,82,1],[82,2,82,4],[83,0,83,1],[83,2,83,4],[77,0,77,1],[77,2,77,4],[78,0,78,1],[78,2,78,4],[79,0,79,1],[79,2,79,5],[73,0,73,4],[74,0,74,4],[75,0,75,1],[75,2,75,4],[76,0,76,1],[76,2,76,4],[47,0,51,0],[47,3,51,3],[47,4,51,4],[56,0,61,0],[56,1,63,3],[72,0,72,4],[0,0,0,1],[29,0,29,4],[30,1,43,3],[44,0,46,0],[44,3,46,3],[44,4,46,4]]}
["Persoonsgegevens"]
["Bedrijf","zelfstandig"]
["Naam","Aalscholver"]
["Voornaam"]
["Rijksregisternummer"]
["Geslacht"]
["Geboortedatum"]
["Leeftijd"]
["Taalkkeuze"]
["Straat + nummer"]
["postcode + gemeente"]
["Emailadres","aalscholver@adres.be"]
["Tel/GSM nummer"]
["Land"]
["Huisarts"]
[]
[]
[]
[]
[]
[]
[]
[]
[]
[]
[]
[]
[]
[]
["MCU",null,null,null,null,null,null,null,null,null,"beweging"]
["Naam",null,null,null,{"$f":"Aalscholver!B32","v":0}]
["Voornaam",null,null,null,{"$f":"Aalscholver!B33","v":0},null,null,null,null,null,"ja"]
["Geslacht",null,null,null,{"$f":"Aalscholver!B35","v":0},null,null,null,null,null,"nee"]
["Geboortedatum",null,null,null,{"$f":"Aalscholver!B36","v":"00:00:00"}]
["Leeftijd",null,null,null,{"$f":"Aalscholver!B37","v":0},null,null,null,null,null,"voeding"]
["Leeftijdscategorie",null,null,null,{"$f":"IF(E35<31,\"cat 20-30\",IF(E35<41,\"cat 30-40\",IF(E35<51,\"cat 40-50\",IF(E35<61,\"cat 50-60\",IF(E35<71,\"cat 60-70\")))))","v":"cat 20-30"}]
["Lengte",null,null,null,{"$f":"#REF!","v":{"$error":"#REF!"}},"dagelijks",null,null,"80 watt + 40 watt/2 min",null,null,null,161,61,null,null,null,null,11]
["Gewicht",null,null,null,{"$f":"#REF!","v":{"$error":"#REF!"}},"wekelijks",null,null,"100 watt + 30 watt/2 min",null,"ja",null,162,62,null,null,null,null,12]
["BMI",null,null,null,{"$f":"IF(F39<18.5,\"te laag\",IF(F39>25,\"te hoog\",\"normaal\"))","v":{"$error":"#REF!"}},{"$f":"#REF!","v":{"$error":"#REF!"}},null,null,null,null,"nee"]
["Buikomtrek",null,null,null,{"$f":"#REF!","v":{"$error":"#REF!"}},null,null,null,null,null,null,null,164,64,null,null,null,null,14]
["Vetpercentage",null,null,null,{"$f":"#REF!","v":{"$error":"#REF!"}},null,null,null,"8u",null,"dagelijks",null,165,65,null,null,null,null,15]
["Spiermassa",null,null,null,{"$f":"#REF!","v":{"$error":"#REF!"}},null,null,null,"9u",null,"wekelijks",null,166,66,null,null,null,null,16]
["Visceraal vet",null,null,null,{"$f":"IF(F43<10,\"laag risico\",IF(F43<15,\"verhoogd risico\",IF(F43<50,\"sterk verhoogd risico\")))","v":{"$error":"#REF!"}},{"$f":"#REF!","v":{"$error":"#REF!"}},null,null,"10u",null,"zelden",null,167,67,null,null,null,null,17]
["Bloeddruk",null,null,null,{"$f":"IF(F44>\"140/80\",\"te hoog\",\"normaal\")","v":{"$error":"#REF!"}},{"$f":"#REF!","v":{"$error":"#REF!"}},null,null,"11u",null,null,null,null,68,null,null,null,null,18]
["Beweging",null,{"$f":"IF(B45=\"ja\",\"1\",\"0\")","v":"0"},{"$f":"C45+C46+C47","v":0},{"$f":"IF(D45=3,\"zeer goed\",IF(D45=2,\"goed\",IF(D45=1,\"kan beter\",IF(D45=0,\"niet goed\"))))","v":"niet goed"},null,null,null,null,null,"alcohol",null,"ja"]
[null,null,{"$f":"IF(B46=\"ja\",\"1\",\"0\")","v":"0"},null,null,null,null,null,null,null,null,null,"nee"]
[null,null,{"$f":"IF(B47=\"ja\",\"1\",\"0\")","v":"0"},null,null,null,null,null,null,null,"nooit"]
["Voeding",null,{"$f":"IF(B48=\"ja\",\"1\",\"0\")","v":"0"},{"$f":"C48+C49+C50+C51+C52","v":0},{"$f":"IF(D48=7,\"uitstekend\",IF(D48=6,\"zeer goed\",IF(D48=5,\"goed\",IF(D48=4,\"matig\",IF(D48=3,\"zeer matig\",IF(D48=2,\"slecht\",IF(D48=1,\"zeer slecht\",IF(D48=0,\"zeer slecht\"))))))))","v":"zeer slecht"},null,null,null,null,null,"minder dan maandelijks"]
[null,null,{"$f":"IF(B49=\"ja\",\"1\",\"0\")","v":"0"},null,null,null,null,null,null,null,"maandelijks"]
[null,null,{"$f":"IF(B50=\"zelden\",\"2\",IF(B50=\"wekelijks\",\"1\",IF(B50=\"dagelijks\",\"0\")))","v":false},null,null,null,null,null,null,null,"wekelijks"]
[null,null,{"$f":"IF(B51=\"zelden\",\"2\",IF(B51=\"wekelijks\",\"1\",IF(B51=\"dagelijks\",\"0\")))","v":false},null,null,null,null,null,null,null,"dagelijks of bijna dagelijks"]
[null,null,{"$f":"IF(B52=\"ja\",\"1\",\"0\")","v":"0"}]
["Alcohol",null,{"$f":"IF(B53=\"nooit\",\"5\",IF(B53=\"minder dan maandelijks\",\"4\",IF(B53=\"maandelijks\",\"3\",IF(B53=\"wekelijks\",\"2\",IF(B53=\"dagelijks of bijna dagelijks\",\"1\")))))","v":false},{"$f":"C53","v":false},{"$f":"IF(D53=\"5\",\"uitstekend\",IF(D53=\"4\",\"zeer goed\",IF(D53=\"3\",\"goed\",IF(D53=\"2\",\"kan beter\",IF(D53=\"1\",\"niet goed\")))))","v":false},null,null,null,null,null,"doelen"]
["Roken",null,{"$f":"IF(B54=\"nee\",\"1\",\"0\")","v":"0"},{"$f":"C54","v":"0"},{"$f":"IF(D54=\"1\",\"goed\",\"niet goed\")","v":"niet goed"}]
["Slapen",null,{"$f":"IF(B55=\"nee\",\"1\",\"0\")","v":"0"},{"$f":"C55","v":"0"},{"$f":"IF(D55=\"1\",\"goed\",\"niet goed\")","v":"niet goed"},null,null,"nooit","voeding",null,"voeding",null,173,73,null,null,null,null,23]
["Stress",null,{"$f":"IF(B56=\"nee\",\"1\",\"0\")","v":"0"},{"$f":"C56","v":"0"},{"$f":"IF(D56=\"1\",\"goed\",\"niet goed\")","v":"niet goed"},null,null,null,null,null,"beweging"]
["Doelen",null,null,null,null,null,null,"maandelijks","alcohol",null,"roken"]
[null,null,null,null,null,null,null,null,null,null,"alcohol"]
[null,null,null,null,null,null,null,null,null,null,"stressniveau"]
[null,null,null,null,null,null,null,null,null,null,"slapen"]
[null,null,null,null,null,null,null,null,null,null,"ik wil niets veranderen"]
[]
["watt/kg",null,null,null,{"$f":"#REF!","v":{"$error":"#REF!"}}]
["Vo2 max",null,null,null,{"$f":"#REF!","v":{"$error":"#REF!"}},null,null,null,null,null,"roken"]
["Voornaam","Naam","m/v","leeftijd","lft categ","beweging","roken","alcohol","voeding","slapen","stress","doelen","doelen","doelen","doelen","doelen","doelen","bmi","buikomtrek","vet%","spiermassa","visc vet","bloeddruk","watt/kg","VO2"]
[{"$f":"Aalscholver!B33","v":0},{"$f":"Aalscholver!B32","v":0},{"$f":"E33","v":0},{"$f":"E35","v":0},{"$f":"E36","v":"cat 20-30"},{"$f":"E45","v":"niet goed"},{"$f":"E54","v":"niet goed"},{"$f":"E53","v":false},{"$f":"E48","v":"zeer slecht"},{"$f":"E55","v":"niet goed"},{"$f":"E56","v":"niet goed"},{"$f":"E57","v":0},{"$f":"E58","v":0},{"$f":"E59","v":0},{"$f":"E60","v":0},{"$f":"E61","v":0},{"$f":"E62","v":0},{"$f":"E39","v":{"$error":"#REF!"}},{"$f":"E40","v":{"$error":"#REF!"}},{"$f":"E41","v":{"$error":"#REF!"}},{"$f":"E42","v":{"$error":"#REF!"}},{"$f":"E43","v":{"$error":"#REF!"}},{"$f":"E44","v":{"$error":"#REF!"}},{"$f":"E63","v":{"$error":"#REF!"}},{"$f":"E64","v":{"$error":"#REF!"}}]
[]
[]
[]
[]
[]
[]
["Arts"]
["Datum onderzoek"]
["Anamnese",null,null,null,null,"Opmerkingen"]
["Medische antecedenten"]
["Roken"]
["Cardiale vragenlijst"]
["Medicatie"]
["Sportanamnese"]
["Overmatige stress"]
["Antropometrie",null,null,null,null,"Opmerkingen"]
["Lengte"]
["Gewicht"]
["BMI"]
["Vetpercentage"]
["Spiermassa"]
["Buikomtrek"]
["Basaal metabolisme"]
["Viscerale vetmassa"]
["Medisch onderzoek",null,null,null,null,"Opmerkingen"]
["Bloeddruk"]
["Klinisch onderzoek"]
["Rust ECG"]
["Inspannings ECG"]
["Evaluatie rust en stress ECG"]
["Longtesten",null,"FVC",null,"%"]
[null,null,"FEV1",null,"%"]
[null,null,"PEF",null,"%"]
[null,null,"FEV1/FVC",{"$f":"(D98/D97)*100","v":{"$error":"#DIV/0!"}}]
["Evaluatie longtesten"]
["Cardiovascualair risico",null,null,{"$f":"IF(C102<5%,\"normaal\",IF(C102<10%,\"licht gestegen risico\",IF(C102<100%,\"sterk gestegen risico\")))","v":"normaal"}]
[null,null,"leeftijd",{"$f":"Aalscholver!B80","v":0}]
[null,null,"bloeddruk",{"$f":"C92","v":0}]
[null,null,"roker",{"$f":"C77","v":0}]
[null,null,"cholesterol",{"$f":"C112","v":0}]
["Labo",null,null,null,null,"Opmerkingen"]
["Stoelgang"]
["Urine"]
["Bloed ","glucose"]
[null,"vitamine D"]
[null,"cholesterol"]
[null,"andere"]
["Verwijsbrieven "]
["Reden van doorverwijzing",null,null,"Conclusie onderzoek"]
[]
[]
[]
[]
[]
[]
[]
[]
[]
["Assistent"]
["Oogtesten",null,null,null,"Opmerkingen"]
["Correcties/Oogaandoeningen"]
["Test veraf"]
[null,"re"]
[null,"li"]
[null,"Beide kanten"]
["Test dichtbij"]
[null,"re"]
[null,"li"]
[null,"Beide kanten"]
["Campi test","Aantal fouten"]
["Oogdruk test","Rechts"]
[null,"Links"]
["Inspanningstest",null,null,null,"Opmerkingen"]
["Max watt"]
["Watt/kg",{"$f":"B140/#REF!","v":{"$error":"#REF!"}}]
["VO2 max"]
["HF max"]
["Reden stop test"]
["Evaluatie"]