{"text_format":"1","workbook":"xlsx","n_sheets":6,"sheets":["Planning","Diagram","feestdagen ed","aanvragen","bestelling","Voorraad"],"not_rendered":{"charts":0,"images":0,"macros":1,"external_links":0,"defined_names":21,"comments":2,"pivot_tables":0},"unopened":[],"bounds":{"document_bytes":16777216,"sheet_cells":100000,"rows_first":2000,"rows_last":500,"rows_between":2000,"halvings":0,"cell_chars":16384,"cell_head_chars":4096},"cells_cut":0,"cells_raw":0,"read":"whole","date_system":"1900"}

{"sheet":"Planning","index":0,"n_rows":150,"n_cols":26,"rows_kept":150,"cut":false,"hidden":false,"merged":[[1,23,3,23],[0,5,0,8],[0,9,0,12],[0,13,0,14],[1,3,2,3],[1,5,1,6],[1,7,1,8],[1,9,1,10],[1,11,1,12],[1,20,3,20],[1,22,3,22],[1,21,3,21],[1,18,3,18],[1,15,2,15]]}
[{"$f":"TODAY()","v":"2019-01-11"},null,null,null,"Zagen","Drogen",null,null,null,"Schaven",null,null,null,"Transporteur",null,null,null,null,null,null,null,null,null,null,5]
[null,null,null,"Order\ndatum",null,"Heen",null,"Terug",null,"Heen",null,"Terug",null,null,null,"Aflever\ndatum",null,null,"m3",null,"totaal m3\nopdracht","M3\nzaagplanning","nog te zagen\ntbv planning","weeknummer",null,"180615_vries"]
["Order","Klant","Hout",null,"Datum","Datum","TRP","Datum","TRP","Datum","TRP","Datum","TRP","TRP","Laden",null,"Af",null,null,"Bedrag ex btw",null,null,null,null,5]
[]
["180916_Hig","Vincent Timmerman","Douglas","2018-11-08","2019-01-30",null,null,null,null,null,null,null,null,null,null,"2019-02-02",null,"I   zsm inplannen ivm lage prijs ",5.5,3726,13.5,5.5,8.5,{"$f":"IF(E5=\"\",\"\",WEEKNUM(E5))","v":5}]
["180916_Hig","Vincent Timmerman","Douglas","2018-11-08","2019-01-29",null,null,null,null,null,null,null,null,null,null,"2019-02-02",null,"II",4,null,8,4,4,{"$f":"IF(E6=\"\",\"\",WEEKNUM(E6))","v":5}]
["190006_Reus houtbouw ","Frank de Reus ","eiken ","2018-12-27","2019-01-28",null,null,null,null,null,null,null,null,null,null,"2019-02-01",null,null,0,495,0.6,0.6,"",{"$f":"IF(E7=\"\",\"\",WEEKNUM(E7))","v":5}]
["180916_Hig","Vincent Timmerman","Douglas","2018-11-08","2019-01-28",null,null,null,null,null,null,null,null,null,null,"2019-02-02",null,"III",4,null,4,4,0,{"$f":"IF(E8=\"\",\"\",WEEKNUM(E8))","v":5}]
["190004_Groot houthandel ","Gert","Douglas ","2019-01-08","2019-01-21",null,null,null,null,null,null,null,null,null,null,"2019-01-25",null,null,0.5,200,0.5,0.5,"",{"$f":"IF(E9=\"\",\"\",WEEKNUM(E9))","v":4}]
["180967_Houwelingen ",null,"eiken","2018-11-30","2019-01-14",null,null,null,null,null,null,null,null,null,null,"2019-01-18",null,"deelevering 2",0,null,2.8,1.1000000000000001,"",{"$f":"IF(E10=\"\",\"\",WEEKNUM(E10))","v":3}]
["181007_Buytendijk ","Evan ","Douglas","2018-12-27","2019-01-11",null,null,null,null,null,null,null,null,null,null,"2019-01-18",null,null,5,2815,4.9800000000000004,5,-1.9999999999999574E-2,{"$f":"IF(E11=\"\",\"\",WEEKNUM(E11))","v":2}]
["180969_BPL Parket ","Betty Uytewaal ","Eiken","2018-12-19","2019-01-10","2019-01-12",null,"2019-01-31",null,"2019-02-02",null,null,null,null,null,"2019-01-25",null,"31-12: LET OP nw leverdatum overleggen met klant",1.5,0,1.4,1.4,0,{"$f":"IF(E12=\"\",\"\",WEEKNUM(E12))","v":2}]
["180974_Ruiterbouw ","Adrian de Ruiter ","Eiken","2018-12-10","2019-01-10",null,null,null,null,null,null,null,null,null,null,"2018-12-28",null,null,1,819,0.84,0.8,3.9999999999999925E-2,{"$f":"IF(E13=\"\",\"\",WEEKNUM(E13))","v":2}]
["180953_Snitselaar",null,"Eiken","2018-11-27","2019-01-10","2019-01-11",null,null,null,null,null,null,null,null,null,"2019-02-25",null,"31-12: staat deze order goed klaar? Is gezaagd door han",0,795,0.65,null,"",{"$f":"IF(E14=\"\",\"\",WEEKNUM(E14))","v":2}]
["180973_Ruiterbouw ","Adrian de Ruiter ","Eiken","2018-12-10","2019-01-09",null,null,null,null,null,null,null,null,null,null,"2018-12-28",null,null,2,3877,2.96,2,0.96,{"$f":"IF(E15=\"\",\"\",WEEKNUM(E15))","v":2}]
["190002_Breehuis","Peter","douglas","2019-01-08","2019-01-08",null,null,null,null,null,null,null,null,null,null,"2019-01-09",null,null,0,616,1.54,1.54,"",{"$f":"IF(E16=\"\",\"\",WEEKNUM(E16))","v":2}]
["190001_Veluwsverfhuis","Herman vd Maarl ","douglas","2019-01-08","2019-01-08",null,null,null,null,null,null,null,null,null,null,"2019-01-09",null,null,0,248.47,0.42,0.42,"",{"$f":"IF(E17=\"\",\"\",WEEKNUM(E17))","v":2}]
["181004_Woodmarc","Marc de Graaf ","Douglas","2018-12-19","2019-01-08",null,null,null,null,null,null,null,null,null,null,"2019-01-18",null,"reeds betaald ? ",2,745,1.86,1.8,6.0000000000000053E-2,{"$f":"IF(E18=\"\",\"\",WEEKNUM(E18))","v":2}]
["180995_Clio Fetim ","Andre Kieft ","Douglas","2018-12-18","2019-01-08",null,null,null,null,null,null,null,null,null,null,"2019-01-09",null,"II",5.5,null,5.3,5.3,"",{"$f":"IF(E19=\"\",\"\",WEEKNUM(E19))","v":2}]
["180629_Donkersgoed","Bertus","Eiken","2018-11-20","2019-01-08",null,null,null,null,null,null,null,null,null,null,"2019-01-18",null,"II",1.5,2000,1.5,1.5,0,{"$f":"IF(E20=\"\",\"\",WEEKNUM(E20))","v":2}]
["180995_Clio Fetim ","Andre Kieft ","Douglas","2018-12-18","2019-01-07",null,null,null,null,null,null,null,null,null,null,"2019-01-09",null,"I",5,3168,10.26,5,5.26,{"$f":"IF(E21=\"\",\"\",WEEKNUM(E21))","v":2}]
["180967_Houwelingen ","Fedor ","Eiken","2018-11-30","2019-01-07","2019-01-07",null,null,"2019-01-10",null,null,null,null,null,null,"2019-01-11",0,"8-1 deellevering 1 1040m1/1,7m3",0,2891,2.85,1.7,"",{"$f":"IF(E22=\"\",\"\",WEEKNUM(E22))","v":2}]
["180629_Donkersgoed","Bertus","Douglas","2018-11-20","2019-01-07",null,null,null,null,null,null,null,null,null,null,"2019-01-18",null,"I",1.5,2000,1.5,1.5,0,{"$f":"IF(E23=\"\",\"\",WEEKNUM(E23))","v":2}]
["180920_Maanen ","eiken","Eiken","2018-11-20","2019-01-07",null,null,null,null,null,null,null,null,null,null,"2018-12-14",null,null,0,5035,3.25,null,"",{"$f":"IF(E24=\"\",\"\",WEEKNUM(E24))","v":2}]
["181001_Houwelingen","Jeremy Broekman ","Eiken","2018-12-20","2019-01-04","2019-01-07",null,"2019-01-18",null,null,null,null,null,null,"2019-01-21","2019-01-21",null,"TRANSPORT",0.5,562,0.33,0.3,3.0000000000000027E-2,{"$f":"IF(E25=\"\",\"\",WEEKNUM(E25))","v":1}]
["180937_Andersbouwen ","Harry van Beek ","Eiken","2018-11-22","2019-01-04",null,null,null,null,null,null,null,null,null,null,"2019-01-04",null,"TRANSPORT \n31-12: BELLEN & OVERLEGGEN (niet af)",3,5000,2.85,2.8,5.0000000000000266E-2,{"$f":"IF(E26=\"\",\"\",WEEKNUM(E26))","v":1}]
["181008_Pol ","marcel Bouwman ","Douglas","2018-12-27","2019-01-03",null,null,null,null,null,null,null,null,null,null,"2019-01-04",0,"afgehaald ",1.5,511.49,1.45,1.4,5.0000000000000044E-2,{"$f":"IF(E27=\"\",\"\",WEEKNUM(E27))","v":1}]
["180996_Kok bouwbedrijf ",null,"Douglas","2018-12-18","2019-01-03",null,null,null,null,"2019-01-03",null,"2019-01-03",null,null,null,"2019-01-04",null,"I",0.5,519,0.5,0.5,0,{"$f":"IF(E28=\"\",\"\",WEEKNUM(E28))","v":1}]
["180996_Kok bouwbedrijf ",null,"Eiken","2018-12-18","2019-01-03",null,null,null,null,"2019-01-03",null,"2019-01-03",null,null,null,"2019-01-04",null,"II",0.5,null,0.5,0.5,-4.0000000000000036E-2,{"$f":"IF(E29=\"\",\"\",WEEKNUM(E29))","v":1}]
["180975_Kokbouwbedrijf ","Reijer kok ","Douglas","2018-12-05","2019-01-03",null,null,null,null,null,null,null,null,null,null,"2019-01-04",null,null,0.5,210,0.49,0.5,-1.0000000000000009E-2,{"$f":"IF(E30=\"\",\"\",WEEKNUM(E30))","v":1}]
["180980_Berkhof ","Gijs Jan berkhof ","Eiken","2018-12-17","2019-01-02",null,null,null,null,null,null,null,null,null,null,"2019-01-08",0,"TRANSPORT 8 januari ",1,2984,0.99,1,-1.0000000000000009E-2,{"$f":"IF(E31=\"\",\"\",WEEKNUM(E31))","v":1}]
["180976_Pol ","Gerhard de Zwaan ","Douglas","2018-12-06","2018-12-24","2019-01-02",null,"2019-01-13",null,null,null,null,null,null,null,"2019-02-14",null,null,4,2222,3.56,3.6,-4.0000000000000036E-2,{"$f":"IF(E32=\"\",\"\",WEEKNUM(E32))","v":52}]
["180955_Die","Bastiaan van Die ","Douglas","2018-11-27","2018-12-17",null,null,null,null,null,null,null,null,null,null,"2018-12-21",null,"31-12: staat in droogkamer ; waar is de partij ? ",0,null,0.34,null,"",{"$f":"IF(E33=\"\",\"\",WEEKNUM(E33))","v":51}]
["180950_GerritJan'sHoeve ","Wim vd Munt ","douglas ","2018-11-27","2018-12-10",null,null,null,null,"2019-01-07",null,null,null,null,null,"2019-01-09",0,null,0,425,0.81,null,"",{"$f":"IF(E34=\"\",\"\",WEEKNUM(E34))","v":50}]
["180935_Boonen ","Jaap Boonen ","eiken ","2018-11-14","2018-11-28",null,null,null,null,null,null,null,null,null,null,"2018-11-28",null,null,0,2140,1.43,null,"",{"$f":"IF(E35=\"\",\"\",WEEKNUM(E35))","v":48}]
["180936_Roordink ",null,"douglas ","2018-11-11","2018-11-28",null,null,null,null,null,null,null,null,null,null,"2018-11-29",null,"31-12: staat in droogkmr:  ",0,108,"0.05",null,"",{"$f":"IF(E36=\"\",\"\",WEEKNUM(E36))","v":48}]
["180647_roelofsen ","T. Roelofsen ","eiken ","2018-10-18","2018-11-05","2018-11-06",null,null,null,null,null,null,null,null,null,"2019-01-14",0,"wanneer uit de droogkamer ",0,431,0.15,null,"",{"$f":"IF(E37=\"\",\"\",WEEKNUM(E37))","v":45}]
["180618_houwelingen","fedor","eiken","2018-09-27","2018-09-27",null,null,null,null,null,null,null,null,null,null,"2018-09-27",0,"58197 / 8-1 alsnog getekende pakbon ter facturering ",0,2909,8.57,null,"",{"$f":"IF(E38=\"\",\"\",WEEKNUM(E38))","v":39}]
["180582_pijnenburg","Pijnenburg\n06-21390977","douglas","2018-09-25","2018-09-27",null,null,null,null,null,null,null,null,null,null,"2018-09-28",null,"wk 41 komt zelf halen en betalen / 8-1 nog in lopende zaken ; geen pak/zaagbon ",0,740.4,1.38,null,"",{"$f":"IF(E39=\"\",\"\",WEEKNUM(E39))","v":39}]
["180585_houwelingen","fedor","eiken","2018-09-25","2018-09-26",null,null,null,null,null,null,null,null,null,null,"2018-10-02",0,"8-1 alsnog getekende pakbon ter facturering ",0,null,7,null,"",{"$f":"IF(E40=\"\",\"\",WEEKNUM(E40))","v":39}]
["180576_nubuiten","Edgar Hougee","douglas","2018-09-17","2018-09-26",null,null,null,null,null,null,null,null,null,null,"2018-09-26",0,"26-9 ophaal / 7-1 geen documenten gevonden ",0,868.8,1.76,null,"",{"$f":"IF(E41=\"\",\"\",WEEKNUM(E41))","v":39}]
["180577_leeuwen","G.Leeuwen","douglas","2018-09-24","2018-09-25",null,null,null,null,null,null,null,null,null,null,"2018-10-13",null,"8-1 geen dossier ",0,83.69,0.06,null,"",{"$f":"IF(E42=\"\",\"\",WEEKNUM(E42))","v":39}]
["180546_allround","Jan Bouw","douglas","2018-09-12","2018-09-24",null,null,null,null,null,null,null,null,null,null,"2018-09-26",0,"week 39",0,576.38,null,null,"",{"$f":"IF(E43=\"\",\"\",WEEKNUM(E43))","v":39}]
["180572_heko","Breus van Dijk","eiken","2018-09-20","2018-09-21",null,null,null,null,null,null,null,null,null,null,"2018-09-21",0,null,0,46.4,0.06,null,"",{"$f":"IF(E44=\"\",\"\",WEEKNUM(E44))","v":38}]
["180566_pol","Marcel Bouwman","douglas","2018-09-14","2018-09-21",null,null,null,null,null,null,null,null,null,null,"2018-09-21",0,null,0,14,0.03,null,"",{"$f":"IF(E45=\"\",\"\",WEEKNUM(E45))","v":38}]
["180558_roelofsen","Roelofsen","eiken","2018-09-13","2018-09-21",null,null,null,null,null,null,null,null,null,null,"2018-10-04",null,"week 40",0,149.78,0.11,null,"",{"$f":"IF(E46=\"\",\"\",WEEKNUM(E46))","v":38}]
["180556_haan","Gert de haan","eiken","2018-09-13","2018-09-20",null,null,null,null,null,null,null,null,null,null,"2018-09-17",0,null,0,264.83999999999997,null,null,"",{"$f":"IF(E47=\"\",\"\",WEEKNUM(E47))","v":38}]
["180517_budding","Barry Budding\n06-43549927","douglas","2018-09-06","2018-09-20",null,null,null,null,null,null,null,null,null,null,"2018-09-21",null,"week 38 ",0,64,0.14000000000000001,null,"",{"$f":"IF(E48=\"\",\"\",WEEKNUM(E48))","v":38}]
["180520_lamarti","Evert","douglas","2018-09-08","2018-09-19",null,null,null,null,null,null,null,null,null,null,"2018-09-19",0,"week 39",0,327.58,null,null,"",{"$f":"IF(E49=\"\",\"\",WEEKNUM(E49))","v":38}]
["180564_ebh","Benno Oostenbrink","Douglas","2018-09-14","2018-09-18",null,null,null,null,null,null,null,null,null,null,"2018-09-19",null,null,4,610.67999999999995,1.53,4,-2.4699999999999998,{"$f":"IF(E50=\"\",\"\",WEEKNUM(E50))","v":38}]
["180542_aha","agnes","douglas","2018-09-11","2018-09-18",null,null,null,null,null,null,null,null,null,null,"2018-09-24",0,"week 39",0,89.61,null,null,"",{"$f":"IF(E51=\"\",\"\",WEEKNUM(E51))","v":38}]
["180543_reemst","Tim reemst\n06-53187459","douglas","2018-09-10","2018-09-18",null,null,null,null,null,null,null,null,null,null,"2018-09-18",0,"18-9",0,90.09,null,null,"",{"$f":"IF(E52=\"\",\"\",WEEKNUM(E52))","v":38}]
["180541_karbouw","Rick Karbouw","douglas","2018-09-12","2018-09-17",null,null,null,null,null,null,null,null,null,"2018-09-17","2018-09-18",0,"18-9 via patrick",0,380.73,null,null,"",{"$f":"IF(E53=\"\",\"\",WEEKNUM(E53))","v":38}]
["180533_pontmeyer",null,"eiken","2018-09-11","2018-09-17",null,null,null,null,null,null,null,null,null,"2018-09-19","2018-09-18",0,"18-9 via patrick",0,724.86,null,null,"",{"$f":"IF(E54=\"\",\"\",WEEKNUM(E54))","v":38}]
["180552_jongeneel","Freek","douglas","2018-09-11","2018-09-17",null,null,null,null,null,null,null,null,null,"2018-09-19","2018-09-19",0,"week 38 ",0,244.21,null,null,"",{"$f":"IF(E55=\"\",\"\",WEEKNUM(E55))","v":38}]
["180521_nieboer","Joost nieboer","douglas","2018-09-10","2018-09-17",null,null,null,null,null,null,null,null,null,"2018-09-19","2018-09-24",0,"week 38 ",0,1672.14,null,null,"",{"$f":"IF(E56=\"\",\"\",WEEKNUM(E56))","v":38}]
["180507_klein","Dhr Klein\n06-53731917","douglas","2018-08-31","2018-09-17",null,null,null,null,null,null,null,null,null,null,"2018-09-19",null,"via flamingo",0,3512,3.44,null,"",{"$f":"IF(E57=\"\",\"\",WEEKNUM(E57))","v":38}]
["180515_pol","Ap Nap","eiken","2018-08-31","2018-09-13",null,null,null,null,null,null,null,null,null,null,"2018-09-14",0,null,0,183.6,null,null,"",{"$f":"IF(E58=\"\",\"\",WEEKNUM(E58))","v":37}]
["180504_groot","Gert","douglas","2018-08-27","2018-09-13",null,null,null,null,null,null,null,null,null,null,"2018-09-17",0,"wk 38",0,480,null,null,"",{"$f":"IF(E59=\"\",\"\",WEEKNUM(E59))","v":37}]
["180491_fetim","Andre Kieft","Douglas","2018-08-27","2018-09-12",null,null,null,null,null,null,null,null,null,null,"2018-09-13",null,"in delen ophalen .was opdracht ipv aanvraag",0,5280,17.88,null,"",{"$f":"IF(E60=\"\",\"\",WEEKNUM(E60))","v":37}]
["180519_schuit","Harold Schuit\n06-23668116","douglas","2018-09-05","2018-09-10",null,null,null,null,null,null,null,null,null,null,"2018-09-10",null,null,0,791.63,1.42,null,"",{"$f":"IF(E61=\"\",\"\",WEEKNUM(E61))","v":37}]
["180484_groot","Gert","douglas","2018-08-23","2018-09-10",null,null,null,null,null,null,null,null,null,null,"2018-09-14",0,"wk 37",{"$f":"CEILING(V62,0.5)","v":0},360,null,null,"",{"$f":"IF(E62=\"\",\"\",WEEKNUM(E62))","v":37}]
["180525_hard","hard en zacht","douglas","2018-09-06","2018-09-07",null,null,null,null,null,null,null,null,null,null,"2018-09-07",0,null,0,1455.3,3.4,null,"",{"$f":"IF(E63=\"\",\"\",WEEKNUM(E63))","v":36}]
["180476_arens","Frans Arens","eiken","2018-08-23","2018-09-07",null,null,null,null,null,null,null,null,null,null,"2018-09-13",null,null,{"$f":"CEILING(V64,0.5)","v":0},239.93,null,null,"",{"$f":"IF(E64=\"\",\"\",WEEKNUM(E64))","v":36}]
["180471_snel",null,"eiken","2018-08-23","2018-09-05",null,null,null,null,null,null,null,null,null,null,"2018-09-13",0,"gebeld: wk 37",{"$f":"CEILING(V65,0.5)","v":0},3112.2,null,null,"",{"$f":"IF(E65=\"\",\"\",WEEKNUM(E65))","v":36}]
["180479_hig","V. Timmerman","douglas","2018-08-23","2018-09-04",null,null,null,null,null,null,null,null,null,null,"2018-09-12",null,null,{"$f":"CEILING(V66,0.5)","v":0},3726,13.5,null,"",{"$f":"IF(E66=\"\",\"\",WEEKNUM(E66))","v":36}]
["180472_houwelingen",null,"eiken",null,"2018-09-04",null,null,null,null,null,null,null,null,null,null,"2018-09-07",0,null,{"$f":"CEILING(V67,0.5)","v":0},3819,null,null,"",{"$f":"IF(E67=\"\",\"\",WEEKNUM(E67))","v":36}]
["180501_legemaat","06-10138971","douglas","2018-08-29","2018-09-03",null,null,null,null,null,null,null,null,null,null,"2018-09-04",null,null,0,102.15,null,null,"",{"$f":"IF(E68=\"\",\"\",WEEKNUM(E68))","v":36}]
["180482_opijnen","P. Opijnen\n06-23378240","Eiken","2018-08-27","2018-08-31",null,null,null,null,null,null,null,null,null,null,"2018-09-04",0,null,{"$f":"CEILING(V69,0.5)","v":0},179.7,null,null,"",{"$f":"IF(E69=\"\",\"\",WEEKNUM(E69))","v":35}]
["180427_heuvel","0341-491461","douglas/eiken","2018-08-10","2018-08-29",null,null,null,null,null,null,null,null,null,null,"2018-09-04",null,"douglas eerder wk 35",{"$f":"CEILING(V70,0.5)","v":0},114.39,null,null,"",{"$f":"IF(E70=\"\",\"\",WEEKNUM(E70))","v":35}]
["180456_melissen","dhr Melissen\n06-20628018","douglas","2018-08-16","2018-08-24","2018-09-28",null,"2018-10-07",null,"2018-10-07",null,null,null,null,null,"2018-10-09",null,"tafelblad. bellen zodra gereed",{"$f":"CEILING(V71,0.5)","v":0},165.29,null,null,"",{"$f":"IF(E71=\"\",\"\",WEEKNUM(E71))","v":34}]
["180443_veldhuizen","06-53807405","Douglas","2018-08-14","2018-08-22",null,null,null,null,null,null,null,null,null,null,"2018-08-24",null,"eerste levering balkhout",{"$f":"CEILING(V72,0.5)","v":0},2445.0700000000002,null,null,"",{"$f":"IF(E72=\"\",\"\",WEEKNUM(E72))","v":34}]
["180463_brandhof","M. Buitenhuis","eiken","2018-08-16","2018-08-21",null,null,null,null,null,null,null,null,null,null,"2018-08-21",null,null,{"$f":"CEILING(V73,0.5)","v":0},415,null,null,"",{"$f":"IF(E73=\"\",\"\",WEEKNUM(E73))","v":34}]
["180459_kraai","06-10282559","douglas","2018-08-14","2018-08-21",null,null,null,null,null,null,null,null,null,null,"2018-08-24",null,null,{"$f":"CEILING(V74,0.5)","v":0.5},75,null,0.1,-0.1,{"$f":"IF(E74=\"\",\"\",WEEKNUM(E74))","v":34}]
["180447_steeg","06-25085117","eiken","2018-08-13","2018-08-21",null,null,null,null,null,null,null,null,null,null,"2018-08-22",0,"balie: € 40,-- betalen, 25-8 opgehaald",{"$f":"CEILING(V75,0.5)","v":0},40,null,null,"",{"$f":"IF(E75=\"\",\"\",WEEKNUM(E75))","v":34}]
["170710_natuurmonumenten","G.J Bronkhorst","Eiken","2017-12-11","2018-08-20","2018-08-13",null,null,null,null,null,null,null,null,null,"2018-05-30",null,"13-8 woerden. Pakket 23t/m29 moet nog",{"$f":"CEILING(V76,0.5)","v":0},18016,null,null,"",{"$f":"IF(E76=\"\",\"\",WEEKNUM(E76))","v":34}]
["180450_Wilpenveen","06-53284993","Douglas","2018-08-15","2018-08-16",null,null,null,null,null,null,null,null,null,null,"2018-08-16",0,"16-17 uur ophalen",{"$f":"CEILING(V77,0.5)","v":0},289.26,null,null,"",{"$f":"IF(E77=\"\",\"\",WEEKNUM(E77))","v":33}]
["180453_peters",null,"douglas","2018-08-14","2018-08-16",null,null,null,null,null,null,null,null,null,null,"2018-08-16",0,"16-8 gereed",{"$f":"CEILING(V78,0.5)","v":0},900,null,null,"",{"$f":"IF(E78=\"\",\"\",WEEKNUM(E78))","v":33}]
["180451_baalman","06-10837752","Eiken","2018-08-13","2018-08-16",null,null,null,null,null,null,null,null,null,null,"2018-08-16",0,"13:00 ophalen",{"$f":"CEILING(V79,0.5)","v":0},70,null,null,"",{"$f":"IF(E79=\"\",\"\",WEEKNUM(E79))","v":33}]
["180432_rooijen","heer van Rooijen\n06-55704080","anders","2018-07-31","2018-08-16",null,null,null,null,null,null,null,null,null,null,"2018-08-21",null,"boomstam Ø 50cm in plakken zagen , geen haast. Niet mogelijk. Stam is hol",{"$f":"CEILING(V80,0.5)","v":0},100,null,null,"",{"$f":"IF(E80=\"\",\"\",WEEKNUM(E80))","v":33}]
["180446_kempen","06-20486762","Douglas","2018-08-13","2018-08-15",null,null,null,null,null,null,null,null,null,null,"2018-08-15",null,"balie: € 50,-- betalen",{"$f":"CEILING(V81,0.5)","v":0},50,null,null,"",{"$f":"IF(E81=\"\",\"\",WEEKNUM(E81))","v":33}]
["180385_natuurmonumenten","Bronkhorst","Larix","2018-07-09","2018-08-09",null,null,null,null,null,null,null,null,null,null,"2018-08-17",null,"datum onder voorbehoud",{"$f":"CEILING(V82,0.5)","v":0},4375,null,null,"",{"$f":"IF(E82=\"\",\"\",WEEKNUM(E82))","v":32}]
["180434_reijersen","G. Reijersen\n0653621350","Douglas","2018-07-30","2018-08-03",null,null,null,null,null,null,null,null,null,null,"2018-08-04",null,null,{"$f":"CEILING(V83,0.5)","v":0},159.38,null,null,"",{"$f":"IF(E83=\"\",\"\",WEEKNUM(E83))","v":31}]
["180414_rusch","Moragh Rusch\n06-40355960","eiken","2018-07-18","2018-07-26",null,null,null,null,null,null,null,null,null,"2018-08-02","2018-08-02",null,"transport",{"$f":"CEILING(V84,0.5)","v":0},2259.3000000000002,null,null,"",{"$f":"IF(E84=\"\",\"\",WEEKNUM(E84))","v":30},"oke"]
["180410_arens","Frans\n06-42880679","eiken","2018-07-19","2018-07-25",null,null,null,null,null,null,null,null,null,null,"2018-07-27",null,"gereed",{"$f":"CEILING(V85,0.5)","v":0},145.30000000000001,null,null,"",{"$f":"IF(E85=\"\",\"\",WEEKNUM(E85))","v":30},"oke"]
["180383_werner",null,"Iepen","2018-07-17","2018-07-25","2018-08-13",null,null,null,null,null,null,null,null,null,"2018-08-10",null,"10-8 gereed",{"$f":"CEILING(V86,0.5)","v":0},14462.81,null,null,"",{"$f":"IF(E86=\"\",\"\",WEEKNUM(E86))","v":30}]
["180388_zwart","G. Zwart","Eiken","2018-07-16","2018-07-16","2018-07-19",null,null,null,null,null,null,null,null,null,"2018-07-25",null,null,{"$f":"CEILING(V87,0.5)","v":0},285,null,null,"",{"$f":"IF(E87=\"\",\"\",WEEKNUM(E87))","v":29}]
["180389_grift","timmer","Douglas","2018-07-16","2018-07-16",null,null,null,null,null,null,null,null,null,null,"2018-07-25",0,null,{"$f":"CEILING(V88,0.5)","v":0},172.64,null,null,"",{"$f":"IF(E88=\"\",\"\",WEEKNUM(E88))","v":29}]
["180379_veldhuizen","G. veldhuizen\n","Eiken","2018-06-25","2018-07-09",null,null,null,null,null,null,null,null,null,null,"2018-07-12",null,"25-7 middag ophalen",{"$f":"CEILING(V89,0.5)","v":0},2026.5,null,null,"",{"$f":"IF(E89=\"\",\"\",WEEKNUM(E89))","v":28},"oke"]
["180323_prattenburg",null,"douglas","2018-06-14","2018-07-06",null,null,null,null,null,null,null,null,null,null,"2018-07-10",null,"loonzagen",{"$f":"CEILING(V90,0.5)","v":0},279.93,null,null,"",{"$f":"IF(E90=\"\",\"\",WEEKNUM(E90))","v":27},"oke"]
["180363_twente","Willem\n0548-681286","Eiken","2018-06-28","2018-06-28",null,null,null,null,null,null,null,null,null,null,"2018-06-29",null,null,{"$f":"CEILING(V91,0.5)","v":0},232.5,null,null,"",{"$f":"IF(E91=\"\",\"\",WEEKNUM(E91))","v":26}]
["180345_davelaar","J. Davelaar\n06-27565866","Eiken","2018-06-18","2018-06-27","2018-06-27",null,null,null,"2018-10-15",null,null,null,null,null,"2018-10-15",null,"zodra gereed bellen",{"$f":"CEILING(V92,0.5)","v":0},356.7,0.97,null,"",{"$f":"IF(E92=\"\",\"\",WEEKNUM(E92))","v":26}]
["180352_noesk","M. Willemsen\n0488-760990","Larix","2018-06-19","2018-06-25",null,null,null,null,null,null,null,null,null,null,"2018-06-27",0,null,{"$f":"CEILING(V93,0.5)","v":0},625.38,null,null,"",{"$f":"IF(E93=\"\",\"\",WEEKNUM(E93))","v":26}]
["180274_brink","J. vd. Brink\n06-10112222","Eiken","2018-06-14","2018-06-25",null,null,null,null,null,null,null,null,null,null,"2018-06-26",0,"na 15.00 uur",{"$f":"CEILING(V94,0.5)","v":0},null,null,null,"",{"$f":"IF(E94=\"\",\"\",WEEKNUM(E94))","v":26}]
["180340_hogendoorn","C. Hogendoorn\n06-42781238","Douglas","2018-06-18","2018-06-22",null,null,null,null,null,null,null,null,null,null,"2018-06-28",null,null,{"$f":"CEILING(V95,0.5)","v":0},70,null,null,"",{"$f":"IF(E95=\"\",\"\",WEEKNUM(E95))","v":25}]
["180331_wolfswinkel","Wolswinkel\n0342-442528","Douglas","2018-06-18","2018-06-21",null,null,null,null,null,null,null,null,null,null,"2018-06-28",null,"planken zwart spuiten",{"$f":"CEILING(V96,0.5)","v":0},200.07,0.64,null,"",{"$f":"IF(E96=\"\",\"\",WEEKNUM(E96))","v":25}]
["180229_vries","B. de Vries\n033-2453595","Eiken","2018-05-16","2018-05-23",null,null,null,null,null,null,null,null,null,null,"2018-05-23",0,"na 16:00 uur aan de weg leggen, gereed",{"$f":"CEILING(V97,0.5)","v":0},null,null,null,"",{"$f":"IF(E97=\"\",\"\",WEEKNUM(E97))","v":21}]
["180216_design","F. Dekker\n06-23993540","Douglas","2018-05-14","2018-05-15","2018-05-15",null,null,null,"2018-05-18",null,null,null,null,null,"2018-05-18",null,null,{"$f":"CEILING(V98,0.5)","v":0},135,4.2699999999999996,null,"",{"$f":"IF(E98=\"\",\"\",WEEKNUM(E98))","v":20}]
["180126_valleihorstee","H Veurink                     06-53701000","Eiken","2018-04-20","2018-05-04",null,null,null,null,null,null,null,null,null,null,"2018-05-25",null,"nog 30 stuks leveren, 28-6 18x geleverd",{"$f":"CEILING(V99,0.5)","v":0},null,null,null,"",3]
["180510_pol","Gerhard de Zwaan","douglas","2018-09-11",null,null,null,null,null,null,null,null,null,null,null,"2018-09-20",0,"week 38 channelsidings",0,816,null,null,"",{"$f":"IF(E100=\"\",\"\",WEEKNUM(E100))","v":""}]
["180349_pol","Bertus","Douglas","2018-07-02",null,null,null,null,null,null,null,null,null,null,null,"2018-07-18",null,"slieten",{"$f":"CEILING(V101,0.5)","v":0},3400,null,null,"",{"$f":"IF(E101=\"\",\"\",WEEKNUM(E101))","v":""}]
["180333_Romijn","G. Romijn","kastanje","2018-06-18",null,null,null,null,null,null,null,null,null,null,null,"2018-06-27",null,"Van vliet",{"$f":"CEILING(V102,0.5)","v":0},null,null,null,"",{"$f":"IF(E102=\"\",\"\",WEEKNUM(E102))","v":""}]
["180155_hard&zachthout","055-5051888","Essen","2018-04-30",null,null,null,null,null,null,null,null,null,null,null,"2018-05-28",null,"Loonzagen Essen",{"$f":"CEILING(V103,0.5)","v":0},null,null,null,"",{"$f":"IF(E103=\"\",\"\",WEEKNUM(E103))","v":""}]
["170712_bettink","J Bettink                  06-52532131","Eiken","2018-02-13",null,"2018-04-09",null,null,null,"2018-05-08",null,null,null,null,null,"2018-05-09",0,"is voor v/d Brink staat in de droogkamer moet nog geschaafd worden, ",{"$f":"CEILING(V104,0.5)","v":0},4150.6000000000004,null,null,"",5]
["170612_pauw","L. de Pauw\n32 93257010","Grenen","2018-01-14",null,null,null,null,null,null,null,null,null,null,null,"2018-08-16",0,"via Grenen",{"$f":"CEILING(V105,0.5)","v":0},2397.6,10,null,"",{"$f":"IF(E105=\"\",\"\",WEEKNUM(E105))","v":""}]
["180492_kuperus ",null,null,null,null,null,null,null,null,null,null,null,null,null,null,null,0,"Status / Droogkamer extern , klant handelt zelf af , facturering ? / nog 1 stam acacia ",0,null,null,null,"",{"$f":"IF(E106=\"\",\"\",WEEKNUM(E106))","v":""}]
["180614_Berkhof ",null,"Eiken",null,null,"2018-12-01",null,null,null,null,null,null,null,null,null,"2018-12-10",0,"week 50 TERUGBELLEN WANNEER UIT DROOGKAMER ",0,null,null,null,"",{"$f":"IF(E107=\"\",\"\",WEEKNUM(E107))","v":""}]
["180632_houwelingen klaar ? ",null,null,null,null,null,null,null,null,null,null,null,null,null,null,null,0,"klaar ? Voor in zaagordner ",0,null,null,null,"",{"$f":"IF(E108=\"\",\"\",WEEKNUM(E108))","v":""}]
["180637_RHS",null,null,null,null,null,null,null,null,null,null,null,null,null,null,null,0,null,0,null,0.49,null,"",{"$f":"IF(E109=\"\",\"\",WEEKNUM(E109))","v":""}]
["180659_Wens ",null,null,null,null,"2018-11-15",null,"2018-12-17",null,"2018-12-18",null,null,null,null,"2018-12-24","2018-12-24",null,"restant , 3 regels drogen schaven ",0,null,null,null,"",{"$f":"IF(E110=\"\",\"\",WEEKNUM(E110))","v":""}]
["180981_Doorn ","Alan van Doorn ","grenen ",null,null,null,null,null,null,null,null,null,null,null,null,"2018-12-14",null,"na aanbetaling 50% ",0,null,null,null,"",{"$f":"IF(E111=\"\",\"\",WEEKNUM(E111))","v":""}]
[null,null,null,null,null,null,null,null,null,null,null,null,null,null,null,null,null,null,0,null,null,null,"",{"$f":"IF(E112=\"\",\"\",WEEKNUM(E112))","v":""}]
[null,null,null,null,null,null,null,null,null,null,null,null,null,null,null,null,null,null,0,null,null,null,"",{"$f":"IF(E113=\"\",\"\",WEEKNUM(E113))","v":""}]
[null,null,null,null,null,null,null,null,null,null,null,null,null,null,null,null,null,null,0,null,null,null,"",{"$f":"IF(E114=\"\",\"\",WEEKNUM(E114))","v":""}]
[null,null,null,null,null,null,null,null,null,null,null,null,null,null,null,null,null,null,0,null,null,null,"",{"$f":"IF(E115=\"\",\"\",WEEKNUM(E115))","v":""}]
[null,null,null,null,null,null,null,null,null,null,null,null,null,null,null,null,null,null,0,null,null,null,null,{"$f":"IF(E116=\"\",\"\",WEEKNUM(E116))","v":""}]
[null,null,null,null,null,null,null,null,null,null,null,null,null,null,null,null,null,null,0,null,null,null,null,{"$f":"IF(E117=\"\",\"\",WEEKNUM(E117))","v":""}]
[null,null,null,null,null,null,null,null,null,null,null,null,null,null,null,null,null,null,0,null,null,null,null,{"$f":"IF(E118=\"\",\"\",WEEKNUM(E118))","v":""}]
[null,null,null,null,null,null,null,null,null,null,null,null,null,null,null,null,null,null,0,null,null,null,null,{"$f":"IF(E119=\"\",\"\",WEEKNUM(E119))","v":""}]
[null,null,null,null,null,null,null,null,null,null,null,null,null,null,null,null,null,null,0,null,null,null,null,{"$f":"IF(E120=\"\",\"\",WEEKNUM(E120))","v":""}]
[null,null,null,null,null,null,null,null,null,null,null,null,null,null,null,null,null,null,0,null,null,null,null,{"$f":"IF(E121=\"\",\"\",WEEKNUM(E121))","v":""}]
[null,null,null,null,null,null,null,null,null,null,null,null,null,null,null,null,null,null,0,null,null,null,null,{"$f":"IF(E122=\"\",\"\",WEEKNUM(E122))","v":""}]
[null,null,null,null,null,null,null,null,null,null,null,null,null,null,null,null,null,null,0,null,null,null,null,{"$f":"IF(E123=\"\",\"\",WEEKNUM(E123))","v":""}]
[null,null,null,null,null,null,null,null,null,null,null,null,null,null,null,null,null,null,0,null,null,null,null,{"$f":"IF(E124=\"\",\"\",WEEKNUM(E124))","v":""}]
[null,null,null,null,null,null,null,null,null,null,null,null,null,null,null,null,null,null,0,null,null,null,null,{"$f":"IF(E125=\"\",\"\",WEEKNUM(E125))","v":""}]
[null,null,null,null,null,null,null,null,null,null,null,null,null,null,null,null,null,null,0,null,null,null,null,{"$f":"IF(E126=\"\",\"\",WEEKNUM(E126))","v":""}]
[null,null,null,null,null,null,null,null,null,null,null,null,null,null,null,null,null,null,0,null,null,null,null,{"$f":"IF(E127=\"\",\"\",WEEKNUM(E127))","v":""}]
[null,null,null,null,null,null,null,null,null,null,null,null,null,null,null,null,null,null,0,null,null,null,null,{"$f":"IF(E128=\"\",\"\",WEEKNUM(E128))","v":""}]
[null,null,null,null,null,null,null,null,null,null,null,null,null,null,null,null,null,null,0,null,null,null,null,{"$f":"IF(E129=\"\",\"\",WEEKNUM(E129))","v":""}]
[null,null,null,null,null,null,null,null,null,null,null,null,null,null,null,null,null,null,0,null,null,null,null,{"$f":"IF(E130=\"\",\"\",WEEKNUM(E130))","v":""}]
[null,null,null,null,null,null,null,null,null,null,null,null,null,null,null,null,null,null,0,null,null,null,null,1]
[null,null,null,null,null,null,null,null,null,null,null,null,null,null,null,null,null,null,0,null,null,null,null,{"$f":"IF(E132=\"\",\"\",WEEKNUM(E132))","v":""}]
[null,null,null,null,null,null,null,null,null,null,null,null,null,null,null,null,null,null,0,null,null,null,null,{"$f":"IF(E133=\"\",\"\",WEEKNUM(E133))","v":""}]
[null,null,null,null,null,null,null,null,null,null,null,null,null,null,null,null,null,null,0,null,null,null,null,{"$f":"IF(E134=\"\",\"\",WEEKNUM(E134))","v":""}]
[null,null,null,null,null,null,null,null,null,null,null,null,null,null,null,null,null,null,0,null,null,null,null,{"$f":"IF(E135=\"\",\"\",WEEKNUM(E135))","v":""}]
[null,null,null,null,null,null,null,null,null,null,null,null,null,null,null,null,null,null,0,null,null,null,null,{"$f":"IF(E136=\"\",\"\",WEEKNUM(E136))","v":""}]
[null,null,null,null,null,null,null,null,null,null,null,null,null,null,null,null,null,null,0,null,null,null,null,{"$f":"IF(E137=\"\",\"\",WEEKNUM(E137))","v":""}]
[null,null,null,null,null,null,null,null,null,null,null,null,null,null,null,null,null,null,0,null,null,null,null,{"$f":"IF(E138=\"\",\"\",WEEKNUM(E138))","v":""}]
[null,null,null,null,null,null,null,null,null,null,null,null,null,null,null,null,null,null,0]
[null,null,null,null,null,null,null,null,null,null,null,null,null,null,null,null,null,null,0]
[null,null,null,null,null,null,null,null,null,null,null,null,null,null,null,null,null,null,0,null,null,null,null,{"$f":"IF(E141=\"\",\"\",WEEKNUM(E141))","v":""}]
[null,null,null,null,null,null,null,null,null,null,null,null,null,null,null,null,null,null,0,null,null,null,null,{"$f":"IF(E142=\"\",\"\",WEEKNUM(E142))","v":""}]
[null,null,null,null,null,null,null,null,null,null,null,null,null,null,null,null,null,null,0,null,null,null,null,{"$f":"IF(E143=\"\",\"\",WEEKNUM(E143))","v":""}]
[null,null,null,null,null,null,null,null,null,null,null,null,null,null,null,null,null,null,0,null,null,null,null,{"$f":"IF(E144=\"\",\"\",WEEKNUM(E144))","v":""}]
[null,null,null,null,null,null,null,null,null,null,null,null,null,null,null,null,null,null,0,null,null,null,null,{"$f":"IF(E145=\"\",\"\",WEEKNUM(E145))","v":""}]
[null,null,null,null,null,null,null,null,null,null,null,null,null,null,null,null,null,null,null,null,null,null,null,{"$f":"IF(E146=\"\",\"\",WEEKNUM(E146))","v":""}]
[null,null,null,null,null,null,null,null,null,null,null,null,null,null,null,null,null,null,null,null,null,null,null,{"$f":"IF(E147=\"\",\"\",WEEKNUM(E147))","v":""}]
[null,null,null,null,null,null,null,null,null,null,null,null,null,null,null,null,null,null,null,null,null,null,null,{"$f":"IF(E148=\"\",\"\",WEEKNUM(E148))","v":""}]
[null,null,null,null,null,null,null,null,null,null,null,null,null,null,null,null,null,null,null,null,null,null,null,{"$f":"IF(E149=\"\",\"\",WEEKNUM(E149))","v":""}]
[null,null,null,null,null,null,null,null,null,null,null,null,null,null,null,null,null,null,null,null,null,null,null,{"$f":"IF(E150=\"\",\"\",WEEKNUM(E150))","v":""}]

{"sheet":"Diagram","index":1,"n_rows":101,"n_cols":39,"rows_kept":101,"cut":false,"hidden":false,"merged":[]}
[null,null,null,null,null,null,null,null,"Jaar 2019  Week02"]
[]
[]
[]
[]
[null,null,null,null,null,null,null,null,{"$f":"VALUE(RIGHT(JaarWeek,2))","v":2},{"$f":"VALUE(MID(JaarWeek,6,4))","v":2019},null,null,null,null,null,null,null,{"$f":"WEEKNUM(R24,21)","v":3},{"$f":"YEAR(S24)","v":2019},null,null,null,null,null,null,null,{"$f":"WEEKNUM(AA24,21)","v":4},{"$f":"YEAR(AA24)","v":2019},null,null,null,null,null,{"$f":"\"Opdrachten van \"&TEXT(DATE(YEAR(I24),1,1),\"dd-mmm\")&\" tot \"&TEXT(I24,\"dd-mmm\")","v":"Opdrachten van 01-jan tot 07-jan"},null,null,{"$f":"\"Opdrachten van \"&TEXT(AE24+1,\"dd-mmm\")&\" tot \"&TEXT(DATE(YEAR(I24),12,31),\"dd-mmm\")","v":"Opdrachten van 26-jan tot 31-dec"}]
[null,null,null,null,null,null,null,null,null,null,null,null,null,null,null,null,null,null,null,null,null,null,null,null,null,null,null,null,null,null,null,null,null,null,null,null,null,null,"m3"]
[null,null,null,null,null,null,8,null,null,null,null,null,null,null,null,8,null,null,null,null,null,null,null,null,8,null,null,null,null,null,null,null,null,"181001_Houwelingen","2019-01-04",null,"180916_Hig","2019-01-30",13.5]
[null,null,null,null,null,null,null,null,null,null,null,null,null,null,null,null,null,null,null,null,null,null,null,null,null,null,null,null,null,null,null,null,null,"180937_Andersbouwen ","2019-01-04",null,"180916_Hig","2019-01-29",8]
[null,null,null,null,null,null,7,null,null,null,null,null,null,null,null,7,null,null,null,null,null,null,null,null,7,null,null,null,null,null,null,null,null,"181008_Pol ","2019-01-03",null,"190006_Reus houtbouw ","2019-01-28",0.6]
[null,null,null,null,null,null,null,null,null,null,null,null,null,null,null,null,null,null,null,null,null,null,null,null,null,null,null,null,null,null,null,null,null,"180996_Kok bouwbedrijf ","2019-01-03",null,"180916_Hig","2019-01-28",4]
[null,null,null,null,null,null,6,null,null,null,null,null,null,null,null,6,null,null,null,null,null,null,null,null,6,null,null,null,null,null,null,null,null,"180996_Kok bouwbedrijf ","2019-01-03",null,null,null,0.5]
[null,null,null,null,null,null,null,null,null,null,null,null,null,null,null,null,null,null,null,null,null,null,null,null,null,null,null,null,null,null,null,null,null,"180975_Kokbouwbedrijf ","2019-01-03"]
[null,null,null,null,null,null,5,null,null,null,null,null,null,null,null,5,null,null,null,null,null,null,null,null,5,null,null,null,null,null,null,null,null,"180980_Berkhof ","2019-01-02"]
[]
[null,null,null,null,null,null,4,null,null,null,null,null,null,null,null,4,null,null,null,null,null,null,null,null,4]
[]
[null,null,null,null,null,null,3,null,null,null,null,null,null,null,null,3,null,null,null,null,null,null,null,null,3]
[]
[null,null,null,null,null,null,2,null,null,null,null,null,null,null,null,2,null,null,null,null,null,null,null,null,2]
[]
[null,null,null,null,null,null,1,null,null,null,null,null,null,null,null,1,null,null,null,null,null,null,null,null,1]
[{"$f":"IF(Planning!C25<>\"\",Planning!C25,\"\")","v":"Eiken"},{"$f":"IF(Planning!S25<>\"\",Planning!S25,\"\")","v":0.5},{"$f":"IF(Planning!E25<>\"\",Planning!E25,\"\")","v":"2019-01-04"},{"$f":"IF(Planning!A25<>\"\",Planning!A25,\"\")","v":"181001_Houwelingen"},{"$f":"IF(C23<>\"\",WEEKNUM(C23,21),\"\")","v":1}]
[{"$f":"IF(Planning!C26<>\"\",Planning!C26,\"\")","v":"Eiken"},{"$f":"IF(Planning!S26<>\"\",Planning!S26,\"\")","v":3},{"$f":"IF(Planning!E26<>\"\",Planning!E26,\"\")","v":"2019-01-04"},{"$f":"IF(Planning!A26<>\"\",Planning!A26,\"\")","v":"180937_Andersbouwen "},1,null,null,{"$f":" I24-1","v":"2019-01-06"},{"$f":"EersteDagVanWeekInJaar(weeknummer,J6)","v":"2019-01-07"},{"$f":"I24+1","v":"2019-01-08"},{"$f":"J24+1","v":"2019-01-09"},{"$f":"K24+1","v":"2019-01-10"},{"$f":"L24+1","v":"2019-01-11"},{"$f":"M24+1","v":"2019-01-12"},null,null,{"$f":"N24+1","v":"2019-01-13"},{"$f":"Q24+1","v":"2019-01-14"},"2019-01-15","2019-01-16","2019-01-17","2019-01-18","2019-01-19",null,null,{"$f":"W24+1","v":"2019-01-20"},{"$f":"Z24+1","v":"2019-01-21"},"2019-01-22","2019-01-23","2019-01-24","2019-01-25","2019-01-26"]
[{"$f":"IF(Planning!C27<>\"\",Planning!C27,\"\")","v":"Douglas"},{"$f":"IF(Planning!S27<>\"\",Planning!S27,\"\")","v":1.5},{"$f":"IF(Planning!E27<>\"\",Planning!E27,\"\")","v":"2019-01-03"},{"$f":"IF(Planning!A27<>\"\",Planning!A27,\"\")","v":"181008_Pol "},1,null,null,{"$f":"IFERROR(VLOOKUP(H24,feestdagenMetNaam,2,FALSE),H24)","v":"2019-01-06"},"2019-01-07","2019-01-08","2019-01-09","2019-01-10","2019-01-11","2019-01-12",null,null,{"$f":"IFERROR(VLOOKUP(Q24,feestdagenMetNaam,2,FALSE),Q24)","v":"2019-01-13"},"2019-01-14","2019-01-15","2019-01-16","2019-01-17","2019-01-18",{"$f":"IFERROR(VLOOKUP(W24,feestdagenMetNaam,2,FALSE),W24)","v":"2019-01-19"},null,null,{"$f":"IFERROR(VLOOKUP(Z24,feestdagenMetNaam,2,FALSE),Z24)","v":"2019-01-20"},"2019-01-21","2019-01-22","2019-01-23","2019-01-24","2019-01-25",{"$f":"IFERROR(VLOOKUP(AF24,feestdagenMetNaam,2,FALSE),AF24)","v":"2019-01-26"}]
[{"$f":"IF(Planning!C28<>\"\",Planning!C28,\"\")","v":"Douglas"},{"$f":"IF(Planning!S28<>\"\",Planning!S28,\"\")","v":0.5},{"$f":"IF(Planning!E28<>\"\",Planning!E28,\"\")","v":"2019-01-03"},{"$f":"IF(Planning!A28<>\"\",Planning!A28,\"\")","v":"180996_Kok bouwbedrijf "},1]
[{"$f":"IF(Planning!C29<>\"\",Planning!C29,\"\")","v":"Eiken"},{"$f":"IF(Planning!S29<>\"\",Planning!S29,\"\")","v":0.5},{"$f":"IF(Planning!E29<>\"\",Planning!E29,\"\")","v":"2019-01-03"},{"$f":"IF(Planning!A29<>\"\",Planning!A29,\"\")","v":"180996_Kok bouwbedrijf "},1]
[{"$f":"IF(Planning!C30<>\"\",Planning!C30,\"\")","v":"Douglas"},{"$f":"IF(Planning!S30<>\"\",Planning!S30,\"\")","v":0.5},{"$f":"IF(Planning!E30<>\"\",Planning!E30,\"\")","v":"2019-01-03"},{"$f":"IF(Planning!A30<>\"\",Planning!A30,\"\")","v":"180975_Kokbouwbedrijf "},1]
[{"$f":"IF(Planning!C31<>\"\",Planning!C31,\"\")","v":"Eiken"},{"$f":"IF(Planning!S31<>\"\",Planning!S31,\"\")","v":1},{"$f":"IF(Planning!E31<>\"\",Planning!E31,\"\")","v":"2019-01-02"},{"$f":"IF(Planning!A31<>\"\",Planning!A31,\"\")","v":"180980_Berkhof "},1]
[{"$f":"IF(Planning!C32<>\"\",Planning!C32,\"\")","v":"Douglas"},{"$f":"IF(Planning!S32<>\"\",Planning!S32,\"\")","v":4},{"$f":"IF(Planning!E32<>\"\",Planning!E32,\"\")","v":"2018-12-24"},{"$f":"IF(Planning!A32<>\"\",Planning!A32,\"\")","v":"180976_Pol "},52]
[{"$f":"IF(Planning!C33<>\"\",Planning!C33,\"\")","v":"Douglas"},{"$f":"IF(Planning!S33<>\"\",Planning!S33,\"\")","v":0},{"$f":"IF(Planning!E33<>\"\",Planning!E33,\"\")","v":"2018-12-17"},{"$f":"IF(Planning!A33<>\"\",Planning!A33,\"\")","v":"180955_Die"},51]
[{"$f":"IF(Planning!C34<>\"\",Planning!C34,\"\")","v":"douglas "},{"$f":"IF(Planning!S34<>\"\",Planning!S34,\"\")","v":0},{"$f":"IF(Planning!E34<>\"\",Planning!E34,\"\")","v":"2018-12-10"},{"$f":"IF(Planning!A34<>\"\",Planning!A34,\"\")","v":"180950_GerritJan'sHoeve "},50]
[{"$f":"IF(Planning!C35<>\"\",Planning!C35,\"\")","v":"eiken "},{"$f":"IF(Planning!S35<>\"\",Planning!S35,\"\")","v":0},{"$f":"IF(Planning!E35<>\"\",Planning!E35,\"\")","v":"2018-11-28"},{"$f":"IF(Planning!A35<>\"\",Planning!A35,\"\")","v":"180935_Boonen "},48]
[{"$f":"IF(Planning!C36<>\"\",Planning!C36,\"\")","v":"douglas "},{"$f":"IF(Planning!S36<>\"\",Planning!S36,\"\")","v":0},{"$f":"IF(Planning!E36<>\"\",Planning!E36,\"\")","v":"2018-11-28"},{"$f":"IF(Planning!A36<>\"\",Planning!A36,\"\")","v":"180936_Roordink "},48]
[{"$f":"IF(Planning!C37<>\"\",Planning!C37,\"\")","v":"eiken "},{"$f":"IF(Planning!S37<>\"\",Planning!S37,\"\")","v":0},{"$f":"IF(Planning!E37<>\"\",Planning!E37,\"\")","v":"2018-11-05"},{"$f":"IF(Planning!A37<>\"\",Planning!A37,\"\")","v":"180647_roelofsen "},{"$f":"IF(C35<>\"\",WEEKNUM(C35,21),\"\")","v":45}]
[{"$f":"IF(Planning!C38<>\"\",Planning!C38,\"\")","v":"eiken"},{"$f":"IF(Planning!S38<>\"\",Planning!S38,\"\")","v":0},{"$f":"IF(Planning!E38<>\"\",Planning!E38,\"\")","v":"2018-09-27"},{"$f":"IF(Planning!A38<>\"\",Planning!A38,\"\")","v":"180618_houwelingen"},39,null,null,null,null,null,null,null,null,null,null,null,"Vragen;"]
[{"$f":"IF(Planning!C39<>\"\",Planning!C39,\"\")","v":"douglas"},{"$f":"IF(Planning!S39<>\"\",Planning!S39,\"\")","v":0},{"$f":"IF(Planning!E39<>\"\",Planning!E39,\"\")","v":"2018-09-27"},{"$f":"IF(Planning!A39<>\"\",Planning!A39,\"\")","v":"180582_pijnenburg"},39]
[{"$f":"IF(Planning!C40<>\"\",Planning!C40,\"\")","v":"eiken"},{"$f":"IF(Planning!S40<>\"\",Planning!S40,\"\")","v":0},{"$f":"IF(Planning!E40<>\"\",Planning!E40,\"\")","v":"2018-09-26"},{"$f":"IF(Planning!A40<>\"\",Planning!A40,\"\")","v":"180585_houwelingen"},39]
[{"$f":"IF(Planning!C41<>\"\",Planning!C41,\"\")","v":"douglas"},{"$f":"IF(Planning!S41<>\"\",Planning!S41,\"\")","v":0},{"$f":"IF(Planning!E41<>\"\",Planning!E41,\"\")","v":"2018-09-26"},{"$f":"IF(Planning!#REF!<>\"\",Planning!#REF!,\"\")","v":{"$error":"#REF!"}},39]
[{"$f":"IF(Planning!C42<>\"\",Planning!C42,\"\")","v":"douglas"},{"$f":"IF(Planning!S42<>\"\",Planning!S42,\"\")","v":0},{"$f":"IF(Planning!E42<>\"\",Planning!E42,\"\")","v":"2018-09-25"},{"$f":"IF(Planning!A41<>\"\",Planning!A41,\"\")","v":"180576_nubuiten"},39]
[{"$f":"IF(Planning!C43<>\"\",Planning!C43,\"\")","v":"douglas"},{"$f":"IF(Planning!S43<>\"\",Planning!S43,\"\")","v":0},{"$f":"IF(Planning!E43<>\"\",Planning!E43,\"\")","v":"2018-09-24"},{"$f":"IF(Planning!A43<>\"\",Planning!A43,\"\")","v":"180546_allround"},39]
[{"$f":"IF(Planning!C44<>\"\",Planning!C44,\"\")","v":"eiken"},{"$f":"IF(Planning!S44<>\"\",Planning!S44,\"\")","v":0},{"$f":"IF(Planning!E44<>\"\",Planning!E44,\"\")","v":"2018-09-21"},{"$f":"IF(Planning!A44<>\"\",Planning!A44,\"\")","v":"180572_heko"},38]
[{"$f":"IF(Planning!C45<>\"\",Planning!C45,\"\")","v":"douglas"},{"$f":"IF(Planning!S45<>\"\",Planning!S45,\"\")","v":0},{"$f":"IF(Planning!E45<>\"\",Planning!E45,\"\")","v":"2018-09-21"},{"$f":"IF(Planning!A45<>\"\",Planning!A45,\"\")","v":"180566_pol"},38]
[{"$f":"IF(Planning!C46<>\"\",Planning!C46,\"\")","v":"eiken"},{"$f":"IF(Planning!S46<>\"\",Planning!S46,\"\")","v":0},{"$f":"IF(Planning!E46<>\"\",Planning!E46,\"\")","v":"2018-09-21"},{"$f":"IF(Planning!A46<>\"\",Planning!A46,\"\")","v":"180558_roelofsen"},38]
[{"$f":"IF(Planning!C47<>\"\",Planning!C47,\"\")","v":"eiken"},{"$f":"IF(Planning!S47<>\"\",Planning!S47,\"\")","v":0},{"$f":"IF(Planning!E47<>\"\",Planning!E47,\"\")","v":"2018-09-20"},{"$f":"IF(Planning!A47<>\"\",Planning!A47,\"\")","v":"180556_haan"},38]
[{"$f":"IF(Planning!C48<>\"\",Planning!C48,\"\")","v":"douglas"},{"$f":"IF(Planning!S48<>\"\",Planning!S48,\"\")","v":0},{"$f":"IF(Planning!E48<>\"\",Planning!E48,\"\")","v":"2018-09-20"},{"$f":"IF(Planning!A48<>\"\",Planning!A48,\"\")","v":"180517_budding"},38]
[{"$f":"IF(Planning!C49<>\"\",Planning!C49,\"\")","v":"douglas"},{"$f":"IF(Planning!S49<>\"\",Planning!S49,\"\")","v":0},{"$f":"IF(Planning!E49<>\"\",Planning!E49,\"\")","v":"2018-09-19"},{"$f":"IF(Planning!A49<>\"\",Planning!A49,\"\")","v":"180520_lamarti"},38]
[{"$f":"IF(Planning!C50<>\"\",Planning!C50,\"\")","v":"Douglas"},{"$f":"IF(Planning!S50<>\"\",Planning!S50,\"\")","v":4},{"$f":"IF(Planning!E50<>\"\",Planning!E50,\"\")","v":"2018-09-18"},{"$f":"IF(Planning!A50<>\"\",Planning!A50,\"\")","v":"180564_ebh"},38]
[{"$f":"IF(Planning!C51<>\"\",Planning!C51,\"\")","v":"douglas"},{"$f":"IF(Planning!S51<>\"\",Planning!S51,\"\")","v":0},{"$f":"IF(Planning!E51<>\"\",Planning!E51,\"\")","v":"2018-09-18"},{"$f":"IF(Planning!A51<>\"\",Planning!A51,\"\")","v":"180542_aha"},38]
[{"$f":"IF(Planning!C52<>\"\",Planning!C52,\"\")","v":"douglas"},{"$f":"IF(Planning!S52<>\"\",Planning!S52,\"\")","v":0},{"$f":"IF(Planning!E52<>\"\",Planning!E52,\"\")","v":"2018-09-18"},{"$f":"IF(Planning!A52<>\"\",Planning!A52,\"\")","v":"180543_reemst"},38]
[{"$f":"IF(Planning!C53<>\"\",Planning!C53,\"\")","v":"douglas"},{"$f":"IF(Planning!S53<>\"\",Planning!S53,\"\")","v":0},{"$f":"IF(Planning!E53<>\"\",Planning!E53,\"\")","v":"2018-09-17"},{"$f":"IF(Planning!A53<>\"\",Planning!A53,\"\")","v":"180541_karbouw"},38]
[{"$f":"IF(Planning!C54<>\"\",Planning!C54,\"\")","v":"eiken"},{"$f":"IF(Planning!S54<>\"\",Planning!S54,\"\")","v":0},{"$f":"IF(Planning!E54<>\"\",Planning!E54,\"\")","v":"2018-09-17"},{"$f":"IF(Planning!A54<>\"\",Planning!A54,\"\")","v":"180533_pontmeyer"},38]
[{"$f":"IF(Planning!C55<>\"\",Planning!C55,\"\")","v":"douglas"},{"$f":"IF(Planning!S55<>\"\",Planning!S55,\"\")","v":0},{"$f":"IF(Planning!E55<>\"\",Planning!E55,\"\")","v":"2018-09-17"},{"$f":"IF(Planning!A55<>\"\",Planning!A55,\"\")","v":"180552_jongeneel"},38]
[{"$f":"IF(Planning!C56<>\"\",Planning!C56,\"\")","v":"douglas"},{"$f":"IF(Planning!S56<>\"\",Planning!S56,\"\")","v":0},{"$f":"IF(Planning!E56<>\"\",Planning!E56,\"\")","v":"2018-09-17"},{"$f":"IF(Planning!A56<>\"\",Planning!A56,\"\")","v":"180521_nieboer"},38]
[{"$f":"IF(Planning!C57<>\"\",Planning!C57,\"\")","v":"douglas"},{"$f":"IF(Planning!S57<>\"\",Planning!S57,\"\")","v":0},{"$f":"IF(Planning!E57<>\"\",Planning!E57,\"\")","v":"2018-09-17"},{"$f":"IF(Planning!A57<>\"\",Planning!A57,\"\")","v":"180507_klein"},38]
[{"$f":"IF(Planning!C58<>\"\",Planning!C58,\"\")","v":"eiken"},{"$f":"IF(Planning!S58<>\"\",Planning!S58,\"\")","v":0},{"$f":"IF(Planning!E58<>\"\",Planning!E58,\"\")","v":"2018-09-13"},{"$f":"IF(Planning!A58<>\"\",Planning!A58,\"\")","v":"180515_pol"},37]
[{"$f":"IF(Planning!C59<>\"\",Planning!C59,\"\")","v":"douglas"},{"$f":"IF(Planning!S59<>\"\",Planning!S59,\"\")","v":0},{"$f":"IF(Planning!E59<>\"\",Planning!E59,\"\")","v":"2018-09-13"},{"$f":"IF(Planning!A59<>\"\",Planning!A59,\"\")","v":"180504_groot"},37]
[{"$f":"IF(Planning!C60<>\"\",Planning!C60,\"\")","v":"Douglas"},{"$f":"IF(Planning!S60<>\"\",Planning!S60,\"\")","v":0},{"$f":"IF(Planning!E60<>\"\",Planning!E60,\"\")","v":"2018-09-12"},{"$f":"IF(Planning!A60<>\"\",Planning!A60,\"\")","v":"180491_fetim"},37]
[{"$f":"IF(Planning!C61<>\"\",Planning!C61,\"\")","v":"douglas"},{"$f":"IF(Planning!S61<>\"\",Planning!S61,\"\")","v":0},{"$f":"IF(Planning!E61<>\"\",Planning!E61,\"\")","v":"2018-09-10"},{"$f":"IF(Planning!A61<>\"\",Planning!A61,\"\")","v":"180519_schuit"},37]
[{"$f":"IF(Planning!C62<>\"\",Planning!C62,\"\")","v":"douglas"},{"$f":"IF(Planning!S62<>\"\",Planning!S62,\"\")","v":0},{"$f":"IF(Planning!E62<>\"\",Planning!E62,\"\")","v":"2018-09-10"},{"$f":"IF(Planning!A62<>\"\",Planning!A62,\"\")","v":"180484_groot"},37]
[{"$f":"IF(Planning!C63<>\"\",Planning!C63,\"\")","v":"douglas"},{"$f":"IF(Planning!S63<>\"\",Planning!S63,\"\")","v":0},{"$f":"IF(Planning!E63<>\"\",Planning!E63,\"\")","v":"2018-09-07"},{"$f":"IF(Planning!A63<>\"\",Planning!A63,\"\")","v":"180525_hard"},36]
[{"$f":"IF(Planning!C64<>\"\",Planning!C64,\"\")","v":"eiken"},{"$f":"IF(Planning!S64<>\"\",Planning!S64,\"\")","v":0},{"$f":"IF(Planning!E64<>\"\",Planning!E64,\"\")","v":"2018-09-07"},{"$f":"IF(Planning!A64<>\"\",Planning!A64,\"\")","v":"180476_arens"},36]
[{"$f":"IF(Planning!C65<>\"\",Planning!C65,\"\")","v":"eiken"},{"$f":"IF(Planning!S65<>\"\",Planning!S65,\"\")","v":0},{"$f":"IF(Planning!E65<>\"\",Planning!E65,\"\")","v":"2018-09-05"},{"$f":"IF(Planning!A65<>\"\",Planning!A65,\"\")","v":"180471_snel"},36]
[{"$f":"IF(Planning!C66<>\"\",Planning!C66,\"\")","v":"douglas"},{"$f":"IF(Planning!S66<>\"\",Planning!S66,\"\")","v":0},{"$f":"IF(Planning!E66<>\"\",Planning!E66,\"\")","v":"2018-09-04"},{"$f":"IF(Planning!A66<>\"\",Planning!A66,\"\")","v":"180479_hig"},36]
[{"$f":"IF(Planning!C67<>\"\",Planning!C67,\"\")","v":"eiken"},{"$f":"IF(Planning!S67<>\"\",Planning!S67,\"\")","v":0},{"$f":"IF(Planning!E67<>\"\",Planning!E67,\"\")","v":"2018-09-04"},{"$f":"IF(Planning!A67<>\"\",Planning!A67,\"\")","v":"180472_houwelingen"},36]
[{"$f":"IF(Planning!C68<>\"\",Planning!C68,\"\")","v":"douglas"},{"$f":"IF(Planning!S68<>\"\",Planning!S68,\"\")","v":0},{"$f":"IF(Planning!E68<>\"\",Planning!E68,\"\")","v":"2018-09-03"},{"$f":"IF(Planning!A68<>\"\",Planning!A68,\"\")","v":"180501_legemaat"},36]
[{"$f":"IF(Planning!C69<>\"\",Planning!C69,\"\")","v":"Eiken"},{"$f":"IF(Planning!S69<>\"\",Planning!S69,\"\")","v":0},{"$f":"IF(Planning!E69<>\"\",Planning!E69,\"\")","v":"2018-08-31"},{"$f":"IF(Planning!A69<>\"\",Planning!A69,\"\")","v":"180482_opijnen"},{"$f":"IF(C67<>\"\",WEEKNUM(C67,21),\"\")","v":35}]
[{"$f":"IF(Planning!C70<>\"\",Planning!C70,\"\")","v":"douglas/eiken"},{"$f":"IF(Planning!S70<>\"\",Planning!S70,\"\")","v":0},{"$f":"IF(Planning!E70<>\"\",Planning!E70,\"\")","v":"2018-08-29"},{"$f":"IF(Planning!A70<>\"\",Planning!A70,\"\")","v":"180427_heuvel"},35]
[{"$f":"IF(Planning!C71<>\"\",Planning!C71,\"\")","v":"douglas"},{"$f":"IF(Planning!S71<>\"\",Planning!S71,\"\")","v":0},{"$f":"IF(Planning!E71<>\"\",Planning!E71,\"\")","v":"2018-08-24"},{"$f":"IF(Planning!A71<>\"\",Planning!A71,\"\")","v":"180456_melissen"},34]
[{"$f":"IF(Planning!C72<>\"\",Planning!C72,\"\")","v":"Douglas"},{"$f":"IF(Planning!S72<>\"\",Planning!S72,\"\")","v":0},{"$f":"IF(Planning!E72<>\"\",Planning!E72,\"\")","v":"2018-08-22"},{"$f":"IF(Planning!A72<>\"\",Planning!A72,\"\")","v":"180443_veldhuizen"},34]
[{"$f":"IF(Planning!C73<>\"\",Planning!C73,\"\")","v":"eiken"},{"$f":"IF(Planning!S73<>\"\",Planning!S73,\"\")","v":0},{"$f":"IF(Planning!E73<>\"\",Planning!E73,\"\")","v":"2018-08-21"},{"$f":"IF(Planning!A73<>\"\",Planning!A73,\"\")","v":"180463_brandhof"},34]
[{"$f":"IF(Planning!C74<>\"\",Planning!C74,\"\")","v":"douglas"},{"$f":"IF(Planning!S74<>\"\",Planning!S74,\"\")","v":0.5},{"$f":"IF(Planning!E74<>\"\",Planning!E74,\"\")","v":"2018-08-21"},{"$f":"IF(Planning!A74<>\"\",Planning!A74,\"\")","v":"180459_kraai"},34]
[{"$f":"IF(Planning!C75<>\"\",Planning!C75,\"\")","v":"eiken"},{"$f":"IF(Planning!S75<>\"\",Planning!S75,\"\")","v":0},{"$f":"IF(Planning!E75<>\"\",Planning!E75,\"\")","v":"2018-08-21"},{"$f":"IF(Planning!A75<>\"\",Planning!A75,\"\")","v":"180447_steeg"},34]
[{"$f":"IF(Planning!C76<>\"\",Planning!C76,\"\")","v":"Eiken"},{"$f":"IF(Planning!S76<>\"\",Planning!S76,\"\")","v":0},{"$f":"IF(Planning!E76<>\"\",Planning!E76,\"\")","v":"2018-08-20"},{"$f":"IF(Planning!A76<>\"\",Planning!A76,\"\")","v":"170710_natuurmonumenten"},34]
[{"$f":"IF(Planning!C77<>\"\",Planning!C77,\"\")","v":"Douglas"},{"$f":"IF(Planning!S77<>\"\",Planning!S77,\"\")","v":0},{"$f":"IF(Planning!E77<>\"\",Planning!E77,\"\")","v":"2018-08-16"},{"$f":"IF(Planning!A77<>\"\",Planning!A77,\"\")","v":"180450_Wilpenveen"},33]
[{"$f":"IF(Planning!C78<>\"\",Planning!C78,\"\")","v":"douglas"},{"$f":"IF(Planning!S78<>\"\",Planning!S78,\"\")","v":0},{"$f":"IF(Planning!E78<>\"\",Planning!E78,\"\")","v":"2018-08-16"},{"$f":"IF(Planning!A78<>\"\",Planning!A78,\"\")","v":"180453_peters"},33]
[{"$f":"IF(Planning!C79<>\"\",Planning!C79,\"\")","v":"Eiken"},{"$f":"IF(Planning!S79<>\"\",Planning!S79,\"\")","v":0},{"$f":"IF(Planning!E79<>\"\",Planning!E79,\"\")","v":"2018-08-16"},{"$f":"IF(Planning!A79<>\"\",Planning!A79,\"\")","v":"180451_baalman"},33]
[{"$f":"IF(Planning!C80<>\"\",Planning!C80,\"\")","v":"anders"},{"$f":"IF(Planning!S80<>\"\",Planning!S80,\"\")","v":0},{"$f":"IF(Planning!E80<>\"\",Planning!E80,\"\")","v":"2018-08-16"},{"$f":"IF(Planning!A80<>\"\",Planning!A80,\"\")","v":"180432_rooijen"},33]
[{"$f":"IF(Planning!C81<>\"\",Planning!C81,\"\")","v":"Douglas"},{"$f":"IF(Planning!S81<>\"\",Planning!S81,\"\")","v":0},{"$f":"IF(Planning!E81<>\"\",Planning!E81,\"\")","v":"2018-08-15"},{"$f":"IF(Planning!A81<>\"\",Planning!A81,\"\")","v":"180446_kempen"},33]
[{"$f":"IF(Planning!C82<>\"\",Planning!C82,\"\")","v":"Larix"},{"$f":"IF(Planning!S82<>\"\",Planning!S82,\"\")","v":0},{"$f":"IF(Planning!E82<>\"\",Planning!E82,\"\")","v":"2018-08-09"},{"$f":"IF(Planning!A82<>\"\",Planning!A82,\"\")","v":"180385_natuurmonumenten"},32]
[{"$f":"IF(Planning!C83<>\"\",Planning!C83,\"\")","v":"Douglas"},{"$f":"IF(Planning!S83<>\"\",Planning!S83,\"\")","v":0},{"$f":"IF(Planning!E83<>\"\",Planning!E83,\"\")","v":"2018-08-03"},{"$f":"IF(Planning!A83<>\"\",Planning!A83,\"\")","v":"180434_reijersen"},31]
[{"$f":"IF(Planning!C84<>\"\",Planning!C84,\"\")","v":"eiken"},{"$f":"IF(Planning!S84<>\"\",Planning!S84,\"\")","v":0},{"$f":"IF(Planning!E84<>\"\",Planning!E84,\"\")","v":"2018-07-26"},{"$f":"IF(Planning!A84<>\"\",Planning!A84,\"\")","v":"180414_rusch"},30]
[{"$f":"IF(Planning!C85<>\"\",Planning!C85,\"\")","v":"eiken"},{"$f":"IF(Planning!S85<>\"\",Planning!S85,\"\")","v":0},{"$f":"IF(Planning!E85<>\"\",Planning!E85,\"\")","v":"2018-07-25"},{"$f":"IF(Planning!A85<>\"\",Planning!A85,\"\")","v":"180410_arens"},30]
[{"$f":"IF(Planning!C86<>\"\",Planning!C86,\"\")","v":"Iepen"},{"$f":"IF(Planning!S86<>\"\",Planning!S86,\"\")","v":0},{"$f":"IF(Planning!E86<>\"\",Planning!E86,\"\")","v":"2018-07-25"},{"$f":"IF(Planning!A86<>\"\",Planning!A86,\"\")","v":"180383_werner"},30]
[{"$f":"IF(Planning!C87<>\"\",Planning!C87,\"\")","v":"Eiken"},{"$f":"IF(Planning!S87<>\"\",Planning!S87,\"\")","v":0},{"$f":"IF(Planning!E87<>\"\",Planning!E87,\"\")","v":"2018-07-16"},{"$f":"IF(Planning!A87<>\"\",Planning!A87,\"\")","v":"180388_zwart"},29]
[{"$f":"IF(Planning!C88<>\"\",Planning!C88,\"\")","v":"Douglas"},{"$f":"IF(Planning!S88<>\"\",Planning!S88,\"\")","v":0},{"$f":"IF(Planning!E88<>\"\",Planning!E88,\"\")","v":"2018-07-16"},{"$f":"IF(Planning!A88<>\"\",Planning!A88,\"\")","v":"180389_grift"},29]
[{"$f":"IF(Planning!C89<>\"\",Planning!C89,\"\")","v":"Eiken"},{"$f":"IF(Planning!S89<>\"\",Planning!S89,\"\")","v":0},{"$f":"IF(Planning!E89<>\"\",Planning!E89,\"\")","v":"2018-07-09"},{"$f":"IF(Planning!A89<>\"\",Planning!A89,\"\")","v":"180379_veldhuizen"},28]
[{"$f":"IF(Planning!C90<>\"\",Planning!C90,\"\")","v":"douglas"},{"$f":"IF(Planning!S90<>\"\",Planning!S90,\"\")","v":0},{"$f":"IF(Planning!E90<>\"\",Planning!E90,\"\")","v":"2018-07-06"},{"$f":"IF(Planning!A90<>\"\",Planning!A90,\"\")","v":"180323_prattenburg"},27]
[{"$f":"IF(Planning!C91<>\"\",Planning!C91,\"\")","v":"Eiken"},{"$f":"IF(Planning!S91<>\"\",Planning!S91,\"\")","v":0},{"$f":"IF(Planning!E91<>\"\",Planning!E91,\"\")","v":"2018-06-28"},{"$f":"IF(Planning!A91<>\"\",Planning!A91,\"\")","v":"180363_twente"},26]
[{"$f":"IF(Planning!C92<>\"\",Planning!C92,\"\")","v":"Eiken"},{"$f":"IF(Planning!S92<>\"\",Planning!S92,\"\")","v":0},{"$f":"IF(Planning!E92<>\"\",Planning!E92,\"\")","v":"2018-06-27"},{"$f":"IF(Planning!A92<>\"\",Planning!A92,\"\")","v":"180345_davelaar"},26]
[{"$f":"IF(Planning!C93<>\"\",Planning!C93,\"\")","v":"Larix"},{"$f":"IF(Planning!S93<>\"\",Planning!S93,\"\")","v":0},{"$f":"IF(Planning!E93<>\"\",Planning!E93,\"\")","v":"2018-06-25"},{"$f":"IF(Planning!A93<>\"\",Planning!A93,\"\")","v":"180352_noesk"},26]
[{"$f":"IF(Planning!C94<>\"\",Planning!C94,\"\")","v":"Eiken"},{"$f":"IF(Planning!S94<>\"\",Planning!S94,\"\")","v":0},{"$f":"IF(Planning!E94<>\"\",Planning!E94,\"\")","v":"2018-06-25"},{"$f":"IF(Planning!A94<>\"\",Planning!A94,\"\")","v":"180274_brink"},26]
[{"$f":"IF(Planning!C95<>\"\",Planning!C95,\"\")","v":"Douglas"},{"$f":"IF(Planning!S95<>\"\",Planning!S95,\"\")","v":0},{"$f":"IF(Planning!E95<>\"\",Planning!E95,\"\")","v":"2018-06-22"},{"$f":"IF(Planning!A95<>\"\",Planning!A95,\"\")","v":"180340_hogendoorn"},25]
[{"$f":"IF(Planning!C96<>\"\",Planning!C96,\"\")","v":"Douglas"},{"$f":"IF(Planning!S96<>\"\",Planning!S96,\"\")","v":0},{"$f":"IF(Planning!E96<>\"\",Planning!E96,\"\")","v":"2018-06-21"},{"$f":"IF(Planning!A96<>\"\",Planning!A96,\"\")","v":"180331_wolfswinkel"},25]
[{"$f":"IF(Planning!C97<>\"\",Planning!C97,\"\")","v":"Eiken"},{"$f":"IF(Planning!S97<>\"\",Planning!S97,\"\")","v":0},{"$f":"IF(Planning!E97<>\"\",Planning!E97,\"\")","v":"2018-05-23"},{"$f":"IF(Planning!A97<>\"\",Planning!A97,\"\")","v":"180229_vries"},21]
[{"$f":"IF(Planning!C98<>\"\",Planning!C98,\"\")","v":"Douglas"},{"$f":"IF(Planning!S98<>\"\",Planning!S98,\"\")","v":0},{"$f":"IF(Planning!E98<>\"\",Planning!E98,\"\")","v":"2018-05-15"},{"$f":"IF(Planning!A98<>\"\",Planning!A98,\"\")","v":"180216_design"},20]
[{"$f":"IF(Planning!C99<>\"\",Planning!C99,\"\")","v":"Eiken"},{"$f":"IF(Planning!S99<>\"\",Planning!S99,\"\")","v":0},{"$f":"IF(Planning!E99<>\"\",Planning!E99,\"\")","v":"2018-05-04"},{"$f":"IF(Planning!A99<>\"\",Planning!A99,\"\")","v":"180126_valleihorstee"},18]
[{"$f":"IF(Planning!C100<>\"\",Planning!C100,\"\")","v":"douglas"},{"$f":"IF(Planning!S100<>\"\",Planning!S100,\"\")","v":0},{"$f":"IF(Planning!E100<>\"\",Planning!E100,\"\")","v":""},{"$f":"IF(Planning!A100<>\"\",Planning!A100,\"\")","v":"180510_pol"},""]
[{"$f":"IF(Planning!C101<>\"\",Planning!C101,\"\")","v":"Douglas"},{"$f":"IF(Planning!S101<>\"\",Planning!S101,\"\")","v":0},{"$f":"IF(Planning!E101<>\"\",Planning!E101,\"\")","v":""},{"$f":"IF(Planning!A101<>\"\",Planning!A101,\"\")","v":"180349_pol"},""]
[{"$f":"IF(Planning!C102<>\"\",Planning!C102,\"\")","v":"kastanje"},{"$f":"IF(Planning!S102<>\"\",Planning!S102,\"\")","v":0},{"$f":"IF(Planning!E102<>\"\",Planning!E102,\"\")","v":""},{"$f":"IF(Planning!A102<>\"\",Planning!A102,\"\")","v":"180333_Romijn"},""]
[{"$f":"IF(Planning!C103<>\"\",Planning!C103,\"\")","v":"Essen"},{"$f":"IF(Planning!S103<>\"\",Planning!S103,\"\")","v":0},{"$f":"IF(Planning!E103<>\"\",Planning!E103,\"\")","v":""},{"$f":"IF(Planning!A103<>\"\",Planning!A103,\"\")","v":"180155_hard&zachthout"},""]

{"sheet":"feestdagen ed","index":2,"n_rows":25,"n_cols":2,"rows_kept":25,"cut":false,"hidden":false,"merged":[]}
[0.5]
[]
[8]
[]
["Eiken"]
["Loonzagen"]
["Douglas"]
["Anders"]
[]
["werkdagen             ma di wo do  vr za  zo  ","alleen werkdagen zichtbaar"]
["0000011",true]
[]
["feestdagen:"]
[{"$f":"DATE(JaarCel,1,1)","v":"2019-01-01"},"Nieuwjaarsdag"]
[{"$f":"A16-2","v":"2019-04-19"},"Goede vrijdag"]
[{"$f":"Pasen(JaarCel)","v":"2019-04-21"},"1e Paasdag"]
[{"$f":"A16+1","v":"2019-04-22"},"2e Paasdag"]
[{"$f":"IF(WEEKDAY( DATE(JaarCel,4,27),1)=1,DATE(JaarCel,4,26),DATE(JaarCel,4,27))","v":"2019-04-27"},"Koningsdag"]
[{"$f":"DATE(JaarCel,5,5)","v":"2019-05-05"},"Bevrijdingsdag"]
[{"$f":"A16+39","v":"2019-05-30"},"Hemelvaartsdag"]
[{"$f":"A16+49","v":"2019-06-09"},"1e Pinksterdag"]
[{"$f":"A21+1","v":"2019-06-10"},"2e Pinksterdag"]
[{"$f":"DATE(JaarCel,12,25)","v":"2019-12-25"},"1e Kersdag"]
[{"$f":"A23+1","v":"2019-12-26"},"2e Kersdag"]
[{"$f":"DATE(JaarCel+1,1,1)","v":"2020-01-01"},"Nieuwjaarsdag"]

{"sheet":"aanvragen","index":3,"n_rows":431,"n_cols":4,"rows_kept":431,"cut":false,"hidden":false,"merged":[]}
["Offerte-/ordernummer","Klant","opmerking","product"]
[180240,"ebh"]
[180241,"Moragh"]
[180242,"Bettink"]
[180243,"EBH"]
[180244,"Fetim","bundel planken is 100 stuks"]
[180245,"Kraats"]
[180246,"top-timmerwerk"]
[180247,"veldhuizen"]
[180248,"Vitesse"]
[180249,"van de pol"]
[180250,"van de pol",null,"eiken"]
[180251,"Rennes"]
[180252,"snel"]
[180253,"tiel",null,"douglas"]
[180254,"koudijs",null,"douglas"]
[180255,"bouwvoordeel"]
[180256,"slijkhuis",null,"douglas zweeds rabat"]
[180257,"pol",null,"eiken"]
[180258,"potkamp",null,"douglas  "]
[180259,"pol",null,"douglas"]
[180260,"buurjongens",null,"douglas"]
[180261,"steeg",null,"douglas"]
[180262,"ebh",null,"eiken"]
[180263,"berkhof",null,"eiken"]
[180264,"ebh",null,"douglas"]
[180265,"dmpt",null,"eiken"]
[180266,"wesselshoek",null,"eiken"]
[180267,"design",null,"douglas"]
[180268,"munt",null,"eiken"]
[180269,"pontmeyer",null,"larix"]
[180270,"breehuis",null,"douglas"]
[180271,"snel",null,"eiken"]
[180272,"lodder",null,"eiken"]
[180273,"verbeek",null,"douglas"]
[180274,"brink",null,"douglas"]
[180275,"pol",null,"eiken"]
[180276,"rhs",null,"eiken"]
[180277,"rhs",null,"vuren"]
[180278,"mulder",null,"eiken"]
[180279,"pol",null,"douglas"]
[180280,"kok",null,"eiken"]
[180281,"wood",null,"douglas"]
[180282,"pontmeyer",null,"douglas"]
[180283,"lamarti",null,"douglas"]
[180284,"harten",null,"eiken"]
[180285,"berg",null,"douglas"]
[180286,"blankespoor",null,"douglas"]
[180287,"jongeneel",null,"douglas"]
[180288,"maanen",null,"douglas"]
[180289,"heuvel",null,"douglas"]
[180290,"wens&co",null,"Douglas"]
[180291,"roelofsen",null,"eiken"]
[180292,"ebh",null,"eiken"]
[180293,"ebh",null,"eiken"]
[180294,"rhs",null,"douglas"]
[180295,"rhs",null,"douglas"]
[180296,"schuit",null,"douglas"]
[180297,"hora ",null,"douglas"]
[180298,"angela",null,"eiken"]
[180299,"barutcu",null,"douglas"]
[180300,"jack",null,"douglas"]
[180301,"kreeft",null,"douglas / eiken"]
[180302,"pol",null,"douglas"]
[180303,"anders",null,"douglas"]
[180304,"multi",null,"douglas"]
[180305,"ebh"]
[180306,"vries",null,"douglas"]
[180307,"heko",null,"eiken"]
[180308,"hulshof",null,"douglas"]
[180309,"soetendaal",null,"douglas"]
[180310,"berg",null,"douglas"]
[180311,"rhs",null,"eiken"]
[180312,"centrop",null,"douglas"]
[180313,"bettink",null,"eiken"]
[180314,"pol",null,"douglas"]
[180315,"noesk",null,"douglas"]
[180316,"bloed",null,"douglas"]
[180317,"dekker",null,"douglas"]
[180318,"potkamp",null,"douglas"]
[180319,"hacom",null,"douglas"]
[180320,"breehuis",null,"douglas"]
[180321,"bouwheer",null,"eiken"]
[180322,"slijkhuis",null,"douglas"]
[180323,"prattenburg",null,"loonzagen"]
[180324,"schuit",null,"douglas"]
[180325,"bettink ",null,"douglas"]
[180326,"beverage",null,"douglas"]
[180327,"lahuis","FB","eiken"]
[180328,"lahuis","VG","eiken"]
[180329,"houwelingen",null,"eiken"]
[180330,"ambacht","c24","douglas "]
[180331,"wolfswinkel",null,"douglas"]
[180332,"hooijer",null,"douglas"]
[180333,"romijn",null,"kastanje"]
[180334,"reijersen",null,"douglas"]
[180335,"strijbos",null,"douglas"]
[180336,"kesteren",null,"douglas"]
[180337,"jack",null,"douglas"]
[180338,"houwelingen",null,"eiken"]
[180339,"roelofsen",null,"eiken"]
[180340,"hogendoorn",null,"douglas"]
[180341,"centrop",null,"douglas"]
[180342,"houwelingen","fedor, geschilt","douglas"]
[180343,"houwelingen","jeremy","eiken"]
[180344,"pol",null,"eiken"]
[180345,"davelaar",null,"eiken"]
[180346,"foppen",null,"douglas"]
[180347,"romijn","via van Vliet","kastanje"]
[180348,"ebh","prijs via Mouris","eiken"]
[180349,"pol","via RHS","douglas/vuren"]
[180350,"hardenzacht","Via RHS - 100 sporen","Douglas"]
[180351,"noesk",null,"douglas"]
[180352,"noesk",null,"lariks"]
[180353,"houwelingen",null,"douglas"]
[180354,"groot",null,"douglas"]
[180355,"twillert",null,"Douglas"]
[180356,"koole",null,"douglas"]
[180357,"roekel",null,"douglas"]
[180358,"houwelingen",null,"douglas"]
[180359,"jack","ebh","douglas"]
[180360,"morren","ebh","douglas"]
[180361,"veldhuizen",null,"eiken"]
[180362,"rhs ","gijs","eiken"]
[180363,"twente",null,"eiken"]
[180364,"stufken",null,"eiken/douglas"]
[180365,"rhs",null,"douglas"]
[180366,"ebh",null,"eiken"]
[180367,"bakker",null,"douglas"]
[180368,"centrop",null,"douglas"]
[180369,"centrop",null,"douglas"]
[180370,"berkhof",null,"eiken"]
[180371,"pol"]
[180372,"pol","slieten","douglas"]
[180373,"ebh",null,"eiken"]
[180374,"pieper",null,"eiken"]
[180375,"hierden",null,"douglas"]
[180376,"jongeneel","via centrop","lariks"]
[180377,"boogaerdt",null,"eiken"]
[180378,"ebh",null,"douglas"]
[180379,"veldhuizen",null,"douglas"]
[180380,"breehuis",null,"douglas"]
[180381,"twente",null,"eiken"]
[180382,"ebh",null,"douglas"]
[180383,"werner",null,"iepen"]
[180384,"gerritjan",null,"douglas"]
[180385]
[180386]
[180387,"dekker",null,"douglas"]
[180388]
[180389]
[180390]
[180391]
[180392,"vliet",null,"douglas"]
[180393,"mpg"]
[180394,"pol",38417614,"eiken"]
[180395,"pontmeyer",null,"douglas"]
[180395,"rhs",7378,"eiken"]
[180396,"kroese",null,"douglas"]
[180397,"rijn",null,"douglas"]
[180398,"snel",null,"douglas"]
[180399,"mouris","boomschijven","eiken"]
[180400,"vandepol",null,"douglas"]
[180401,"betach",null,"douglas"]
[180402,"derden",null,"douglas"]
[180403,"rhs",7404,"douglas"]
[180404,"pol",38417514,"eiken"]
[180405,"geresteijn",null,"eiken"]
[180406,"centrop",null,"douglas"]
[180407,"boogaerdt",null,"eiken"]
[180408,"anders",null,"eiken"]
[180409,"tomassen",null,"zweeds rabat"]
[180410,"arens",null,"eiken"]
[180411,"tuinhoutcentrale",null,"douglas"]
[180412,"rooijen",null,"douglas"]
[180413,"gds",null,"douglas/larix"]
[180414,"rusch",null,"eiken"]
[180415,"bentum",null,"eiken"]
[180416,"rijt",null,"douglas"]
[180417,"pluktuin",null,"douglas "]
[180418,"hartog",null,"eiken"]
[180419,"rooijen",null,"douglas"]
[180420,"tuinplus",null,"douglas"]
[180421,"pol",null,"douglas"]
[180422,"rhs",null,"eiken"]
[180423,"alst",null,"flamingo"]
[180424,"langhout",null,"douglas"]
[180425,"romijn",null,"eiken en douglas"]
[180426,"troost",null,"douglas"]
[180427,"heuvel",null,"eiken"]
[180428,"derden",null,"douglas"]
[180429,"Brouwer",null,"douglas"]
[180430,"troost",null,"douglas"]
[180431,"centrop"]
[180432,"rooijen",null,"boomstam"]
[180433,"graafschap",null,"douglas"]
[180434,"reijersen",null,"douglas"]
[180435,"breehuis",null,"douglas"]
[180436,"pol",38418835,"eiken"]
[180437,"slingerland",null,"douglas"]
[180438,"rijk",null,"douglas"]
[180439,"ambacht",null,"douglas"]
[180440,"top",null,"eiken"]
[180441,"houwelingen","1700mt","eiken"]
[180442,"storm",null,"douglas"]
[180443,"veldhuizen","bart","douglas"]
[180444,"Jansen","Ria Jansen-voorthuizen","douglas"]
[180445,"guyt","veranda","douglas"]
[180446,"kempen",null,"douglas"]
[180447,"steeg",null,"eiken"]
[180448,"pruis",null,"douglas"]
[180449,"schutte","frank","douglas"]
[180450,"Wilpenveen",null,"douglas"]
[180451,"Baalman","Rood-amerikaans","eiken"]
[180452,"daalmeijer",null,"eiken"]
[180453,"peters",null,"douglas"]
[180454,"zuilhof",null,"douglas"]
[180455,"benschop",null,"douglas"]
[180456,"meelissen",null,"douglas"]
[180457,"Veldhuizen"]
[180458,"houwelingen","Fedor ","eiken"]
[180459,"kraai",null,"douglas"]
[180460,"hamoen",null,"douglas"]
[180461,"melissen",null,"douglas"]
[180462,"anders",null,"douglas"]
[180463,"brandhof",null,"eiken"]
[180464,"breehuis",null,"douglas"]
[180465,"heko",null,"douglas"]
[180466,"staatsbosbeheer",null,"douglas"]
[180467,"goor",null,"douglas"]
[180468,"jolle"]
[180469,"hamoen"]
[180470,"ebh"]
[180471,"snel"]
[180472,"houwelingen",2700,"eiken"]
[180473,"ebh"]
[180474,"snel"]
[180475,"rhs"]
[180476,"aren"]
[180477,"noesk"]
[180478,"anders"]
[180479,"hig"]
[180480,"jongeneel"]
[180481,"rhs",7331]
[180482,"opijnen"]
[180483,"arends"]
[180484,"groot",null,"douglas"]
[180485,"rhs",null,"eiken"]
[180486,"ebh",null,"eiken"]
[180487,"pontmeyer","zr","douglas"]
[180488,"ebh",null,"eiken"]
[180489,"karbouw",null,"douglas"]
[180490,"breehuis",null,"douglas"]
[180491,"fetim",null,"douglas"]
[180492,"kurperir"]
[180493,"anders",null,"douglas"]
[180494,"pontmeyer","karbouw"]
[180495,"koudijs",null,"douglas"]
[180496,"pol",null,"eiken"]
[180497,"anders",null,"douglas"]
[180498,"schuit","zweed rabat","douglas"]
[180499,"kamp","via breve inpregneren","douglas"]
[180500,"anders",null,"douglas"]
[180501,"legemaat",null,"douglas"]
[180502,"anders","jeffrey","dougl;as"]
[180503,"essen",null,"douglas"]
[180504,"groot ",null,"douglas"]
[180505,"ebh",null,"douglas"]
[180506,"welschen",null,"douglas"]
[180507,"klein",null,"eiken"]
[180508,"berkhof",null,"eiken"]
[180509,"pol",null,"douglas"]
[180510,"pol",null,"douglas"]
[180511,"ebh",null,"eiken"]
[180512,"jongeneel",null,"douglas"]
[180513,"snel",null,"douglas"]
[180514,"jansen",null,"douglas"]
[180515,"pol",38420237,"eiken"]
[180516,"robbin",null,"douglas"]
[180517,"budding",null,"douglas"]
[180518,"wens",null,"douglas"]
[180519,"schuit",null,"douglas"]
[180520,"Lamarti",null,"douglas"]
[180521,"nieboer",null,"douglas"]
[180522,"arends",null,"eiken"]
[180523,"vink",null,"douglas"]
[180524,"ebh",null,"eiken"]
[180525,"hard",null,"douglas"]
[180526,"groot",null,"douglas"]
[180527,"snel",null,"eiken"]
[180528,"snel",null,"eiken"]
[180529,"houtex",null,"eiken"]
[180530,"houtex",null,"eiken"]
[180531,"kok",null,"douglas"]
[180532,"pol",null,"douglas"]
[180533,"pontmeyer","amersfoort","eiken"]
[180534,"pol",null,"douglas"]
[180535,"bentum",null,"eiken"]
[180536,"valk",null,"eiken"]
[180537,"snel",null,"douglas"]
[180538,"ambacht",null,"douglas"]
[180539,"jongeneel",null,"eiken"]
[180540,"ambacht",null,"douglas"]
[180541,"karbouw",null,"douglas"]
[180542,"ah",null,"douglas"]
[180543,"reemst","particulier","douglas"]
[180544,"vries",null,"douglas"]
[180545,"daalmeijer",null,"eiken"]
[180546,"allround",null,"douglas"]
[180547,"jager",null,"eiken"]
[180548,"derden",null,"douglas"]
[180549,"vellinga",null,"douglas"]
[180550,"landing",null,"douglas"]
[180551,"the",null,"eiken"]
[180552,"jongeneel",null,"douglas"]
[180553,"snel",null,"eiken"]
[180554,"fetim",null,"douglas"]
[180555,"wolwinkel"]
[180556,"gert de haan"]
[180557,"ebh","winddroog","eiken"]
[180558,"roelofsen",null,"eiken"]
[180559,"pontmeyer",null,"douglas"]
[180560,"speeling","Moragh Rusch","eiken"]
[180561,"terra",null,"eiken"]
[180562,"snel",null,"eiken"]
[180563,"geresteijn",null,"douglas"]
[180564,"ebh",null,"douglas"]
[180565,"breve","opdracht zwart borstelen","douglas"]
[180566,"pol",null,"douglas"]
[180567,"ebh",null,"douglas"]
[180568,"pontmeyer",null,"douglas"]
[180569,"heko","eiken","eiken"]
[180570,"heko",null,"douglas"]
[180571,"sarah",null,"douglas"]
[180572,"heko",null,"eiken"]
[180573,"storm",null,"douglas"]
[180574,"pontmeyer",null,"douglas"]
[180575,"pol",null,"douglas"]
[180576,"nubuiten",null,"douglas"]
[180577,"leeuwen",null,"douglas"]
[180578,"heimgartner",null,"douglas"]
[180579,"snel",null,"eiken"]
[180580,"brom",null,"douglas"]
[180581,"ebh",null,"eiken"]
[180582,"pijnenburg",null,"douglas"]
[180583,"pater",null,"douglas"]
[180584,"breehuis",null,"douglas"]
[180585,"houwelingen",null,"eiken"]
[180586,"kriemel",null,"douglas"]
[180587,"kliksafe",null,"eiken"]
[180588,"anders",null,"douglas"]
[180589,"pol",null,"douglas"]
[180590,"heko",null,"douglas"]
[180591,"grift",null,"eiken"]
[180592,"zwart",null,"douglas"]
[180593,"breehuis",null,"eiken"]
[180594,"fveldhuizen",null,"douglas"]
[180595,"duits",null,"eiken / douglas "]
[180596,"kerkhofs ",null,"douglas / dakbeschot"]
[180597,"ebh ",null,"douglas "]
[180598,"rondhout ",null,"eiken "]
[180599,"mpg bouw ",null,"eiken "]
[180600,"de Hoop ",null,"eiken "]
[180601,"de Vries houth.",null,"douglas "]
[180602,"Pol ",null,"douglas "]
[180603,"Bouw ",null,"douglas potdeksel "]
[180604,"Gul ",null,"eiken "]
[180605,"Leenen ",null,"eiken "]
[180606,"houtbouwderden",null,"douglas "]
[180607,"rhs",null,"douglas"]
[180608,"ierssel",null,"douglas"]
[180609,"pol",null,"eiken"]
[180610,"houwelingen",null,"eiken"]
[180611,"vd heuvel ",null,"douglas "]
[180612,"wensenco",null,"douglas "]
[180613,"fetim",null,"douglas "]
[180614,"berkhof",null,"eiken "]
[180615,"vries",null,"douglas"]
[180616,"spijker","loonzagen","douglas"]
[180617,"rondhout ",null,"douglas"]
[180618,"Houwelingen",null,"eiken"]
[180619,"Houwelingen",null,"eiken"]
[180620,"Houwelingen",null,"eiken"]
[180621,"pontmeyer ",null,"douglas "]
[180622,"RHS",null,"douglas"]
[180623,"RHS",null,"douglas "]
[180624,"RHS ",null,"eiken "]
[180625,"Jongeneel",null,"douglas"]
[180626]
[180627]
[180628]
[180629]
[180630]
[180631]
[180632]
[180633]
[180634]
[180635]
[180636]
[180637]
[180638]
[180639]
[180640]
[180641]
[180642]
[180643]
[180644]
[180645]
[180646]
[180647]
[180648]
[180649]
[180650]
[180651]
[180652]
[180653]
[180654]
[180655]
[180656]
[180657]
[180658]
[180659]
[180660]
[180661]
[180662]
[180663]
[180664]
[180665]
[180666]
[180667]
[180668]

{"sheet":"bestelling","index":4,"n_rows":6,"n_cols":7,"rows_kept":6,"cut":false,"hidden":false,"merged":[]}
["Bestellingen"]
[]
["Datum","Order","klant","Bestelling","Leverancier","bestelnummer","Opmerking "]
["2018-06-18","180333_romijn","Gerard Romijn","4xØ 8x 4000\n11xØ 8x1200","Van Vliet",1005667,"19-6 afm aangepast"]
["2018-07-02",null,"henri van roekel","52 stuks sporen","rhs"]
["2018-07-04","170612_pauw","Luc de Pauw","gg-delen","gras"]

{"sheet":"Voorraad","index":5,"n_rows":1,"n_cols":10,"rows_kept":1,"cut":false,"hidden":false,"merged":[]}
["Datum inventarisatie","Houtsoort","dikte","breedte","lengte","aantal","datum afname","aantal","datum afname","aantal"]