{"text_format":"1","workbook":"xlsx","n_sheets":9,"sheets":["Bij- en afboeken","Voorraad","Picklijst 8410","Picklijst 8437","Picklijst 8438","Picklijst 8439","Picklijst 8464","Picklijst 8510","Mutaties"],"not_rendered":{"charts":0,"images":3,"macros":1,"external_links":6,"defined_names":11,"comments":0,"pivot_tables":0},"unopened":[],"bounds":{"document_bytes":16777216,"sheet_cells":100000,"rows_first":2000,"rows_last":500,"rows_between":2000,"halvings":0,"cell_chars":16384,"cell_head_chars":4096},"cells_cut":0,"cells_raw":0,"read":"whole","date_system":"1900"}

{"sheet":"Bij- en afboeken","index":0,"n_rows":29,"n_cols":5,"rows_kept":29,"cut":false,"hidden":false,"merged":[]}
[]
[null,"Artikelnummer CSI","Art Nr Leverancier","Omschrijving","Voorraad"]
[null,{"$f":"VLOOKUP($B$8,Voorraad!$A$2:$D$1001,1)","v":"BX0043"},{"$f":"VLOOKUP($B$8,Voorraad!$A$2:$D$1001,2)","v":"PCB 8439L"},{"$f":"VLOOKUP($B$8,Voorraad!$A$2:$E$1001,3)","v":"PCB 8439L"},{"$f":"VLOOKUP($B$8,Voorraad!$A$2:$D$1002,4)","v":43}]
[]
[]
[]
[null,"Artikel nummer CSI","Aantal"]
[null,"BX0043",50]
[]
[]
[]
[]
[]
[]
[]
[]
[]
[]
[]
[]
[]
[]
[]
[]
[]
[]
[]
[]
[null,null,null," "]

{"sheet":"Voorraad","index":1,"n_rows":795,"n_cols":24,"rows_kept":795,"cut":false,"hidden":false,"merged":[]}
[]
[" Artikel Nr CSI","Art Nr Leverancier","Omschrijving","Voorraad","PCB","Leverancier","Producent","Produco Nr","Order Nr","Opmerkingen/Alternatieven","Min. Voorraad","Bestellen","Locatie","EH Prijs","Waarde"]
["BR0001","#10012201","R 22E 1% 0.6W 7X2,5MM",425,8510,null,"BCC",500028,null,null,100,{"$f":"IF(K3>D3,$U$3,$U$5)","v":"Nee"},"-",0,{"$f":"N3*D3","v":0},null,null,null,null,null,"Ja",null,null,"totaal"]
["BR0002","#10014701","R 47E 1% 0.6W 7X2,5MM",350,8510,"TME","BCC",500032,"M0.6W-47R",null,100,"Nee","-",0,0,null,null,null,null,null,null,null,null,{"$f":"SUM(O3:O999)","v":0}]
["BR0003","#10021001","R 100E 1% 0.6W 7X2,5MM",1725,"8510/8464",null,"BCC",500036,null,null,100,"Nee","-",0,0,null,null,null,null,null,"Nee"]
["BR0004","#10031001","R 1K00 1% 0.6W 7X2,5MM",208,"8510/8437/8438/8439/8464",null,"BCC",500048,null,null,100,"Nee","-",0,0]
["BR0005","#10041001","R 10K0 1% 0.6W 7X2,5MM",1908,"8510/8437/8438/8439",null,"BCC",500060,null,null,100,"Nee","-",0,0]
["BR0006","#10041501","R 15K0 1% 0.6W 7X2,5MM",1775,8510,null,"BCC",500062,null,null,100,"Nee","-",0,0]
["BR0007","#10042201","R 22K0 1% 0.6W 7X2,5MM",1025,8510,null,"BCC",500064,null,null,100,"Nee","-",0,0]
["BR0008","#10051001","R 100K 1% 0.6W 7X2,5MM",1350,8510,null,"BCC",500072,null,null,100,"Nee","-",0,0]
["BR0009","#10015601","R 56E 1% 0.6W 7X2,5MM",1125,"8510/8464",null,"BCC",500033,null,null,100,"Nee","-",0,0]
["BR0010","#10021801","R 180E 1% 0.6W 7X2,5MM",125,8510,"TME","BCC",500039,"MO.6W-180R",null,100,"Nee","-",0,0]
["BR0011","#10031801","R 1K8 1% 0.6W 7X2,5MM",1050,8510,null,"BCC",500051,null,null,100,"Nee","-",0,0]
["BR0012","#10032701","R 2K7 1% 0.6W 7X2,5MM",2225,8510,null,"BCC",500053,null,null,100,"Nee","-",0,0]
["BR0013","#10045601","R 56K 1% 0.6W 7X2,5MM",1925,8510,null,"BCC",500069,null,null,100,"Nee","-",0,0]
["BR0014","#10056801","R 680K 1% 0.6W 7X2,5MM",1100,8510,null,"BCC",500082,null,null,100,"Nee","-",0,0]
["BR0015",null,"R 2K2",500,8464,null,"Philips",null,null,null,100,"Nee","-",0,0]
["BR0016",null,"R 27K",0,8464,null,"Philips",null,null,null,100,"Ja","-",0,0]
["BR3020",null,"R 470k",1000,8464,null,"Philips",null,null,null,100,"Nee","-",0,0]
["BR3030",null,"R 4K7",2000,8464,null,"Philips",null,null,null,100,"Nee","-",0,0]
["BR3035",null,"R 33K",3000,8464,null,"Philips",null,null,null,100,"Nee","-",0,0]
["BR3517",null,"R 6K8",4000,8464,null,"Philips",null,null,null,100,"Nee","-",0,0]
["BR3520","#350100","R 5,6E",0,8410,null,"Philips",null,null,null,100,"Ja","-",0,0]
["BR3525","#120164K102JE","RT 1K 450MW 10% NTC 2E",725,8510,null,"EPCOS",500277,null,null,50,"Nee","-",0,0]
["BR3530","#120995120A","RT 13E PTC 2E WPT2390-995",5,8510,"DISTRELEC","EPCOS",500248,"B59995-C120-A70",null,250,"Ja","-",0,0]
["BR3535","-","-",0,"-","-","-","-","-",null,null,"Nee","-",0,0]
["BR3550","#122S05K30","RV S05K30 100A 0.01W",86,"8410/8437/8438/8439/8510","TME","EPCOS",500088,"SIOV-S05K30","Groter aantal inkopen ",200,"Ja","-",0,0]
["BR4008","#122S05K385","RV S05K385 385V 0.10W",-142,"8410/8510","DISTRELEC","EPCOS",null,"B72207-S 381K101","RS COMPONENTS NR: 138-9254",100,"Ja","-",0,0]
["BR4016","#679MFR020","F MF-R020 0.20A 60V",-51,8510,"FARNELL","BOURNS",null,9350373,null,100,"Ja","-",0,0]
["BR4020","ERF-RA13560Z","MFR135 ",14,"8437/8438","TME","ECE",null,"ERF - RA135-60Z",null,100,"Ja","-",0,0]
["BR4025","ERF-LX005V2","MFR005",742,8439,"TME","ECE",null,"LX005-V2",null,100,"Nee","-",0,0]
["BR4030","CM-100N-Y5V","100NF50V",184,"8437/8438/8439","TME","SR Passives",null,"CM-100N-Y5V",null,100,"Nee","-",0,0]
["BR4035",350100,"V275LA4",219,8410,null,"HARRIS",null,"H809159",null,100,"Nee","-",0,0]
["BR4040","#138X2310B","RA 1K-4X SIL08 4608X-2",225,8510,null,"BOURNS",500209,null,null,100,"Nee","-",0,0]
["BR4045","#138X23270B","RA 2K7 4X SIL8 4608X-2",15,8510,"TME","BOURNS",500340,"4608X-102-272LF",null,100,"Ja","-",0,0]
["BR4050","#138X24100B","RA 10K-4X SIL08 4608X-2",-101,8510,"MOUSER","BOURNS",500342,"4608X-102-103LF",null,100,"Ja","-",0,0]
["BR4060","#140X13100B","RA 1K-9X SIL10 4610X-1",-142,8510,null,"BOURNS",500361,null,null,100,"Ja","-",0,0]
["BR4070","#140X14270B","RA 27K 9X SIL10 4610X-101",1,8510,"MOUSER","BOURNS",500202,"652-4610X-1LF-27K",null,100,"Ja","-",0,0]
["BR4530G","#140X1510B","RA 100K-9X SIL10 4610X-1",-46,8510,null,"BOURNS",500302,null,null,100,"Ja","-",0,0]
["BR4535G","#152R15100B","RA 100K-8X SIL8 4116R-001",0,8510,"UT SOURCE","BOURNS",500204,"4116R-001-104",null,100,"Ja","-",0,0]
["BR4540","#29222100020P","CC 220P 3KV 20% 3E",-75,8510,null,"AVX / PANASONIC",500131,null,null,100,"Ja","-",0,0]
["BR45810","#2231010K","CC 1N 100V +/- 10% 2E",7,8510,"MOUSER","PHILIPS",500135,"FG28X7R1H102KNT6",null,100,"Ja","-",0,0]
["BR45812","#2202210KR","CC 2N2 100V 10% 2E K2000",0,8510,"MOUSER","BCE",500325,"594-K222K15X7RH5UL2",null,100,"Ja","-",0,0]
["BR5010","#2344710KKE","CC 47N 63V +80 -20% 2E 55'",-450,"8410/8510",null,"BCC",500138,null,"Alternatief: 47NF/100V",100,"Ja","-",0,0]
["BR5060","#2112710GB","CC 27P 100V 2% 2E NPO 85'",-2,8510,"TME","BCC",500125,"CCK-27P",null,100,"Ja","-",0,0]
["BR5070","#2113910GB","CC 39P 100V +/- 0,25 2E",232,8510,null,"BCE",599999,null,null,100,"Nee","-",0,0]
["BR5080","#2341010KS","CC 10N 100V 10% 2E X7R",0,8510,"TME","KEMET",500241,"C317C103K1R5TA",null,100,"Ja","-",0,0]
["BR5090","#2242210KSX","CC 22N 100V 10% X7R 2E",2,8510,"MOUSER","KEMET",500137,"80-C322C223K1R-TR",null,100,"Ja","-",0,0]
["BR6010",161590,"22NF",0,8410,null,"KEMET",null,null,null,100,"Ja","-",0,0]
["BR6012","#2344710KKE","220PF/2KV",0,8410,null,"BCC",null,null,null,100,"Ja","-",0,0]
["BR6060","#25053305KW1","CF 330N 63V 10% 2E MKS22",-1575,8510,null,"WIMA",500324,null,null,100,"Ja","-",0,0]
["BR6070","#2921063025EMZ","CF 100P630V 2,5% 6E 300'",-75,8510,"FARNELL","EMZ",null,9520015,null,100,"Ja","-",0,0]
["BR6080","#27722040V","CE 220U 40V -10 +50% AX",0,8510,null,"BCC",500225,null,null,100,"Ja","-",0,0]
["BR6090","#30515040BC","CE 1U5 40V 20% 175' SAL",108,8510,null,"BCC",null,null,"2.2UF mag ook, is beter verkrijgbaar",100,"Nee","-",0,0]
["BSH001","#2816680062M","CE 68U 6V3 20% 175' SAL",-495,8510,"TME","VISHAY",500119,"EEUFM1E101",null,100,"Ja","-",0,0]
["BSH002","EEUFC1V221 ","220U / 35V ",178,"8437/8438/8439","TME","Panasonic",null,"EEUFC1V221 ","Alternatief: SE050M0220-1012",100,"Nee","-",0,0]
["BU0001",null,"100U /35V ",21,8438,null,null,null,null,null,100,"Ja","-",0,0]
["BU0002",222202127479,"47U/40V",22,8464,"Farnell","Vishay",null,456556565,1165428,100,"Ja","-",0,0]
["BU0003",222211651229,"22UF/50V",0,8464,"TME","Philips",null,null,null,100,"Ja","-",0,0]
["BU0004",222237021473,"47NF/100V",136,8464,null,"Philips",null,null,null,100,"Nee","-",0,0]
["BU0005","2046-09-C2LF","T83-A90X ",57,"8437/8438/8439","Farnell","Bourns",null,2335982,null,50,"Nee","-",0,0]
["BU0006",null,"BC639",0,8464,"TME ","Philips",null,null,null,100,"Ja","-",0,0]
["BU0007",null,"BC640",0,8464,"TME ","Philips",null,null,null,100,"Ja","-",0,0]
["BU0008","#33108S1105J","L 1000UH 100MA 10% AX 85'",0,8510,"FARNELL","EPCOS",500210,608609,null,100,"Ja","-",0,0]
["BU0009","#33108S1473J","L 47UH 340MA 10% AX 85'",750,8510,null,"EPCOS",500214,null,null,100,"Nee","-",0,0]
["BU0010","HBCC-220K-02","22UH",60,"8437/8438/8439","TME","FASTRON",null,"HBCC-220K-02"," MICC-R22M-02",100,"Ja","-",0,0]
["BU0011",304030,"1UH",0,8410,null,null,null,"R0411R12",null,100,{"$f":"IF(K67>D67,$U$3,$U$5)","v":"Ja"},"-",0,{"$f":"N67*D67","v":0}]
["BU0012",315000,"100UH 275MA",2000,8410,null,"TAI-TECH",null,"FI-0410NA-101K",null,100,"Nee","-",0,0]
["BU0013","FI-0410NA-102K","1MH",0,8410,null,"TAI-TECH",null,"FI-0410NA-102K",null,100,"Ja","-",0,0]
["BU0014","#341N4004DC","D 1N4004 400V-1A DO-41",485,"8410/8464/8510",null,null,522000,null,null,100,"Nee","-",0,0]
["BU0015","#341N4148P","D 1N4148PH 75V-200MA",-1075,"8464/8510","TME","PHILIPS",522001,"1N4148-TAP",null,100,"Ja","-",0,0]
["BU0016",null,"D BYV27-150-TAP",-7,"8437/8438/8439/8510","MOUSER","PHILIPS",520005,"BYV27-150-TAP",null,100,"Ja","-",0,0]
["BU0017","#35BZX55C29","DZ BZX79C20 20V 0.5W DO35",1925,8510,null,null,522023,null,null,100,"Nee","-",0,0]
["BU0018","#35ZPD3V9D","DZ ZPD3V9 500MW 2%",125,8510,null,"GSI",522011,null,null,100,"Nee","-",0,0]
["BU0019","#35BZX79C5V6","DZ BZX79C5V6 5V6 0.5W DO",103,8510,null,null,520014,null,null,100,"Nee","-",0,0]
["BU0022","4E","BZX79-C18",30,8464,"TME",null,null,"Zener18V 0.5W DO35","I.P.V. BZX55-C18",100,"Ja","-",0,{"$f":"N76*D76","v":0}]
["BU0023","-","-",0,"-","-","-","-","-",null,100,"Ja","-",0,0]
["BU0024","#372N2222ASTM","T 2N2222A TO-18 NPO",0,8510,"FARNELL","ST",520033,9207120,null,100,"Ja","-",0,0]
["BU0025","#37IRFF310i","T IRFF310 MOSFET T05",0,8510,"UT SOURCE","HARRIS",520039,null,"1000 stuks extra inkopen voor vervolgen!",100,"Ja","-",0,0]
["BU0026","#661MS18425","IS MS184-25 TRANS. VOET",925,8510,null,"FISCHER",null,null,null,100,"Nee","-",0,0]
["BU0027","#665MS34518","IS MS34-518 T05/18 Isol",1,8510,"DISTRELEC","FISCHER",null,"TO-5/TO-18PU",null,100,"Ja","-",0,0]
["BU0028","#432373NCTI","SN74HC373N DIP-20 Ti",-1,8510,"TME","Ti",null,"SN74HC373N",null,100,"Ja","-",0,0]
["BU0029","#41693EPEM","IC MAX693EPE -20/+85'",-75,8510,"UT SOURCE","AD",522301,null,"alternatief van ADM of LTC mag ook, opvragen!",100,"Ja","-",0,0]
["BU0030","#432374NCPH","IC P74HC374N",-36,8510,"TME","NXP",520343,"SN74HC374N",null,100,"Ja","-",0,0]
["BU0031","#43404CPH","IC P74HCT04N DIP-14",23,8510,"AVNET","NXP",520013,"TISSN74HCT04N",null,100,"Ja","-",0,0]
["BU0032","#4680C31X2A","IC TS80C31X2-MIA",0,8510,"UT SOURCE","TEMIC",522300,"TS80C31X2-MIA",null,100,"Ja","-",0,0]
["BU0033","#47256B12F1GP","IC M27C256B-12F1 EPROM",-75,8510,"MOUSER","ST",522216,"UT8BGCHB2117",null,100,"Ja","-",0,0]
["BU0034","#411225Y150PM","IC DS1225Y-200",-75,8510,null,"DALLAS/HANBIT / MAXIM",522224,null,null,100,"Ja","-",0,0]
["BU0035","#94TLP626T","IC TLP626 OPTOCOUPLER",-188,8510,"TME","TOSHIBA",552112,"TLP626","AVNET ORDERCODE - XYETOSTLP626(F)",100,"Ja","-",0,0]
["BU0036","#94TLP627TO","IC TLP627 OPTOCOUPLER DIL-4",-171,8510,null,"TOSHIBA",552114,null,null,100,"Ja","-",0,0]
["BU0037","?","IC TLP627 OPTOCOUPLER DIL-16",-152,8510,null,null,552116,null,null,100,"Ja","-",0,0]
["BU0038","DIL6","4N35 Optocoupler",15,"8437/8464","TME ","Vishay",null,"4N35",null,100,"Ja","-",0,0]
["BU0039",7091968,"IC 4013 CMOS dual D-flipflop",0,8464,"RS","Div",null,"CD4013BE",null,100,"Ja","-",0,0]
["BU0040",null,"CD40106 CMOS hex inverter",0,8464,"TME","Div.",null,"CD40106BE",null,100,"Ja","-",0,0]
["BU0041",null,"7812 Stabilizer  12V 1A",0,8464,"TME","Div.",null,"L7812CV-DG",null,100,"Ja","-",0,0]
["BU0042",null,"CD4024B CMOS 6 stage ripple counter",1,8464,"TME","Texas Instruments",null,"CD4024BE",null,100,"Ja","-",0,0]
["BU0043","#50DH3WF","LED HOUDER DH3W HAAKS",-1,8510,"DISTELEC","FISCHER",552122,"175-07-513",null,100,"Ja","-",0,0]
["BU0044","#50DH5WF","LED HOUDER DH5W HAAKSE",109,8510,"DISTRELEC","FISCHER",552123,"175-07-515",null,100,"Nee","-",0,0]
["BU0045","KVD-03-035/G","LED TLG124A GROEN 3.18MM",2,"8437/8438/8439/8464/8510","TME","KHATOD / King Bright","?","L-934GD",null,100,"Ja","-",0,0]
["BU0046","#900TLHY4400","LED TLY124 AMBER 3.18MM",-63,8510,null,"TOSHIBA",552102,null,null,100,"Ja","-",0,0]
["BU0047","#901L63GDK","LED L63GD 5MM GROEN",0,8510,"TME","VISHAY",552103,"TLHG5205",null,100,"Ja","-",0,0]
["BU0048","#49TLRE263APT","LED TLRE263AP ROOD 2E",-501,8510,"TME","KINGBRIGHT",552104,"WP63iT","TME: L-1502EC  /  FARNELL: 2335729",100,"Ja","-",0,0]
["BU0049",null,"LDR 550 NM TO-18",24,8510,"FARNELL","ADVANCED",null,3168335,null,100,"Ja","-",0,0]
["BU0050","KVD-03-035/R","LED-RED",32,8464,"TME","KHATOD / King Bright",null,"L-934LSRD",null,100,"Ja","-",0,0]
["BU0051","#502G6RN124VO","REL G6RN1-24VDC 24V",-75,"8410/8510","TME","OMRON",536001,"G6RN-1-24","alternatief:   y23061-b1007    siemens ",100,"Ja","-",0,0]
["BU0052",null,"V23105-A5303-A201 printrelay DPDT 12V dc",0,8464,"Siemens","Tyco",null,"V23042 A2003-B101","Alternatief:   DS2Y-S DC12V  /  G5V-2-12V DC",100,"Ja","-",0,0]
["BU0053",906442394,"TMR6_2422",37,"8437/8439","TME","TRACO POWER",null,"TMR6-2422","DISTRELEC: 169-54-689",100,"Ja","-",0,0]
["BU0054",null,"uPd-D114I DC/DC converter 12V/12V isolated",0,8464,null,"uPd (Alcom)",null,"NMV1212SAC",null,100,"Ja","-",0,0]
["BU0055",372250,"REL V23061-B1009",3,8410,null,"SIEMENS",null,null,null,100,"Ja","-",0,0]
["BU0056","#511020PRE","CON ICV 20P 0-0345721-6",-75,8510,"TME","EURODIP",516245,"ICVT-20P",null,100,"Ja","-",0,0]
["BU0057","#511028PRE","CON ICV 28P 0-0345728-6",-142,8510,"TME","CONNFLY",516231,"ICVT-28P",null,100,"Ja","-",0,0]
["BU0058","#511040PRE","CON ICV 40P 0-0345730-6",-74,8510,"TME","CONNFLY",516232,"ICVT-40P",null,100,"Ja","-",0,0]
["BU0059","#513JUMPOFSW","CON 1-881545-1 SHUNT",1725,"8437/8439/8464/8510","TME",null,null,"JUMPER-BL",null,100,"Nee","-",0,0]
["BU0060","#514890003811","CON 8280224-03-02 3P MALE",272,8510,null,"PRECIDIP",null,null,null,100,"Nee","-",0,0]
["BU0061","-","-",0,"-","-","-","-","-",null,100,"Ja","-",0,0]
["BU0062","#5B031646921","CON 09031646921 64P A+C",-75,8510,"TME","HARTING",516129,9031646921,null,100,"Ja","-",0,0]
["BU0063",1727078,"MKDS1/8-3.81 Printconnector",0,8464,null,"Phoenix",null,1727078,null,100,"Ja","-",0,0]
["BU0064",9185206904,"FKV20M",54,8439,null,"Harting",null,null,null,100,"Ja","-",0,0]
["BU0065","09 66 451 6513","DB37F ",13,"8437/8438","TME","Harting ",null,"09 66 451 6513",null,100,"Ja","-",0,0]
["BU0066",1780015,"KDS3 ",546,"8437/8438/8439","Van Egmond Groep","Phoenix",null,1780015,null,100,"Nee","-",0,0]
["BU0067","ZL305-02","ZL305-02",214,8439,"TME","Nigini",null,"ZL305-02",null,100,"Nee","-",0,0]
["BU0068","DS1021-136sf11","ZL201-03G",931,"8437/8439/8464/8510","TME","Connfly",null,"ZL201-03G",null,100,"Nee","-",0,0]
["BU0069",null,"SIL3 Male printheader 3p",0,8464,"TME","Div",null,"PH1-40-UA",null,100,"Ja","-",0,0]
["BU0070",null,"-",0,"-","-","-","-","-",null,100,"Ja","-",0,0]
["BU0071",260340,"HEAD.SEK18 MALE FLAT CABLE CONNECTOR",13,8410,null,"HARTING",null,"09-18-564-7914",null,100,"Ja","-",0,0]
["BU0072",null,"DIPFIX",574,8439,"JvB","JvB",null,null,null,100,"Nee","-",0,0]
["BU0073",null,"EARTH",12,8439,"JvB","JvB",null,null,null,100,"Ja","-",0,0]
["BU0074","#552TP33W003000","SW TP33W0030 drukknopschakelaar",-75,8510,"MOUSER","APEM",530220,"642-TP33W003000",null,100,"Ja","-",0,0]
["BU0075","#553PT65101L1","SW P65-101L254 kodeerschakelaar",-277,8510,"MOUSER","HARTMAN",536219,"642-PT65101L254",null,100,{"$f":"IF(K129>D129,$U$3,$U$5)","v":"Ja"},"-",0,0]
["BU0076","#611RM5RD","LTRM5RD 25/13W",-28,8510,null,"TRAFA",null,null,"groter aantal inkopen voor vervolgen 100x",100,"Ja","-",0,0]
["BU0078","#5F171633","BL5.08/3 ",-75,8510,null,"PHOENIX",null,null,null,100,"Ja","-",0,{"$f":"N131*D131","v":0}]
["BU0079","#5F171634","BL5.08/4 ",0,8510,null,"WEIDMULLER",null,null,null,100,"Ja","-",0,0]
["BX0001","#5F171642","BL5.08/12 ",-210,8510,null,"PHOENIX",null,null,null,100,"Ja","-",0,0]
["BX0002","XY2500V-C(5.08)-2PIN","SL2 ",92,"8437/8438/8439","TME","Xinya",null,"TBG-5-PB-2P-GN",null,100,"Ja","-",0,0]
["BX0003","TBW-5-2P/GN","BL2",93,"8437/8438/8439","TME","Ninigi",null,"TBW-5-2P/GN",null,100,"Ja","-",0,0]
["BX0004","TBG-5-PB-4P/GN","SL4",45,8439,"TME","Nigini",null,"TBG-5-PB-4P-GN",null,100,"Ja","-",0,0]
["BX0005","TBW-5-4P/GN","BL4",-100,8439,"TME","Nigini",null,"TBW-5-4P/GN",null,100,"Ja","-",0,0]
["BX0006","XY2500V C5.08) 5PIN","SL5 ",5,8438,"TME","Xinya",null,"TBG-5-PB-5P-GN",null,100,"Ja","-",0,0]
["BX0007","TBW-5-5P/GN ","BL5",62,8438,"TME","Ninigi",null,null,null,100,"Ja","-",0,0]
["BX0008","XY2500V-C(5.08)-6PIN","SL6 ",10,8437,"TME","Xinya",null,"TBG-5-PB-6P-GN",null,100,"Ja","-",0,0]
["BX0009","TBW-5-6P/GN","BL6",10,8437,"TME","Ninigi",null,"TBW-5-6P/GN",null,100,"Ja","-",0,0]
["BX0010",101410,"BL2 R5.08",0,8410,null,"WEIDMULLER",null,null,null,100,"Ja","-",0,0]
["BX0011",101420,"SL2 R5.08",0,8410,null,"WEIDMULLER",null,null,null,100,"Ja","-",0,0]
[null,null,"BL4",0,8410,null,"WEIDMULLER",null,null,null,null,null,null,0,0]
["BX0012",101440,"SL4 R5.08",0,8410,null,"WEIDMULLER",null,null,null,100,"Ja","-",0,0]
[null,null,"BL3",0,8410,null,"WEIDMULLER",null,null,null,null,null,null,0,0]
["BX0013",101460,"SL3 R5.08",0,8410,null,"WEIDMULLER",null,null,null,100,"Ja","-",0,0]
["BX0014",101280,"MSTB 2.5/2ST-5.08 AANSLUITBLOK",0,8410,null,"PHOENIX",null,1757019,null,100,"Ja","-",0,0]
["BX0015",101300,"MDSTBW 2.5/2 PRINTPLAATCONNECTOR",0,8410,null,"PHOENIX",null,1802430,null,100,"Ja","-",0,0]
["BX0016",2996922,"UM72 Profile 140MM",23,8437,"Van Egmond Groep","Phoenix",null,74005679,null,100,"Ja","-",0,0]
["BX0017",2952020,"UM72-profiel 161MM",0,8439,"Phoenix / Overwijn","Phoenix",null,null,null,100,"Ja","-",0,0]
["BX0018",2959256,"UM72 Profile 220MM",12,8438,"Phoenix / Overwijn",null,null,74005678,null,100,"Ja","-",0,0]
["BX0019",2959340,"UM72 SEFE/L",11,"8437/8438/8439","Van Egmond Groep","Phoenix",null,2959340,null,100,"Ja","-",0,0]
["BX0020",2959353,"UM72 SEFE/R",13,"8437/8438/8439","Van Egmond Groep","Phoenix",null,2959353,null,100,"Ja","-",0,0]
["BX0021",2959382,"UM72 FE",0,"8438/8439","Phoenix",null,null,null,null,100,"Ja","-",0,0]
["BX0022",2970028,"UMK-BE 22.5",5,8464,null,"Phoenix ",null,"2970028 / 1620255",null,100,"Ja","-",0,0]
["BX0023",2970015,"UMK-BE 45",0,"8410/8464",null,"Phoenix",null,null,null,100,"Ja","-",0,0]
["BX0024",2970002,"UMK-SE 11.25",0,"8410/8464",null,"Phoenix ",null,null,null,100,"Ja","-",0,0]
["BX0025",2970031,"UMK-FE",0,"8410/8464",null,"Phoenix ",null,null,null,100,"Ja","-",0,0]
["BX0026","#320120000M","XT 12.000000MHZ HC49U",29,8510,"RS COMPONENTS",null,500246,"173-4735",null,100,"Ja","-",0,0]
["BX0027","#65124665210","BOUT M2X10",1700,8510,null,"FABORY",null,null,null,100,"Nee","-",0,0]
["BX0028","#680ACHTER8510B","DIN achterwand 8510 bewerkt",-55,8510,null,"APRANORM",null,"445-273-01",null,100,"Ja","-",0,0]
["BX0029","#680KAST8510","DIN behuizing 8510 CSI",7,8510,null,"APRANORM",null,null,null,100,"Ja","-",0,0]
["BX0030","#680MONTBE8510","DIN montagebeugel 8510 CSI",87,8510,null,"APRANORM",null,"440-001",null,100,"Ja","-",0,0]
["BX0031","#686940035CSI","FRONTJE INCL RAAM (DE NAAMPL)",-44,8510,null,null,null,null,null,100,"Ja","-",0,0]
["BX0032","#4818CV8P15Li","IC 18CV8P-15 PEEL GEPROGR. V1.2",-75,8510,null,"ICT",null,null,"Ongeprogrammeerd. Graag 15Z versie nemen.",100,"Ja","-",0,0]
["BX0033","#4818CV8P15LiPR","IC 18CV8P-15 PEEL GEPROGR. V1.2",-75,8510,"MOUSER","ICT",null,"UT8IC89M5530","Geprogrammeerd. Z versie beter programmeerbaar",100,"Ja","-",0,0]
["BX0034","#TDSTICK8510A3","IC 8510 EPROM PROG V2.71",12,8510,null,"NSD",null,null,null,100,"Ja","-",0,0]
["BX0035","#5F171633","BL5.08/3 SN 171633",0,8510,null,"WEIDMULLER",null,null,null,100,"Ja","-",0,0]
["BX0036","#5F171634","BL5.08/4 SN 171634",0,8510,null,"WEIDMULLER",null,null,null,100,"Ja","-",0,0]
["BX0037","#5F171642","BL5.08/12 SN 171642",0,8510,null,"WEIDMULLER",null,null,null,100,"Ja","-",0,0]
["BX0038","PCB 8410","PCB 8410",0,"PCB 8410","JvB","JvB",476700,null,null,10,"Ja","-",0,0]
["BX0039","PCB 8437L","PCB 8437L",0,"PCB 8437L","JvB","JvB",null,null,null,10,"Ja","-",0,0]
["BX0040","PCB 8437R","PCB 8437R",17,"PCB 8437R","JvB","JvB",null,null,null,10,"Nee","-",0,0]
["BX0041","PCB 8438L","PCB 8438L",0,"PCB 8438L","JvB","JvB",null,null,null,10,"Ja","-",0,0]
["BX0042","PCB 8438R","PCB 8438R",18,"PCB 8438R","JvB","JvB",null,null,null,10,"Nee","-",0,0]
["BX0043","PCB 8439L","PCB 8439L",43,"PCB 8439L","JvB","JvB",null,null,null,10,"Nee","-",0,0]
["BX0044","PCB 8439R","PCB 8439R",21,"PCB 8439R","JvB","JvB",null,null,null,10,"Nee","-",0,0]
["BX0045","PCB 8464","PCB 8464",1,"PCB 8464","JvB","JvB",null,null,null,10,"Ja","-",0,0]
["BX0046","PCB 8510","PCB 8510",130,"PCB 8510","JvB","JvB",548187,null,null,10,"Nee","-",0,0]
["BX0047","PCB 8510i","PCB 8510i",44,"PCB 8510i","JvB","JvB",null,null,null,10,"Nee","-",0,0]
["BX0048","PCB 8510Ri","PCB 8510Ri",9,"PCB 8510Ri","JvB","JvB",null,null,null,10,"Ja","-",0,0]
["BX0049","PCB 409","PCB 409",9,"-",null,null,null,null,null,20,"Ja","-",0,0]
["BX0050","PCB 421","PCB 421",2,"-",null,null,null,null,null,20,"Ja","-",0,0]
["BX0051","PCB 422b","PCB 422b",2,"-",null,null,null,null,null,20,"Ja","-",0,0]
["BX0052","PCB 429","PCB 429",5,"-",null,null,null,null,null,20,"Ja","-",0,0]
["BX0053","PCB 430","PCB 430",3,"-",null,null,null,null,null,20,"Ja","-",0,0]
["BX0054","PCB 431","PCB 431",9,"-",null,null,null,null,null,20,"Ja","-",0,0]
["BX0055","PCB 436","PCB 436",6,"-",null,null,null,null,null,20,"Ja","-",0,0]
["CA0001","PCB 437","PCB 437",1,"-",null,null,null,null,null,20,"Ja","-",0,0]
["DO0001","PCB 445","PCB 445",2,"-",null,null,null,null,null,20,"Ja","-",0,0]
["DU0001","PCB 451","PCB 451",5,"-",null,null,null,null,null,20,"Ja","-",0,0]
["DU0002","PCB 455","PCB 455",2,"-",null,null,null,null,null,20,"Ja","-",0,0]
["DU0003","PCB 458","PCB 458",8,"-",null,null,null,null,null,20,{"$f":"IF(K194>D194,$U$3,$U$5)","v":"Ja"},"-",0,0]
["DU0004","PCB 460","PCB 460",25,"-",null,null,null,null,null,20,"Nee","-",0,{"$f":"N195*D195","v":0}]
["DU0005","PCB 463","PCB 463",1,"-",null,null,null,null,null,20,"Ja","-",0,0]
["DU0006","PCB 464","PCB 464",4,"-",null,null,null,null,null,20,"Ja","-",0,0]
["DU0007","PCB 465","PCB 465",5,"-",null,null,null,null,null,20,"Ja","-",0,0]
["DU0008","PCB 467","PCB 467",4,"-",null,null,null,null,null,20,"Ja","-",0,0]
["DU0009","PCB 487","PCB 487",51,"-",null,null,null,null,null,20,"Nee","-",0,0]
["DU0010","PCB 490","PCB 490",14,"-",null,null,null,null,null,20,"Ja","-",0,0]
["DU0011","PCB 496","PCB 496",42,"-",null,null,null,null,null,20,"Nee","-",0,0]
["DU0012","PCB 497","PCB 497",3,"-",null,null,null,null,null,20,"Ja","-",0,0]
["DU0013","PCB 501","PCB 501",6,"-",null,null,null,null,null,20,"Ja","-",0,0]
["DU0014","PCB 508","PCB 508",2,"-",null,null,null,null,null,20,"Ja","-",0,0]
["DY0001","PCB 522","PCB 522",8,"-",null,null,null,null,null,20,"Ja","-",0,0]
["DY0002","PCB 522R","PCB 522R",6,"-",null,null,null,null,null,20,"Ja","-",0,0]
["DY0003","PCB 561","PCB 561",3,"-",null,null,null,null,null,20,"Ja","-",0,0]
["EC0001","PCB 564","PCB 564",1,"-",null,null,null,null,null,20,"Ja","-",0,0]
["EC0002","PCB 567","PCB 567",2,"-",null,null,null,null,null,20,"Ja","-",0,0]
["EC0003","PCB 574","PCB 574",2,"-",null,null,null,null,null,20,"Ja","-",0,0]
["EC0004","PCB 575","PCB 575",2,"-",null,null,null,null,null,20,"Ja","-",0,0]
["EC0005","PCB 588","PCB 588",8,"-",null,null,null,null,null,20,"Ja","-",0,0]
["EC0006","PCB 596","PCB 596",32,"-",null,null,null,null,null,20,"Nee","-",0,0]
["EC0007","PCB 597","PCB 597",6,"-",null,null,null,null,null,20,"Ja","-",0,0]
["EC0008","PCB 598","PCB 598",4,"-",null,null,null,null,null,20,"Ja","-",0,0]
["EC0009","PCB 955-1bs","PCB 955-1bs",2,"-",null,null,null,null,null,20,"Ja","-",0,0]
["EC0010","PCB 2110A","PCB 2110A",10,"-",null,null,null,null,null,20,"Ja","-",0,0]
["EC0011","PCB 2111","PCB 2111",7,"-",null,null,null,null,null,20,"Ja","-",0,0]
["EC0012","PCB 2207","PCB 2207",11,"-",null,null,null,null,null,20,"Ja","-",0,0]
["EC0013","PCB 2308B","PCB 2308B",2,"-",null,null,null,null,null,20,"Ja","-",0,0]
["EC0014","PCB 2605","PCB 2605",11,"-",null,null,null,null,null,20,"Ja","-",0,0]
["EC0015","PCB 2690","PCB 2690",2,"-",null,null,null,null,null,20,"Ja","-",0,0]
["EC0016","PCB 2702R","PCB 2702R",57,"-",null,null,null,null,null,20,"Nee","-",0,0]
["EC0017","PCB 2711","PCB 2711",87,"-",null,null,null,null,null,20,"Nee","-",0,0]
["EC0018","PCB 2712","PCB 2712",26,"-",null,null,null,null,null,20,"Nee","-",0,0]
["EC0019","PCB 2713","PCB 2713",44,"-",null,null,null,null,null,20,"Nee","-",0,0]
["EC0020","PCB 3211","PCB 3211",7,"-",null,null,null,null,null,20,"Ja","-",0,0]
["EC0021","PCB 3212","PCB 3212",1,"-",null,null,null,null,null,20,"Ja","-",0,0]
["EC0022","PCB 3223","PCB 3223",4,"-",null,null,null,null,null,20,"Ja","-",0,0]
["EC0023","PCB 4100","PCB 4100",7,"-",null,null,null,null,null,20,"Ja","-",0,0]
["EC0024","PCB 6001","PCB 6001",11,"-",null,null,null,null,null,20,"Ja","-",0,0]
["EC0025","PCB 6002","PCB 6002",12,"-",null,null,null,null,null,20,"Ja","-",0,0]
["EC0026","PCB 6006B","PCB 6006B",1,"-",null,null,null,null,null,20,"Ja","-",0,0]
["EC0027","PCB 6010","PCB 6010",3,"-",null,null,null,null,null,20,"Ja","-",0,0]
["EC0028","PCB 6013","PCB 6013",10,"-",null,null,null,null,null,20,"Ja","-",0,0]
["EL0001","PCB 6019","PCB 6019",3,"-",null,null,null,null,null,20,"Ja","-",0,0]
["EL0002","PCB 6067","PCB 6067",4,"-",null,null,null,null,null,20,"Ja","-",0,0]
["EL0003","PCB 6110","PCB 6110",15,"-",null,null,null,null,null,20,"Ja","-",0,0]
["EL0004","PCB 6203","PCB 6203",9,"-",null,null,null,null,null,20,"Ja","-",0,0]
["EL0005","PCB 6213","PCB 6213",1,"-",null,null,null,null,null,20,"Ja","-",0,0]
["EL0006","PCB 6214","PCB 6214",18,"-",null,null,null,null,null,20,"Ja","-",0,0]
["EL0007","PCB 6224","PCB 6224",3,"-",null,null,null,null,null,20,"Ja","-",0,0]
["EL0008","PCB 6225","PCB 6225",10,"-",null,null,null,null,null,20,"Ja","-",0,0]
["EL0009","PCB 6240","PCB 6240",2,"-",null,null,null,null,null,20,"Ja","-",0,0]
["EL0010","PCB 6241","PCB 6241",2,"-",null,null,null,null,null,20,"Ja","-",0,0]
["EL0011","PCB 6248","PCB 6248",3,"-",null,null,null,null,null,20,"Ja","-",0,0]
["EL0012","PCB 6301","PCB 6301",5,"-",null,null,null,null,null,20,"Ja","-",0,0]
["EL0013","PCB 6311","PCB 6311",1,"-",null,null,null,null,null,20,"Ja","-",0,0]
["EL0014","PCB 6312","PCB 6312",6,"-",null,null,null,null,null,20,"Ja","-",0,0]
["EL0015","PCB 6319","PCB 6319",16,"-",null,null,null,null,null,20,"Ja","-",0,0]
["EL0016","PCB 6420","PCB 6420",6,"-",null,null,null,null,null,20,"Ja","-",0,0]
["EL0017","PCB 6435","PCB 6435",10,"-",null,null,null,null,null,20,"Ja","-",0,0]
["EL0018","PCB 6461","PCB 6461",6,"-",null,null,null,null,null,20,"Ja","-",0,0]
["EL0019","PCB 6463","PCB 6463",5,"-",null,null,null,null,null,20,"Ja","-",0,0]
["EL0020","PCB 6465","PCB 6465",6,"-",null,null,null,null,null,20,"Ja","-",0,0]
["EL0021","PCB 6707","PCB 6707",3,"-",null,null,null,null,null,20,"Ja","-",0,0]
["EL0022","PCB 6709","PCB 6709",10,"-",null,null,null,null,null,20,{"$f":"IF(K258>D258,$U$3,$U$5)","v":"Ja"},"-",0,0]
["EL0023","PCB 6713","PCB 6713",1,"-",null,null,null,null,null,20,"Ja","-",0,{"$f":"N259*D259","v":0}]
["EL0024","PCB 6910","PCB 6910",2,"-",null,null,null,null,null,20,"Ja","-",0,0]
["EL0025","PCB 6911","PCB 6911",2,"-",null,null,null,null,null,20,"Ja","-",0,0]
["EL0026","PCB 8004","PCB 8004",50,"-",null,null,null,null,null,20,"Nee","-",0,0]
["EL0027","PCB 8016","PCB 8016",80,"-",null,null,null,null,null,20,"Nee","-",0,0]
["EL0028","PCB 8020","PCB 8020",8,"-",null,null,null,null,null,20,"Ja","-",0,0]
["EL0029","PCB 8032","PCB 8032",50,"-",null,null,null,null,null,20,"Nee","-",0,0]
["EL0030","PCB 8101","PCB 8101",4,"-",null,null,null,null,null,20,"Ja","-",0,0]
["EL0031","PCB 8386xt","PCB 8386xt",30,"-",null,null,null,null,null,20,"Nee","-",0,0]
["EL0032","PCB 8386c","PCB 8386c",0,"-",null,null,null,null,null,20,"Ja","-",0,0]
["EL0033","PCB 8386 P104","PCB 8386 P104",82,"-",null,null,null,null,null,20,"Nee","-",0,0]
["EL0034","PCB 8402","PCB 8402",56,"-",null,null,null,null,null,20,"Nee","-",0,0]
["EL0035","PCB 8405","PCB 8405",25,"-",null,null,null,null,null,20,"Nee","-",0,0]
["EL0036","PCB 8411","PCB 8411",2,"-",null,null,null,null,null,20,"Ja","-",0,0]
["KC0001","PCB 8416","PCB 8416",133,"-",null,null,null,null,null,20,"Nee","-",0,0]
["KH0001","PCB 8416L","PCB 8416L",33,"-",null,null,null,null,null,20,"Nee","-",0,0]
["KH0002","PCB 8417","PCB 8417",34,"-",null,null,null,null,null,20,"Nee","-",0,0]
["LM0001","PCB 8417L","PCB 8417L",6,"-",null,null,null,null,null,20,"Ja","-",0,0]
["LM0002","PCB 8422","PCB 8422",1,"-",null,null,null,null,null,20,"Ja","-",0,0]
["LM0003","PCB 8426","PCB 8426",26,"-",null,null,null,null,null,20,"Nee","-",0,0]
["LM0004","PCB 8434","PCB 8434",31,"-",null,null,null,null,null,20,"Nee","-",0,0]
["LM0005","PCB 8434L","PCB 8434L",64,"-",null,null,null,null,null,20,"Nee","-",0,0]
["LM0006","PCB 8435","PCB 8435",25,"-",null,null,null,null,null,20,"Nee","-",0,0]
["LM0007","PCB 8440LB","PCB 8440LB",7,"-",null,null,null,null,null,20,"Ja","-",0,0]
["LM0008","PCB 8496","PCB 8496",41,"-",null,null,null,null,null,20,"Nee","-",0,0]
["LM0009","PCB 8498","PCB 8498",9,"-",null,null,null,null,null,20,"Ja","-",0,0]
["LM0010","PCB 8541","PCB 8541",5,"-",null,null,null,null,null,20,"Ja","-",0,0]
["LM0011","PCB 8553","PCB 8553",21,"-",null,null,null,null,null,20,"Nee","-",0,0]
["LM0012","PCB 8588","PCB 8588",1,"-",null,null,null,null,null,20,"Ja","-",0,0]
["LM0013","PCB 8599i","PCB 8599i",1,"-",null,null,null,null,null,20,"Ja","-",0,0]
["LM0014","PCB 8599","PCB 8599",4,"-",null,null,null,null,null,20,"Ja","-",0,0]
["LS0001","PCB ALR8-1abdL","PCB ALR8-1abdL",35,"-",null,null,null,null,null,20,"Nee","-",0,0]
["LS0002","PCB PD565","PCB PD565",4,"-",null,null,null,null,null,20,"Ja","-",0,0]
["LS0003","PCB PD3213","PCB PD3213",1,"-",null,null,null,null,null,20,"Ja","-",0,0]
["LS0004","PCB PD KRE 1a","PCB PD KRE 1a",2,"-",null,null,null,null,null,20,"Ja","-",0,0]
["LS0005","PCB Signum-10","PCB Signum-10",10,"-",null,null,null,null,null,20,"Ja","-",0,0]
["LS0006","PCB V542","PCB V542",9,"-",null,null,null,null,null,20,"Ja","-",0,0]
["LS0007","PCB V552","PCB V552",10,"-",null,null,null,null,null,20,"Ja","-",0,0]
["LS0008","PCB V556","PCB V556",2,"-",null,null,null,null,null,20,"Ja","-",0,0]
["LS0009","PCB V557","PCB V557",2,"-",null,null,null,null,null,20,"Ja","-",0,0]
["LS0010","PCB 80TST81","PCB 80TST81",1,"-",null,null,null,null,null,20,"Ja","-",0,0]
["LS0011","PCB 925L","PCB 925L",2,"-",null,null,null,null,"In doos diversen!",20,"Ja","-",0,0]
["LS0012",null,null,null,null,null,null,null,null,null,null,"Nee","-",null,0]
["LS0013",null,null,null,null,null,null,null,null,null,null,"Nee","-",null,0]
["LS0014",null,null,null,null,null,null,null,null,null,null,"Nee",null,null,0]
["LS0015",null,null,null,null,null,null,null,null,null,null,"Nee",null,null,0]
["LS0016",null,null,null,null,null,null,null,null,null,null,"Nee",null,null,0]
["LS0017",null,null,null,null,null,null,null,null,null,null,"Nee",null,null,0]
["LS0018",null,null,null,null,null,null,null,null,null,null,"Nee",null,null,0]
["LS0019",null,null,null,null,null,null,null,null,null,null,"Nee",null,null,0]
["LS0020",null,null,null,null,null,null,null,null,null,null,"Nee",null,null,0]
["LS0021",null,null,null,null,null,null,null,null,null,null,"Nee",null,null,0]
["LS0022",null,null,null,null,null,null,null,null,null,null,"Nee",null,null,0]
["LS0023",null,null,null,null,null,null,null,null,null,null,"Nee",null,null,0]
["LS0024",null,null,null,null,null,null,null,null,null,null,"Nee",null,null,0]
["LS0025",null,null,null,null,null,null,null,null,null,null,"Nee",null,null,0]
["LS0026",null,null,null,null,null,null,null,null,null,null,"Nee",null,null,0]
["LS0027",null,null,null,null,null,null,null,null,null,null,"Nee",null,null,0]
["LS0028",null,null,null,null,null,null,null,null,null,null,"Nee",null,null,0]
["LS0029",null,null,null,null,null,null,null,null,null,null,"Nee",null,null,0]
["LS0030",null,null,null,null,null,null,null,null,null,null,"Nee",null,null,0]
["LS0031",null,null,null,null,null,null,null,null,null,null,"Nee",null,null,0]
["LS0032",null,null,null,null,null,null,null,null,null,null,"Nee",null,null,0]
["LS0033",null,null,null,null,null,null,null,null,null,null,{"$f":"IF(K322>D322,$U$3,$U$5)","v":"Nee"},null,null,0]
["LS0034",null,null,null,null,null,null,null,null,null,null,"Nee",null,null,{"$f":"N323*D323","v":0}]
["LS0035",null,null,null,null,null,null,null,null,null,null,"Nee",null,null,0]
["LS0036",null,null,null,null,null,null,null,null,null,null,"Nee",null,null,0]
["LS0037",null,null,null,null,null,null,null,null,null,null,"Nee",null,null,0]
["LS0038",null,null,null,null,null,null,null,null,null,null,"Nee",null,null,0]
["LS0039",null,null,null,null,null,null,null,null,null,null,"Nee",null,null,0]
["LS0040",null,null,null,null,null,null,null,null,null,null,"Nee",null,null,0]
["LS0041",null,null,null,null,null,null,null,null,null,null,"Nee",null,null,0]
["LS0042",null,null,null,null,null,null,null,null,null,null,"Nee",null,null,0]
["LS0043",null,null,null,null,null,null,null,null,null,null,"Nee",null,null,0]
["LS0044",null,null,null,null,null,null,null,null,null,null,"Nee",null,null,0]
["LS0045",null,null,null,null,null,null,null,null,null,null,"Nee",null,null,0]
["LS0046",null,null,null,null,null,null,null,null,null,null,"Nee",null,null,0]
["LS0047",null,null,null,null,null,null,null,null,null,null,"Nee",null,null,0]
["LS0048",null,null,null,null,null,null,null,null,null,null,"Nee",null,null,0]
["LS0049",null,null,null,null,null,null,null,null,null,null,"Nee",null,null,0]
["LS0050",null,null,null,null,null,null,null,null,null,null,"Nee",null,null,0]
["LS0051",null,null,null,null,null,null,null,null,null,null,"Nee",null,null,0]
["LS0052",null,null,null,null,null,null,null,null,null,null,"Nee",null,null,0]
["LS0053",null,null,null,null,null,null,null,null,null,null,"Nee",null,null,0]
["LS0054",null,null,null,null,null,null,null,null,null,null,"Nee",null,null,0]
["LS0055",null,null,null,null,null,null,null,null,null,null,"Nee",null,null,0]
["LS0056",null,null,null,null,null,null,null,null,null,null,"Nee",null,null,0]
["LS0057",null,null,null,null,null,null,null,null,null,null,"Nee",null,null,0]
["LS0058",null,null,null,null,null,null,null,null,null,null,"Nee",null,null,0]
["LS0059",null,null,null,null,null,null,null,null,null,null,"Nee",null,null,0]
["LS0060",null,null,null,null,null,null,null,null,null,null,"Nee",null,null,0]
["LS0100",null,null,null,null,null,null,null,null,null,null,"Nee",null,null,0]
["MC0001",null,null,null,null,null,null,null,null,null,null,"Nee",null,null,0]
["RS0001",null,null,null,null,null,null,null,null,null,null,"Nee",null,null,0]
["ST0001",null,null,null,null,null,null,null,null,null,null,"Nee",null,null,0]
["VH0001",null,null,null,null,null,null,null,null,null,null,"Nee",null,null,0]
["VH0002",null,null,null,null,null,null,null,null,null,null,"Nee",null,null,0]
["VH0003",null,null,null,null,null,null,null,null,null,null,"Nee",null,null,0]
["VH0004",null,null,null,null,null,null,null,null,null,null,"Nee",null,null,0]
["VH0005",null,null,null,null,null,null,null,null,null,null,"Nee",null,null,0]
["VH0006",null,null,null,null,null,null,null,null,null,null,"Nee",null,null,0]
["VH0007",null,null,null,null,null,null,null,null,null,null,"Nee",null,null,0]
["VH0008",null,null,null,null,null,null,null,null,null,null,"Nee",null,null,0]
["VH0009",null,null,null,null,null,null,null,null,null,null,"Nee",null,null,0]
["VH0010",null,null,null,null,null,null,null,null,null,null,"Nee",null,null,0]
["VH0011",null,null,null,null,null,null,null,null,null,null,"Nee",null,null,0]
["VH0012",null,null,null,null,null,null,null,null,null,null,"Nee",null,null,0]
["VH0013",null,null,null,null,null,null,null,null,null,null,"Nee",null,null,0]
["VH0014",null,null,null,null,null,null,null,null,null,null,"Nee",null,null,0]
["VH0015",null,null,null,null,null,null,null,null,null,null,"Nee",null,null,0]
["VH0016",null,null,null,null,null,null,null,null,null,null,"Nee",null,null,0]
["VH0017",null,null,null,null,null,null,null,null,null,null,"Nee",null,null,0]
["VH0018",null,null,null,null,null,null,null,null,null,null,"Nee",null,null,0]
["VH0019",null,null,null,null,null,null,null,null,null,null,"Nee",null,null,0]
["VH0020",null,null,null,null,null,null,null,null,null,null,"Nee",null,null,0]
["VH0021",null,null,null,null,null,null,null,null,null,null,"Nee",null,null,0]
["VH0022",null,null,null,null,null,null,null,null,null,null,"Nee",null,null,0]
["VH0023",null,null,null,null,null,null,null,null,null,null,"Nee",null,null,0]
["VH0024",null,null,null,null,null,null,null,null,null,null,"Nee",null,null,0]
["VH0025",null,null,null,null,null,null,null,null,null,null,"Nee",null,null,0]
["VH0026",null,null,null,null,null,null,null,null,null,null,"Nee",null,null,0]
["VH0027",null,null,null,null,null,null,null,null,null,null,"Nee",null,null,0]
["VH0028",null,null,null,null,null,null,null,null,null,null,"Nee",null,null,0]
["VH0029",null,null,null,null,null,null,null,null,null,null,"Nee",null,null,0]
["VH0030",null,null,null,null,null,null,null,null,null,null,"Nee",null,null,0]
["VH0031",null,null,null,null,null,null,null,null,null,null,"Nee",null,null,0]
["VH0032",null,null,null,null,null,null,null,null,null,null,"Nee",null,null,0]
["VH0033",null,null,null,null,null,null,null,null,null,null,{"$f":"IF(K386>D386,$U$3,$U$5)","v":"Nee"},null,null,0]
["VH0034",null,null,null,null,null,null,null,null,null,null,"Nee",null,null,{"$f":"N387*D387","v":0}]
["VH0035",null,null,null,null,null,null,null,null,null,null,"Nee",null,null,0]
["VH0036",null,null,null,null,null,null,null,null,null,null,"Nee",null,null,0]
["VH0037",null,null,null,null,null,null,null,null,null,null,"Nee",null,null,0]
["VH0038",null,null,null,null,null,null,null,null,null,null,"Nee",null,null,0]
["VH0039",null,null,null,null,null,null,null,null,null,null,"Nee",null,null,0]
["VH0040",null,null,null,null,null,null,null,null,null,null,"Nee",null,null,0]
["VH0041",null,null,null,null,null,null,null,null,null,null,"Nee",null,null,0]
["VH0042",null,null,null,null,null,null,null,null,null,null,"Nee",null,null,0]
["VH0043",null,null,null,null,null,null,null,null,null,null,"Nee",null,null,0]
["VH0044",null,null,null,null,null,null,null,null,null,null,"Nee",null,null,0]
["VH0045",null,null,null,null,null,null,null,null,null,null,"Nee",null,null,0]
["VH0046",null,null,null,null,null,null,null,null,null,null,"Nee",null,null,0]
["VH0047",null,null,null,null,null,null,null,null,null,null,"Nee",null,null,0]
["VH0048",null,null,null,null,null,null,null,null,null,null,"Nee",null,null,0]
["VH0049",null,null,null,null,null,null,null,null,null,null,"Nee",null,null,0]
["VH0050",null,null,null,null,null,null,null,null,null,null,"Nee",null,null,0]
["VH0051",null,null,null,null,null,null,null,null,null,null,"Nee",null,null,0]
["VH0052",null,null,null,null,null,null,null,null,null,null,"Nee",null,null,0]
["VH0053",null,null,null,null,null,null,null,null,null,null,"Nee",null,null,0]
["VH0054",null,null,null,null,null,null,null,null,null,null,"Nee",null,null,0]
["VH0055",null,null,null,null,null,null,null,null,null,null,"Nee",null,null,0]
["VH0056",null,null,null,null,null,null,null,null,null,null,"Nee",null,null,0]
["VH0057",null,null,null,null,null,null,null,null,null,null,"Nee",null,null,0]
["VH0058",null,null,null,null,null,null,null,null,null,null,"Nee",null,null,0]
["VH0059",null,null,null,null,null,null,null,null,null,null,"Nee",null,null,0]
["VH0060",null,null,null,null,null,null,null,null,null,null,"Nee",null,null,0]
["VH0061",null,null,null,null,null,null,null,null,null,null,"Nee",null,null,0]
["VH0062",null,null,null,null,null,null,null,null,null,null,"Nee",null,null,0]
["VH0063",null,null,null,null,null,null,null,null,null,null,"Nee",null,null,0]
["VH0064",null,null,null,null,null,null,null,null,null,null,"Nee",null,null,0]
["VH0065",null,null,null,null,null,null,null,null,null,null,"Nee",null,null,0]
["VH0066",null,null,null,null,null,null,null,null,null,null,"Nee",null,null,0]
["VH0067",null,null,null,null,null,null,null,null,null,null,"Nee",null,null,0]
["VH0068",null,null,null,null,null,null,null,null,null,null,"Nee",null,null,0]
["VH0069",null,null,null,null,null,null,null,null,null,null,"Nee",null,null,0]
["VH0070",null,null,null,null,null,null,null,null,null,null,"Nee",null,null,0]
["VH0071",null,null,null,null,null,null,null,null,null,null,"Nee",null,null,0]
["VH0072",null,null,null,null,null,null,null,null,null,null,"Nee",null,null,0]
["VH0073",null,null,null,null,null,null,null,null,null,null,"Nee",null,null,0]
["VH0074",null,null,null,null,null,null,null,null,null,null,"Nee",null,null,0]
["VH0075",null,null,null,null,null,null,null,null,null,null,"Nee",null,null,0]
["VH0076",null,null,null,null,null,null,null,null,null,null,"Nee",null,null,0]
["VH0077",null,null,null,null,null,null,null,null,null,null,"Nee",null,null,0]
["VH0078",null,null,null,null,null,null,null,null,null,null,"Nee",null,null,0]
["VH0079",null,null,null,null,null,null,null,null,null,null,"Nee",null,null,0]
["VH0080",null,null,null,null,null,null,null,null,null,null,"Nee",null,null,0]
["VH0081",null,null,null,null,null,null,null,null,null,null,"Nee",null,null,0]
["VH0082",null,null,null,null,null,null,null,null,null,null,"Nee",null,null,0]
["VH0083",null,null,null,null,null,null,null,null,null,null,"Nee",null,null,0]
["VH0084",null,null,null,null,null,null,null,null,null,null,"Nee",null,null,0]
["VH0085",null,null,null,null,null,null,null,null,null,null,"Nee",null,null,0]
["VH0086",null,null,null,null,null,null,null,null,null,null,"Nee",null,null,0]
["VH0087",null,null,null,null,null,null,null,null,null,null,"Nee",null,null,0]
["VH0088",null,null,null,null,null,null,null,null,null,null,"Nee",null,null,0]
["VH0089",null,null,null,null,null,null,null,null,null,null,"Nee",null,null,0]
["VH0090",null,null,null,null,null,null,null,null,null,null,"Nee",null,null,0]
["VH0091",null,null,null,null,null,null,null,null,null,null,"Nee",null,null,0]
["VH0092",null,null,null,null,null,null,null,null,null,null,"Nee",null,null,0]
["VH0093",null,null,null,null,null,null,null,null,null,null,"Nee",null,null,0]
["VH0094",null,null,null,null,null,null,null,null,null,null,"Nee",null,null,0]
["VH0095",null,null,null,null,null,null,null,null,null,null,"Nee",null,null,0]
["VH0096",null,null,null,null,null,null,null,null,null,null,"Nee",null,null,0]
["VH0097",null,null,null,null,null,null,null,null,null,null,{"$f":"IF(K450>D450,$U$3,$U$5)","v":"Nee"},null,null,0]
["VH0098",null,null,null,null,null,null,null,null,null,null,"Nee",null,null,{"$f":"N451*D451","v":0}]
["VH0099",null,null,null,null,null,null,null,null,null,null,"Nee",null,null,0]
["VH0100",null,null,null,null,null,null,null,null,null,null,"Nee",null,null,0]
["VH0101",null,null,null,null,null,null,null,null,null,null,"Nee",null,null,0]
["VH0102",null,null,null,null,null,null,null,null,null,null,"Nee",null,null,0]
["VH0103",null,null,null,null,null,null,null,null,null,null,"Nee",null,null,0]
["VH0104",null,null,null,null,null,null,null,null,null,null,"Nee",null,null,0]
["VH0105",null,null,null,null,null,null,null,null,null,null,"Nee",null,null,0]
["VH0106",null,null,null,null,null,null,null,null,null,null,"Nee",null,null,0]
["VH0107",null,null,null,null,null,null,null,null,null,null,"Nee",null,null,0]
["VH0108",null,null,null,null,null,null,null,null,null,null,"Nee",null,null,0]
["VH0109",null,null,null,null,null,null,null,null,null,null,"Nee",null,null,0]
["VH0110",null,null,null,null,null,null,null,null,null,null,"Nee",null,null,0]
["VH0111",null,null,null,null,null,null,null,null,null,null,"Nee",null,null,0]
["VH0112",null,null,null,null,null,null,null,null,null,null,"Nee",null,null,0]
["VH0113",null,null,null,null,null,null,null,null,null,null,"Nee",null,null,0]
["VH0114",null,null,null,null,null,null,null,null,null,null,"Nee",null,null,0]
["VH0115",null,null,null,null,null,null,null,null,null,null,"Nee",null,null,0]
["VH0116",null,null,null,null,null,null,null,null,null,null,"Nee",null,null,0]
["VH0117",null,null,null,null,null,null,null,null,null,null,"Nee",null,null,0]
["VH0118",null,null,null,null,null,null,null,null,null,null,"Nee",null,null,0]
["VH0119",null,null,null,null,null,null,null,null,null,null,"Nee",null,null,0]
["VH0120",null,null,null,null,null,null,null,null,null,null,"Nee",null,null,0]
["VH0121",null,null,null,null,null,null,null,null,null,null,"Nee",null,null,0]
["VH0122",null,null,null,null,null,null,null,null,null,null,"Nee",null,null,0]
["VH0123",null,null,null,null,null,null,null,null,null,null,"Nee",null,null,0]
["VH0124",null,null,null,null,null,null,null,null,null,null,"Nee",null,null,0]
["VH0125",null,null,null,null,null,null,null,null,null,null,"Nee",null,null,0]
["VH0126",null,null,null,null,null,null,null,null,null,null,"Nee",null,null,0]
["VH0127",null,null,null,null,null,null,null,null,null,null,"Nee",null,null,0]
["VH0128",null,null,null,null,null,null,null,null,null,null,"Nee",null,null,0]
["VH0129",null,null,null,null,null,null,null,null,null,null,"Nee",null,null,0]
["VH0130",null,null,null,null,null,null,null,null,null,null,"Nee",null,null,0]
["VH0131",null,null,null,null,null,null,null,null,null,null,"Nee",null,null,0]
["VH0132",null,null,null,null,null,null,null,null,null,null,"Nee",null,null,0]
["VH0133",null,null,null,null,null,null,null,null,null,null,"Nee",null,null,0]
["VH0134",null,null,null,null,null,null,null,null,null,null,"Nee",null,null,0]
["VH0135",null,null,null,null,null,null,null,null,null,null,"Nee",null,null,0]
["VH0136",null,null,null,null,null,null,null,null,null,null,"Nee",null,null,0]
["VH0137",null,null,null,null,null,null,null,null,null,null,"Nee",null,null,0]
["VH0138",null,null,null,null,null,null,null,null,null,null,"Nee",null,null,0]
["VH0139",null,null,null,null,null,null,null,null,null,null,"Nee",null,null,0]
["VH0140",null,null,null,null,null,null,null,null,null,null,"Nee",null,null,0]
["VH0141",null,null,null,null,null,null,null,null,null,null,"Nee",null,null,0]
["VH0142",null,null,null,null,null,null,null,null,null,null,"Nee",null,null,0]
["VH0143",null,null,null,null,null,null,null,null,null,null,"Nee",null,null,0]
["VH0144",null,null,null,null,null,null,null,null,null,null,"Nee",null,null,0]
["VH0145",null,null,null,null,null,null,null,null,null,null,"Nee",null,null,0]
["VH0146",null,null,null,null,null,null,null,null,null,null,"Nee",null,null,0]
["VH0147",null,null,null,null,null,null,null,null,null,null,"Nee",null,null,0]
["VH0148",null,null,null,null,null,null,null,null,null,null,"Nee",null,null,0]
["VH0149",null,null,null,null,null,null,null,null,null,null,"Nee",null,null,0]
["VH0150",null,null,null,null,null,null,null,null,null,null,"Nee",null,null,0]
["VH0151",null,null,null,null,null,null,null,null,null,null,"Nee",null,null,0]
["VH0152",null,null,null,null,null,null,null,null,null,null,"Nee",null,null,0]
["VH0153",null,null,null,null,null,null,null,null,null,null,"Nee",null,null,0]
["VH0154",null,null,null,null,null,null,null,null,null,null,"Nee",null,null,0]
["VH0155",null,null,null,null,null,null,null,null,null,null,"Nee",null,null,0]
["VH0156",null,null,null,null,null,null,null,null,null,null,"Nee",null,null,0]
["VH0157",null,null,null,null,null,null,null,null,null,null,"Nee",null,null,0]
["VH0158",null,null,null,null,null,null,null,null,null,null,"Nee",null,null,0]
["VH0159",null,null,null,null,null,null,null,null,null,null,"Nee",null,null,0]
["VH0160",null,null,null,null,null,null,null,null,null,null,"Nee",null,null,0]
["VH0161",null,null,null,null,null,null,null,null,null,null,{"$f":"IF(K514>D514,$U$3,$U$5)","v":"Nee"},null,null,0]
["VH0162",null,null,null,null,null,null,null,null,null,null,"Nee",null,null,{"$f":"N515*D515","v":0}]
["VH0163",null,null,null,null,null,null,null,null,null,null,"Nee",null,null,0]
["VH0164",null,null,null,null,null,null,null,null,null,null,"Nee",null,null,0]
["VH0165",null,null,null,null,null,null,null,null,null,null,"Nee",null,null,0]
["VH0166",null,null,null,null,null,null,null,null,null,null,"Nee",null,null,0]
["VH0167",null,null,null,null,null,null,null,null,null,null,"Nee",null,null,0]
["VH0168",null,null,null,null,null,null,null,null,null,null,"Nee",null,null,0]
["VH0169",null,null,null,null,null,null,null,null,null,null,"Nee",null,null,0]
["VH0170",null,null,null,null,null,null,null,null,null,null,"Nee",null,null,0]
["VH0171",null,null,null,null,null,null,null,null,null,null,"Nee",null,null,0]
["VH0172",null,null,null,null,null,null,null,null,null,null,"Nee",null,null,0]
["VH0173",null,null,null,null,null,null,null,null,null,null,"Nee",null,null,0]
["VH0174",null,null,null,null,null,null,null,null,null,null,"Nee",null,null,0]
["VH0175",null,null,null,null,null,null,null,null,null,null,"Nee",null,null,0]
["VH0176",null,null,null,null,null,null,null,null,null,null,"Nee",null,null,0]
["VH0177",null,null,null,null,null,null,null,null,null,null,"Nee",null,null,0]
["VH0178",null,null,null,null,null,null,null,null,null,null,"Nee",null,null,0]
["VH0179",null,null,null,null,null,null,null,null,null,null,"Nee",null,null,0]
["VH0180",null,null,null,null,null,null,null,null,null,null,"Nee",null,null,0]
["VH0181",null,null,null,null,null,null,null,null,null,null,"Nee",null,null,0]
["VH0182",null,null,null,null,null,null,null,null,null,null,"Nee",null,null,0]
["VH0183",null,null,null,null,null,null,null,null,null,null,"Nee",null,null,0]
["VH0184",null,null,null,null,null,null,null,null,null,null,"Nee",null,null,0]
["VH0185",null,null,null,null,null,null,null,null,null,null,"Nee",null,null,0]
["VH0186",null,null,null,null,null,null,null,null,null,null,"Nee",null,null,0]
["VH0187",null,null,null,null,null,null,null,null,null,null,"Nee",null,null,0]
["VH0188",null,null,null,null,null,null,null,null,null,null,"Nee",null,null,0]
["VH0189",null,null,null,null,null,null,null,null,null,null,"Nee",null,null,0]
["VH0190",null,null,null,null,null,null,null,null,null,null,"Nee",null,null,0]
["VH0191",null,null,null,null,null,null,null,null,null,null,"Nee",null,null,0]
["VH0192",null,null,null,null,null,null,null,null,null,null,"Nee",null,null,0]
["VH0193",null,null,null,null,null,null,null,null,null,null,"Nee",null,null,0]
["VH0194",null,null,null,null,null,null,null,null,null,null,"Nee",null,null,0]
["VH0195",null,null,null,null,null,null,null,null,null,null,"Nee",null,null,0]
["VH0196",null,null,null,null,null,null,null,null,null,null,"Nee",null,null,0]
["VH0197",null,null,null,null,null,null,null,null,null,null,"Nee",null,null,0]
["VH0198",null,null,null,null,null,null,null,null,null,null,"Nee",null,null,0]
["VH0199",null,null,null,null,null,null,null,null,null,null,"Nee",null,null,0]
["VH0200",null,null,null,null,null,null,null,null,null,null,"Nee",null,null,0]
["VH0201",null,null,null,null,null,null,null,null,null,null,"Nee",null,null,0]
["VH0202",null,null,null,null,null,null,null,null,null,null,"Nee",null,null,0]
["VH0203",null,null,null,null,null,null,null,null,null,null,"Nee",null,null,0]
["VH0204",null,null,null,null,null,null,null,null,null,null,"Nee",null,null,0]
["VH0205",null,null,null,null,null,null,null,null,null,null,"Nee",null,null,0]
["VH0206",null,null,null,null,null,null,null,null,null,null,"Nee",null,null,0]
["VH0207",null,null,null,null,null,null,null,null,null,null,"Nee",null,null,0]
["VH0208",null,null,null,null,null,null,null,null,null,null,"Nee",null,null,0]
["VH0209",null,null,null,null,null,null,null,null,null,null,"Nee",null,null,0]
["VH0210",null,null,null,null,null,null,null,null,null,null,"Nee",null,null,0]
["VH0211",null,null,null,null,null,null,null,null,null,null,"Nee",null,null,0]
["VH0212",null,null,null,null,null,null,null,null,null,null,"Nee",null,null,0]
["VH0213",null,null,null,null,null,null,null,null,null,null,"Nee",null,null,0]
["VH0214",null,null,null,null,null,null,null,null,null,null,"Nee",null,null,0]
["VH0215",null,null,null,null,null,null,null,null,null,null,"Nee",null,null,0]
["VH0216",null,null,null,null,null,null,null,null,null,null,"Nee",null,null,0]
["VH0217",null,null,null,null,null,null,null,null,null,null,"Nee",null,null,0]
["VH0218",null,null,null,null,null,null,null,null,null,null,"Nee",null,null,0]
["VH0219",null,null,null,null,null,null,null,null,null,null,"Nee",null,null,0]
["VH0220",null,null,null,null,null,null,null,null,null,null,"Nee",null,null,0]
["VH0221",null,null,null,null,null,null,null,null,null,null,"Nee",null,null,0]
["VH0222",null,null,null,null,null,null,null,null,null,null,"Nee",null,null,0]
["VH0223",null,null,null,null,null,null,null,null,null,null,"Nee",null,null,0]
["VH0224",null,null,null,null,null,null,null,null,null,null,"Nee",null,null,0]
["VH0225",null,null,null,null,null,null,null,null,null,null,{"$f":"IF(K578>D578,$U$3,$U$5)","v":"Nee"},null,null,0]
["VH0226",null,null,null,null,null,null,null,null,null,null,"Nee",null,null,{"$f":"N579*D579","v":0}]
["VH0227",null,null,null,null,null,null,null,null,null,null,"Nee",null,null,0]
["VH0228",null,null,null,null,null,null,null,null,null,null,"Nee",null,null,0]
["VH0229",null,null,null,null,null,null,null,null,null,null,"Nee",null,null,0]
["VH0230",null,null,null,null,null,null,null,null,null,null,"Nee",null,null,0]
["VH0231",null,null,null,null,null,null,null,null,null,null,"Nee",null,null,0]
["VH0232",null,null,null,null,null,null,null,null,null,null,"Nee",null,null,0]
["VH0233",null,null,null,null,null,null,null,null,null,null,"Nee",null,null,0]
["VH0234",null,null,null,null,null,null,null,null,null,null,"Nee",null,null,0]
["VH0235",null,null,null,null,null,null,null,null,null,null,"Nee",null,null,0]
["VH0236",null,null,null,null,null,null,null,null,null,null,"Nee",null,null,0]
["VH0237",null,null,null,null,null,null,null,null,null,null,"Nee",null,null,0]
["VH0238",null,null,null,null,null,null,null,null,null,null,"Nee",null,null,0]
["VH0239",null,null,null,null,null,null,null,null,null,null,"Nee",null,null,0]
["VH0240",null,null,null,null,null,null,null,null,null,null,"Nee",null,null,0]
["VH0241",null,null,null,null,null,null,null,null,null,null,"Nee",null,null,0]
["VH0242",null,null,null,null,null,null,null,null,null,null,"Nee",null,null,0]
["VH0243",null,null,null,null,null,null,null,null,null,null,"Nee",null,null,0]
["VH0244",null,null,null,null,null,null,null,null,null,null,"Nee",null,null,0]
["VH0245",null,null,null,null,null,null,null,null,null,null,"Nee",null,null,0]
["VH0246",null,null,null,null,null,null,null,null,null,null,"Nee",null,null,0]
["VH0247",null,null,null,null,null,null,null,null,null,null,"Nee",null,null,0]
["VH0248",null,null,null,null,null,null,null,null,null,null,"Nee",null,null,0]
["VH0249",null,null,null,null,null,null,null,null,null,null,"Nee",null,null,0]
["VH0250",null,null,null,null,null,null,null,null,null,null,"Nee",null,null,0]
["VH0251",null,null,null,null,null,null,null,null,null,null,"Nee",null,null,0]
["VH0252",null,null,null,null,null,null,null,null,null,null,"Nee",null,null,0]
["VH0253",null,null,null,null,null,null,null,null,null,null,"Nee",null,null,0]
["VH0254",null,null,null,null,null,null,null,null,null,null,"Nee",null,null,0]
["VH0255",null,null,null,null,null,null,null,null,null,null,"Nee",null,null,0]
["VH0256",null,null,null,null,null,null,null,null,null,null,"Nee",null,null,0]
["VH0257",null,null,null,null,null,null,null,null,null,null,"Nee",null,null,0]
["VH0258",null,null,null,null,null,null,null,null,null,null,"Nee",null,null,0]
["VH0259",null,null,null,null,null,null,null,null,null,null,"Nee",null,null,0]
["VH0260",null,null,null,null,null,null,null,null,null,null,"Nee",null,null,0]
["VH0261",null,null,null,null,null,null,null,null,null,null,"Nee",null,null,0]
["VH0262",null,null,null,null,null,null,null,null,null,null,"Nee",null,null,0]
["VH0263",null,null,null,null,null,null,null,null,null,null,"Nee",null,null,0]
["VH0264",null,null,null,null,null,null,null,null,null,null,"Nee",null,null,0]
["VH0265",null,null,null,null,null,null,null,null,null,null,"Nee",null,null,0]
["VH0266",null,null,null,null,null,null,null,null,null,null,"Nee",null,null,0]
["VH0267",null,null,null,null,null,null,null,null,null,null,"Nee",null,null,0]
["VH0268",null,null,null,null,null,null,null,null,null,null,"Nee",null,null,0]
["VH0269",null,null,null,null,null,null,null,null,null,null,"Nee",null,null,0]
["VH0270",null,null,null,null,null,null,null,null,null,null,"Nee",null,null,0]
["VH0271",null,null,null,null,null,null,null,null,null,null,"Nee",null,null,0]
["VH0272",null,null,null,null,null,null,null,null,null,null,"Nee",null,null,0]
["VH0273",null,null,null,null,null,null,null,null,null,null,"Nee",null,null,0]
["VH0274",null,null,null,null,null,null,null,null,null,null,"Nee",null,null,0]
["VH0275",null,null,null,null,null,null,null,null,null,null,"Nee",null,null,0]
["VH0276",null,null,null,null,null,null,null,null,null,null,"Nee",null,null,0]
["VH0277",null,null,null,null,null,null,null,null,null,null,"Nee",null,null,0]
["VH0278",null,null,null,null,null,null,null,null,null,null,"Nee",null,null,0]
["VH0279",null,null,null,null,null,null,null,null,null,null,"Nee",null,null,0]
["VH0280",null,null,null,null,null,null,null,null,null,null,"Nee",null,null,0]
["VH0281",null,null,null,null,null,null,null,null,null,null,"Nee",null,null,0]
["VH0282",null,null,null,null,null,null,null,null,null,null,"Nee",null,null,0]
["VH0283",null,null,null,null,null,null,null,null,null,null,"Nee",null,null,0]
["VH0284",null,null,null,null,null,null,null,null,null,null,"Nee",null,null,0]
["VH0285",null,null,null,null,null,null,null,null,null,null,"Nee",null,null,0]
["VH0286",null,null,null,null,null,null,null,null,null,null,"Nee",null,null,0]
["VH0287",null,null,null,null,null,null,null,null,null,null,"Nee",null,null,0]
["VH0288",null,null,null,null,null,null,null,null,null,null,"Nee",null,null,0]
["VH0289",null,null,null,null,null,null,null,null,null,null,{"$f":"IF(K642>D642,$U$3,$U$5)","v":"Nee"},null,null,0]
["VH0290",null,null,null,null,null,null,null,null,null,null,"Nee",null,null,{"$f":"N643*D643","v":0}]
["VH0291",null,null,null,null,null,null,null,null,null,null,"Nee",null,null,0]
["VH0292",null,null,null,null,null,null,null,null,null,null,"Nee",null,null,0]
["VH0293",null,null,null,null,null,null,null,null,null,null,"Nee",null,null,0]
["VH0294",null,null,null,null,null,null,null,null,null,null,"Nee",null,null,0]
["VH0295",null,null,null,null,null,null,null,null,null,null,"Nee",null,null,0]
["VH0296",null,null,null,null,null,null,null,null,null,null,"Nee",null,null,0]
["VH0297",null,null,null,null,null,null,null,null,null,null,"Nee",null,null,0]
["VH0298",null,null,null,null,null,null,null,null,null,null,"Nee",null,null,0]
["VH0299",null,null,null,null,null,null,null,null,null,null,"Nee",null,null,0]
["VH0300",null,null,null,null,null,null,null,null,null,null,"Nee",null,null,0]
["VH0301",null,null,null,null,null,null,null,null,null,null,"Nee",null,null,0]
["VH0302",null,null,null,null,null,null,null,null,null,null,"Nee",null,null,0]
["VH0303",null,null,null,null,null,null,null,null,null,null,"Nee",null,null,0]
["VH0304",null,null,null,null,null,null,null,null,null,null,"Nee",null,null,0]
["VH0305",null,null,null,null,null,null,null,null,null,null,"Nee",null,null,0]
["VH0306",null,null,null,null,null,null,null,null,null,null,"Nee",null,null,0]
["VH0307",null,null,null,null,null,null,null,null,null,null,"Nee",null,null,0]
["VH0308",null,null,null,null,null,null,null,null,null,null,"Nee",null,null,0]
["VH0309",null,null,null,null,null,null,null,null,null,null,"Nee",null,null,0]
["VH0310",null,null,null,null,null,null,null,null,null,null,"Nee",null,null,0]
["VH0311",null,null,null,null,null,null,null,null,null,null,"Nee",null,null,0]
["VH0312",null,null,null,null,null,null,null,null,null,null,"Nee",null,null,0]
["VH0313",null,null,null,null,null,null,null,null,null,null,"Nee",null,null,0]
["VH0314",null,null,null,null,null,null,null,null,null,null,"Nee",null,null,0]
["VH0315",null,null,null,null,null,null,null,null,null,null,"Nee",null,null,0]
["VH0316",null,null,null,null,null,null,null,null,null,null,"Nee",null,null,0]
["VH0317",null,null,null,null,null,null,null,null,null,null,"Nee",null,null,0]
["VH0318",null,null,null,null,null,null,null,null,null,null,"Nee",null,null,0]
["VH0319",null,null,null,null,null,null,null,null,null,null,"Nee",null,null,0]
["VH0320",null,null,null,null,null,null,null,null,null,null,"Nee",null,null,0]
["VH0321",null,null,null,null,null,null,null,null,null,null,"Nee",null,null,0]
["VH0322",null,null,null,null,null,null,null,null,null,null,"Nee",null,null,0]
["VH0323",null,null,null,null,null,null,null,null,null,null,"Nee",null,null,0]
["VH0324",null,null,null,null,null,null,null,null,null,null,"Nee",null,null,0]
["VH0325",null,null,null,null,null,null,null,null,null,null,"Nee",null,null,0]
["VH0326",null,null,null,null,null,null,null,null,null,null,"Nee",null,null,0]
["VH0327",null,null,null,null,null,null,null,null,null,null,"Nee",null,null,0]
["VH0328",null,null,null,null,null,null,null,null,null,null,"Nee",null,null,0]
["VH0329",null,null,null,null,null,null,null,null,null,null,"Nee",null,null,0]
["VH0330",null,null,null,null,null,null,null,null,null,null,"Nee",null,null,0]
["VH0331",null,null,null,null,null,null,null,null,null,null,"Nee",null,null,0]
["VH0332",null,null,null,null,null,null,null,null,null,null,"Nee",null,null,0]
["VH0333",null,null,null,null,null,null,null,null,null,null,"Nee",null,null,0]
["VH0334",null,null,null,null,null,null,null,null,null,null,"Nee",null,null,0]
["VH0335",null,null,null,null,null,null,null,null,null,null,"Nee",null,null,0]
["VH0336",null,null,null,null,null,null,null,null,null,null,"Nee",null,null,0]
["VH0337",null,null,null,null,null,null,null,null,null,null,"Nee",null,null,0]
["VH0338",null,null,null,null,null,null,null,null,null,null,"Nee",null,null,0]
["VH0339",null,null,null,null,null,null,null,null,null,null,"Nee",null,null,0]
["VH0340",null,null,null,null,null,null,null,null,null,null,"Nee",null,null,0]
["VH0341",null,null,null,null,null,null,null,null,null,null,"Nee",null,null,0]
["VH0342",null,null,null,null,null,null,null,null,null,null,"Nee",null,null,0]
["VH0343",null,null,null,null,null,null,null,null,null,null,"Nee",null,null,0]
["VH0344",null,null,null,null,null,null,null,null,null,null,"Nee",null,null,0]
["VH0345",null,null,null,null,null,null,null,null,null,null,"Nee",null,null,0]
["VH0346",null,null,null,null,null,null,null,null,null,null,"Nee",null,null,0]
["VH0347",null,null,null,null,null,null,null,null,null,null,"Nee",null,null,0]
["VH0348",null,null,null,null,null,null,null,null,null,null,"Nee",null,null,0]
["VH0349",null,null,null,null,null,null,null,null,null,null,"Nee",null,null,0]
["VH0350",null,null,null,null,null,null,null,null,null,null,"Nee",null,null,0]
["VH0351",null,null,null,null,null,null,null,null,null,null,"Nee",null,null,0]
["VH0352",null,null,null,null,null,null,null,null,null,null,"Nee",null,null,0]
["VH0353",null,null,null,null,null,null,null,null,null,null,{"$f":"IF(K706>D706,$U$3,$U$5)","v":"Nee"},null,null,0]
["VH0354",null,null,null,null,null,null,null,null,null,null,"Nee",null,null,{"$f":"N707*D707","v":0}]
["VO0001",null,null,null,null,null,null,null,null,null,null,"Nee",null,null,0]
["VO0002",null,null,null,null,null,null,null,null,null,null,"Nee",null,null,0]
["VO0003",null,null,null,null,null,null,null,null,null,null,"Nee",null,null,0]
["VO0004",null,null,null,null,null,null,null,null,null,null,"Nee",null,null,0]
["VO0005",null,null,null,null,null,null,null,null,null,null,"Nee",null,null,0]
["VO0006",null,null,null,null,null,null,null,null,null,null,"Nee",null,null,0]
["VO0007",null,null,null,null,null,null,null,null,null,null,"Nee",null,null,0]
["VO0008",null,null,null,null,null,null,null,null,null,null,"Nee",null,null,0]
["VO0009",null,null,null,null,null,null,null,null,null,null,"Nee",null,null,0]
["VO0010",null,null,null,null,null,null,null,null,null,null,"Nee",null,null,0]
["VO0011",null,null,null,null,null,null,null,null,null,null,"Nee",null,null,0]
["VO0012",null,null,null,null,null,null,null,null,null,null,"Nee",null,null,0]
["VO0013",null,null,null,null,null,null,null,null,null,null,"Nee",null,null,0]
["VO0014",null,null,null,null,null,null,null,null,null,null,"Nee",null,null,0]
["VO0015",null,null,null,null,null,null,null,null,null,null,"Nee",null,null,0]
["VO0016",null,null,null,null,null,null,null,null,null,null,"Nee",null,null,0]
["VO0017",null,null,null,null,null,null,null,null,null,null,"Nee",null,null,0]
["VO0018",null,null,null,null,null,null,null,null,null,null,"Nee",null,null,0]
["VO0019",null,null,null,null,null,null,null,null,null,null,"Nee",null,null,0]
["VO0020",null,null,null,null,null,null,null,null,null,null,"Nee",null,null,0]
["VO0021",null,null,null,null,null,null,null,null,null,null,"Nee",null,null,0]
["VO0022",null,null,null,null,null,null,null,null,null,null,"Nee",null,null,0]
["VO0023",null,null,null,null,null,null,null,null,null,null,"Nee",null,null,0]
["VO0024",null,null,null,null,null,null,null,null,null,null,"Nee",null,null,0]
["VO0025",null,null,null,null,null,null,null,null,null,null,"Nee",null,null,0]
["VO0026",null,null,null,null,null,null,null,null,null,null,"Nee",null,null,0]
["VO0027",null,null,null,null,null,null,null,null,null,null,"Nee",null,null,0]
["VO0028",null,null,null,null,null,null,null,null,null,null,"Nee",null,null,0]
["VO0029",null,null,null,null,null,null,null,null,null,null,"Nee",null,null,0]
["VO0030",null,null,null,null,null,null,null,null,null,null,"Nee",null,null,0]
["VO0031",null,null,null,null,null,null,null,null,null,null,"Nee",null,null,0]
["VO0032",null,null,null,null,null,null,null,null,null,null,"Nee",null,null,0]
["VO0033",null,null,null,null,null,null,null,null,null,null,"Nee",null,null,0]
["VO0034",null,null,null,null,null,null,null,null,null,null,"Nee",null,null,0]
["VO0035",null,null,null,null,null,null,null,null,null,null,"Nee",null,null,0]
["VO0036",null,null,null,null,null,null,null,null,null,null,"Nee",null,null,0]
["VO0037",null,null,null,null,null,null,null,null,null,null,"Nee",null,null,0]
["VO0038",null,null,null,null,null,null,null,null,null,null,"Nee",null,null,0]
["VO0039",null,null,null,null,null,null,null,null,null,null,"Nee",null,null,0]
["VO0040",null,null,null,null,null,null,null,null,null,null,"Nee",null,null,0]
["VO0041",null,null,null,null,null,null,null,null,null,null,"Nee",null,null,0]
["VO0042",null,null,null,null,null,null,null,null,null,null,"Nee",null,null,0]
["VO0043",null,null,null,null,null,null,null,null,null,null,"Nee",null,null,0]
["VO0044",null,null,null,null,null,null,null,null,null,null,"Nee",null,null,0]
["VO0045",null,null,null,null,null,null,null,null,null,null,"Nee",null,null,0]
["VO0046",null,null,null,null,null,null,null,null,null,null,"Nee",null,null,0]
["VO0047",null,null,null,null,null,null,null,null,null,null,"Nee",null,null,0]
["VO0048",null,null,null,null,null,null,null,null,null,null,"Nee",null,null,0]
["VO0049",null,null,null,null,null,null,null,null,null,null,"Nee",null,null,0]
["VO0050",null,null,null,null,null,null,null,null,null,null,"Nee",null,null,0]
["VO0051",null,null,null,null,null,null,null,null,null,null,"Nee",null,null,0]
["VO0052",null,null,null,null,null,null,null,null,null,null,"Nee",null,null,0]
["VO0053",null,null,null,null,null,null,null,null,null,null,"Nee",null,null,0]
["VO0054",null,null,null,null,null,null,null,null,null,null,"Nee",null,null,0]
["VO0055",null,null,null,null,null,null,null,null,null,null,"Nee",null,null,0]
["VO0056",null,null,null,null,null,null,null,null,null,null,"Nee",null,null,0]
["VO0057",null,null,null,null,null,null,null,null,null,null,"Nee",null,null,0]
["VO0058",null,null,null,null,null,null,null,null,null,null,"Nee",null,null,0]
["VO0059",null,null,null,null,null,null,null,null,null,null,"Nee",null,null,0]
["VO0060",null,null,null,null,null,null,null,null,null,null,"Nee",null,null,0]
["VO0061",null,null,null,null,null,null,null,null,null,null,"Nee",null,null,0]
["VO0063",null,null,null,null,null,null,null,null,null,null,"Nee",null,null,0]
["VO0064",null,null,null,null,null,null,null,null,null,null,{"$f":"IF(K770>D770,$U$3,$U$5)","v":"Nee"},null,null,0]
["VO0065",null,null,null,null,null,null,null,null,null,null,"Nee",null,null,{"$f":"N771*D771","v":0}]
["VO0066",null,null,null,null,null,null,null,null,null,null,"Nee",null,null,0]
["VO0067",null,null,null,null,null,null,null,null,null,null,"Nee",null,null,0]
["VO0068",null,null,null,null,null,null,null,null,null,null,"Nee",null,null,0]
["VO0071",null,null,null,null,null,null,null,null,null,null,"Nee",null,null,0]
["VO0072",null,null,null,null,null,null,null,null,null,null,"Nee",null,null,0]
["VO0073",null,null,null,null,null,null,null,null,null,null,"Nee",null,null,0]
["VO0074",null,null,null,null,null,null,null,null,null,null,"Nee",null,null,0]
["VO0075",null,null,null,null,null,null,null,null,null,null,"Nee",null,null,0]
["VO0076",null,null,null,null,null,null,null,null,null,null,"Nee",null,null,0]
["VO0077",null,null,null,null,null,null,null,null,null,null,"Nee",null,null,0]
["VO0078",null,null,null,null,null,null,null,null,null,null,"Nee",null,null,0]
["VH0355",null,null,null,null,null,null,null,null,null,null,"Nee",null,null,0]
["BR2864",null,null,null,null,null,null,null,null,null,null,"Nee",null,null,0]
["BX0056",null,null,null,null,null,null,null,null,null,null,"Nee",null,null,0]
[null,null,null,0,null,null,null,null,null,null,null,null,null,null,0]
[null,null,null,null,null,null,null,null,null,null,null,null,null,null,0]
["VH0356",null,null,null,null,null,null,null,null,null,null,{"$f":"IF(K788>D788,$U$3,$U$5)","v":"Nee"},null,null,0]
[]
[]
[]
[]
[]
[]
[null,null," "]

{"sheet":"Picklijst 8410","index":2,"n_rows":33,"n_cols":14,"rows_kept":33,"cut":false,"hidden":false,"merged":[]}
[]
["Pickorder 8410",null,{"$f":"[1]Sheet1!$D$2","v":5},"X"]
[]
[]
[]
[]
[]
["Art Nr CSI","Benodigd","Art Nr CSI","Omschrijving","Leverancier Nr","Produco Nr","OrderNr","Opmerkingen/Alternatieven","Leverancier","Producent","PCB","Voorraad","Benodigd","Bestellen"]
["BX0014",{"$f":"[1]Sheet1!$E$4","v":140},{"$f":"IF(ISERROR(VLOOKUP($A$9,Voorraad!$A$2:$D$1001,1)),\"\",VLOOKUP($A$9,Voorraad!$A$2:$D$1001,1))","v":"BX0014"},{"$f":"IF(ISERROR(VLOOKUP($A$9,Voorraad!$A$2:$D$1001,3)),\"\",VLOOKUP($A$9,Voorraad!$A$2:$D$1001,3))","v":"MSTB 2.5/2ST-5.08 AANSLUITBLOK"},{"$f":"IF(ISERROR(VLOOKUP($A$9,Voorraad!$A$2:$D$1001,2)),\"\",VLOOKUP($A$9,Voorraad!$A$2:$D$1001,2))","v":101280},{"$f":"IF(ISERROR(VLOOKUP($A$9,Voorraad!$A$2:$H$1001,8)),\"\",VLOOKUP($A$9,Voorraad!$A$2:$H$1001,8))","v":0},{"$f":"IF(ISERROR(VLOOKUP($A$9,Voorraad!$A$2:$I$1001,9)),\"\",VLOOKUP($A$9,Voorraad!$A$2:$I$1001,9))","v":1757019},{"$f":"IF(ISERROR(VLOOKUP($A$9,Voorraad!$A$2:$J$1001,10)),\"\",VLOOKUP($A$9,Voorraad!$A$2:$J$1001,10))","v":0},{"$f":"IF(ISERROR(VLOOKUP($A$9,Voorraad!$A$2:$G$1001,6)),\"\",VLOOKUP($A$9,Voorraad!$A$2:$G$1001,6))","v":0},{"$f":"IF(ISERROR(VLOOKUP($A$9,Voorraad!$A$2:$G$1001,7)),\"\",VLOOKUP($A$9,Voorraad!$A$2:$G$1001,7))","v":"PHOENIX"},{"$f":"IF(ISERROR(VLOOKUP($A$9,Voorraad!$A$2:$G$1001,5)),\"\",VLOOKUP($A$9,Voorraad!$A$2:$G$1001,5))","v":8410},{"$f":"IF(ISERROR(VLOOKUP($A$9,Voorraad!$A$2:$D$1001,4)),\"\",VLOOKUP($A$9,Voorraad!$A$2:$D$1001,4))","v":0},{"$f":"B9","v":140},{"$f":"MAX(0,(SUM(M9-L9)))","v":140}]
["BX0015",{"$f":"[1]Sheet1!$E$5","v":70},{"$f":"IF(ISERROR(VLOOKUP($A$10,Voorraad!$A$2:$D$1001,1)),\"\",VLOOKUP($A$10,Voorraad!$A$2:$D$1001,1))","v":"BX0015"},{"$f":"IF(ISERROR(VLOOKUP($A$10,Voorraad!$A$2:$D$1001,3)),\"\",VLOOKUP($A$10,Voorraad!$A$2:$D$1001,3))","v":"MDSTBW 2.5/2 PRINTPLAATCONNECTOR"},{"$f":"IF(ISERROR(VLOOKUP($A$10,Voorraad!$A$2:$D$1001,2)),\"\",VLOOKUP($A$10,Voorraad!$A$2:$D$1001,2))","v":101300},{"$f":"IF(ISERROR(VLOOKUP($A$10,Voorraad!$A$2:$H$1001,8)),\"\",VLOOKUP($A$10,Voorraad!$A$2:$H$1001,8))","v":0},{"$f":"IF(ISERROR(VLOOKUP($A$10,Voorraad!$A$2:$I$1001,9)),\"\",VLOOKUP($A$10,Voorraad!$A$2:$I$1001,9))","v":1802430},{"$f":"IF(ISERROR(VLOOKUP($A$10,Voorraad!$A$2:$J$1001,10)),\"\",VLOOKUP($A$10,Voorraad!$A$2:$J$1001,10))","v":0},{"$f":"IF(ISERROR(VLOOKUP($A$10,Voorraad!$A$2:$G$1001,6)),\"\",VLOOKUP($A$10,Voorraad!$A$2:$G$1001,6))","v":0},{"$f":"IF(ISERROR(VLOOKUP($A$10,Voorraad!$A$2:$G$1001,7)),\"\",VLOOKUP($A$10,Voorraad!$A$2:$G$1001,7))","v":"PHOENIX"},{"$f":"IF(ISERROR(VLOOKUP($A$10,Voorraad!$A$2:$G$1001,5)),\"\",VLOOKUP($A$10,Voorraad!$A$2:$G$1001,5))","v":8410},{"$f":"IF(ISERROR(VLOOKUP($A$10,Voorraad!$A$2:$D$1001,4)),\"\",VLOOKUP($A$10,Voorraad!$A$2:$D$1001,4))","v":0},70,70]
["BX0010",{"$f":"[1]Sheet1!$E$6","v":10},{"$f":"IF(ISERROR(VLOOKUP($A$11,Voorraad!$A$2:$D$1001,1)),\"\",VLOOKUP($A$11,Voorraad!$A$2:$D$1001,1))","v":"BX0010"},{"$f":"IF(ISERROR(VLOOKUP($A$11,Voorraad!$A$2:$D$1001,3)),\"\",VLOOKUP($A$11,Voorraad!$A$2:$D$1001,3))","v":"BL2 R5.08"},{"$f":"IF(ISERROR(VLOOKUP($A$11,Voorraad!$A$2:$D$1001,2)),\"\",VLOOKUP($A$11,Voorraad!$A$2:$D$1001,2))","v":101410},{"$f":"IF(ISERROR(VLOOKUP($A$11,Voorraad!$A$2:$H$1001,8)),\"\",VLOOKUP($A$11,Voorraad!$A$2:$H$1001,8))","v":0},{"$f":"IF(ISERROR(VLOOKUP($A$11,Voorraad!$A$2:$I$1001,9)),\"\",VLOOKUP($A$11,Voorraad!$A$2:$I$1001,9))","v":0},{"$f":"IF(ISERROR(VLOOKUP($A$11,Voorraad!$A$2:$J$1001,10)),\"\",VLOOKUP($A$11,Voorraad!$A$2:$J$1001,10))","v":0},{"$f":"IF(ISERROR(VLOOKUP($A$11,Voorraad!$A$2:$G$1001,6)),\"\",VLOOKUP($A$11,Voorraad!$A$2:$G$1001,6))","v":0},{"$f":"IF(ISERROR(VLOOKUP($A$11,Voorraad!$A$2:$G$1001,7)),\"\",VLOOKUP($A$11,Voorraad!$A$2:$G$1001,7))","v":"WEIDMULLER"},{"$f":"IF(ISERROR(VLOOKUP($A$11,Voorraad!$A$2:$G$1001,5)),\"\",VLOOKUP($A$11,Voorraad!$A$2:$G$1001,5))","v":8410},{"$f":"IF(ISERROR(VLOOKUP($A$11,Voorraad!$A$2:$D$1001,4)),\"\",VLOOKUP($A$11,Voorraad!$A$2:$D$1001,4))","v":0},10,10]
["BX0011",{"$f":"[1]Sheet1!$E$7","v":10},{"$f":"IF(ISERROR(VLOOKUP($A$12,Voorraad!$A$2:$D$1001,1)),\"\",VLOOKUP($A$12,Voorraad!$A$2:$D$1001,1))","v":"BX0011"},{"$f":"IF(ISERROR(VLOOKUP($A$12,Voorraad!$A$2:$D$1001,3)),\"\",VLOOKUP($A$12,Voorraad!$A$2:$D$1001,3))","v":"SL2 R5.08"},{"$f":"IF(ISERROR(VLOOKUP($A$12,Voorraad!$A$2:$D$1001,2)),\"\",VLOOKUP($A$12,Voorraad!$A$2:$D$1001,2))","v":101420},{"$f":"IF(ISERROR(VLOOKUP($A$12,Voorraad!$A$2:$H$1001,8)),\"\",VLOOKUP($A$12,Voorraad!$A$2:$H$1001,8))","v":0},{"$f":"IF(ISERROR(VLOOKUP($A$12,Voorraad!$A$2:$I$1001,9)),\"\",VLOOKUP($A$12,Voorraad!$A$2:$I$1001,9))","v":0},{"$f":"IF(ISERROR(VLOOKUP($A$12,Voorraad!$A$2:$J$1001,10)),\"\",VLOOKUP($A$12,Voorraad!$A$2:$J$1001,10))","v":0},{"$f":"IF(ISERROR(VLOOKUP($A$12,Voorraad!$A$2:$G$1001,6)),\"\",VLOOKUP($A$12,Voorraad!$A$2:$G$1001,6))","v":0},{"$f":"IF(ISERROR(VLOOKUP($A$12,Voorraad!$A$2:$G$1001,7)),\"\",VLOOKUP($A$12,Voorraad!$A$2:$G$1001,7))","v":"WEIDMULLER"},{"$f":"IF(ISERROR(VLOOKUP($A$12,Voorraad!$A$2:$G$1001,5)),\"\",VLOOKUP($A$12,Voorraad!$A$2:$G$1001,5))","v":8410},{"$f":"IF(ISERROR(VLOOKUP($A$12,Voorraad!$A$2:$D$1001,4)),\"\",VLOOKUP($A$12,Voorraad!$A$2:$D$1001,4))","v":0},10,10]
["BX0012",{"$f":"[1]Sheet1!$E$8","v":15},{"$f":"IF(ISERROR(VLOOKUP($A$13,Voorraad!$A$2:$D$1001,1)),\"\",VLOOKUP($A$13,Voorraad!$A$2:$D$1001,1))","v":"BX0012"},{"$f":"IF(ISERROR(VLOOKUP($A$13,Voorraad!$A$2:$D$1001,3)),\"\",VLOOKUP($A$13,Voorraad!$A$2:$D$1001,3))","v":"SL4 R5.08"},{"$f":"IF(ISERROR(VLOOKUP($A$13,Voorraad!$A$2:$D$1001,2)),\"\",VLOOKUP($A$13,Voorraad!$A$2:$D$1001,2))","v":101440},{"$f":"IF(ISERROR(VLOOKUP($A$13,Voorraad!$A$2:$H$1001,8)),\"\",VLOOKUP($A$13,Voorraad!$A$2:$H$1001,8))","v":0},{"$f":"IF(ISERROR(VLOOKUP($A$13,Voorraad!$A$2:$I$1001,9)),\"\",VLOOKUP($A$13,Voorraad!$A$2:$I$1001,9))","v":0},{"$f":"IF(ISERROR(VLOOKUP($A$13,Voorraad!$A$2:$J$1001,10)),\"\",VLOOKUP($A$13,Voorraad!$A$2:$J$1001,10))","v":0},{"$f":"IF(ISERROR(VLOOKUP($A$13,Voorraad!$A$2:$G$1001,6)),\"\",VLOOKUP($A$13,Voorraad!$A$2:$G$1001,6))","v":0},{"$f":"IF(ISERROR(VLOOKUP($A$13,Voorraad!$A$2:$G$1001,7)),\"\",VLOOKUP($A$13,Voorraad!$A$2:$G$1001,7))","v":"WEIDMULLER"},{"$f":"IF(ISERROR(VLOOKUP($A$13,Voorraad!$A$2:$G$1001,5)),\"\",VLOOKUP($A$13,Voorraad!$A$2:$G$1001,5))","v":8410},{"$f":"IF(ISERROR(VLOOKUP($A$13,Voorraad!$A$2:$D$1001,4)),\"\",VLOOKUP($A$13,Voorraad!$A$2:$D$1001,4))","v":0},15,15]
["BU0079",{"$f":"[1]Sheet1!$E$9","v":15},{"$f":"IF(ISERROR(VLOOKUP($A$14,Voorraad!$A$2:$D$1001,1)),\"\",VLOOKUP($A$14,Voorraad!$A$2:$D$1001,1))","v":"BU0079"},{"$f":"IF(ISERROR(VLOOKUP($A$14,Voorraad!$A$2:$D$1001,3)),\"\",VLOOKUP($A$14,Voorraad!$A$2:$D$1001,3))","v":"BL5.08/4 "},{"$f":"IF(ISERROR(VLOOKUP($A$14,Voorraad!$A$2:$D$1001,2)),\"\",VLOOKUP($A$14,Voorraad!$A$2:$D$1001,2))","v":"#5F171634"},{"$f":"IF(ISERROR(VLOOKUP($A$14,Voorraad!$A$2:$H$1001,8)),\"\",VLOOKUP($A$14,Voorraad!$A$2:$H$1001,8))","v":0},{"$f":"IF(ISERROR(VLOOKUP($A$14,Voorraad!$A$2:$I$1001,9)),\"\",VLOOKUP($A$14,Voorraad!$A$2:$I$1001,9))","v":0},{"$f":"IF(ISERROR(VLOOKUP($A$14,Voorraad!$A$2:$J$1001,10)),\"\",VLOOKUP($A$14,Voorraad!$A$2:$J$1001,10))","v":0},{"$f":"IF(ISERROR(VLOOKUP($A$14,Voorraad!$A$2:$G$1001,6)),\"\",VLOOKUP($A$14,Voorraad!$A$2:$G$1001,6))","v":0},{"$f":"IF(ISERROR(VLOOKUP($A$14,Voorraad!$A$2:$G$1001,7)),\"\",VLOOKUP($A$14,Voorraad!$A$2:$G$1001,7))","v":"WEIDMULLER"},{"$f":"IF(ISERROR(VLOOKUP($A$14,Voorraad!$A$2:$G$1001,5)),\"\",VLOOKUP($A$14,Voorraad!$A$2:$G$1001,5))","v":8510},{"$f":"IF(ISERROR(VLOOKUP($A$14,Voorraad!$A$2:$D$1001,4)),\"\",VLOOKUP($A$14,Voorraad!$A$2:$D$1001,4))","v":0},15,15]
["BX0013",{"$f":"[1]Sheet1!$E$10","v":5},{"$f":"IF(ISERROR(VLOOKUP($A$15,Voorraad!$A$2:$D$1001,1)),\"\",VLOOKUP($A$15,Voorraad!$A$2:$D$1001,1))","v":"BX0013"},{"$f":"IF(ISERROR(VLOOKUP($A$15,Voorraad!$A$2:$D$1001,3)),\"\",VLOOKUP($A$15,Voorraad!$A$2:$D$1001,3))","v":"SL3 R5.08"},{"$f":"IF(ISERROR(VLOOKUP($A$15,Voorraad!$A$2:$D$1001,2)),\"\",VLOOKUP($A$9,Voorraad!$A$2:$D$1001,2))","v":101280},{"$f":"IF(ISERROR(VLOOKUP($A$15,Voorraad!$A$2:$H$1001,8)),\"\",VLOOKUP($A$15,Voorraad!$A$2:$H$1001,8))","v":0},{"$f":"IF(ISERROR(VLOOKUP($A$15,Voorraad!$A$2:$I$1001,9)),\"\",VLOOKUP($A$15,Voorraad!$A$2:$I$1001,9))","v":0},{"$f":"IF(ISERROR(VLOOKUP($A$15,Voorraad!$A$2:$J$1001,10)),\"\",VLOOKUP($A$15,Voorraad!$A$2:$J$1001,10))","v":0},{"$f":"IF(ISERROR(VLOOKUP($A$15,Voorraad!$A$2:$G$1001,6)),\"\",VLOOKUP($A$15,Voorraad!$A$2:$G$1001,6))","v":0},{"$f":"IF(ISERROR(VLOOKUP($A$15,Voorraad!$A$2:$G$1001,7)),\"\",VLOOKUP($A$15,Voorraad!$A$2:$G$1001,7))","v":"WEIDMULLER"},{"$f":"IF(ISERROR(VLOOKUP($A$15,Voorraad!$A$2:$G$1001,5)),\"\",VLOOKUP($A$15,Voorraad!$A$2:$G$1001,5))","v":8410},{"$f":"IF(ISERROR(VLOOKUP($A$15,Voorraad!$A$2:$D$1001,4)),\"\",VLOOKUP($A$15,Voorraad!$A$2:$D$1001,4))","v":0},5,5]
["BU0078",{"$f":"[1]Sheet1!$E$11","v":5},{"$f":"IF(ISERROR(VLOOKUP($A$16,Voorraad!$A$2:$D$1001,1)),\"\",VLOOKUP($A$16,Voorraad!$A$2:$D$1001,1))","v":"BU0078"},{"$f":"IF(ISERROR(VLOOKUP($A$16,Voorraad!$A$2:$D$1001,3)),\"\",VLOOKUP($A$16,Voorraad!$A$2:$D$1001,3))","v":"BL5.08/3 "},{"$f":"IF(ISERROR(VLOOKUP($A$16,Voorraad!$A$2:$D$1001,2)),\"\",VLOOKUP($A$16,Voorraad!$A$2:$D$1001,2))","v":"#5F171633"},{"$f":"IF(ISERROR(VLOOKUP($A$16,Voorraad!$A$2:$H$1001,8)),\"\",VLOOKUP($A$16,Voorraad!$A$2:$H$1001,8))","v":0},{"$f":"IF(ISERROR(VLOOKUP($A$16,Voorraad!$A$2:$I$1001,9)),\"\",VLOOKUP($A$16,Voorraad!$A$2:$I$1001,9))","v":0},{"$f":"IF(ISERROR(VLOOKUP($A$16,Voorraad!$A$2:$J$1001,10)),\"\",VLOOKUP($A$16,Voorraad!$A$2:$J$1001,10))","v":0},{"$f":"IF(ISERROR(VLOOKUP($A$16,Voorraad!$A$2:$G$1001,6)),\"\",VLOOKUP($A$16,Voorraad!$A$2:$G$1001,6))","v":0},{"$f":"IF(ISERROR(VLOOKUP($A$16,Voorraad!$A$2:$G$1001,7)),\"\",VLOOKUP($A$16,Voorraad!$A$2:$G$1001,7))","v":"PHOENIX"},{"$f":"IF(ISERROR(VLOOKUP($A$16,Voorraad!$A$2:$G$1001,5)),\"\",VLOOKUP($A$16,Voorraad!$A$2:$G$1001,5))","v":8510},{"$f":"IF(ISERROR(VLOOKUP($A$16,Voorraad!$A$2:$D$1001,4)),\"\",VLOOKUP($A$16,Voorraad!$A$2:$D$1001,4))","v":-75},5,80]
["BR6010",{"$f":"[1]Sheet1!$E$12","v":5},{"$f":"IF(ISERROR(VLOOKUP($A$17,Voorraad!$A$2:$D$1001,1)),\"\",VLOOKUP($A$17,Voorraad!$A$2:$D$1001,1))","v":"BR6010"},{"$f":"IF(ISERROR(VLOOKUP($A$17,Voorraad!$A$2:$D$1001,3)),\"\",VLOOKUP($A$17,Voorraad!$A$2:$D$1001,3))","v":"22NF"},{"$f":"IF(ISERROR(VLOOKUP($A$17,Voorraad!$A$2:$D$1001,2)),\"\",VLOOKUP($A$17,Voorraad!$A$2:$D$1001,2))","v":161590},{"$f":"IF(ISERROR(VLOOKUP($A$17,Voorraad!$A$2:$H$1001,8)),\"\",VLOOKUP($A$17,Voorraad!$A$2:$H$1001,8))","v":0},{"$f":"IF(ISERROR(VLOOKUP($A$17,Voorraad!$A$2:$I$1001,9)),\"\",VLOOKUP($A$17,Voorraad!$A$2:$I$1001,9))","v":0},{"$f":"IF(ISERROR(VLOOKUP($A$17,Voorraad!$A$2:$J$1001,10)),\"\",VLOOKUP($A$17,Voorraad!$A$2:$J$1001,10))","v":0},{"$f":"IF(ISERROR(VLOOKUP($A$17,Voorraad!$A$2:$G$1001,6)),\"\",VLOOKUP($A$17,Voorraad!$A$2:$G$1001,6))","v":0},{"$f":"IF(ISERROR(VLOOKUP($A$17,Voorraad!$A$2:$G$1001,7)),\"\",VLOOKUP($A$17,Voorraad!$A$2:$G$1001,7))","v":"KEMET"},{"$f":"IF(ISERROR(VLOOKUP($A$17,Voorraad!$A$2:$G$1001,5)),\"\",VLOOKUP($A$17,Voorraad!$A$2:$G$1001,5))","v":8410},{"$f":"IF(ISERROR(VLOOKUP($A$17,Voorraad!$A$2:$D$1001,4)),\"\",VLOOKUP($A$17,Voorraad!$A$2:$D$1001,4))","v":0},5,5]
["BR5010",{"$f":"[1]Sheet1!$E$13","v":5},{"$f":"IF(ISERROR(VLOOKUP($A$18,Voorraad!$A$2:$D$1001,1)),\"\",VLOOKUP($A$18,Voorraad!$A$2:$D$1001,1))","v":"BR5010"},{"$f":"IF(ISERROR(VLOOKUP($A$18,Voorraad!$A$2:$D$1001,3)),\"\",VLOOKUP($A$18,Voorraad!$A$2:$D$1001,3))","v":"CC 47N 63V +80 -20% 2E 55'"},{"$f":"IF(ISERROR(VLOOKUP($A$18,Voorraad!$A$2:$D$1001,2)),\"\",VLOOKUP($A$18,Voorraad!$A$2:$D$1001,2))","v":"#2344710KKE"},{"$f":"IF(ISERROR(VLOOKUP($A$18,Voorraad!$A$2:$H$1001,8)),\"\",VLOOKUP($A$18,Voorraad!$A$2:$H$1001,8))","v":500138},{"$f":"IF(ISERROR(VLOOKUP($A$18,Voorraad!$A$2:$I$1001,9)),\"\",VLOOKUP($A$18,Voorraad!$A$2:$I$1001,9))","v":0},{"$f":"IF(ISERROR(VLOOKUP($A$18,Voorraad!$A$2:$J$1001,10)),\"\",VLOOKUP($A$18,Voorraad!$A$2:$J$1001,10))","v":"Alternatief: 47NF/100V"},{"$f":"IF(ISERROR(VLOOKUP($A$18,Voorraad!$A$2:$G$1001,6)),\"\",VLOOKUP($A$18,Voorraad!$A$2:$G$1001,6))","v":0},{"$f":"IF(ISERROR(VLOOKUP($A$18,Voorraad!$A$2:$G$1001,7)),\"\",VLOOKUP($A$18,Voorraad!$A$2:$G$1001,7))","v":"BCC"},{"$f":"IF(ISERROR(VLOOKUP($A$18,Voorraad!$A$2:$G$1001,5)),\"\",VLOOKUP($A$18,Voorraad!$A$2:$G$1001,5))","v":"8410/8510"},{"$f":"IF(ISERROR(VLOOKUP($A$18,Voorraad!$A$2:$D$1001,4)),\"\",VLOOKUP($A$18,Voorraad!$A$2:$D$1001,4))","v":-450},5,455]
["BR6012",{"$f":"[1]Sheet1!$E$14","v":15},{"$f":"IF(ISERROR(VLOOKUP($A$19,Voorraad!$A$2:$D$1001,1)),\"\",VLOOKUP($A$19,Voorraad!$A$2:$D$1001,1))","v":"BR6012"},{"$f":"IF(ISERROR(VLOOKUP($A$19,Voorraad!$A$2:$D$1001,3)),\"\",VLOOKUP($A$19,Voorraad!$A$2:$D$1001,3))","v":"220PF/2KV"},{"$f":"IF(ISERROR(VLOOKUP($A$19,Voorraad!$A$2:$D$1001,2)),\"\",VLOOKUP($A$19,Voorraad!$A$2:$D$1001,2))","v":"#2344710KKE"},{"$f":"IF(ISERROR(VLOOKUP($A$19,Voorraad!$A$2:$H$1001,8)),\"\",VLOOKUP($A$19,Voorraad!$A$2:$H$1001,8))","v":0},{"$f":"IF(ISERROR(VLOOKUP($A$19,Voorraad!$A$2:$I$1001,9)),\"\",VLOOKUP($A$19,Voorraad!$A$2:$I$1001,9))","v":0},{"$f":"IF(ISERROR(VLOOKUP($A$19,Voorraad!$A$2:$J$1001,10)),\"\",VLOOKUP($A$19,Voorraad!$A$2:$J$1001,10))","v":0},{"$f":"IF(ISERROR(VLOOKUP($A$19,Voorraad!$A$2:$G$1001,6)),\"\",VLOOKUP($A$19,Voorraad!$A$2:$G$1001,6))","v":0},{"$f":"IF(ISERROR(VLOOKUP($A$19,Voorraad!$A$2:$G$1001,7)),\"\",VLOOKUP($A$19,Voorraad!$A$2:$G$1001,7))","v":"BCC"},{"$f":"IF(ISERROR(VLOOKUP($A$19,Voorraad!$A$2:$G$1001,5)),\"\",VLOOKUP($A$19,Voorraad!$A$2:$G$1001,5))","v":8410},{"$f":"IF(ISERROR(VLOOKUP($A$19,Voorraad!$A$2:$D$1001,4)),\"\",VLOOKUP($A$19,Voorraad!$A$2:$D$1001,4))","v":0},15,15]
["BU0014",{"$f":"[1]Sheet1!$E$15","v":5},{"$f":"IF(ISERROR(VLOOKUP($A$20,Voorraad!$A$2:$D$1001,1)),\"\",VLOOKUP($A$20,Voorraad!$A$2:$D$1001,1))","v":"BU0014"},{"$f":"IF(ISERROR(VLOOKUP($A$20,Voorraad!$A$2:$D$1001,3)),\"\",VLOOKUP($A$20,Voorraad!$A$2:$D$1001,3))","v":"D 1N4004 400V-1A DO-41"},{"$f":"IF(ISERROR(VLOOKUP($A$20,Voorraad!$A$2:$D$1001,2)),\"\",VLOOKUP($A$20,Voorraad!$A$2:$D$1001,2))","v":"#341N4004DC"},{"$f":"IF(ISERROR(VLOOKUP($A$20,Voorraad!$A$2:$H$1001,8)),\"\",VLOOKUP($A$20,Voorraad!$A$2:$H$1001,8))","v":522000},{"$f":"IF(ISERROR(VLOOKUP($A$20,Voorraad!$A$2:$I$1001,9)),\"\",VLOOKUP($A$20,Voorraad!$A$2:$I$1001,9))","v":0},{"$f":"IF(ISERROR(VLOOKUP($A$20,Voorraad!$A$2:$J$1001,10)),\"\",VLOOKUP($A$20,Voorraad!$A$2:$J$1001,10))","v":0},{"$f":"IF(ISERROR(VLOOKUP($A$20,Voorraad!$A$2:$G$1001,6)),\"\",VLOOKUP($A$20,Voorraad!$A$2:$G$1001,6))","v":0},{"$f":"IF(ISERROR(VLOOKUP($A$20,Voorraad!$A$2:$G$1001,7)),\"\",VLOOKUP($A$20,Voorraad!$A$2:$G$1001,7))","v":0},{"$f":"IF(ISERROR(VLOOKUP($A$20,Voorraad!$A$2:$G$1001,5)),\"\",VLOOKUP($A$20,Voorraad!$A$2:$G$1001,5))","v":"8410/8464/8510"},{"$f":"IF(ISERROR(VLOOKUP($A$20,Voorraad!$A$2:$D$1001,4)),\"\",VLOOKUP($A$20,Voorraad!$A$2:$D$1001,4))","v":485},5,0]
["BU0071",{"$f":"[1]Sheet1!$E$16","v":5},{"$f":"IF(ISERROR(VLOOKUP($A$21,Voorraad!$A$2:$D$1001,1)),\"\",VLOOKUP($A$21,Voorraad!$A$2:$D$1001,1))","v":"BU0071"},{"$f":"IF(ISERROR(VLOOKUP($A$21,Voorraad!$A$2:$D$1001,3)),\"\",VLOOKUP($A$21,Voorraad!$A$2:$D$1001,3))","v":"HEAD.SEK18 MALE FLAT CABLE CONNECTOR"},{"$f":"IF(ISERROR(VLOOKUP($A$21,Voorraad!$A$2:$D$1001,2)),\"\",VLOOKUP($A$21,Voorraad!$A$2:$D$1001,2))","v":260340},{"$f":"IF(ISERROR(VLOOKUP($A$21,Voorraad!$A$2:$H$1001,8)),\"\",VLOOKUP($A$21,Voorraad!$A$2:$H$1001,8))","v":0},{"$f":"IF(ISERROR(VLOOKUP($A$21,Voorraad!$A$2:$I$1001,9)),\"\",VLOOKUP($A$21,Voorraad!$A$2:$I$1001,9))","v":"09-18-564-7914"},{"$f":"IF(ISERROR(VLOOKUP($A$21,Voorraad!$A$2:$J$1001,10)),\"\",VLOOKUP($A$21,Voorraad!$A$2:$J$1001,10))","v":0},{"$f":"IF(ISERROR(VLOOKUP($A$21,Voorraad!$A$2:$G$1001,6)),\"\",VLOOKUP($A$21,Voorraad!$A$2:$G$1001,6))","v":0},{"$f":"IF(ISERROR(VLOOKUP($A$21,Voorraad!$A$2:$G$1001,7)),\"\",VLOOKUP($A$21,Voorraad!$A$2:$G$1001,7))","v":"HARTING"},{"$f":"IF(ISERROR(VLOOKUP($A$21,Voorraad!$A$2:$G$1001,5)),\"\",VLOOKUP($A$21,Voorraad!$A$2:$G$1001,5))","v":8410},{"$f":"IF(ISERROR(VLOOKUP($A$21,Voorraad!$A$2:$D$1001,4)),\"\",VLOOKUP($A$21,Voorraad!$A$2:$D$1001,4))","v":13},5,0]
["BU0011",{"$f":"[1]Sheet1!$E$17","v":20},{"$f":"IF(ISERROR(VLOOKUP($A$22,Voorraad!$A$2:$D$1001,1)),\"\",VLOOKUP($A$22,Voorraad!$A$2:$D$1001,1))","v":"BU0011"},{"$f":"IF(ISERROR(VLOOKUP($A$22,Voorraad!$A$2:$D$1001,3)),\"\",VLOOKUP($A$22,Voorraad!$A$2:$D$1001,3))","v":"1UH"},{"$f":"IF(ISERROR(VLOOKUP($A$22,Voorraad!$A$2:$D$1001,2)),\"\",VLOOKUP($A$22,Voorraad!$A$2:$D$1001,2))","v":304030},{"$f":"IF(ISERROR(VLOOKUP($A$22,Voorraad!$A$2:$H$1001,8)),\"\",VLOOKUP($A$22,Voorraad!$A$2:$H$1001,8))","v":0},{"$f":"IF(ISERROR(VLOOKUP($A$22,Voorraad!$A$2:$I$1001,9)),\"\",VLOOKUP($A$22,Voorraad!$A$2:$I$1001,9))","v":"R0411R12"},{"$f":"IF(ISERROR(VLOOKUP($A$22,Voorraad!$A$2:$J$1001,10)),\"\",VLOOKUP($A$22,Voorraad!$A$2:$J$1001,10))","v":0},{"$f":"IF(ISERROR(VLOOKUP($A$22,Voorraad!$A$2:$G$1001,6)),\"\",VLOOKUP($A$22,Voorraad!$A$2:$G$1001,6))","v":0},{"$f":"IF(ISERROR(VLOOKUP($A$22,Voorraad!$A$2:$G$1001,7)),\"\",VLOOKUP($A$22,Voorraad!$A$2:$G$1001,7))","v":0},{"$f":"IF(ISERROR(VLOOKUP($A$22,Voorraad!$A$2:$G$1001,5)),\"\",VLOOKUP($A$22,Voorraad!$A$2:$G$1001,5))","v":8410},{"$f":"IF(ISERROR(VLOOKUP($A$22,Voorraad!$A$2:$D$1001,4)),\"\",VLOOKUP($A$22,Voorraad!$A$2:$D$1001,4))","v":0},20,20]
["BU0012",{"$f":"[1]Sheet1!$E$18","v":10},{"$f":"IF(ISERROR(VLOOKUP($A$23,Voorraad!$A$2:$D$1001,1)),\"\",VLOOKUP($A$23,Voorraad!$A$2:$D$1001,1))","v":"BU0012"},{"$f":"IF(ISERROR(VLOOKUP($A$23,Voorraad!$A$2:$D$1001,3)),\"\",VLOOKUP($A$23,Voorraad!$A$2:$D$1001,3))","v":"100UH 275MA"},{"$f":"IF(ISERROR(VLOOKUP($A$23,Voorraad!$A$2:$D$1001,2)),\"\",VLOOKUP($A$23,Voorraad!$A$2:$D$1001,2))","v":315000},{"$f":"IF(ISERROR(VLOOKUP($A$23,Voorraad!$A$2:$H$1001,8)),\"\",VLOOKUP($A$23,Voorraad!$A$2:$H$1001,8))","v":0},{"$f":"IF(ISERROR(VLOOKUP($A$23,Voorraad!$A$2:$I$1001,9)),\"\",VLOOKUP($A$23,Voorraad!$A$2:$I$1001,9))","v":"FI-0410NA-101K"},{"$f":"IF(ISERROR(VLOOKUP($A$23,Voorraad!$A$2:$J$1001,10)),\"\",VLOOKUP($A$23,Voorraad!$A$2:$J$1001,10))","v":0},{"$f":"IF(ISERROR(VLOOKUP($A$23,Voorraad!$A$2:$G$1001,6)),\"\",VLOOKUP($A$23,Voorraad!$A$2:$G$1001,6))","v":0},{"$f":"IF(ISERROR(VLOOKUP($A$23,Voorraad!$A$2:$G$1001,7)),\"\",VLOOKUP($A$23,Voorraad!$A$2:$G$1001,7))","v":"TAI-TECH"},{"$f":"IF(ISERROR(VLOOKUP($A$23,Voorraad!$A$2:$G$1001,5)),\"\",VLOOKUP($A$23,Voorraad!$A$2:$G$1001,5))","v":8410},{"$f":"IF(ISERROR(VLOOKUP($A$23,Voorraad!$A$2:$D$1001,4)),\"\",VLOOKUP($A$23,Voorraad!$A$2:$D$1001,4))","v":2000},10,0]
["BU0013",{"$f":"[1]Sheet1!$E$19","v":5},{"$f":"IF(ISERROR(VLOOKUP($A$24,Voorraad!$A$2:$D$1001,1)),\"\",VLOOKUP($A$24,Voorraad!$A$2:$D$1001,1))","v":"BU0013"},{"$f":"IF(ISERROR(VLOOKUP($A$24,Voorraad!$A$2:$D$1001,3)),\"\",VLOOKUP($A$24,Voorraad!$A$2:$D$1001,3))","v":"1MH"},{"$f":"IF(ISERROR(VLOOKUP($A$24,Voorraad!$A$2:$D$1001,2)),\"\",VLOOKUP($A$24,Voorraad!$A$2:$D$1001,2))","v":"FI-0410NA-102K"},{"$f":"IF(ISERROR(VLOOKUP($A$24,Voorraad!$A$2:$H$1001,8)),\"\",VLOOKUP($A$24,Voorraad!$A$2:$H$1001,8))","v":0},{"$f":"IF(ISERROR(VLOOKUP($A$24,Voorraad!$A$2:$I$1001,9)),\"\",VLOOKUP($A$24,Voorraad!$A$2:$I$1001,9))","v":"FI-0410NA-102K"},{"$f":"IF(ISERROR(VLOOKUP($A$24,Voorraad!$A$2:$J$1001,10)),\"\",VLOOKUP($A$24,Voorraad!$A$2:$J$1001,10))","v":0},{"$f":"IF(ISERROR(VLOOKUP($A$24,Voorraad!$A$2:$G$1001,6)),\"\",VLOOKUP($A$24,Voorraad!$A$2:$G$1001,6))","v":0},{"$f":"IF(ISERROR(VLOOKUP($A$24,Voorraad!$A$2:$G$1001,7)),\"\",VLOOKUP($A$24,Voorraad!$A$2:$G$1001,7))","v":"TAI-TECH"},{"$f":"IF(ISERROR(VLOOKUP($A$24,Voorraad!$A$2:$G$1001,5)),\"\",VLOOKUP($A$24,Voorraad!$A$2:$G$1001,5))","v":8410},{"$f":"IF(ISERROR(VLOOKUP($A$24,Voorraad!$A$2:$D$1001,4)),\"\",VLOOKUP($A$24,Voorraad!$A$2:$D$1001,4))","v":0},5,5]
["BR3520",{"$f":"[1]Sheet1!$E$20","v":5},{"$f":"IF(ISERROR(VLOOKUP($A$25,Voorraad!$A$2:$D$1001,1)),\"\",VLOOKUP($A$25,Voorraad!$A$2:$D$1001,1))","v":"BR3520"},{"$f":"IF(ISERROR(VLOOKUP($A$25,Voorraad!$A$2:$D$1001,3)),\"\",VLOOKUP($A$25,Voorraad!$A$2:$D$1001,3))","v":"R 5,6E"},{"$f":"IF(ISERROR(VLOOKUP($A$25,Voorraad!$A$2:$D$1001,2)),\"\",VLOOKUP($A$25,Voorraad!$A$2:$D$1001,2))","v":"#350100"},{"$f":"IF(ISERROR(VLOOKUP($A$25,Voorraad!$A$2:$H$1001,8)),\"\",VLOOKUP($A$25,Voorraad!$A$2:$H$1001,8))","v":0},{"$f":"IF(ISERROR(VLOOKUP($A$25,Voorraad!$A$2:$I$1001,9)),\"\",VLOOKUP($A$25,Voorraad!$A$2:$I$1001,9))","v":0},{"$f":"IF(ISERROR(VLOOKUP($A$25,Voorraad!$A$2:$J$1001,10)),\"\",VLOOKUP($A$25,Voorraad!$A$2:$J$1001,10))","v":0},{"$f":"IF(ISERROR(VLOOKUP($A$25,Voorraad!$A$2:$G$1001,6)),\"\",VLOOKUP($A$25,Voorraad!$A$2:$G$1001,6))","v":0},{"$f":"IF(ISERROR(VLOOKUP($A$25,Voorraad!$A$2:$G$1001,7)),\"\",VLOOKUP($A$25,Voorraad!$A$2:$G$1001,7))","v":"Philips"},{"$f":"IF(ISERROR(VLOOKUP($A$25,Voorraad!$A$2:$G$1001,5)),\"\",VLOOKUP($A$25,Voorraad!$A$2:$G$1001,5))","v":8410},{"$f":"IF(ISERROR(VLOOKUP($A$25,Voorraad!$A$2:$D$1001,4)),\"\",VLOOKUP($A$25,Voorraad!$A$2:$D$1001,4))","v":0},5,5]
["BR4035",{"$f":"[1]Sheet1!$E$21","v":10},{"$f":"IF(ISERROR(VLOOKUP($A$26,Voorraad!$A$2:$D$1001,1)),\"\",VLOOKUP($A$26,Voorraad!$A$2:$D$1001,1))","v":"BR4035"},{"$f":"IF(ISERROR(VLOOKUP($A$26,Voorraad!$A$2:$D$1001,3)),\"\",VLOOKUP($A$26,Voorraad!$A$2:$D$1001,3))","v":"V275LA4"},{"$f":"IF(ISERROR(VLOOKUP($A$26,Voorraad!$A$2:$D$1001,2)),\"\",VLOOKUP($A$26,Voorraad!$A$2:$D$1001,2))","v":350100},{"$f":"IF(ISERROR(VLOOKUP($A$26,Voorraad!$A$2:$H$1001,8)),\"\",VLOOKUP($A$26,Voorraad!$A$2:$H$1001,8))","v":0},{"$f":"IF(ISERROR(VLOOKUP($A$26,Voorraad!$A$2:$I$1001,9)),\"\",VLOOKUP($A$26,Voorraad!$A$2:$I$1001,9))","v":"H809159"},{"$f":"IF(ISERROR(VLOOKUP($A$26,Voorraad!$A$2:$J$1001,10)),\"\",VLOOKUP($A$26,Voorraad!$A$2:$J$1001,10))","v":0},{"$f":"IF(ISERROR(VLOOKUP($A$26,Voorraad!$A$2:$G$1001,6)),\"\",VLOOKUP($A$26,Voorraad!$A$2:$G$1001,6))","v":0},{"$f":"IF(ISERROR(VLOOKUP($A$26,Voorraad!$A$2:$G$1001,7)),\"\",VLOOKUP($A$26,Voorraad!$A$2:$G$1001,7))","v":"HARRIS"},{"$f":"IF(ISERROR(VLOOKUP($A$26,Voorraad!$A$2:$G$1001,5)),\"\",VLOOKUP($A$26,Voorraad!$A$2:$G$1001,5))","v":8410},{"$f":"IF(ISERROR(VLOOKUP($A$26,Voorraad!$A$2:$D$1001,4)),\"\",VLOOKUP($A$26,Voorraad!$A$2:$D$1001,4))","v":219},10,0]
["BR3550",{"$f":"[1]Sheet1!$E$22","v":75},{"$f":"IF(ISERROR(VLOOKUP($A$27,Voorraad!$A$2:$D$1001,1)),\"\",VLOOKUP($A$27,Voorraad!$A$2:$D$1001,1))","v":"BR3550"},{"$f":"IF(ISERROR(VLOOKUP($A$27,Voorraad!$A$2:$D$1001,3)),\"\",VLOOKUP($A$27,Voorraad!$A$2:$D$1001,3))","v":"RV S05K30 100A 0.01W"},{"$f":"IF(ISERROR(VLOOKUP($A$27,Voorraad!$A$2:$D$1001,2)),\"\",VLOOKUP($A$27,Voorraad!$A$2:$D$1001,2))","v":"#122S05K30"},{"$f":"IF(ISERROR(VLOOKUP($A$27,Voorraad!$A$2:$H$1001,8)),\"\",VLOOKUP($A$27,Voorraad!$A$2:$H$1001,8))","v":500088},{"$f":"IF(ISERROR(VLOOKUP($A$27,Voorraad!$A$2:$I$1001,9)),\"\",VLOOKUP($A$27,Voorraad!$A$2:$I$1001,9))","v":"SIOV-S05K30"},{"$f":"IF(ISERROR(VLOOKUP($A$27,Voorraad!$A$2:$J$1001,10)),\"\",VLOOKUP($A$27,Voorraad!$A$2:$J$1001,10))","v":"Groter aantal inkopen "},{"$f":"IF(ISERROR(VLOOKUP($A$27,Voorraad!$A$2:$G$1001,6)),\"\",VLOOKUP($A$27,Voorraad!$A$2:$G$1001,6))","v":"TME"},{"$f":"IF(ISERROR(VLOOKUP($A$27,Voorraad!$A$2:$G$1001,7)),\"\",VLOOKUP($A$27,Voorraad!$A$2:$G$1001,7))","v":"EPCOS"},{"$f":"IF(ISERROR(VLOOKUP($A$27,Voorraad!$A$2:$G$1001,5)),\"\",VLOOKUP($A$27,Voorraad!$A$2:$G$1001,5))","v":"8410/8437/8438/8439/8510"},{"$f":"IF(ISERROR(VLOOKUP($A$27,Voorraad!$A$2:$D$1001,4)),\"\",VLOOKUP($A$27,Voorraad!$A$2:$D$1001,4))","v":86},75,0]
["BR4008",{"$f":"[1]Sheet1!$E$23","v":20},{"$f":"IF(ISERROR(VLOOKUP($A$28,Voorraad!$A$2:$D$1001,1)),\"\",VLOOKUP($A$28,Voorraad!$A$2:$D$1001,1))","v":"BR4008"},{"$f":"IF(ISERROR(VLOOKUP($A$28,Voorraad!$A$2:$D$1001,3)),\"\",VLOOKUP($A$28,Voorraad!$A$2:$D$1001,3))","v":"RV S05K385 385V 0.10W"},{"$f":"IF(ISERROR(VLOOKUP($A$28,Voorraad!$A$2:$D$1001,2)),\"\",VLOOKUP($A$28,Voorraad!$A$2:$D$1001,2))","v":"#122S05K385"},{"$f":"IF(ISERROR(VLOOKUP($A$28,Voorraad!$A$2:$H$1001,8)),\"\",VLOOKUP($A$28,Voorraad!$A$2:$H$1001,8))","v":0},{"$f":"IF(ISERROR(VLOOKUP($A$28,Voorraad!$A$2:$I$1001,9)),\"\",VLOOKUP($A$28,Voorraad!$A$2:$I$1001,9))","v":"B72207-S 381K101"},{"$f":"IF(ISERROR(VLOOKUP($A$28,Voorraad!$A$2:$J$1001,10)),\"\",VLOOKUP($A$28,Voorraad!$A$2:$J$1001,10))","v":"RS COMPONENTS NR: 138-9254"},{"$f":"IF(ISERROR(VLOOKUP($A$28,Voorraad!$A$2:$G$1001,6)),\"\",VLOOKUP($A$28,Voorraad!$A$2:$G$1001,6))","v":"DISTRELEC"},{"$f":"IF(ISERROR(VLOOKUP($A$28,Voorraad!$A$2:$G$1001,7)),\"\",VLOOKUP($A$28,Voorraad!$A$2:$G$1001,7))","v":"EPCOS"},{"$f":"IF(ISERROR(VLOOKUP($A$28,Voorraad!$A$2:$G$1001,5)),\"\",VLOOKUP($A$28,Voorraad!$A$2:$G$1001,5))","v":"8410/8510"},{"$f":"IF(ISERROR(VLOOKUP($A$28,Voorraad!$A$2:$D$1001,4)),\"\",VLOOKUP($A$28,Voorraad!$A$2:$D$1001,4))","v":-142},20,162]
["BU0055",{"$f":"[1]Sheet1!$E$24","v":5},{"$f":"IF(ISERROR(VLOOKUP($A$29,Voorraad!$A$2:$D$1001,1)),\"\",VLOOKUP($A$29,Voorraad!$A$2:$D$1001,1))","v":"BU0055"},{"$f":"IF(ISERROR(VLOOKUP($A$29,Voorraad!$A$2:$D$1001,3)),\"\",VLOOKUP($A$29,Voorraad!$A$2:$D$1001,3))","v":"REL V23061-B1009"},{"$f":"IF(ISERROR(VLOOKUP($A$29,Voorraad!$A$2:$D$1001,2)),\"\",VLOOKUP($A$29,Voorraad!$A$2:$D$1001,2))","v":372250},{"$f":"IF(ISERROR(VLOOKUP($A$29,Voorraad!$A$2:$H$1001,8)),\"\",VLOOKUP($A$29,Voorraad!$A$2:$H$1001,8))","v":0},{"$f":"IF(ISERROR(VLOOKUP($A$29,Voorraad!$A$2:$I$1001,9)),\"\",VLOOKUP($A$29,Voorraad!$A$2:$I$1001,9))","v":0},{"$f":"IF(ISERROR(VLOOKUP($A$29,Voorraad!$A$2:$J$1001,10)),\"\",VLOOKUP($A$29,Voorraad!$A$2:$J$1001,10))","v":0},{"$f":"IF(ISERROR(VLOOKUP($A$29,Voorraad!$A$2:$G$1001,6)),\"\",VLOOKUP($A$29,Voorraad!$A$2:$G$1001,6))","v":0},{"$f":"IF(ISERROR(VLOOKUP($A$29,Voorraad!$A$2:$G$1001,7)),\"\",VLOOKUP($A$29,Voorraad!$A$2:$G$1001,7))","v":"SIEMENS"},{"$f":"IF(ISERROR(VLOOKUP($A$29,Voorraad!$A$2:$G$1001,5)),\"\",VLOOKUP($A$29,Voorraad!$A$2:$G$1001,5))","v":8410},{"$f":"IF(ISERROR(VLOOKUP($A$29,Voorraad!$A$2:$D$1001,4)),\"\",VLOOKUP($A$29,Voorraad!$A$2:$D$1001,4))","v":3},5,2]
["BX0023",{"$f":"[1]Sheet1!$E$25","v":20},{"$f":"IF(ISERROR(VLOOKUP($A$30,Voorraad!$A$2:$D$1001,1)),\"\",VLOOKUP($A$30,Voorraad!$A$2:$D$1001,1))","v":"BX0023"},{"$f":"IF(ISERROR(VLOOKUP($A$30,Voorraad!$A$2:$D$1001,3)),\"\",VLOOKUP($A$30,Voorraad!$A$2:$D$1001,3))","v":"UMK-BE 45"},{"$f":"IF(ISERROR(VLOOKUP($A$30,Voorraad!$A$2:$D$1001,2)),\"\",VLOOKUP($A$30,Voorraad!$A$2:$D$1001,2))","v":2970015},{"$f":"IF(ISERROR(VLOOKUP($A$30,Voorraad!$A$2:$H$1001,8)),\"\",VLOOKUP($A$30,Voorraad!$A$2:$H$1001,8))","v":0},{"$f":"IF(ISERROR(VLOOKUP($A$30,Voorraad!$A$2:$I$1001,9)),\"\",VLOOKUP($A$30,Voorraad!$A$2:$I$1001,9))","v":0},{"$f":"IF(ISERROR(VLOOKUP($A$30,Voorraad!$A$2:$J$1001,10)),\"\",VLOOKUP($A$30,Voorraad!$A$2:$J$1001,10))","v":0},{"$f":"IF(ISERROR(VLOOKUP($A$30,Voorraad!$A$2:$G$1001,6)),\"\",VLOOKUP($A$30,Voorraad!$A$2:$G$1001,6))","v":0},{"$f":"IF(ISERROR(VLOOKUP($A$30,Voorraad!$A$2:$G$1001,7)),\"\",VLOOKUP($A$30,Voorraad!$A$2:$G$1001,7))","v":"Phoenix"},{"$f":"IF(ISERROR(VLOOKUP($A$30,Voorraad!$A$2:$G$1001,5)),\"\",VLOOKUP($A$30,Voorraad!$A$2:$G$1001,5))","v":"8410/8464"},{"$f":"IF(ISERROR(VLOOKUP($A$30,Voorraad!$A$2:$D$1001,4)),\"\",VLOOKUP($A$30,Voorraad!$A$2:$D$1001,4))","v":0},20,20]
["BX0024",{"$f":"[1]Sheet1!$E$26","v":10},{"$f":"IF(ISERROR(VLOOKUP($A$31,Voorraad!$A$2:$D$1001,1)),\"\",VLOOKUP($A$31,Voorraad!$A$2:$D$1001,1))","v":"BX0024"},{"$f":"IF(ISERROR(VLOOKUP($A$31,Voorraad!$A$2:$D$1001,3)),\"\",VLOOKUP($A$31,Voorraad!$A$2:$D$1001,3))","v":"UMK-SE 11.25"},{"$f":"IF(ISERROR(VLOOKUP($A$31,Voorraad!$A$2:$D$1001,2)),\"\",VLOOKUP($A$31,Voorraad!$A$2:$D$1001,2))","v":2970002},{"$f":"IF(ISERROR(VLOOKUP($A$31,Voorraad!$A$2:$H$1001,8)),\"\",VLOOKUP($A$31,Voorraad!$A$2:$H$1001,8))","v":0},{"$f":"IF(ISERROR(VLOOKUP($A$31,Voorraad!$A$2:$I$1001,9)),\"\",VLOOKUP($A$31,Voorraad!$A$2:$I$1001,9))","v":0},{"$f":"IF(ISERROR(VLOOKUP($A$31,Voorraad!$A$2:$J$1001,10)),\"\",VLOOKUP($A$31,Voorraad!$A$2:$J$1001,10))","v":0},{"$f":"IF(ISERROR(VLOOKUP($A$31,Voorraad!$A$2:$G$1001,6)),\"\",VLOOKUP($A$31,Voorraad!$A$2:$G$1001,6))","v":0},{"$f":"IF(ISERROR(VLOOKUP($A$31,Voorraad!$A$2:$G$1001,7)),\"\",VLOOKUP($A$31,Voorraad!$A$2:$G$1001,7))","v":"Phoenix "},{"$f":"IF(ISERROR(VLOOKUP($A$31,Voorraad!$A$2:$G$1001,5)),\"\",VLOOKUP($A$31,Voorraad!$A$2:$G$1001,5))","v":"8410/8464"},{"$f":"IF(ISERROR(VLOOKUP($A$31,Voorraad!$A$2:$D$1001,4)),\"\",VLOOKUP($A$31,Voorraad!$A$2:$D$1001,4))","v":0},10,10]
["BX0025",{"$f":"[1]Sheet1!$E$27","v":15},{"$f":"IF(ISERROR(VLOOKUP($A$32,Voorraad!$A$2:$D$1001,1)),\"\",VLOOKUP($A$32,Voorraad!$A$2:$D$1001,1))","v":"BX0025"},{"$f":"IF(ISERROR(VLOOKUP($A$32,Voorraad!$A$2:$D$1001,3)),\"\",VLOOKUP($A$32,Voorraad!$A$2:$D$1001,3))","v":"UMK-FE"},{"$f":"IF(ISERROR(VLOOKUP($A$32,Voorraad!$A$2:$D$1001,2)),\"\",VLOOKUP($A$32,Voorraad!$A$2:$D$1001,2))","v":2970031},{"$f":"IF(ISERROR(VLOOKUP($A$32,Voorraad!$A$2:$H$1001,8)),\"\",VLOOKUP($A$32,Voorraad!$A$2:$H$1001,8))","v":0},{"$f":"IF(ISERROR(VLOOKUP($A$32,Voorraad!$A$2:$I$1001,9)),\"\",VLOOKUP($A$32,Voorraad!$A$2:$I$1001,9))","v":0},{"$f":"IF(ISERROR(VLOOKUP($A$32,Voorraad!$A$2:$J$1001,10)),\"\",VLOOKUP($A$32,Voorraad!$A$2:$J$1001,10))","v":0},{"$f":"IF(ISERROR(VLOOKUP($A$32,Voorraad!$A$2:$G$1001,6)),\"\",VLOOKUP($A$32,Voorraad!$A$2:$G$1001,6))","v":0},{"$f":"IF(ISERROR(VLOOKUP($A$32,Voorraad!$A$2:$G$1001,7)),\"\",VLOOKUP($A$32,Voorraad!$A$2:$G$1001,7))","v":"Phoenix "},{"$f":"IF(ISERROR(VLOOKUP($A$32,Voorraad!$A$2:$G$1001,5)),\"\",VLOOKUP($A$32,Voorraad!$A$2:$G$1001,5))","v":"8410/8464"},{"$f":"IF(ISERROR(VLOOKUP($A$32,Voorraad!$A$2:$D$1001,4)),\"\",VLOOKUP($A$32,Voorraad!$A$2:$D$1001,4))","v":0},15,15]
["BX0038",{"$f":"[1]Sheet1!$E$28","v":5},{"$f":"IF(ISERROR(VLOOKUP($A$33,Voorraad!$A$2:$D$1001,1)),\"\",VLOOKUP($A$33,Voorraad!$A$2:$D$1001,1))","v":"BX0038"},{"$f":"IF(ISERROR(VLOOKUP($A$33,Voorraad!$A$2:$D$1001,3)),\"\",VLOOKUP($A$33,Voorraad!$A$2:$D$1001,3))","v":"PCB 8410"},{"$f":"IF(ISERROR(VLOOKUP($A$33,Voorraad!$A$2:$D$1001,2)),\"\",VLOOKUP($A$33,Voorraad!$A$2:$D$1001,2))","v":"PCB 8410"},{"$f":"IF(ISERROR(VLOOKUP($A$33,Voorraad!$A$2:$H$1001,8)),\"\",VLOOKUP($A$33,Voorraad!$A$2:$H$1001,8))","v":476700},{"$f":"IF(ISERROR(VLOOKUP($A$33,Voorraad!$A$2:$I$1001,9)),\"\",VLOOKUP($A$33,Voorraad!$A$2:$I$1001,9))","v":0},{"$f":"IF(ISERROR(VLOOKUP($A$33,Voorraad!$A$2:$J$1001,10)),\"\",VLOOKUP($A$33,Voorraad!$A$2:$J$1001,10))","v":0},{"$f":"IF(ISERROR(VLOOKUP($A$33,Voorraad!$A$2:$G$1001,6)),\"\",VLOOKUP($A$33,Voorraad!$A$2:$G$1001,6))","v":"JvB"},{"$f":"IF(ISERROR(VLOOKUP($A$33,Voorraad!$A$2:$G$1001,7)),\"\",VLOOKUP($A$33,Voorraad!$A$2:$G$1001,7))","v":"JvB"},{"$f":"IF(ISERROR(VLOOKUP($A$33,Voorraad!$A$2:$G$1001,5)),\"\",VLOOKUP($A$33,Voorraad!$A$2:$G$1001,5))","v":"PCB 8410"},{"$f":"IF(ISERROR(VLOOKUP($A$33,Voorraad!$A$2:$D$1001,4)),\"\",VLOOKUP($A$33,Voorraad!$A$2:$D$1001,4))","v":0},5,5]

{"sheet":"Picklijst 8437","index":3,"n_rows":33,"n_cols":14,"rows_kept":33,"cut":false,"hidden":false,"merged":[]}
[]
["Pickorder 8437",null,{"$f":"[2]Sheet1!$D$2","v":10},"X"]
[]
[]
[]
[]
[]
["Art Nr CSI","Benodigd","Art Nr CSI","Omschrijving","Leverancier Nr","Produco Nr","OrderNr","Opmerkingen/Alternatieven","Leverancier","Producent","PCB","Voorraad","Benodigd","Bestellen"]
["BSH002",{"$f":"[2]Sheet1!$E$4","v":40},{"$f":"IF(ISERROR(VLOOKUP($A$9,Voorraad!$A$2:$D$1001,1)),\"\",VLOOKUP($A$9,Voorraad!$A$2:$D$1001,1))","v":"BSH002"},{"$f":"IF(ISERROR(VLOOKUP($A$9,Voorraad!$A$2:$D$1001,3)),\"\",VLOOKUP($A$9,Voorraad!$A$2:$D$1001,3))","v":"220U / 35V "},{"$f":"IF(ISERROR(VLOOKUP($A$9,Voorraad!$A$2:$D$1001,2)),\"\",VLOOKUP($A$9,Voorraad!$A$2:$D$1001,2))","v":"EEUFC1V221 "},{"$f":"IF(ISERROR(VLOOKUP($A$9,Voorraad!$A$2:$H$1001,8)),\"\",VLOOKUP($A$9,Voorraad!$A$2:$H$1001,8))","v":0},{"$f":"IF(ISERROR(VLOOKUP($A$9,Voorraad!$A$2:$I$1001,9)),\"\",VLOOKUP($A$9,Voorraad!$A$2:$I$1001,9))","v":"EEUFC1V221 "},{"$f":"IF(ISERROR(VLOOKUP($A$9,Voorraad!$A$2:$J$1001,10)),\"\",VLOOKUP($A$9,Voorraad!$A$2:$J$1001,10))","v":"Alternatief: SE050M0220-1012"},{"$f":"IF(ISERROR(VLOOKUP($A$9,Voorraad!$A$2:$G$1001,6)),\"\",VLOOKUP($A$9,Voorraad!$A$2:$G$1001,6))","v":"TME"},{"$f":"IF(ISERROR(VLOOKUP($A$9,Voorraad!$A$2:$G$1001,7)),\"\",VLOOKUP($A$9,Voorraad!$A$2:$G$1001,7))","v":"Panasonic"},{"$f":"IF(ISERROR(VLOOKUP($A$9,Voorraad!$A$2:$G$1001,5)),\"\",VLOOKUP($A$9,Voorraad!$A$2:$G$1001,5))","v":"8437/8438/8439"},{"$f":"IF(ISERROR(VLOOKUP($A$9,Voorraad!$A$2:$D$1001,4)),\"\",VLOOKUP($A$9,Voorraad!$A$2:$D$1001,4))","v":178},{"$f":"B9","v":40},{"$f":"MAX(0,(SUM(M9-L9)))","v":0}]
["BU0005",{"$f":"[2]Sheet1!$E$5","v":10},{"$f":"IF(ISERROR(VLOOKUP($A$10,Voorraad!$A$2:$D$1001,1)),\"\",VLOOKUP($A$10,Voorraad!$A$2:$D$1001,1))","v":"BU0005"},{"$f":"IF(ISERROR(VLOOKUP($A$10,Voorraad!$A$2:$D$1001,3)),\"\",VLOOKUP($A$10,Voorraad!$A$2:$D$1001,3))","v":"T83-A90X "},{"$f":"IF(ISERROR(VLOOKUP($A$10,Voorraad!$A$2:$D$1001,2)),\"\",VLOOKUP($A$10,Voorraad!$A$2:$D$1001,2))","v":"2046-09-C2LF"},{"$f":"IF(ISERROR(VLOOKUP($A$10,Voorraad!$A$2:$H$1001,8)),\"\",VLOOKUP($A$10,Voorraad!$A$2:$H$1001,8))","v":0},{"$f":"IF(ISERROR(VLOOKUP($A$10,Voorraad!$A$2:$I$1001,9)),\"\",VLOOKUP($A$10,Voorraad!$A$2:$I$1001,9))","v":2335982},{"$f":"IF(ISERROR(VLOOKUP($A$10,Voorraad!$A$2:$J$1001,10)),\"\",VLOOKUP($A$10,Voorraad!$A$2:$J$1001,10))","v":0},{"$f":"IF(ISERROR(VLOOKUP($A$10,Voorraad!$A$2:$G$1001,6)),\"\",VLOOKUP($A$10,Voorraad!$A$2:$G$1001,6))","v":"Farnell"},{"$f":"IF(ISERROR(VLOOKUP($A$10,Voorraad!$A$2:$G$1001,7)),\"\",VLOOKUP($A$10,Voorraad!$A$2:$G$1001,7))","v":"Bourns"},{"$f":"IF(ISERROR(VLOOKUP($A$10,Voorraad!$A$2:$G$1001,5)),\"\",VLOOKUP($A$10,Voorraad!$A$2:$G$1001,5))","v":"8437/8438/8439"},{"$f":"IF(ISERROR(VLOOKUP($A$10,Voorraad!$A$2:$D$1001,4)),\"\",VLOOKUP($A$10,Voorraad!$A$2:$D$1001,4))","v":57},10,0]
["BU0016",{"$f":"[2]Sheet1!$E$6","v":10},{"$f":"IF(ISERROR(VLOOKUP($A$11,Voorraad!$A$2:$D$1001,1)),\"\",VLOOKUP($A$11,Voorraad!$A$2:$D$1001,1))","v":"BU0016"},{"$f":"IF(ISERROR(VLOOKUP($A$11,Voorraad!$A$2:$D$1001,3)),\"\",VLOOKUP($A$11,Voorraad!$A$2:$D$1001,3))","v":"D BYV27-150-TAP"},{"$f":"IF(ISERROR(VLOOKUP($A$11,Voorraad!$A$2:$D$1001,2)),\"\",VLOOKUP($A$11,Voorraad!$A$2:$D$1001,2))","v":0},{"$f":"IF(ISERROR(VLOOKUP($A$11,Voorraad!$A$2:$H$1001,8)),\"\",VLOOKUP($A$11,Voorraad!$A$2:$H$1001,8))","v":520005},{"$f":"IF(ISERROR(VLOOKUP($A$11,Voorraad!$A$2:$I$1001,9)),\"\",VLOOKUP($A$11,Voorraad!$A$2:$I$1001,9))","v":"BYV27-150-TAP"},{"$f":"IF(ISERROR(VLOOKUP($A$11,Voorraad!$A$2:$J$1001,10)),\"\",VLOOKUP($A$11,Voorraad!$A$2:$J$1001,10))","v":0},{"$f":"IF(ISERROR(VLOOKUP($A$11,Voorraad!$A$2:$G$1001,6)),\"\",VLOOKUP($A$11,Voorraad!$A$2:$G$1001,6))","v":"MOUSER"},{"$f":"IF(ISERROR(VLOOKUP($A$11,Voorraad!$A$2:$G$1001,7)),\"\",VLOOKUP($A$11,Voorraad!$A$2:$G$1001,7))","v":"PHILIPS"},{"$f":"IF(ISERROR(VLOOKUP($A$11,Voorraad!$A$2:$G$1001,5)),\"\",VLOOKUP($A$11,Voorraad!$A$2:$G$1001,5))","v":"8437/8438/8439/8510"},{"$f":"IF(ISERROR(VLOOKUP($A$11,Voorraad!$A$2:$D$1001,4)),\"\",VLOOKUP($A$11,Voorraad!$A$2:$D$1001,4))","v":-7},10,17]
["BU0038",{"$f":"[2]Sheet1!$E$7","v":10},{"$f":"IF(ISERROR(VLOOKUP($A$12,Voorraad!$A$2:$D$1001,1)),\"\",VLOOKUP($A$12,Voorraad!$A$2:$D$1001,1))","v":"BU0038"},{"$f":"IF(ISERROR(VLOOKUP($A$12,Voorraad!$A$2:$D$1001,3)),\"\",VLOOKUP($A$12,Voorraad!$A$2:$D$1001,3))","v":"4N35 Optocoupler"},{"$f":"IF(ISERROR(VLOOKUP($A$12,Voorraad!$A$2:$D$1001,2)),\"\",VLOOKUP($A$12,Voorraad!$A$2:$D$1001,2))","v":"DIL6"},{"$f":"IF(ISERROR(VLOOKUP($A$12,Voorraad!$A$2:$H$1001,8)),\"\",VLOOKUP($A$12,Voorraad!$A$2:$H$1001,8))","v":0},{"$f":"IF(ISERROR(VLOOKUP($A$12,Voorraad!$A$2:$I$1001,9)),\"\",VLOOKUP($A$12,Voorraad!$A$2:$I$1001,9))","v":"4N35"},{"$f":"IF(ISERROR(VLOOKUP($A$12,Voorraad!$A$2:$J$1001,10)),\"\",VLOOKUP($A$12,Voorraad!$A$2:$J$1001,10))","v":0},{"$f":"IF(ISERROR(VLOOKUP($A$12,Voorraad!$A$2:$G$1001,6)),\"\",VLOOKUP($A$12,Voorraad!$A$2:$G$1001,6))","v":"TME "},{"$f":"IF(ISERROR(VLOOKUP($A$12,Voorraad!$A$2:$G$1001,7)),\"\",VLOOKUP($A$12,Voorraad!$A$2:$G$1001,7))","v":"Vishay"},{"$f":"IF(ISERROR(VLOOKUP($A$12,Voorraad!$A$2:$G$1001,5)),\"\",VLOOKUP($A$12,Voorraad!$A$2:$G$1001,5))","v":"8437/8464"},{"$f":"IF(ISERROR(VLOOKUP($A$12,Voorraad!$A$2:$D$1001,4)),\"\",VLOOKUP($A$12,Voorraad!$A$2:$D$1001,4))","v":15},10,0]
["BU0053",{"$f":"[2]Sheet1!$E$8","v":10},{"$f":"IF(ISERROR(VLOOKUP($A$13,Voorraad!$A$2:$D$1001,1)),\"\",VLOOKUP($A$13,Voorraad!$A$2:$D$1001,1))","v":"BU0053"},{"$f":"IF(ISERROR(VLOOKUP($A$13,Voorraad!$A$2:$D$1001,3)),\"\",VLOOKUP($A$13,Voorraad!$A$2:$D$1001,3))","v":"TMR6_2422"},{"$f":"IF(ISERROR(VLOOKUP($A$13,Voorraad!$A$2:$D$1001,2)),\"\",VLOOKUP($A$13,Voorraad!$A$2:$D$1001,2))","v":906442394},{"$f":"IF(ISERROR(VLOOKUP($A$13,Voorraad!$A$2:$H$1001,8)),\"\",VLOOKUP($A$13,Voorraad!$A$2:$H$1001,8))","v":0},{"$f":"IF(ISERROR(VLOOKUP($A$13,Voorraad!$A$2:$I$1001,9)),\"\",VLOOKUP($A$13,Voorraad!$A$2:$I$1001,9))","v":"TMR6-2422"},{"$f":"IF(ISERROR(VLOOKUP($A$13,Voorraad!$A$2:$J$1001,10)),\"\",VLOOKUP($A$13,Voorraad!$A$2:$J$1001,10))","v":"DISTRELEC: 169-54-689"},{"$f":"IF(ISERROR(VLOOKUP($A$13,Voorraad!$A$2:$G$1001,6)),\"\",VLOOKUP($A$13,Voorraad!$A$2:$G$1001,6))","v":"TME"},{"$f":"IF(ISERROR(VLOOKUP($A$13,Voorraad!$A$2:$G$1001,7)),\"\",VLOOKUP($A$13,Voorraad!$A$2:$G$1001,7))","v":"TRACO POWER"},{"$f":"IF(ISERROR(VLOOKUP($A$13,Voorraad!$A$2:$G$1001,5)),\"\",VLOOKUP($A$13,Voorraad!$A$2:$G$1001,5))","v":"8437/8439"},{"$f":"IF(ISERROR(VLOOKUP($A$13,Voorraad!$A$2:$D$1001,4)),\"\",VLOOKUP($A$13,Voorraad!$A$2:$D$1001,4))","v":37},10,0]
["BR4020",{"$f":"[2]Sheet1!$E$9","v":10},{"$f":"IF(ISERROR(VLOOKUP($A$14,Voorraad!$A$2:$D$1001,1)),\"\",VLOOKUP($A$14,Voorraad!$A$2:$D$1001,1))","v":"BR4020"},{"$f":"IF(ISERROR(VLOOKUP($A$14,Voorraad!$A$2:$D$1001,3)),\"\",VLOOKUP($A$14,Voorraad!$A$2:$D$1001,3))","v":"MFR135 "},{"$f":"IF(ISERROR(VLOOKUP($A$14,Voorraad!$A$2:$D$1001,2)),\"\",VLOOKUP($A$14,Voorraad!$A$2:$D$1001,2))","v":"ERF-RA13560Z"},{"$f":"IF(ISERROR(VLOOKUP($A$14,Voorraad!$A$2:$H$1001,8)),\"\",VLOOKUP($A$14,Voorraad!$A$2:$H$1001,8))","v":0},{"$f":"IF(ISERROR(VLOOKUP($A$14,Voorraad!$A$2:$I$1001,9)),\"\",VLOOKUP($A$14,Voorraad!$A$2:$I$1001,9))","v":"ERF - RA135-60Z"},{"$f":"IF(ISERROR(VLOOKUP($A$14,Voorraad!$A$2:$J$1001,10)),\"\",VLOOKUP($A$14,Voorraad!$A$2:$J$1001,10))","v":0},{"$f":"IF(ISERROR(VLOOKUP($A$14,Voorraad!$A$2:$G$1001,6)),\"\",VLOOKUP($A$14,Voorraad!$A$2:$G$1001,6))","v":"TME"},{"$f":"IF(ISERROR(VLOOKUP($A$14,Voorraad!$A$2:$G$1001,7)),\"\",VLOOKUP($A$14,Voorraad!$A$2:$G$1001,7))","v":"ECE"},{"$f":"IF(ISERROR(VLOOKUP($A$14,Voorraad!$A$2:$G$1001,5)),\"\",VLOOKUP($A$14,Voorraad!$A$2:$G$1001,5))","v":"8437/8438"},{"$f":"IF(ISERROR(VLOOKUP($A$14,Voorraad!$A$2:$D$1001,4)),\"\",VLOOKUP($A$14,Voorraad!$A$2:$D$1001,4))","v":14},10,0]
["BR4030",{"$f":"[2]Sheet1!$E$10","v":10},{"$f":"IF(ISERROR(VLOOKUP($A$15,Voorraad!$A$2:$D$1001,1)),\"\",VLOOKUP($A$15,Voorraad!$A$2:$D$1001,1))","v":"BR4030"},{"$f":"IF(ISERROR(VLOOKUP($A$15,Voorraad!$A$2:$D$1001,3)),\"\",VLOOKUP($A$15,Voorraad!$A$2:$D$1001,3))","v":"100NF50V"},{"$f":"IF(ISERROR(VLOOKUP($A$15,Voorraad!$A$2:$D$1001,2)),\"\",VLOOKUP($A$9,Voorraad!$A$2:$D$1001,2))","v":"EEUFC1V221 "},{"$f":"IF(ISERROR(VLOOKUP($A$15,Voorraad!$A$2:$H$1001,8)),\"\",VLOOKUP($A$15,Voorraad!$A$2:$H$1001,8))","v":0},{"$f":"IF(ISERROR(VLOOKUP($A$15,Voorraad!$A$2:$I$1001,9)),\"\",VLOOKUP($A$15,Voorraad!$A$2:$I$1001,9))","v":"CM-100N-Y5V"},{"$f":"IF(ISERROR(VLOOKUP($A$15,Voorraad!$A$2:$J$1001,10)),\"\",VLOOKUP($A$15,Voorraad!$A$2:$J$1001,10))","v":0},{"$f":"IF(ISERROR(VLOOKUP($A$15,Voorraad!$A$2:$G$1001,6)),\"\",VLOOKUP($A$15,Voorraad!$A$2:$G$1001,6))","v":"TME"},{"$f":"IF(ISERROR(VLOOKUP($A$15,Voorraad!$A$2:$G$1001,7)),\"\",VLOOKUP($A$15,Voorraad!$A$2:$G$1001,7))","v":"SR Passives"},{"$f":"IF(ISERROR(VLOOKUP($A$15,Voorraad!$A$2:$G$1001,5)),\"\",VLOOKUP($A$15,Voorraad!$A$2:$G$1001,5))","v":"8437/8438/8439"},{"$f":"IF(ISERROR(VLOOKUP($A$15,Voorraad!$A$2:$D$1001,4)),\"\",VLOOKUP($A$15,Voorraad!$A$2:$D$1001,4))","v":184},10,0]
["BR3550",{"$f":"[2]Sheet1!$E$11","v":10},{"$f":"IF(ISERROR(VLOOKUP($A$16,Voorraad!$A$2:$D$1001,1)),\"\",VLOOKUP($A$16,Voorraad!$A$2:$D$1001,1))","v":"BR3550"},{"$f":"IF(ISERROR(VLOOKUP($A$16,Voorraad!$A$2:$D$1001,3)),\"\",VLOOKUP($A$16,Voorraad!$A$2:$D$1001,3))","v":"RV S05K30 100A 0.01W"},{"$f":"IF(ISERROR(VLOOKUP($A$16,Voorraad!$A$2:$D$1001,2)),\"\",VLOOKUP($A$16,Voorraad!$A$2:$D$1001,2))","v":"#122S05K30"},{"$f":"IF(ISERROR(VLOOKUP($A$16,Voorraad!$A$2:$H$1001,8)),\"\",VLOOKUP($A$16,Voorraad!$A$2:$H$1001,8))","v":500088},{"$f":"IF(ISERROR(VLOOKUP($A$16,Voorraad!$A$2:$I$1001,9)),\"\",VLOOKUP($A$16,Voorraad!$A$2:$I$1001,9))","v":"SIOV-S05K30"},{"$f":"IF(ISERROR(VLOOKUP($A$16,Voorraad!$A$2:$J$1001,10)),\"\",VLOOKUP($A$16,Voorraad!$A$2:$J$1001,10))","v":"Groter aantal inkopen "},{"$f":"IF(ISERROR(VLOOKUP($A$16,Voorraad!$A$2:$G$1001,6)),\"\",VLOOKUP($A$16,Voorraad!$A$2:$G$1001,6))","v":"TME"},{"$f":"IF(ISERROR(VLOOKUP($A$16,Voorraad!$A$2:$G$1001,7)),\"\",VLOOKUP($A$16,Voorraad!$A$2:$G$1001,7))","v":"EPCOS"},{"$f":"IF(ISERROR(VLOOKUP($A$16,Voorraad!$A$2:$G$1001,5)),\"\",VLOOKUP($A$16,Voorraad!$A$2:$G$1001,5))","v":"8410/8437/8438/8439/8510"},{"$f":"IF(ISERROR(VLOOKUP($A$16,Voorraad!$A$2:$D$1001,4)),\"\",VLOOKUP($A$16,Voorraad!$A$2:$D$1001,4))","v":86},10,0]
["BR0004",{"$f":"[2]Sheet1!$E$12","v":20},{"$f":"IF(ISERROR(VLOOKUP($A$17,Voorraad!$A$2:$D$1001,1)),\"\",VLOOKUP($A$17,Voorraad!$A$2:$D$1001,1))","v":"BR0004"},{"$f":"IF(ISERROR(VLOOKUP($A$17,Voorraad!$A$2:$D$1001,3)),\"\",VLOOKUP($A$17,Voorraad!$A$2:$D$1001,3))","v":"R 1K00 1% 0.6W 7X2,5MM"},{"$f":"IF(ISERROR(VLOOKUP($A$17,Voorraad!$A$2:$D$1001,2)),\"\",VLOOKUP($A$17,Voorraad!$A$2:$D$1001,2))","v":"#10031001"},{"$f":"IF(ISERROR(VLOOKUP($A$17,Voorraad!$A$2:$H$1001,8)),\"\",VLOOKUP($A$17,Voorraad!$A$2:$H$1001,8))","v":500048},{"$f":"IF(ISERROR(VLOOKUP($A$17,Voorraad!$A$2:$I$1001,9)),\"\",VLOOKUP($A$17,Voorraad!$A$2:$I$1001,9))","v":0},{"$f":"IF(ISERROR(VLOOKUP($A$17,Voorraad!$A$2:$J$1001,10)),\"\",VLOOKUP($A$17,Voorraad!$A$2:$J$1001,10))","v":0},{"$f":"IF(ISERROR(VLOOKUP($A$17,Voorraad!$A$2:$G$1001,6)),\"\",VLOOKUP($A$17,Voorraad!$A$2:$G$1001,6))","v":0},{"$f":"IF(ISERROR(VLOOKUP($A$17,Voorraad!$A$2:$G$1001,7)),\"\",VLOOKUP($A$17,Voorraad!$A$2:$G$1001,7))","v":"BCC"},{"$f":"IF(ISERROR(VLOOKUP($A$17,Voorraad!$A$2:$G$1001,5)),\"\",VLOOKUP($A$17,Voorraad!$A$2:$G$1001,5))","v":"8510/8437/8438/8439/8464"},{"$f":"IF(ISERROR(VLOOKUP($A$17,Voorraad!$A$2:$D$1001,4)),\"\",VLOOKUP($A$17,Voorraad!$A$2:$D$1001,4))","v":208},20,0]
["BR0005",{"$f":"[2]Sheet1!$E$13","v":20},{"$f":"IF(ISERROR(VLOOKUP($A$18,Voorraad!$A$2:$D$1001,1)),\"\",VLOOKUP($A$18,Voorraad!$A$2:$D$1001,1))","v":"BR0005"},{"$f":"IF(ISERROR(VLOOKUP($A$18,Voorraad!$A$2:$D$1001,3)),\"\",VLOOKUP($A$18,Voorraad!$A$2:$D$1001,3))","v":"R 10K0 1% 0.6W 7X2,5MM"},{"$f":"IF(ISERROR(VLOOKUP($A$18,Voorraad!$A$2:$D$1001,2)),\"\",VLOOKUP($A$18,Voorraad!$A$2:$D$1001,2))","v":"#10041001"},{"$f":"IF(ISERROR(VLOOKUP($A$18,Voorraad!$A$2:$H$1001,8)),\"\",VLOOKUP($A$18,Voorraad!$A$2:$H$1001,8))","v":500060},{"$f":"IF(ISERROR(VLOOKUP($A$18,Voorraad!$A$2:$I$1001,9)),\"\",VLOOKUP($A$18,Voorraad!$A$2:$I$1001,9))","v":0},{"$f":"IF(ISERROR(VLOOKUP($A$18,Voorraad!$A$2:$J$1001,10)),\"\",VLOOKUP($A$18,Voorraad!$A$2:$J$1001,10))","v":0},{"$f":"IF(ISERROR(VLOOKUP($A$18,Voorraad!$A$2:$G$1001,6)),\"\",VLOOKUP($A$18,Voorraad!$A$2:$G$1001,6))","v":0},{"$f":"IF(ISERROR(VLOOKUP($A$18,Voorraad!$A$2:$G$1001,7)),\"\",VLOOKUP($A$18,Voorraad!$A$2:$G$1001,7))","v":"BCC"},{"$f":"IF(ISERROR(VLOOKUP($A$18,Voorraad!$A$2:$G$1001,5)),\"\",VLOOKUP($A$18,Voorraad!$A$2:$G$1001,5))","v":"8510/8437/8438/8439"},{"$f":"IF(ISERROR(VLOOKUP($A$18,Voorraad!$A$2:$D$1001,4)),\"\",VLOOKUP($A$18,Voorraad!$A$2:$D$1001,4))","v":1908},20,0]
["BU0010",{"$f":"[2]Sheet1!$E$14","v":10},{"$f":"IF(ISERROR(VLOOKUP($A$19,Voorraad!$A$2:$D$1001,1)),\"\",VLOOKUP($A$19,Voorraad!$A$2:$D$1001,1))","v":"BU0010"},{"$f":"IF(ISERROR(VLOOKUP($A$19,Voorraad!$A$2:$D$1001,3)),\"\",VLOOKUP($A$19,Voorraad!$A$2:$D$1001,3))","v":"22UH"},{"$f":"IF(ISERROR(VLOOKUP($A$19,Voorraad!$A$2:$D$1001,2)),\"\",VLOOKUP($A$19,Voorraad!$A$2:$D$1001,2))","v":"HBCC-220K-02"},{"$f":"IF(ISERROR(VLOOKUP($A$19,Voorraad!$A$2:$H$1001,8)),\"\",VLOOKUP($A$19,Voorraad!$A$2:$H$1001,8))","v":0},{"$f":"IF(ISERROR(VLOOKUP($A$19,Voorraad!$A$2:$I$1001,9)),\"\",VLOOKUP($A$19,Voorraad!$A$2:$I$1001,9))","v":"HBCC-220K-02"},{"$f":"IF(ISERROR(VLOOKUP($A$19,Voorraad!$A$2:$J$1001,10)),\"\",VLOOKUP($A$19,Voorraad!$A$2:$J$1001,10))","v":" MICC-R22M-02"},{"$f":"IF(ISERROR(VLOOKUP($A$19,Voorraad!$A$2:$G$1001,6)),\"\",VLOOKUP($A$19,Voorraad!$A$2:$G$1001,6))","v":"TME"},{"$f":"IF(ISERROR(VLOOKUP($A$19,Voorraad!$A$2:$G$1001,7)),\"\",VLOOKUP($A$19,Voorraad!$A$2:$G$1001,7))","v":"FASTRON"},{"$f":"IF(ISERROR(VLOOKUP($A$19,Voorraad!$A$2:$G$1001,5)),\"\",VLOOKUP($A$19,Voorraad!$A$2:$G$1001,5))","v":"8437/8438/8439"},{"$f":"IF(ISERROR(VLOOKUP($A$19,Voorraad!$A$2:$D$1001,4)),\"\",VLOOKUP($A$19,Voorraad!$A$2:$D$1001,4))","v":60},10,0]
["BU0065",{"$f":"[2]Sheet1!$E$15","v":10},{"$f":"IF(ISERROR(VLOOKUP($A$20,Voorraad!$A$2:$D$1001,1)),\"\",VLOOKUP($A$20,Voorraad!$A$2:$D$1001,1))","v":"BU0065"},{"$f":"IF(ISERROR(VLOOKUP($A$20,Voorraad!$A$2:$D$1001,3)),\"\",VLOOKUP($A$20,Voorraad!$A$2:$D$1001,3))","v":"DB37F "},{"$f":"IF(ISERROR(VLOOKUP($A$20,Voorraad!$A$2:$D$1001,2)),\"\",VLOOKUP($A$20,Voorraad!$A$2:$D$1001,2))","v":"09 66 451 6513"},{"$f":"IF(ISERROR(VLOOKUP($A$20,Voorraad!$A$2:$H$1001,8)),\"\",VLOOKUP($A$20,Voorraad!$A$2:$H$1001,8))","v":0},{"$f":"IF(ISERROR(VLOOKUP($A$20,Voorraad!$A$2:$I$1001,9)),\"\",VLOOKUP($A$20,Voorraad!$A$2:$I$1001,9))","v":"09 66 451 6513"},{"$f":"IF(ISERROR(VLOOKUP($A$20,Voorraad!$A$2:$J$1001,10)),\"\",VLOOKUP($A$20,Voorraad!$A$2:$J$1001,10))","v":0},{"$f":"IF(ISERROR(VLOOKUP($A$20,Voorraad!$A$2:$G$1001,6)),\"\",VLOOKUP($A$20,Voorraad!$A$2:$G$1001,6))","v":"TME"},{"$f":"IF(ISERROR(VLOOKUP($A$20,Voorraad!$A$2:$G$1001,7)),\"\",VLOOKUP($A$20,Voorraad!$A$2:$G$1001,7))","v":"Harting "},{"$f":"IF(ISERROR(VLOOKUP($A$20,Voorraad!$A$2:$G$1001,5)),\"\",VLOOKUP($A$20,Voorraad!$A$2:$G$1001,5))","v":"8437/8438"},{"$f":"IF(ISERROR(VLOOKUP($A$20,Voorraad!$A$2:$D$1001,4)),\"\",VLOOKUP($A$20,Voorraad!$A$2:$D$1001,4))","v":13},10,0]
["BU0066",{"$f":"[2]Sheet1!$E$16","v":280},{"$f":"IF(ISERROR(VLOOKUP($A$21,Voorraad!$A$2:$D$1001,1)),\"\",VLOOKUP($A$21,Voorraad!$A$2:$D$1001,1))","v":"BU0066"},{"$f":"IF(ISERROR(VLOOKUP($A$21,Voorraad!$A$2:$D$1001,3)),\"\",VLOOKUP($A$21,Voorraad!$A$2:$D$1001,3))","v":"KDS3 "},{"$f":"IF(ISERROR(VLOOKUP($A$21,Voorraad!$A$2:$D$1001,2)),\"\",VLOOKUP($A$21,Voorraad!$A$2:$D$1001,2))","v":1780015},{"$f":"IF(ISERROR(VLOOKUP($A$21,Voorraad!$A$2:$H$1001,8)),\"\",VLOOKUP($A$21,Voorraad!$A$2:$H$1001,8))","v":0},{"$f":"IF(ISERROR(VLOOKUP($A$21,Voorraad!$A$2:$I$1001,9)),\"\",VLOOKUP($A$21,Voorraad!$A$2:$I$1001,9))","v":1780015},{"$f":"IF(ISERROR(VLOOKUP($A$21,Voorraad!$A$2:$J$1001,10)),\"\",VLOOKUP($A$21,Voorraad!$A$2:$J$1001,10))","v":0},{"$f":"IF(ISERROR(VLOOKUP($A$21,Voorraad!$A$2:$G$1001,6)),\"\",VLOOKUP($A$21,Voorraad!$A$2:$G$1001,6))","v":"Van Egmond Groep"},{"$f":"IF(ISERROR(VLOOKUP($A$21,Voorraad!$A$2:$G$1001,7)),\"\",VLOOKUP($A$21,Voorraad!$A$2:$G$1001,7))","v":"Phoenix"},{"$f":"IF(ISERROR(VLOOKUP($A$21,Voorraad!$A$2:$G$1001,5)),\"\",VLOOKUP($A$21,Voorraad!$A$2:$G$1001,5))","v":"8437/8438/8439"},{"$f":"IF(ISERROR(VLOOKUP($A$21,Voorraad!$A$2:$D$1001,4)),\"\",VLOOKUP($A$21,Voorraad!$A$2:$D$1001,4))","v":546},280,0]
["BU0068",{"$f":"[2]Sheet1!$E$17","v":160},{"$f":"IF(ISERROR(VLOOKUP($A$22,Voorraad!$A$2:$D$1001,1)),\"\",VLOOKUP($A$22,Voorraad!$A$2:$D$1001,1))","v":"BU0068"},{"$f":"IF(ISERROR(VLOOKUP($A$22,Voorraad!$A$2:$D$1001,3)),\"\",VLOOKUP($A$22,Voorraad!$A$2:$D$1001,3))","v":"ZL201-03G"},{"$f":"IF(ISERROR(VLOOKUP($A$22,Voorraad!$A$2:$D$1001,2)),\"\",VLOOKUP($A$22,Voorraad!$A$2:$D$1001,2))","v":"DS1021-136sf11"},{"$f":"IF(ISERROR(VLOOKUP($A$22,Voorraad!$A$2:$H$1001,8)),\"\",VLOOKUP($A$22,Voorraad!$A$2:$H$1001,8))","v":0},{"$f":"IF(ISERROR(VLOOKUP($A$22,Voorraad!$A$2:$I$1001,9)),\"\",VLOOKUP($A$22,Voorraad!$A$2:$I$1001,9))","v":"ZL201-03G"},{"$f":"IF(ISERROR(VLOOKUP($A$22,Voorraad!$A$2:$J$1001,10)),\"\",VLOOKUP($A$22,Voorraad!$A$2:$J$1001,10))","v":0},{"$f":"IF(ISERROR(VLOOKUP($A$22,Voorraad!$A$2:$G$1001,6)),\"\",VLOOKUP($A$22,Voorraad!$A$2:$G$1001,6))","v":"TME"},{"$f":"IF(ISERROR(VLOOKUP($A$22,Voorraad!$A$2:$G$1001,7)),\"\",VLOOKUP($A$22,Voorraad!$A$2:$G$1001,7))","v":"Connfly"},{"$f":"IF(ISERROR(VLOOKUP($A$22,Voorraad!$A$2:$G$1001,5)),\"\",VLOOKUP($A$22,Voorraad!$A$2:$G$1001,5))","v":"8437/8439/8464/8510"},{"$f":"IF(ISERROR(VLOOKUP($A$22,Voorraad!$A$2:$D$1001,4)),\"\",VLOOKUP($A$22,Voorraad!$A$2:$D$1001,4))","v":931},160,0]
["BU0059",{"$f":"[2]Sheet1!$E$18","v":160},{"$f":"IF(ISERROR(VLOOKUP($A$23,Voorraad!$A$2:$D$1001,1)),\"\",VLOOKUP($A$23,Voorraad!$A$2:$D$1001,1))","v":"BU0059"},{"$f":"IF(ISERROR(VLOOKUP($A$23,Voorraad!$A$2:$D$1001,3)),\"\",VLOOKUP($A$23,Voorraad!$A$2:$D$1001,3))","v":"CON 1-881545-1 SHUNT"},{"$f":"IF(ISERROR(VLOOKUP($A$23,Voorraad!$A$2:$D$1001,2)),\"\",VLOOKUP($A$23,Voorraad!$A$2:$D$1001,2))","v":"#513JUMPOFSW"},{"$f":"IF(ISERROR(VLOOKUP($A$23,Voorraad!$A$2:$H$1001,8)),\"\",VLOOKUP($A$23,Voorraad!$A$2:$H$1001,8))","v":0},{"$f":"IF(ISERROR(VLOOKUP($A$23,Voorraad!$A$2:$I$1001,9)),\"\",VLOOKUP($A$23,Voorraad!$A$2:$I$1001,9))","v":"JUMPER-BL"},{"$f":"IF(ISERROR(VLOOKUP($A$23,Voorraad!$A$2:$J$1001,10)),\"\",VLOOKUP($A$23,Voorraad!$A$2:$J$1001,10))","v":0},{"$f":"IF(ISERROR(VLOOKUP($A$23,Voorraad!$A$2:$G$1001,6)),\"\",VLOOKUP($A$23,Voorraad!$A$2:$G$1001,6))","v":"TME"},{"$f":"IF(ISERROR(VLOOKUP($A$23,Voorraad!$A$2:$G$1001,7)),\"\",VLOOKUP($A$23,Voorraad!$A$2:$G$1001,7))","v":0},{"$f":"IF(ISERROR(VLOOKUP($A$23,Voorraad!$A$2:$G$1001,5)),\"\",VLOOKUP($A$23,Voorraad!$A$2:$G$1001,5))","v":"8437/8439/8464/8510"},{"$f":"IF(ISERROR(VLOOKUP($A$23,Voorraad!$A$2:$D$1001,4)),\"\",VLOOKUP($A$23,Voorraad!$A$2:$D$1001,4))","v":1725},160,0]
["BU0045",{"$f":"[2]Sheet1!$E$19","v":10},{"$f":"IF(ISERROR(VLOOKUP($A$24,Voorraad!$A$2:$D$1001,1)),\"\",VLOOKUP($A$24,Voorraad!$A$2:$D$1001,1))","v":"BU0045"},{"$f":"IF(ISERROR(VLOOKUP($A$24,Voorraad!$A$2:$D$1001,3)),\"\",VLOOKUP($A$24,Voorraad!$A$2:$D$1001,3))","v":"LED TLG124A GROEN 3.18MM"},{"$f":"IF(ISERROR(VLOOKUP($A$24,Voorraad!$A$2:$D$1001,2)),\"\",VLOOKUP($A$24,Voorraad!$A$2:$D$1001,2))","v":"KVD-03-035/G"},{"$f":"IF(ISERROR(VLOOKUP($A$24,Voorraad!$A$2:$H$1001,8)),\"\",VLOOKUP($A$24,Voorraad!$A$2:$H$1001,8))","v":"?"},{"$f":"IF(ISERROR(VLOOKUP($A$24,Voorraad!$A$2:$I$1001,9)),\"\",VLOOKUP($A$24,Voorraad!$A$2:$I$1001,9))","v":"L-934GD"},{"$f":"IF(ISERROR(VLOOKUP($A$24,Voorraad!$A$2:$J$1001,10)),\"\",VLOOKUP($A$24,Voorraad!$A$2:$J$1001,10))","v":0},{"$f":"IF(ISERROR(VLOOKUP($A$24,Voorraad!$A$2:$G$1001,6)),\"\",VLOOKUP($A$24,Voorraad!$A$2:$G$1001,6))","v":"TME"},{"$f":"IF(ISERROR(VLOOKUP($A$24,Voorraad!$A$2:$G$1001,7)),\"\",VLOOKUP($A$24,Voorraad!$A$2:$G$1001,7))","v":"KHATOD / King Bright"},{"$f":"IF(ISERROR(VLOOKUP($A$24,Voorraad!$A$2:$G$1001,5)),\"\",VLOOKUP($A$24,Voorraad!$A$2:$G$1001,5))","v":"8437/8438/8439/8464/8510"},{"$f":"IF(ISERROR(VLOOKUP($A$24,Voorraad!$A$2:$D$1001,4)),\"\",VLOOKUP($A$24,Voorraad!$A$2:$D$1001,4))","v":2},10,8]
["BX0002",{"$f":"[2]Sheet1!$E$20","v":10},{"$f":"IF(ISERROR(VLOOKUP($A$25,Voorraad!$A$2:$D$1001,1)),\"\",VLOOKUP($A$25,Voorraad!$A$2:$D$1001,1))","v":"BX0002"},{"$f":"IF(ISERROR(VLOOKUP($A$25,Voorraad!$A$2:$D$1001,3)),\"\",VLOOKUP($A$25,Voorraad!$A$2:$D$1001,3))","v":"SL2 "},{"$f":"IF(ISERROR(VLOOKUP($A$25,Voorraad!$A$2:$D$1001,2)),\"\",VLOOKUP($A$25,Voorraad!$A$2:$D$1001,2))","v":"XY2500V-C(5.08)-2PIN"},{"$f":"IF(ISERROR(VLOOKUP($A$25,Voorraad!$A$2:$H$1001,8)),\"\",VLOOKUP($A$25,Voorraad!$A$2:$H$1001,8))","v":0},{"$f":"IF(ISERROR(VLOOKUP($A$25,Voorraad!$A$2:$I$1001,9)),\"\",VLOOKUP($A$25,Voorraad!$A$2:$I$1001,9))","v":"TBG-5-PB-2P-GN"},{"$f":"IF(ISERROR(VLOOKUP($A$25,Voorraad!$A$2:$J$1001,10)),\"\",VLOOKUP($A$25,Voorraad!$A$2:$J$1001,10))","v":0},{"$f":"IF(ISERROR(VLOOKUP($A$25,Voorraad!$A$2:$G$1001,6)),\"\",VLOOKUP($A$25,Voorraad!$A$2:$G$1001,6))","v":"TME"},{"$f":"IF(ISERROR(VLOOKUP($A$25,Voorraad!$A$2:$G$1001,7)),\"\",VLOOKUP($A$25,Voorraad!$A$2:$G$1001,7))","v":"Xinya"},{"$f":"IF(ISERROR(VLOOKUP($A$25,Voorraad!$A$2:$G$1001,5)),\"\",VLOOKUP($A$25,Voorraad!$A$2:$G$1001,5))","v":"8437/8438/8439"},{"$f":"IF(ISERROR(VLOOKUP($A$25,Voorraad!$A$2:$D$1001,4)),\"\",VLOOKUP($A$25,Voorraad!$A$2:$D$1001,4))","v":92},10,0]
["BX0003",{"$f":"[2]Sheet1!$E$21","v":10},{"$f":"IF(ISERROR(VLOOKUP($A$26,Voorraad!$A$2:$D$1001,1)),\"\",VLOOKUP($A$26,Voorraad!$A$2:$D$1001,1))","v":"BX0003"},{"$f":"IF(ISERROR(VLOOKUP($A$26,Voorraad!$A$2:$D$1001,3)),\"\",VLOOKUP($A$26,Voorraad!$A$2:$D$1001,3))","v":"BL2"},{"$f":"IF(ISERROR(VLOOKUP($A$26,Voorraad!$A$2:$D$1001,2)),\"\",VLOOKUP($A$26,Voorraad!$A$2:$D$1001,2))","v":"TBW-5-2P/GN"},{"$f":"IF(ISERROR(VLOOKUP($A$26,Voorraad!$A$2:$H$1001,8)),\"\",VLOOKUP($A$26,Voorraad!$A$2:$H$1001,8))","v":0},{"$f":"IF(ISERROR(VLOOKUP($A$26,Voorraad!$A$2:$I$1001,9)),\"\",VLOOKUP($A$26,Voorraad!$A$2:$I$1001,9))","v":"TBW-5-2P/GN"},{"$f":"IF(ISERROR(VLOOKUP($A$26,Voorraad!$A$2:$J$1001,10)),\"\",VLOOKUP($A$26,Voorraad!$A$2:$J$1001,10))","v":0},{"$f":"IF(ISERROR(VLOOKUP($A$26,Voorraad!$A$2:$G$1001,6)),\"\",VLOOKUP($A$26,Voorraad!$A$2:$G$1001,6))","v":"TME"},{"$f":"IF(ISERROR(VLOOKUP($A$26,Voorraad!$A$2:$G$1001,7)),\"\",VLOOKUP($A$26,Voorraad!$A$2:$G$1001,7))","v":"Ninigi"},{"$f":"IF(ISERROR(VLOOKUP($A$26,Voorraad!$A$2:$G$1001,5)),\"\",VLOOKUP($A$26,Voorraad!$A$2:$G$1001,5))","v":"8437/8438/8439"},{"$f":"IF(ISERROR(VLOOKUP($A$26,Voorraad!$A$2:$D$1001,4)),\"\",VLOOKUP($A$26,Voorraad!$A$2:$D$1001,4))","v":93},10,0]
["BX0008",{"$f":"[2]Sheet1!$E$22","v":10},{"$f":"IF(ISERROR(VLOOKUP($A$27,Voorraad!$A$2:$D$1001,1)),\"\",VLOOKUP($A$27,Voorraad!$A$2:$D$1001,1))","v":"BX0008"},{"$f":"IF(ISERROR(VLOOKUP($A$27,Voorraad!$A$2:$D$1001,3)),\"\",VLOOKUP($A$27,Voorraad!$A$2:$D$1001,3))","v":"SL6 "},{"$f":"IF(ISERROR(VLOOKUP($A$27,Voorraad!$A$2:$D$1001,2)),\"\",VLOOKUP($A$27,Voorraad!$A$2:$D$1001,2))","v":"XY2500V-C(5.08)-6PIN"},{"$f":"IF(ISERROR(VLOOKUP($A$27,Voorraad!$A$2:$H$1001,8)),\"\",VLOOKUP($A$27,Voorraad!$A$2:$H$1001,8))","v":0},{"$f":"IF(ISERROR(VLOOKUP($A$27,Voorraad!$A$2:$I$1001,9)),\"\",VLOOKUP($A$27,Voorraad!$A$2:$I$1001,9))","v":"TBG-5-PB-6P-GN"},{"$f":"IF(ISERROR(VLOOKUP($A$27,Voorraad!$A$2:$J$1001,10)),\"\",VLOOKUP($A$27,Voorraad!$A$2:$J$1001,10))","v":0},{"$f":"IF(ISERROR(VLOOKUP($A$27,Voorraad!$A$2:$G$1001,6)),\"\",VLOOKUP($A$27,Voorraad!$A$2:$G$1001,6))","v":"TME"},{"$f":"IF(ISERROR(VLOOKUP($A$27,Voorraad!$A$2:$G$1001,7)),\"\",VLOOKUP($A$27,Voorraad!$A$2:$G$1001,7))","v":"Xinya"},{"$f":"IF(ISERROR(VLOOKUP($A$27,Voorraad!$A$2:$G$1001,5)),\"\",VLOOKUP($A$27,Voorraad!$A$2:$G$1001,5))","v":8437},{"$f":"IF(ISERROR(VLOOKUP($A$27,Voorraad!$A$2:$D$1001,4)),\"\",VLOOKUP($A$27,Voorraad!$A$2:$D$1001,4))","v":10},10,0]
["BX0009",{"$f":"[2]Sheet1!$E$23","v":10},{"$f":"IF(ISERROR(VLOOKUP($A$28,Voorraad!$A$2:$D$1001,1)),\"\",VLOOKUP($A$28,Voorraad!$A$2:$D$1001,1))","v":"BX0009"},{"$f":"IF(ISERROR(VLOOKUP($A$28,Voorraad!$A$2:$D$1001,3)),\"\",VLOOKUP($A$28,Voorraad!$A$2:$D$1001,3))","v":"BL6"},{"$f":"IF(ISERROR(VLOOKUP($A$28,Voorraad!$A$2:$D$1001,2)),\"\",VLOOKUP($A$28,Voorraad!$A$2:$D$1001,2))","v":"TBW-5-6P/GN"},{"$f":"IF(ISERROR(VLOOKUP($A$28,Voorraad!$A$2:$H$1001,8)),\"\",VLOOKUP($A$28,Voorraad!$A$2:$H$1001,8))","v":0},{"$f":"IF(ISERROR(VLOOKUP($A$28,Voorraad!$A$2:$I$1001,9)),\"\",VLOOKUP($A$28,Voorraad!$A$2:$I$1001,9))","v":"TBW-5-6P/GN"},{"$f":"IF(ISERROR(VLOOKUP($A$28,Voorraad!$A$2:$J$1001,10)),\"\",VLOOKUP($A$28,Voorraad!$A$2:$J$1001,10))","v":0},{"$f":"IF(ISERROR(VLOOKUP($A$28,Voorraad!$A$2:$G$1001,6)),\"\",VLOOKUP($A$28,Voorraad!$A$2:$G$1001,6))","v":"TME"},{"$f":"IF(ISERROR(VLOOKUP($A$28,Voorraad!$A$2:$G$1001,7)),\"\",VLOOKUP($A$28,Voorraad!$A$2:$G$1001,7))","v":"Ninigi"},{"$f":"IF(ISERROR(VLOOKUP($A$28,Voorraad!$A$2:$G$1001,5)),\"\",VLOOKUP($A$28,Voorraad!$A$2:$G$1001,5))","v":8437},{"$f":"IF(ISERROR(VLOOKUP($A$28,Voorraad!$A$2:$D$1001,4)),\"\",VLOOKUP($A$28,Voorraad!$A$2:$D$1001,4))","v":10},10,0]
["BX0016",{"$f":"[2]Sheet1!$E$24","v":10},{"$f":"IF(ISERROR(VLOOKUP($A$29,Voorraad!$A$2:$D$1001,1)),\"\",VLOOKUP($A$29,Voorraad!$A$2:$D$1001,1))","v":"BX0016"},{"$f":"IF(ISERROR(VLOOKUP($A$29,Voorraad!$A$2:$D$1001,3)),\"\",VLOOKUP($A$29,Voorraad!$A$2:$D$1001,3))","v":"UM72 Profile 140MM"},{"$f":"IF(ISERROR(VLOOKUP($A$29,Voorraad!$A$2:$D$1001,2)),\"\",VLOOKUP($A$29,Voorraad!$A$2:$D$1001,2))","v":2996922},{"$f":"IF(ISERROR(VLOOKUP($A$29,Voorraad!$A$2:$H$1001,8)),\"\",VLOOKUP($A$29,Voorraad!$A$2:$H$1001,8))","v":0},{"$f":"IF(ISERROR(VLOOKUP($A$29,Voorraad!$A$2:$I$1001,9)),\"\",VLOOKUP($A$29,Voorraad!$A$2:$I$1001,9))","v":74005679},{"$f":"IF(ISERROR(VLOOKUP($A$29,Voorraad!$A$2:$J$1001,10)),\"\",VLOOKUP($A$29,Voorraad!$A$2:$J$1001,10))","v":0},{"$f":"IF(ISERROR(VLOOKUP($A$29,Voorraad!$A$2:$G$1001,6)),\"\",VLOOKUP($A$29,Voorraad!$A$2:$G$1001,6))","v":"Van Egmond Groep"},{"$f":"IF(ISERROR(VLOOKUP($A$29,Voorraad!$A$2:$G$1001,7)),\"\",VLOOKUP($A$29,Voorraad!$A$2:$G$1001,7))","v":"Phoenix"},{"$f":"IF(ISERROR(VLOOKUP($A$29,Voorraad!$A$2:$G$1001,5)),\"\",VLOOKUP($A$29,Voorraad!$A$2:$G$1001,5))","v":8437},{"$f":"IF(ISERROR(VLOOKUP($A$29,Voorraad!$A$2:$D$1001,4)),\"\",VLOOKUP($A$29,Voorraad!$A$2:$D$1001,4))","v":23},10,0]
["BX0019",{"$f":"[2]Sheet1!$E$25","v":10},{"$f":"IF(ISERROR(VLOOKUP($A$30,Voorraad!$A$2:$D$1001,1)),\"\",VLOOKUP($A$30,Voorraad!$A$2:$D$1001,1))","v":"BX0019"},{"$f":"IF(ISERROR(VLOOKUP($A$30,Voorraad!$A$2:$D$1001,3)),\"\",VLOOKUP($A$30,Voorraad!$A$2:$D$1001,3))","v":"UM72 SEFE/L"},{"$f":"IF(ISERROR(VLOOKUP($A$30,Voorraad!$A$2:$D$1001,2)),\"\",VLOOKUP($A$30,Voorraad!$A$2:$D$1001,2))","v":2959340},{"$f":"IF(ISERROR(VLOOKUP($A$30,Voorraad!$A$2:$H$1001,8)),\"\",VLOOKUP($A$30,Voorraad!$A$2:$H$1001,8))","v":0},{"$f":"IF(ISERROR(VLOOKUP($A$30,Voorraad!$A$2:$I$1001,9)),\"\",VLOOKUP($A$30,Voorraad!$A$2:$I$1001,9))","v":2959340},{"$f":"IF(ISERROR(VLOOKUP($A$30,Voorraad!$A$2:$J$1001,10)),\"\",VLOOKUP($A$30,Voorraad!$A$2:$J$1001,10))","v":0},{"$f":"IF(ISERROR(VLOOKUP($A$30,Voorraad!$A$2:$G$1001,6)),\"\",VLOOKUP($A$30,Voorraad!$A$2:$G$1001,6))","v":"Van Egmond Groep"},{"$f":"IF(ISERROR(VLOOKUP($A$30,Voorraad!$A$2:$G$1001,7)),\"\",VLOOKUP($A$30,Voorraad!$A$2:$G$1001,7))","v":"Phoenix"},{"$f":"IF(ISERROR(VLOOKUP($A$30,Voorraad!$A$2:$G$1001,5)),\"\",VLOOKUP($A$30,Voorraad!$A$2:$G$1001,5))","v":"8437/8438/8439"},{"$f":"IF(ISERROR(VLOOKUP($A$30,Voorraad!$A$2:$D$1001,4)),\"\",VLOOKUP($A$30,Voorraad!$A$2:$D$1001,4))","v":11},10,0]
["BX0020",{"$f":"[2]Sheet1!$E$26","v":10},{"$f":"IF(ISERROR(VLOOKUP($A$31,Voorraad!$A$2:$D$1001,1)),\"\",VLOOKUP($A$31,Voorraad!$A$2:$D$1001,1))","v":"BX0020"},{"$f":"IF(ISERROR(VLOOKUP($A$31,Voorraad!$A$2:$D$1001,3)),\"\",VLOOKUP($A$31,Voorraad!$A$2:$D$1001,3))","v":"UM72 SEFE/R"},{"$f":"IF(ISERROR(VLOOKUP($A$31,Voorraad!$A$2:$D$1001,2)),\"\",VLOOKUP($A$31,Voorraad!$A$2:$D$1001,2))","v":2959353},{"$f":"IF(ISERROR(VLOOKUP($A$31,Voorraad!$A$2:$H$1001,8)),\"\",VLOOKUP($A$31,Voorraad!$A$2:$H$1001,8))","v":0},{"$f":"IF(ISERROR(VLOOKUP($A$31,Voorraad!$A$2:$I$1001,9)),\"\",VLOOKUP($A$31,Voorraad!$A$2:$I$1001,9))","v":2959353},{"$f":"IF(ISERROR(VLOOKUP($A$31,Voorraad!$A$2:$J$1001,10)),\"\",VLOOKUP($A$31,Voorraad!$A$2:$J$1001,10))","v":0},{"$f":"IF(ISERROR(VLOOKUP($A$31,Voorraad!$A$2:$G$1001,6)),\"\",VLOOKUP($A$31,Voorraad!$A$2:$G$1001,6))","v":"Van Egmond Groep"},{"$f":"IF(ISERROR(VLOOKUP($A$31,Voorraad!$A$2:$G$1001,7)),\"\",VLOOKUP($A$31,Voorraad!$A$2:$G$1001,7))","v":"Phoenix"},{"$f":"IF(ISERROR(VLOOKUP($A$31,Voorraad!$A$2:$G$1001,5)),\"\",VLOOKUP($A$31,Voorraad!$A$2:$G$1001,5))","v":"8437/8438/8439"},{"$f":"IF(ISERROR(VLOOKUP($A$31,Voorraad!$A$2:$D$1001,4)),\"\",VLOOKUP($A$31,Voorraad!$A$2:$D$1001,4))","v":13},10,0]
["BX0039",{"$f":"[2]Sheet1!$E$27","v":10},{"$f":"IF(ISERROR(VLOOKUP($A$32,Voorraad!$A$2:$D$1001,1)),\"\",VLOOKUP($A$32,Voorraad!$A$2:$D$1001,1))","v":"BX0039"},{"$f":"IF(ISERROR(VLOOKUP($A$32,Voorraad!$A$2:$D$1001,3)),\"\",VLOOKUP($A$32,Voorraad!$A$2:$D$1001,3))","v":"PCB 8437L"},{"$f":"IF(ISERROR(VLOOKUP($A$32,Voorraad!$A$2:$D$1001,2)),\"\",VLOOKUP($A$32,Voorraad!$A$2:$D$1001,2))","v":"PCB 8437L"},{"$f":"IF(ISERROR(VLOOKUP($A$32,Voorraad!$A$2:$H$1001,8)),\"\",VLOOKUP($A$32,Voorraad!$A$2:$H$1001,8))","v":0},{"$f":"IF(ISERROR(VLOOKUP($A$32,Voorraad!$A$2:$I$1001,9)),\"\",VLOOKUP($A$32,Voorraad!$A$2:$I$1001,9))","v":0},{"$f":"IF(ISERROR(VLOOKUP($A$32,Voorraad!$A$2:$J$1001,10)),\"\",VLOOKUP($A$32,Voorraad!$A$2:$J$1001,10))","v":0},{"$f":"IF(ISERROR(VLOOKUP($A$32,Voorraad!$A$2:$G$1001,6)),\"\",VLOOKUP($A$32,Voorraad!$A$2:$G$1001,6))","v":"JvB"},{"$f":"IF(ISERROR(VLOOKUP($A$32,Voorraad!$A$2:$G$1001,7)),\"\",VLOOKUP($A$32,Voorraad!$A$2:$G$1001,7))","v":"JvB"},{"$f":"IF(ISERROR(VLOOKUP($A$32,Voorraad!$A$2:$G$1001,5)),\"\",VLOOKUP($A$32,Voorraad!$A$2:$G$1001,5))","v":"PCB 8437L"},{"$f":"IF(ISERROR(VLOOKUP($A$32,Voorraad!$A$2:$D$1001,4)),\"\",VLOOKUP($A$32,Voorraad!$A$2:$D$1001,4))","v":0},10,10]
["BX0040",{"$f":"[2]Sheet1!$E$28","v":10},{"$f":"IF(ISERROR(VLOOKUP($A$33,Voorraad!$A$2:$D$1001,1)),\"\",VLOOKUP($A$33,Voorraad!$A$2:$D$1001,1))","v":"BX0040"},{"$f":"IF(ISERROR(VLOOKUP($A$33,Voorraad!$A$2:$D$1001,3)),\"\",VLOOKUP($A$33,Voorraad!$A$2:$D$1001,3))","v":"PCB 8437R"},{"$f":"IF(ISERROR(VLOOKUP($A$33,Voorraad!$A$2:$D$1001,2)),\"\",VLOOKUP($A$33,Voorraad!$A$2:$D$1001,2))","v":"PCB 8437R"},{"$f":"IF(ISERROR(VLOOKUP($A$33,Voorraad!$A$2:$H$1001,8)),\"\",VLOOKUP($A$33,Voorraad!$A$2:$H$1001,8))","v":0},{"$f":"IF(ISERROR(VLOOKUP($A$33,Voorraad!$A$2:$I$1001,9)),\"\",VLOOKUP($A$33,Voorraad!$A$2:$I$1001,9))","v":0},{"$f":"IF(ISERROR(VLOOKUP($A$33,Voorraad!$A$2:$J$1001,10)),\"\",VLOOKUP($A$33,Voorraad!$A$2:$J$1001,10))","v":0},{"$f":"IF(ISERROR(VLOOKUP($A$33,Voorraad!$A$2:$G$1001,6)),\"\",VLOOKUP($A$33,Voorraad!$A$2:$G$1001,6))","v":"JvB"},{"$f":"IF(ISERROR(VLOOKUP($A$33,Voorraad!$A$2:$G$1001,7)),\"\",VLOOKUP($A$33,Voorraad!$A$2:$G$1001,7))","v":"JvB"},{"$f":"IF(ISERROR(VLOOKUP($A$33,Voorraad!$A$2:$G$1001,5)),\"\",VLOOKUP($A$33,Voorraad!$A$2:$G$1001,5))","v":"PCB 8437R"},{"$f":"IF(ISERROR(VLOOKUP($A$33,Voorraad!$A$2:$D$1001,4)),\"\",VLOOKUP($A$33,Voorraad!$A$2:$D$1001,4))","v":17},10,0]

{"sheet":"Picklijst 8438","index":4,"n_rows":31,"n_cols":14,"rows_kept":31,"cut":false,"hidden":false,"merged":[]}
[]
["Pickorder 8438",null,{"$f":"[3]Sheet1!$D$2","v":1},"X"]
[]
[]
[]
[]
[]
["Art Nr CSI","Benodigd","Art Nr CSI","Omschrijving","Leverancier Nr","Produco Nr","OrderNr","Opmerkingen/Alternatieven","Leverancier","Producent","PCB","Voorraad","Benodigd","Bestellen"]
["BSH002",{"$f":"[3]Sheet1!$E$4","v":2},{"$f":"IF(ISERROR(VLOOKUP($A$9,Voorraad!$A$2:$D$1001,1)),\"\",VLOOKUP($A$9,Voorraad!$A$2:$D$1001,1))","v":"BSH002"},{"$f":"IF(ISERROR(VLOOKUP($A$9,Voorraad!$A$2:$D$1001,3)),\"\",VLOOKUP($A$9,Voorraad!$A$2:$D$1001,3))","v":"220U / 35V "},{"$f":"IF(ISERROR(VLOOKUP($A$9,Voorraad!$A$2:$D$1001,2)),\"\",VLOOKUP($A$9,Voorraad!$A$2:$D$1001,2))","v":"EEUFC1V221 "},{"$f":"IF(ISERROR(VLOOKUP($A$9,Voorraad!$A$2:$H$1001,8)),\"\",VLOOKUP($A$9,Voorraad!$A$2:$H$1001,8))","v":0},{"$f":"IF(ISERROR(VLOOKUP($A$9,Voorraad!$A$2:$I$1001,9)),\"\",VLOOKUP($A$9,Voorraad!$A$2:$I$1001,9))","v":"EEUFC1V221 "},{"$f":"IF(ISERROR(VLOOKUP($A$9,Voorraad!$A$2:$J$1001,10)),\"\",VLOOKUP($A$9,Voorraad!$A$2:$J$1001,10))","v":"Alternatief: SE050M0220-1012"},{"$f":"IF(ISERROR(VLOOKUP($A$9,Voorraad!$A$2:$G$1001,6)),\"\",VLOOKUP($A$9,Voorraad!$A$2:$G$1001,6))","v":"TME"},{"$f":"IF(ISERROR(VLOOKUP($A$9,Voorraad!$A$2:$G$1001,7)),\"\",VLOOKUP($A$9,Voorraad!$A$2:$G$1001,7))","v":"Panasonic"},{"$f":"IF(ISERROR(VLOOKUP($A$9,Voorraad!$A$2:$G$1001,5)),\"\",VLOOKUP($A$9,Voorraad!$A$2:$G$1001,5))","v":"8437/8438/8439"},{"$f":"IF(ISERROR(VLOOKUP($A$9,Voorraad!$A$2:$D$1001,4)),\"\",VLOOKUP($A$9,Voorraad!$A$2:$D$1001,4))","v":178},{"$f":"B9","v":2},{"$f":"MAX(0,(SUM(M9-L9)))","v":0}]
["BU0001",{"$f":"[3]Sheet1!$E$5","v":1},{"$f":"IF(ISERROR(VLOOKUP($A$10,Voorraad!$A$2:$D$1001,1)),\"\",VLOOKUP($A$10,Voorraad!$A$2:$D$1001,1))","v":"BU0001"},{"$f":"IF(ISERROR(VLOOKUP($A$10,Voorraad!$A$2:$D$1001,3)),\"\",VLOOKUP($A$10,Voorraad!$A$2:$D$1001,3))","v":"100U /35V "},{"$f":"IF(ISERROR(VLOOKUP($A$10,Voorraad!$A$2:$D$1001,2)),\"\",VLOOKUP($A$10,Voorraad!$A$2:$D$1001,2))","v":0},{"$f":"IF(ISERROR(VLOOKUP($A$10,Voorraad!$A$2:$H$1001,8)),\"\",VLOOKUP($A$10,Voorraad!$A$2:$H$1001,8))","v":0},{"$f":"IF(ISERROR(VLOOKUP($A$10,Voorraad!$A$2:$I$1001,9)),\"\",VLOOKUP($A$10,Voorraad!$A$2:$I$1001,9))","v":0},{"$f":"IF(ISERROR(VLOOKUP($A$10,Voorraad!$A$2:$J$1001,10)),\"\",VLOOKUP($A$10,Voorraad!$A$2:$J$1001,10))","v":0},{"$f":"IF(ISERROR(VLOOKUP($A$10,Voorraad!$A$2:$G$1001,6)),\"\",VLOOKUP($A$10,Voorraad!$A$2:$G$1001,6))","v":0},{"$f":"IF(ISERROR(VLOOKUP($A$10,Voorraad!$A$2:$G$1001,7)),\"\",VLOOKUP($A$10,Voorraad!$A$2:$G$1001,7))","v":0},{"$f":"IF(ISERROR(VLOOKUP($A$10,Voorraad!$A$2:$G$1001,5)),\"\",VLOOKUP($A$10,Voorraad!$A$2:$G$1001,5))","v":8438},{"$f":"IF(ISERROR(VLOOKUP($A$10,Voorraad!$A$2:$D$1001,4)),\"\",VLOOKUP($A$10,Voorraad!$A$2:$D$1001,4))","v":21},1,0]
["BU0005",{"$f":"[3]Sheet1!$E$6","v":1},{"$f":"IF(ISERROR(VLOOKUP($A$11,Voorraad!$A$2:$D$1001,1)),\"\",VLOOKUP($A$11,Voorraad!$A$2:$D$1001,1))","v":"BU0005"},{"$f":"IF(ISERROR(VLOOKUP($A$11,Voorraad!$A$2:$D$1001,3)),\"\",VLOOKUP($A$11,Voorraad!$A$2:$D$1001,3))","v":"T83-A90X "},{"$f":"IF(ISERROR(VLOOKUP($A$11,Voorraad!$A$2:$D$1001,2)),\"\",VLOOKUP($A$11,Voorraad!$A$2:$D$1001,2))","v":"2046-09-C2LF"},{"$f":"IF(ISERROR(VLOOKUP($A$11,Voorraad!$A$2:$H$1001,8)),\"\",VLOOKUP($A$11,Voorraad!$A$2:$H$1001,8))","v":0},{"$f":"IF(ISERROR(VLOOKUP($A$11,Voorraad!$A$2:$I$1001,9)),\"\",VLOOKUP($A$11,Voorraad!$A$2:$I$1001,9))","v":2335982},{"$f":"IF(ISERROR(VLOOKUP($A$11,Voorraad!$A$2:$J$1001,10)),\"\",VLOOKUP($A$11,Voorraad!$A$2:$J$1001,10))","v":0},{"$f":"IF(ISERROR(VLOOKUP($A$11,Voorraad!$A$2:$G$1001,6)),\"\",VLOOKUP($A$11,Voorraad!$A$2:$G$1001,6))","v":"Farnell"},{"$f":"IF(ISERROR(VLOOKUP($A$11,Voorraad!$A$2:$G$1001,7)),\"\",VLOOKUP($A$11,Voorraad!$A$2:$G$1001,7))","v":"Bourns"},{"$f":"IF(ISERROR(VLOOKUP($A$11,Voorraad!$A$2:$G$1001,5)),\"\",VLOOKUP($A$11,Voorraad!$A$2:$G$1001,5))","v":"8437/8438/8439"},{"$f":"IF(ISERROR(VLOOKUP($A$11,Voorraad!$A$2:$D$1001,4)),\"\",VLOOKUP($A$11,Voorraad!$A$2:$D$1001,4))","v":57},1,0]
["BU0016",{"$f":"[3]Sheet1!$E$7","v":1},{"$f":"IF(ISERROR(VLOOKUP($A$12,Voorraad!$A$2:$D$1001,1)),\"\",VLOOKUP($A$12,Voorraad!$A$2:$D$1001,1))","v":"BU0016"},{"$f":"IF(ISERROR(VLOOKUP($A$12,Voorraad!$A$2:$D$1001,3)),\"\",VLOOKUP($A$12,Voorraad!$A$2:$D$1001,3))","v":"D BYV27-150-TAP"},{"$f":"IF(ISERROR(VLOOKUP($A$12,Voorraad!$A$2:$D$1001,2)),\"\",VLOOKUP($A$12,Voorraad!$A$2:$D$1001,2))","v":0},{"$f":"IF(ISERROR(VLOOKUP($A$12,Voorraad!$A$2:$H$1001,8)),\"\",VLOOKUP($A$12,Voorraad!$A$2:$H$1001,8))","v":520005},{"$f":"IF(ISERROR(VLOOKUP($A$12,Voorraad!$A$2:$I$1001,9)),\"\",VLOOKUP($A$12,Voorraad!$A$2:$I$1001,9))","v":"BYV27-150-TAP"},{"$f":"IF(ISERROR(VLOOKUP($A$12,Voorraad!$A$2:$J$1001,10)),\"\",VLOOKUP($A$12,Voorraad!$A$2:$J$1001,10))","v":0},{"$f":"IF(ISERROR(VLOOKUP($A$12,Voorraad!$A$2:$G$1001,6)),\"\",VLOOKUP($A$12,Voorraad!$A$2:$G$1001,6))","v":"MOUSER"},{"$f":"IF(ISERROR(VLOOKUP($A$12,Voorraad!$A$2:$G$1001,7)),\"\",VLOOKUP($A$12,Voorraad!$A$2:$G$1001,7))","v":"PHILIPS"},{"$f":"IF(ISERROR(VLOOKUP($A$12,Voorraad!$A$2:$G$1001,5)),\"\",VLOOKUP($A$12,Voorraad!$A$2:$G$1001,5))","v":"8437/8438/8439/8510"},{"$f":"IF(ISERROR(VLOOKUP($A$12,Voorraad!$A$2:$D$1001,4)),\"\",VLOOKUP($A$12,Voorraad!$A$2:$D$1001,4))","v":-7},1,8]
["BR4020",{"$f":"[3]Sheet1!$E$8","v":1},{"$f":"IF(ISERROR(VLOOKUP($A$13,Voorraad!$A$2:$D$1001,1)),\"\",VLOOKUP($A$13,Voorraad!$A$2:$D$1001,1))","v":"BR4020"},{"$f":"IF(ISERROR(VLOOKUP($A$13,Voorraad!$A$2:$D$1001,3)),\"\",VLOOKUP($A$13,Voorraad!$A$2:$D$1001,3))","v":"MFR135 "},{"$f":"IF(ISERROR(VLOOKUP($A$13,Voorraad!$A$2:$D$1001,2)),\"\",VLOOKUP($A$13,Voorraad!$A$2:$D$1001,2))","v":"ERF-RA13560Z"},{"$f":"IF(ISERROR(VLOOKUP($A$13,Voorraad!$A$2:$H$1001,8)),\"\",VLOOKUP($A$13,Voorraad!$A$2:$H$1001,8))","v":0},{"$f":"IF(ISERROR(VLOOKUP($A$13,Voorraad!$A$2:$I$1001,9)),\"\",VLOOKUP($A$13,Voorraad!$A$2:$I$1001,9))","v":"ERF - RA135-60Z"},{"$f":"IF(ISERROR(VLOOKUP($A$13,Voorraad!$A$2:$J$1001,10)),\"\",VLOOKUP($A$13,Voorraad!$A$2:$J$1001,10))","v":0},{"$f":"IF(ISERROR(VLOOKUP($A$13,Voorraad!$A$2:$G$1001,6)),\"\",VLOOKUP($A$13,Voorraad!$A$2:$G$1001,6))","v":"TME"},{"$f":"IF(ISERROR(VLOOKUP($A$13,Voorraad!$A$2:$G$1001,7)),\"\",VLOOKUP($A$13,Voorraad!$A$2:$G$1001,7))","v":"ECE"},{"$f":"IF(ISERROR(VLOOKUP($A$13,Voorraad!$A$2:$G$1001,5)),\"\",VLOOKUP($A$13,Voorraad!$A$2:$G$1001,5))","v":"8437/8438"},{"$f":"IF(ISERROR(VLOOKUP($A$13,Voorraad!$A$2:$D$1001,4)),\"\",VLOOKUP($A$13,Voorraad!$A$2:$D$1001,4))","v":14},1,0]
["BR4030",{"$f":"[3]Sheet1!$E$9","v":1},{"$f":"IF(ISERROR(VLOOKUP($A$14,Voorraad!$A$2:$D$1001,1)),\"\",VLOOKUP($A$14,Voorraad!$A$2:$D$1001,1))","v":"BR4030"},{"$f":"IF(ISERROR(VLOOKUP($A$14,Voorraad!$A$2:$D$1001,3)),\"\",VLOOKUP($A$14,Voorraad!$A$2:$D$1001,3))","v":"100NF50V"},{"$f":"IF(ISERROR(VLOOKUP($A$14,Voorraad!$A$2:$D$1001,2)),\"\",VLOOKUP($A$14,Voorraad!$A$2:$D$1001,2))","v":"CM-100N-Y5V"},{"$f":"IF(ISERROR(VLOOKUP($A$14,Voorraad!$A$2:$H$1001,8)),\"\",VLOOKUP($A$14,Voorraad!$A$2:$H$1001,8))","v":0},{"$f":"IF(ISERROR(VLOOKUP($A$14,Voorraad!$A$2:$I$1001,9)),\"\",VLOOKUP($A$14,Voorraad!$A$2:$I$1001,9))","v":"CM-100N-Y5V"},{"$f":"IF(ISERROR(VLOOKUP($A$14,Voorraad!$A$2:$J$1001,10)),\"\",VLOOKUP($A$14,Voorraad!$A$2:$J$1001,10))","v":0},{"$f":"IF(ISERROR(VLOOKUP($A$14,Voorraad!$A$2:$G$1001,6)),\"\",VLOOKUP($A$14,Voorraad!$A$2:$G$1001,6))","v":"TME"},{"$f":"IF(ISERROR(VLOOKUP($A$14,Voorraad!$A$2:$G$1001,7)),\"\",VLOOKUP($A$14,Voorraad!$A$2:$G$1001,7))","v":"SR Passives"},{"$f":"IF(ISERROR(VLOOKUP($A$14,Voorraad!$A$2:$G$1001,5)),\"\",VLOOKUP($A$14,Voorraad!$A$2:$G$1001,5))","v":"8437/8438/8439"},{"$f":"IF(ISERROR(VLOOKUP($A$14,Voorraad!$A$2:$D$1001,4)),\"\",VLOOKUP($A$14,Voorraad!$A$2:$D$1001,4))","v":184},1,0]
["BR3550",{"$f":"[3]Sheet1!$E$10","v":2},{"$f":"IF(ISERROR(VLOOKUP($A$15,Voorraad!$A$2:$D$1001,1)),\"\",VLOOKUP($A$15,Voorraad!$A$2:$D$1001,1))","v":"BR3550"},{"$f":"IF(ISERROR(VLOOKUP($A$15,Voorraad!$A$2:$D$1001,3)),\"\",VLOOKUP($A$15,Voorraad!$A$2:$D$1001,3))","v":"RV S05K30 100A 0.01W"},{"$f":"IF(ISERROR(VLOOKUP($A$15,Voorraad!$A$2:$D$1001,2)),\"\",VLOOKUP($A$9,Voorraad!$A$2:$D$1001,2))","v":"EEUFC1V221 "},{"$f":"IF(ISERROR(VLOOKUP($A$15,Voorraad!$A$2:$H$1001,8)),\"\",VLOOKUP($A$15,Voorraad!$A$2:$H$1001,8))","v":500088},{"$f":"IF(ISERROR(VLOOKUP($A$15,Voorraad!$A$2:$I$1001,9)),\"\",VLOOKUP($A$15,Voorraad!$A$2:$I$1001,9))","v":"SIOV-S05K30"},{"$f":"IF(ISERROR(VLOOKUP($A$15,Voorraad!$A$2:$J$1001,10)),\"\",VLOOKUP($A$15,Voorraad!$A$2:$J$1001,10))","v":"Groter aantal inkopen "},{"$f":"IF(ISERROR(VLOOKUP($A$15,Voorraad!$A$2:$G$1001,6)),\"\",VLOOKUP($A$15,Voorraad!$A$2:$G$1001,6))","v":"TME"},{"$f":"IF(ISERROR(VLOOKUP($A$15,Voorraad!$A$2:$G$1001,7)),\"\",VLOOKUP($A$15,Voorraad!$A$2:$G$1001,7))","v":"EPCOS"},{"$f":"IF(ISERROR(VLOOKUP($A$15,Voorraad!$A$2:$G$1001,5)),\"\",VLOOKUP($A$15,Voorraad!$A$2:$G$1001,5))","v":"8410/8437/8438/8439/8510"},{"$f":"IF(ISERROR(VLOOKUP($A$15,Voorraad!$A$2:$D$1001,4)),\"\",VLOOKUP($A$15,Voorraad!$A$2:$D$1001,4))","v":86},2,0]
["BR0004",{"$f":"[3]Sheet1!$E$11","v":1},{"$f":"IF(ISERROR(VLOOKUP($A$16,Voorraad!$A$2:$D$1001,1)),\"\",VLOOKUP($A$16,Voorraad!$A$2:$D$1001,1))","v":"BR0004"},{"$f":"IF(ISERROR(VLOOKUP($A$16,Voorraad!$A$2:$D$1001,3)),\"\",VLOOKUP($A$16,Voorraad!$A$2:$D$1001,3))","v":"R 1K00 1% 0.6W 7X2,5MM"},{"$f":"IF(ISERROR(VLOOKUP($A$16,Voorraad!$A$2:$D$1001,2)),\"\",VLOOKUP($A$16,Voorraad!$A$2:$D$1001,2))","v":"#10031001"},{"$f":"IF(ISERROR(VLOOKUP($A$16,Voorraad!$A$2:$H$1001,8)),\"\",VLOOKUP($A$16,Voorraad!$A$2:$H$1001,8))","v":500048},{"$f":"IF(ISERROR(VLOOKUP($A$16,Voorraad!$A$2:$I$1001,9)),\"\",VLOOKUP($A$16,Voorraad!$A$2:$I$1001,9))","v":0},{"$f":"IF(ISERROR(VLOOKUP($A$16,Voorraad!$A$2:$J$1001,10)),\"\",VLOOKUP($A$16,Voorraad!$A$2:$J$1001,10))","v":0},{"$f":"IF(ISERROR(VLOOKUP($A$16,Voorraad!$A$2:$G$1001,6)),\"\",VLOOKUP($A$16,Voorraad!$A$2:$G$1001,6))","v":0},{"$f":"IF(ISERROR(VLOOKUP($A$16,Voorraad!$A$2:$G$1001,7)),\"\",VLOOKUP($A$16,Voorraad!$A$2:$G$1001,7))","v":"BCC"},{"$f":"IF(ISERROR(VLOOKUP($A$16,Voorraad!$A$2:$G$1001,5)),\"\",VLOOKUP($A$16,Voorraad!$A$2:$G$1001,5))","v":"8510/8437/8438/8439/8464"},{"$f":"IF(ISERROR(VLOOKUP($A$16,Voorraad!$A$2:$D$1001,4)),\"\",VLOOKUP($A$16,Voorraad!$A$2:$D$1001,4))","v":208},1,0]
["BR0005",{"$f":"[3]Sheet1!$E$12","v":1},{"$f":"IF(ISERROR(VLOOKUP($A$17,Voorraad!$A$2:$D$1001,1)),\"\",VLOOKUP($A$17,Voorraad!$A$2:$D$1001,1))","v":"BR0005"},{"$f":"IF(ISERROR(VLOOKUP($A$17,Voorraad!$A$2:$D$1001,3)),\"\",VLOOKUP($A$17,Voorraad!$A$2:$D$1001,3))","v":"R 10K0 1% 0.6W 7X2,5MM"},{"$f":"IF(ISERROR(VLOOKUP($A$17,Voorraad!$A$2:$D$1001,2)),\"\",VLOOKUP($A$17,Voorraad!$A$2:$D$1001,2))","v":"#10041001"},{"$f":"IF(ISERROR(VLOOKUP($A$17,Voorraad!$A$2:$H$1001,8)),\"\",VLOOKUP($A$17,Voorraad!$A$2:$H$1001,8))","v":500060},{"$f":"IF(ISERROR(VLOOKUP($A$17,Voorraad!$A$2:$I$1001,9)),\"\",VLOOKUP($A$17,Voorraad!$A$2:$I$1001,9))","v":0},{"$f":"IF(ISERROR(VLOOKUP($A$17,Voorraad!$A$2:$J$1001,10)),\"\",VLOOKUP($A$17,Voorraad!$A$2:$J$1001,10))","v":0},{"$f":"IF(ISERROR(VLOOKUP($A$17,Voorraad!$A$2:$G$1001,6)),\"\",VLOOKUP($A$17,Voorraad!$A$2:$G$1001,6))","v":0},{"$f":"IF(ISERROR(VLOOKUP($A$17,Voorraad!$A$2:$G$1001,7)),\"\",VLOOKUP($A$17,Voorraad!$A$2:$G$1001,7))","v":"BCC"},{"$f":"IF(ISERROR(VLOOKUP($A$17,Voorraad!$A$2:$G$1001,5)),\"\",VLOOKUP($A$17,Voorraad!$A$2:$G$1001,5))","v":"8510/8437/8438/8439"},{"$f":"IF(ISERROR(VLOOKUP($A$17,Voorraad!$A$2:$D$1001,4)),\"\",VLOOKUP($A$17,Voorraad!$A$2:$D$1001,4))","v":1908},1,0]
["BU0010",{"$f":"[3]Sheet1!$E$13","v":1},{"$f":"IF(ISERROR(VLOOKUP($A$18,Voorraad!$A$2:$D$1001,1)),\"\",VLOOKUP($A$18,Voorraad!$A$2:$D$1001,1))","v":"BU0010"},{"$f":"IF(ISERROR(VLOOKUP($A$18,Voorraad!$A$2:$D$1001,3)),\"\",VLOOKUP($A$18,Voorraad!$A$2:$D$1001,3))","v":"22UH"},{"$f":"IF(ISERROR(VLOOKUP($A$18,Voorraad!$A$2:$D$1001,2)),\"\",VLOOKUP($A$18,Voorraad!$A$2:$D$1001,2))","v":"HBCC-220K-02"},{"$f":"IF(ISERROR(VLOOKUP($A$18,Voorraad!$A$2:$H$1001,8)),\"\",VLOOKUP($A$18,Voorraad!$A$2:$H$1001,8))","v":0},{"$f":"IF(ISERROR(VLOOKUP($A$18,Voorraad!$A$2:$I$1001,9)),\"\",VLOOKUP($A$18,Voorraad!$A$2:$I$1001,9))","v":"HBCC-220K-02"},{"$f":"IF(ISERROR(VLOOKUP($A$18,Voorraad!$A$2:$J$1001,10)),\"\",VLOOKUP($A$18,Voorraad!$A$2:$J$1001,10))","v":" MICC-R22M-02"},{"$f":"IF(ISERROR(VLOOKUP($A$18,Voorraad!$A$2:$G$1001,6)),\"\",VLOOKUP($A$18,Voorraad!$A$2:$G$1001,6))","v":"TME"},{"$f":"IF(ISERROR(VLOOKUP($A$18,Voorraad!$A$2:$G$1001,7)),\"\",VLOOKUP($A$18,Voorraad!$A$2:$G$1001,7))","v":"FASTRON"},{"$f":"IF(ISERROR(VLOOKUP($A$18,Voorraad!$A$2:$G$1001,5)),\"\",VLOOKUP($A$18,Voorraad!$A$2:$G$1001,5))","v":"8437/8438/8439"},{"$f":"IF(ISERROR(VLOOKUP($A$18,Voorraad!$A$2:$D$1001,4)),\"\",VLOOKUP($A$18,Voorraad!$A$2:$D$1001,4))","v":60},1,0]
["BU0065",{"$f":"[3]Sheet1!$E$14","v":1},{"$f":"IF(ISERROR(VLOOKUP($A$19,Voorraad!$A$2:$D$1001,1)),\"\",VLOOKUP($A$19,Voorraad!$A$2:$D$1001,1))","v":"BU0065"},{"$f":"IF(ISERROR(VLOOKUP($A$19,Voorraad!$A$2:$D$1001,3)),\"\",VLOOKUP($A$19,Voorraad!$A$2:$D$1001,3))","v":"DB37F "},{"$f":"IF(ISERROR(VLOOKUP($A$19,Voorraad!$A$2:$D$1001,2)),\"\",VLOOKUP($A$19,Voorraad!$A$2:$D$1001,2))","v":"09 66 451 6513"},{"$f":"IF(ISERROR(VLOOKUP($A$19,Voorraad!$A$2:$H$1001,8)),\"\",VLOOKUP($A$19,Voorraad!$A$2:$H$1001,8))","v":0},{"$f":"IF(ISERROR(VLOOKUP($A$19,Voorraad!$A$2:$I$1001,9)),\"\",VLOOKUP($A$19,Voorraad!$A$2:$I$1001,9))","v":"09 66 451 6513"},{"$f":"IF(ISERROR(VLOOKUP($A$19,Voorraad!$A$2:$J$1001,10)),\"\",VLOOKUP($A$19,Voorraad!$A$2:$J$1001,10))","v":0},{"$f":"IF(ISERROR(VLOOKUP($A$19,Voorraad!$A$2:$G$1001,6)),\"\",VLOOKUP($A$19,Voorraad!$A$2:$G$1001,6))","v":"TME"},{"$f":"IF(ISERROR(VLOOKUP($A$19,Voorraad!$A$2:$G$1001,7)),\"\",VLOOKUP($A$19,Voorraad!$A$2:$G$1001,7))","v":"Harting "},{"$f":"IF(ISERROR(VLOOKUP($A$19,Voorraad!$A$2:$G$1001,5)),\"\",VLOOKUP($A$19,Voorraad!$A$2:$G$1001,5))","v":"8437/8438"},{"$f":"IF(ISERROR(VLOOKUP($A$19,Voorraad!$A$2:$D$1001,4)),\"\",VLOOKUP($A$19,Voorraad!$A$2:$D$1001,4))","v":13},1,0]
["BU0066",{"$f":"[3]Sheet1!$E$15","v":42},{"$f":"IF(ISERROR(VLOOKUP($A$20,Voorraad!$A$2:$D$1001,1)),\"\",VLOOKUP($A$20,Voorraad!$A$2:$D$1001,1))","v":"BU0066"},{"$f":"IF(ISERROR(VLOOKUP($A$20,Voorraad!$A$2:$D$1001,3)),\"\",VLOOKUP($A$20,Voorraad!$A$2:$D$1001,3))","v":"KDS3 "},{"$f":"IF(ISERROR(VLOOKUP($A$20,Voorraad!$A$2:$D$1001,2)),\"\",VLOOKUP($A$20,Voorraad!$A$2:$D$1001,2))","v":1780015},{"$f":"IF(ISERROR(VLOOKUP($A$20,Voorraad!$A$2:$H$1001,8)),\"\",VLOOKUP($A$20,Voorraad!$A$2:$H$1001,8))","v":0},{"$f":"IF(ISERROR(VLOOKUP($A$20,Voorraad!$A$2:$I$1001,9)),\"\",VLOOKUP($A$20,Voorraad!$A$2:$I$1001,9))","v":1780015},{"$f":"IF(ISERROR(VLOOKUP($A$20,Voorraad!$A$2:$J$1001,10)),\"\",VLOOKUP($A$20,Voorraad!$A$2:$J$1001,10))","v":0},{"$f":"IF(ISERROR(VLOOKUP($A$20,Voorraad!$A$2:$G$1001,6)),\"\",VLOOKUP($A$20,Voorraad!$A$2:$G$1001,6))","v":"Van Egmond Groep"},{"$f":"IF(ISERROR(VLOOKUP($A$20,Voorraad!$A$2:$G$1001,7)),\"\",VLOOKUP($A$20,Voorraad!$A$2:$G$1001,7))","v":"Phoenix"},{"$f":"IF(ISERROR(VLOOKUP($A$20,Voorraad!$A$2:$G$1001,5)),\"\",VLOOKUP($A$20,Voorraad!$A$2:$G$1001,5))","v":"8437/8438/8439"},{"$f":"IF(ISERROR(VLOOKUP($A$20,Voorraad!$A$2:$D$1001,4)),\"\",VLOOKUP($A$20,Voorraad!$A$2:$D$1001,4))","v":546},42,0]
["BU0045",{"$f":"[3]Sheet1!$E$16","v":1},{"$f":"IF(ISERROR(VLOOKUP($A$21,Voorraad!$A$2:$D$1001,1)),\"\",VLOOKUP($A$21,Voorraad!$A$2:$D$1001,1))","v":"BU0045"},{"$f":"IF(ISERROR(VLOOKUP($A$21,Voorraad!$A$2:$D$1001,3)),\"\",VLOOKUP($A$21,Voorraad!$A$2:$D$1001,3))","v":"LED TLG124A GROEN 3.18MM"},{"$f":"IF(ISERROR(VLOOKUP($A$21,Voorraad!$A$2:$D$1001,2)),\"\",VLOOKUP($A$21,Voorraad!$A$2:$D$1001,2))","v":"KVD-03-035/G"},{"$f":"IF(ISERROR(VLOOKUP($A$21,Voorraad!$A$2:$H$1001,8)),\"\",VLOOKUP($A$21,Voorraad!$A$2:$H$1001,8))","v":"?"},{"$f":"IF(ISERROR(VLOOKUP($A$21,Voorraad!$A$2:$I$1001,9)),\"\",VLOOKUP($A$21,Voorraad!$A$2:$I$1001,9))","v":"L-934GD"},{"$f":"IF(ISERROR(VLOOKUP($A$21,Voorraad!$A$2:$J$1001,10)),\"\",VLOOKUP($A$21,Voorraad!$A$2:$J$1001,10))","v":0},{"$f":"IF(ISERROR(VLOOKUP($A$21,Voorraad!$A$2:$G$1001,6)),\"\",VLOOKUP($A$21,Voorraad!$A$2:$G$1001,6))","v":"TME"},{"$f":"IF(ISERROR(VLOOKUP($A$21,Voorraad!$A$2:$G$1001,7)),\"\",VLOOKUP($A$21,Voorraad!$A$2:$G$1001,7))","v":"KHATOD / King Bright"},{"$f":"IF(ISERROR(VLOOKUP($A$21,Voorraad!$A$2:$G$1001,5)),\"\",VLOOKUP($A$21,Voorraad!$A$2:$G$1001,5))","v":"8437/8438/8439/8464/8510"},{"$f":"IF(ISERROR(VLOOKUP($A$21,Voorraad!$A$2:$D$1001,4)),\"\",VLOOKUP($A$21,Voorraad!$A$2:$D$1001,4))","v":2},1,0]
["BX0002",{"$f":"[3]Sheet1!$E$17","v":1},{"$f":"IF(ISERROR(VLOOKUP($A$22,Voorraad!$A$2:$D$1001,1)),\"\",VLOOKUP($A$22,Voorraad!$A$2:$D$1001,1))","v":"BX0002"},{"$f":"IF(ISERROR(VLOOKUP($A$22,Voorraad!$A$2:$D$1001,3)),\"\",VLOOKUP($A$22,Voorraad!$A$2:$D$1001,3))","v":"SL2 "},{"$f":"IF(ISERROR(VLOOKUP($A$22,Voorraad!$A$2:$D$1001,2)),\"\",VLOOKUP($A$22,Voorraad!$A$2:$D$1001,2))","v":"XY2500V-C(5.08)-2PIN"},{"$f":"IF(ISERROR(VLOOKUP($A$22,Voorraad!$A$2:$H$1001,8)),\"\",VLOOKUP($A$22,Voorraad!$A$2:$H$1001,8))","v":0},{"$f":"IF(ISERROR(VLOOKUP($A$22,Voorraad!$A$2:$I$1001,9)),\"\",VLOOKUP($A$22,Voorraad!$A$2:$I$1001,9))","v":"TBG-5-PB-2P-GN"},{"$f":"IF(ISERROR(VLOOKUP($A$22,Voorraad!$A$2:$J$1001,10)),\"\",VLOOKUP($A$22,Voorraad!$A$2:$J$1001,10))","v":0},{"$f":"IF(ISERROR(VLOOKUP($A$22,Voorraad!$A$2:$G$1001,6)),\"\",VLOOKUP($A$22,Voorraad!$A$2:$G$1001,6))","v":"TME"},{"$f":"IF(ISERROR(VLOOKUP($A$22,Voorraad!$A$2:$G$1001,7)),\"\",VLOOKUP($A$22,Voorraad!$A$2:$G$1001,7))","v":"Xinya"},{"$f":"IF(ISERROR(VLOOKUP($A$22,Voorraad!$A$2:$G$1001,5)),\"\",VLOOKUP($A$22,Voorraad!$A$2:$G$1001,5))","v":"8437/8438/8439"},{"$f":"IF(ISERROR(VLOOKUP($A$22,Voorraad!$A$2:$D$1001,4)),\"\",VLOOKUP($A$22,Voorraad!$A$2:$D$1001,4))","v":92},1,0]
["BX0003",{"$f":"[3]Sheet1!$E$18","v":1},{"$f":"IF(ISERROR(VLOOKUP($A$23,Voorraad!$A$2:$D$1001,1)),\"\",VLOOKUP($A$23,Voorraad!$A$2:$D$1001,1))","v":"BX0003"},{"$f":"IF(ISERROR(VLOOKUP($A$23,Voorraad!$A$2:$D$1001,3)),\"\",VLOOKUP($A$23,Voorraad!$A$2:$D$1001,3))","v":"BL2"},{"$f":"IF(ISERROR(VLOOKUP($A$23,Voorraad!$A$2:$D$1001,2)),\"\",VLOOKUP($A$23,Voorraad!$A$2:$D$1001,2))","v":"TBW-5-2P/GN"},{"$f":"IF(ISERROR(VLOOKUP($A$23,Voorraad!$A$2:$H$1001,8)),\"\",VLOOKUP($A$23,Voorraad!$A$2:$H$1001,8))","v":0},{"$f":"IF(ISERROR(VLOOKUP($A$23,Voorraad!$A$2:$I$1001,9)),\"\",VLOOKUP($A$23,Voorraad!$A$2:$I$1001,9))","v":"TBW-5-2P/GN"},{"$f":"IF(ISERROR(VLOOKUP($A$23,Voorraad!$A$2:$J$1001,10)),\"\",VLOOKUP($A$23,Voorraad!$A$2:$J$1001,10))","v":0},{"$f":"IF(ISERROR(VLOOKUP($A$23,Voorraad!$A$2:$G$1001,6)),\"\",VLOOKUP($A$23,Voorraad!$A$2:$G$1001,6))","v":"TME"},{"$f":"IF(ISERROR(VLOOKUP($A$23,Voorraad!$A$2:$G$1001,7)),\"\",VLOOKUP($A$23,Voorraad!$A$2:$G$1001,7))","v":"Ninigi"},{"$f":"IF(ISERROR(VLOOKUP($A$23,Voorraad!$A$2:$G$1001,5)),\"\",VLOOKUP($A$23,Voorraad!$A$2:$G$1001,5))","v":"8437/8438/8439"},{"$f":"IF(ISERROR(VLOOKUP($A$23,Voorraad!$A$2:$D$1001,4)),\"\",VLOOKUP($A$23,Voorraad!$A$2:$D$1001,4))","v":93},1,0]
["BX0006",{"$f":"[3]Sheet1!$E$19","v":1},{"$f":"IF(ISERROR(VLOOKUP($A$24,Voorraad!$A$2:$D$1001,1)),\"\",VLOOKUP($A$24,Voorraad!$A$2:$D$1001,1))","v":"BX0006"},{"$f":"IF(ISERROR(VLOOKUP($A$24,Voorraad!$A$2:$D$1001,3)),\"\",VLOOKUP($A$24,Voorraad!$A$2:$D$1001,3))","v":"SL5 "},{"$f":"IF(ISERROR(VLOOKUP($A$24,Voorraad!$A$2:$D$1001,2)),\"\",VLOOKUP($A$24,Voorraad!$A$2:$D$1001,2))","v":"XY2500V C5.08) 5PIN"},{"$f":"IF(ISERROR(VLOOKUP($A$24,Voorraad!$A$2:$H$1001,8)),\"\",VLOOKUP($A$24,Voorraad!$A$2:$H$1001,8))","v":0},{"$f":"IF(ISERROR(VLOOKUP($A$24,Voorraad!$A$2:$I$1001,9)),\"\",VLOOKUP($A$24,Voorraad!$A$2:$I$1001,9))","v":"TBG-5-PB-5P-GN"},{"$f":"IF(ISERROR(VLOOKUP($A$24,Voorraad!$A$2:$J$1001,10)),\"\",VLOOKUP($A$24,Voorraad!$A$2:$J$1001,10))","v":0},{"$f":"IF(ISERROR(VLOOKUP($A$24,Voorraad!$A$2:$G$1001,6)),\"\",VLOOKUP($A$24,Voorraad!$A$2:$G$1001,6))","v":"TME"},{"$f":"IF(ISERROR(VLOOKUP($A$24,Voorraad!$A$2:$G$1001,7)),\"\",VLOOKUP($A$24,Voorraad!$A$2:$G$1001,7))","v":"Xinya"},{"$f":"IF(ISERROR(VLOOKUP($A$24,Voorraad!$A$2:$G$1001,5)),\"\",VLOOKUP($A$24,Voorraad!$A$2:$G$1001,5))","v":8438},{"$f":"IF(ISERROR(VLOOKUP($A$24,Voorraad!$A$2:$D$1001,4)),\"\",VLOOKUP($A$24,Voorraad!$A$2:$D$1001,4))","v":5},1,0]
["BX0007",{"$f":"[3]Sheet1!$E$20","v":1},{"$f":"IF(ISERROR(VLOOKUP($A$25,Voorraad!$A$2:$D$1001,1)),\"\",VLOOKUP($A$25,Voorraad!$A$2:$D$1001,1))","v":"BX0007"},{"$f":"IF(ISERROR(VLOOKUP($A$25,Voorraad!$A$2:$D$1001,3)),\"\",VLOOKUP($A$25,Voorraad!$A$2:$D$1001,3))","v":"BL5"},{"$f":"IF(ISERROR(VLOOKUP($A$25,Voorraad!$A$2:$D$1001,2)),\"\",VLOOKUP($A$25,Voorraad!$A$2:$D$1001,2))","v":"TBW-5-5P/GN "},{"$f":"IF(ISERROR(VLOOKUP($A$25,Voorraad!$A$2:$H$1001,8)),\"\",VLOOKUP($A$25,Voorraad!$A$2:$H$1001,8))","v":0},{"$f":"IF(ISERROR(VLOOKUP($A$25,Voorraad!$A$2:$I$1001,9)),\"\",VLOOKUP($A$25,Voorraad!$A$2:$I$1001,9))","v":0},{"$f":"IF(ISERROR(VLOOKUP($A$25,Voorraad!$A$2:$J$1001,10)),\"\",VLOOKUP($A$25,Voorraad!$A$2:$J$1001,10))","v":0},{"$f":"IF(ISERROR(VLOOKUP($A$25,Voorraad!$A$2:$G$1001,6)),\"\",VLOOKUP($A$25,Voorraad!$A$2:$G$1001,6))","v":"TME"},{"$f":"IF(ISERROR(VLOOKUP($A$25,Voorraad!$A$2:$G$1001,7)),\"\",VLOOKUP($A$25,Voorraad!$A$2:$G$1001,7))","v":"Ninigi"},{"$f":"IF(ISERROR(VLOOKUP($A$25,Voorraad!$A$2:$G$1001,5)),\"\",VLOOKUP($A$25,Voorraad!$A$2:$G$1001,5))","v":8438},{"$f":"IF(ISERROR(VLOOKUP($A$25,Voorraad!$A$2:$D$1001,4)),\"\",VLOOKUP($A$25,Voorraad!$A$2:$D$1001,4))","v":62},1,0]
["BX0018",{"$f":"[3]Sheet1!$E$21","v":1},{"$f":"IF(ISERROR(VLOOKUP($A$26,Voorraad!$A$2:$D$1001,1)),\"\",VLOOKUP($A$26,Voorraad!$A$2:$D$1001,1))","v":"BX0018"},{"$f":"IF(ISERROR(VLOOKUP($A$26,Voorraad!$A$2:$D$1001,3)),\"\",VLOOKUP($A$26,Voorraad!$A$2:$D$1001,3))","v":"UM72 Profile 220MM"},{"$f":"IF(ISERROR(VLOOKUP($A$26,Voorraad!$A$2:$D$1001,2)),\"\",VLOOKUP($A$26,Voorraad!$A$2:$D$1001,2))","v":2959256},{"$f":"IF(ISERROR(VLOOKUP($A$26,Voorraad!$A$2:$H$1001,8)),\"\",VLOOKUP($A$26,Voorraad!$A$2:$H$1001,8))","v":0},{"$f":"IF(ISERROR(VLOOKUP($A$26,Voorraad!$A$2:$I$1001,9)),\"\",VLOOKUP($A$26,Voorraad!$A$2:$I$1001,9))","v":74005678},{"$f":"IF(ISERROR(VLOOKUP($A$26,Voorraad!$A$2:$J$1001,10)),\"\",VLOOKUP($A$26,Voorraad!$A$2:$J$1001,10))","v":0},{"$f":"IF(ISERROR(VLOOKUP($A$26,Voorraad!$A$2:$G$1001,6)),\"\",VLOOKUP($A$26,Voorraad!$A$2:$G$1001,6))","v":"Phoenix / Overwijn"},{"$f":"IF(ISERROR(VLOOKUP($A$26,Voorraad!$A$2:$G$1001,7)),\"\",VLOOKUP($A$26,Voorraad!$A$2:$G$1001,7))","v":0},{"$f":"IF(ISERROR(VLOOKUP($A$26,Voorraad!$A$2:$G$1001,5)),\"\",VLOOKUP($A$26,Voorraad!$A$2:$G$1001,5))","v":8438},{"$f":"IF(ISERROR(VLOOKUP($A$26,Voorraad!$A$2:$D$1001,4)),\"\",VLOOKUP($A$26,Voorraad!$A$2:$D$1001,4))","v":12},1,0]
["BX0019",{"$f":"[3]Sheet1!$E$22","v":1},{"$f":"IF(ISERROR(VLOOKUP($A$27,Voorraad!$A$2:$D$1001,1)),\"\",VLOOKUP($A$27,Voorraad!$A$2:$D$1001,1))","v":"BX0019"},{"$f":"IF(ISERROR(VLOOKUP($A$27,Voorraad!$A$2:$D$1001,3)),\"\",VLOOKUP($A$27,Voorraad!$A$2:$D$1001,3))","v":"UM72 SEFE/L"},{"$f":"IF(ISERROR(VLOOKUP($A$27,Voorraad!$A$2:$D$1001,2)),\"\",VLOOKUP($A$27,Voorraad!$A$2:$D$1001,2))","v":2959340},{"$f":"IF(ISERROR(VLOOKUP($A$27,Voorraad!$A$2:$H$1001,8)),\"\",VLOOKUP($A$27,Voorraad!$A$2:$H$1001,8))","v":0},{"$f":"IF(ISERROR(VLOOKUP($A$27,Voorraad!$A$2:$I$1001,9)),\"\",VLOOKUP($A$27,Voorraad!$A$2:$I$1001,9))","v":2959340},{"$f":"IF(ISERROR(VLOOKUP($A$27,Voorraad!$A$2:$J$1001,10)),\"\",VLOOKUP($A$27,Voorraad!$A$2:$J$1001,10))","v":0},{"$f":"IF(ISERROR(VLOOKUP($A$27,Voorraad!$A$2:$G$1001,6)),\"\",VLOOKUP($A$27,Voorraad!$A$2:$G$1001,6))","v":"Van Egmond Groep"},{"$f":"IF(ISERROR(VLOOKUP($A$27,Voorraad!$A$2:$G$1001,7)),\"\",VLOOKUP($A$27,Voorraad!$A$2:$G$1001,7))","v":"Phoenix"},{"$f":"IF(ISERROR(VLOOKUP($A$27,Voorraad!$A$2:$G$1001,5)),\"\",VLOOKUP($A$27,Voorraad!$A$2:$G$1001,5))","v":"8437/8438/8439"},{"$f":"IF(ISERROR(VLOOKUP($A$27,Voorraad!$A$2:$D$1001,4)),\"\",VLOOKUP($A$27,Voorraad!$A$2:$D$1001,4))","v":11},1,0]
["BX0020",{"$f":"[3]Sheet1!$E$23","v":1},{"$f":"IF(ISERROR(VLOOKUP($A$28,Voorraad!$A$2:$D$1001,1)),\"\",VLOOKUP($A$28,Voorraad!$A$2:$D$1001,1))","v":"BX0020"},{"$f":"IF(ISERROR(VLOOKUP($A$28,Voorraad!$A$2:$D$1001,3)),\"\",VLOOKUP($A$28,Voorraad!$A$2:$D$1001,3))","v":"UM72 SEFE/R"},{"$f":"IF(ISERROR(VLOOKUP($A$28,Voorraad!$A$2:$D$1001,2)),\"\",VLOOKUP($A$28,Voorraad!$A$2:$D$1001,2))","v":2959353},{"$f":"IF(ISERROR(VLOOKUP($A$28,Voorraad!$A$2:$H$1001,8)),\"\",VLOOKUP($A$28,Voorraad!$A$2:$H$1001,8))","v":0},{"$f":"IF(ISERROR(VLOOKUP($A$28,Voorraad!$A$2:$I$1001,9)),\"\",VLOOKUP($A$28,Voorraad!$A$2:$I$1001,9))","v":2959353},{"$f":"IF(ISERROR(VLOOKUP($A$28,Voorraad!$A$2:$J$1001,10)),\"\",VLOOKUP($A$28,Voorraad!$A$2:$J$1001,10))","v":0},{"$f":"IF(ISERROR(VLOOKUP($A$28,Voorraad!$A$2:$G$1001,6)),\"\",VLOOKUP($A$28,Voorraad!$A$2:$G$1001,6))","v":"Van Egmond Groep"},{"$f":"IF(ISERROR(VLOOKUP($A$28,Voorraad!$A$2:$G$1001,7)),\"\",VLOOKUP($A$28,Voorraad!$A$2:$G$1001,7))","v":"Phoenix"},{"$f":"IF(ISERROR(VLOOKUP($A$28,Voorraad!$A$2:$G$1001,5)),\"\",VLOOKUP($A$28,Voorraad!$A$2:$G$1001,5))","v":"8437/8438/8439"},{"$f":"IF(ISERROR(VLOOKUP($A$28,Voorraad!$A$2:$D$1001,4)),\"\",VLOOKUP($A$28,Voorraad!$A$2:$D$1001,4))","v":13},1,0]
["BX0021",{"$f":"[3]Sheet1!$E$24","v":1},{"$f":"IF(ISERROR(VLOOKUP($A$29,Voorraad!$A$2:$D$1001,1)),\"\",VLOOKUP($A$29,Voorraad!$A$2:$D$1001,1))","v":"BX0021"},{"$f":"IF(ISERROR(VLOOKUP($A$29,Voorraad!$A$2:$D$1001,3)),\"\",VLOOKUP($A$29,Voorraad!$A$2:$D$1001,3))","v":"UM72 FE"},{"$f":"IF(ISERROR(VLOOKUP($A$29,Voorraad!$A$2:$D$1001,2)),\"\",VLOOKUP($A$29,Voorraad!$A$2:$D$1001,2))","v":2959382},{"$f":"IF(ISERROR(VLOOKUP($A$29,Voorraad!$A$2:$H$1001,8)),\"\",VLOOKUP($A$29,Voorraad!$A$2:$H$1001,8))","v":0},{"$f":"IF(ISERROR(VLOOKUP($A$29,Voorraad!$A$2:$I$1001,9)),\"\",VLOOKUP($A$29,Voorraad!$A$2:$I$1001,9))","v":0},{"$f":"IF(ISERROR(VLOOKUP($A$29,Voorraad!$A$2:$J$1001,10)),\"\",VLOOKUP($A$29,Voorraad!$A$2:$J$1001,10))","v":0},{"$f":"IF(ISERROR(VLOOKUP($A$29,Voorraad!$A$2:$G$1001,6)),\"\",VLOOKUP($A$29,Voorraad!$A$2:$G$1001,6))","v":"Phoenix"},{"$f":"IF(ISERROR(VLOOKUP($A$29,Voorraad!$A$2:$G$1001,7)),\"\",VLOOKUP($A$29,Voorraad!$A$2:$G$1001,7))","v":0},{"$f":"IF(ISERROR(VLOOKUP($A$29,Voorraad!$A$2:$G$1001,5)),\"\",VLOOKUP($A$29,Voorraad!$A$2:$G$1001,5))","v":"8438/8439"},{"$f":"IF(ISERROR(VLOOKUP($A$29,Voorraad!$A$2:$D$1001,4)),\"\",VLOOKUP($A$29,Voorraad!$A$2:$D$1001,4))","v":0},1,1]
["BX0041",{"$f":"[3]Sheet1!$E$25","v":0},{"$f":"IF(ISERROR(VLOOKUP($A$30,Voorraad!$A$2:$D$1001,1)),\"\",VLOOKUP($A$30,Voorraad!$A$2:$D$1001,1))","v":"BX0041"},{"$f":"IF(ISERROR(VLOOKUP($A$30,Voorraad!$A$2:$D$1001,3)),\"\",VLOOKUP($A$30,Voorraad!$A$2:$D$1001,3))","v":"PCB 8438L"},{"$f":"IF(ISERROR(VLOOKUP($A$30,Voorraad!$A$2:$D$1001,2)),\"\",VLOOKUP($A$30,Voorraad!$A$2:$D$1001,2))","v":"PCB 8438L"},{"$f":"IF(ISERROR(VLOOKUP($A$30,Voorraad!$A$2:$H$1001,8)),\"\",VLOOKUP($A$30,Voorraad!$A$2:$H$1001,8))","v":0},{"$f":"IF(ISERROR(VLOOKUP($A$30,Voorraad!$A$2:$I$1001,9)),\"\",VLOOKUP($A$30,Voorraad!$A$2:$I$1001,9))","v":0},{"$f":"IF(ISERROR(VLOOKUP($A$30,Voorraad!$A$2:$J$1001,10)),\"\",VLOOKUP($A$30,Voorraad!$A$2:$J$1001,10))","v":0},{"$f":"IF(ISERROR(VLOOKUP($A$30,Voorraad!$A$2:$G$1001,6)),\"\",VLOOKUP($A$30,Voorraad!$A$2:$G$1001,6))","v":"JvB"},{"$f":"IF(ISERROR(VLOOKUP($A$30,Voorraad!$A$2:$G$1001,7)),\"\",VLOOKUP($A$30,Voorraad!$A$2:$G$1001,7))","v":"JvB"},{"$f":"IF(ISERROR(VLOOKUP($A$30,Voorraad!$A$2:$G$1001,5)),\"\",VLOOKUP($A$30,Voorraad!$A$2:$G$1001,5))","v":"PCB 8438L"},{"$f":"IF(ISERROR(VLOOKUP($A$30,Voorraad!$A$2:$D$1001,4)),\"\",VLOOKUP($A$30,Voorraad!$A$2:$D$1001,4))","v":0},0,0]
["BX0042",{"$f":"[3]Sheet1!$E$26","v":0},{"$f":"IF(ISERROR(VLOOKUP($A$31,Voorraad!$A$2:$D$1001,1)),\"\",VLOOKUP($A$31,Voorraad!$A$2:$D$1001,1))","v":"BX0042"},{"$f":"IF(ISERROR(VLOOKUP($A$31,Voorraad!$A$2:$D$1001,3)),\"\",VLOOKUP($A$31,Voorraad!$A$2:$D$1001,3))","v":"PCB 8438R"},{"$f":"IF(ISERROR(VLOOKUP($A$31,Voorraad!$A$2:$D$1001,2)),\"\",VLOOKUP($A$31,Voorraad!$A$2:$D$1001,2))","v":"PCB 8438R"},{"$f":"IF(ISERROR(VLOOKUP($A$31,Voorraad!$A$2:$H$1001,8)),\"\",VLOOKUP($A$31,Voorraad!$A$2:$H$1001,8))","v":0},{"$f":"IF(ISERROR(VLOOKUP($A$31,Voorraad!$A$2:$I$1001,9)),\"\",VLOOKUP($A$31,Voorraad!$A$2:$I$1001,9))","v":0},{"$f":"IF(ISERROR(VLOOKUP($A$31,Voorraad!$A$2:$J$1001,10)),\"\",VLOOKUP($A$31,Voorraad!$A$2:$J$1001,10))","v":0},{"$f":"IF(ISERROR(VLOOKUP($A$31,Voorraad!$A$2:$G$1001,6)),\"\",VLOOKUP($A$31,Voorraad!$A$2:$G$1001,6))","v":"JvB"},{"$f":"IF(ISERROR(VLOOKUP($A$31,Voorraad!$A$2:$G$1001,7)),\"\",VLOOKUP($A$31,Voorraad!$A$2:$G$1001,7))","v":"JvB"},{"$f":"IF(ISERROR(VLOOKUP($A$31,Voorraad!$A$2:$G$1001,5)),\"\",VLOOKUP($A$31,Voorraad!$A$2:$G$1001,5))","v":"PCB 8438R"},{"$f":"IF(ISERROR(VLOOKUP($A$31,Voorraad!$A$2:$D$1001,4)),\"\",VLOOKUP($A$31,Voorraad!$A$2:$D$1001,4))","v":18},0,0]

{"sheet":"Picklijst 8439","index":5,"n_rows":36,"n_cols":14,"rows_kept":36,"cut":false,"hidden":false,"merged":[]}
[]
["Pickorder 8439",null,{"$f":"[4]Sheet1!$D$2","v":20},"X"]
[]
[]
[]
[]
[]
["Art Nr CSI","Benodigd","Art Nr CSI","Omschrijving","Leverancier Nr","Produco Nr","OrderNr","Opmerkingen/Alternatieven","Leverancier","Producent","PCB","Voorraad","Benodigd","Bestellen"]
["BSH002",{"$f":"[4]Sheet1!$E$4","v":60},{"$f":"IF(ISERROR(VLOOKUP($A$9,Voorraad!$A$2:$D$1001,1)),\"\",VLOOKUP($A$9,Voorraad!$A$2:$D$1001,1))","v":"BSH002"},{"$f":"IF(ISERROR(VLOOKUP($A$9,Voorraad!$A$2:$D$1001,3)),\"\",VLOOKUP($A$9,Voorraad!$A$2:$D$1001,3))","v":"220U / 35V "},{"$f":"IF(ISERROR(VLOOKUP($A$9,Voorraad!$A$2:$D$1001,2)),\"\",VLOOKUP($A$9,Voorraad!$A$2:$D$1001,2))","v":"EEUFC1V221 "},{"$f":"IF(ISERROR(VLOOKUP($A$9,Voorraad!$A$2:$H$1001,8)),\"\",VLOOKUP($A$9,Voorraad!$A$2:$H$1001,8))","v":0},{"$f":"IF(ISERROR(VLOOKUP($A$9,Voorraad!$A$2:$I$1001,9)),\"\",VLOOKUP($A$9,Voorraad!$A$2:$I$1001,9))","v":"EEUFC1V221 "},{"$f":"IF(ISERROR(VLOOKUP($A$9,Voorraad!$A$2:$J$1001,10)),\"\",VLOOKUP($A$9,Voorraad!$A$2:$J$1001,10))","v":"Alternatief: SE050M0220-1012"},{"$f":"IF(ISERROR(VLOOKUP($A$9,Voorraad!$A$2:$G$1001,6)),\"\",VLOOKUP($A$9,Voorraad!$A$2:$G$1001,6))","v":"TME"},{"$f":"IF(ISERROR(VLOOKUP($A$9,Voorraad!$A$2:$G$1001,7)),\"\",VLOOKUP($A$9,Voorraad!$A$2:$G$1001,7))","v":"Panasonic"},{"$f":"IF(ISERROR(VLOOKUP($A$9,Voorraad!$A$2:$G$1001,5)),\"\",VLOOKUP($A$9,Voorraad!$A$2:$G$1001,5))","v":"8437/8438/8439"},{"$f":"IF(ISERROR(VLOOKUP($A$9,Voorraad!$A$2:$D$1001,4)),\"\",VLOOKUP($A$9,Voorraad!$A$2:$D$1001,4))","v":178},{"$f":"B9","v":60},{"$f":"MAX(0,(SUM(M9-L9)))","v":0}]
["BU0005",{"$f":"[4]Sheet1!$E$5","v":20},{"$f":"IF(ISERROR(VLOOKUP($A$10,Voorraad!$A$2:$D$1001,1)),\"\",VLOOKUP($A$10,Voorraad!$A$2:$D$1001,1))","v":"BU0005"},{"$f":"IF(ISERROR(VLOOKUP($A$10,Voorraad!$A$2:$D$1001,3)),\"\",VLOOKUP($A$10,Voorraad!$A$2:$D$1001,3))","v":"T83-A90X "},{"$f":"IF(ISERROR(VLOOKUP($A$10,Voorraad!$A$2:$D$1001,2)),\"\",VLOOKUP($A$10,Voorraad!$A$2:$D$1001,2))","v":"2046-09-C2LF"},{"$f":"IF(ISERROR(VLOOKUP($A$10,Voorraad!$A$2:$H$1001,8)),\"\",VLOOKUP($A$10,Voorraad!$A$2:$H$1001,8))","v":0},{"$f":"IF(ISERROR(VLOOKUP($A$10,Voorraad!$A$2:$I$1001,9)),\"\",VLOOKUP($A$10,Voorraad!$A$2:$I$1001,9))","v":2335982},{"$f":"IF(ISERROR(VLOOKUP($A$10,Voorraad!$A$2:$J$1001,10)),\"\",VLOOKUP($A$10,Voorraad!$A$2:$J$1001,10))","v":0},{"$f":"IF(ISERROR(VLOOKUP($A$10,Voorraad!$A$2:$G$1001,6)),\"\",VLOOKUP($A$10,Voorraad!$A$2:$G$1001,6))","v":"Farnell"},{"$f":"IF(ISERROR(VLOOKUP($A$10,Voorraad!$A$2:$G$1001,7)),\"\",VLOOKUP($A$10,Voorraad!$A$2:$G$1001,7))","v":"Bourns"},{"$f":"IF(ISERROR(VLOOKUP($A$10,Voorraad!$A$2:$G$1001,5)),\"\",VLOOKUP($A$10,Voorraad!$A$2:$G$1001,5))","v":"8437/8438/8439"},{"$f":"IF(ISERROR(VLOOKUP($A$10,Voorraad!$A$2:$D$1001,4)),\"\",VLOOKUP($A$10,Voorraad!$A$2:$D$1001,4))","v":57},20,0]
["BU0016",{"$f":"[4]Sheet1!$E$6","v":40},{"$f":"IF(ISERROR(VLOOKUP($A$11,Voorraad!$A$2:$D$1001,1)),\"\",VLOOKUP($A$11,Voorraad!$A$2:$D$1001,1))","v":"BU0016"},{"$f":"IF(ISERROR(VLOOKUP($A$11,Voorraad!$A$2:$D$1001,3)),\"\",VLOOKUP($A$11,Voorraad!$A$2:$D$1001,3))","v":"D BYV27-150-TAP"},{"$f":"IF(ISERROR(VLOOKUP($A$11,Voorraad!$A$2:$D$1001,2)),\"\",VLOOKUP($A$11,Voorraad!$A$2:$D$1001,2))","v":0},{"$f":"IF(ISERROR(VLOOKUP($A$11,Voorraad!$A$2:$H$1001,8)),\"\",VLOOKUP($A$11,Voorraad!$A$2:$H$1001,8))","v":520005},{"$f":"IF(ISERROR(VLOOKUP($A$11,Voorraad!$A$2:$I$1001,9)),\"\",VLOOKUP($A$11,Voorraad!$A$2:$I$1001,9))","v":"BYV27-150-TAP"},{"$f":"IF(ISERROR(VLOOKUP($A$11,Voorraad!$A$2:$J$1001,10)),\"\",VLOOKUP($A$11,Voorraad!$A$2:$J$1001,10))","v":0},{"$f":"IF(ISERROR(VLOOKUP($A$11,Voorraad!$A$2:$G$1001,6)),\"\",VLOOKUP($A$11,Voorraad!$A$2:$G$1001,6))","v":"MOUSER"},{"$f":"IF(ISERROR(VLOOKUP($A$11,Voorraad!$A$2:$G$1001,7)),\"\",VLOOKUP($A$11,Voorraad!$A$2:$G$1001,7))","v":"PHILIPS"},{"$f":"IF(ISERROR(VLOOKUP($A$11,Voorraad!$A$2:$G$1001,5)),\"\",VLOOKUP($A$11,Voorraad!$A$2:$G$1001,5))","v":"8437/8438/8439/8510"},{"$f":"IF(ISERROR(VLOOKUP($A$11,Voorraad!$A$2:$D$1001,4)),\"\",VLOOKUP($A$11,Voorraad!$A$2:$D$1001,4))","v":-7},40,47]
["BU0053",{"$f":"[4]Sheet1!$E$7","v":20},{"$f":"IF(ISERROR(VLOOKUP($A$12,Voorraad!$A$2:$D$1001,1)),\"\",VLOOKUP($A$12,Voorraad!$A$2:$D$1001,1))","v":"BU0053"},{"$f":"IF(ISERROR(VLOOKUP($A$12,Voorraad!$A$2:$D$1001,3)),\"\",VLOOKUP($A$12,Voorraad!$A$2:$D$1001,3))","v":"TMR6_2422"},{"$f":"IF(ISERROR(VLOOKUP($A$12,Voorraad!$A$2:$D$1001,2)),\"\",VLOOKUP($A$12,Voorraad!$A$2:$D$1001,2))","v":906442394},{"$f":"IF(ISERROR(VLOOKUP($A$12,Voorraad!$A$2:$H$1001,8)),\"\",VLOOKUP($A$12,Voorraad!$A$2:$H$1001,8))","v":0},{"$f":"IF(ISERROR(VLOOKUP($A$12,Voorraad!$A$2:$I$1001,9)),\"\",VLOOKUP($A$12,Voorraad!$A$2:$I$1001,9))","v":"TMR6-2422"},{"$f":"IF(ISERROR(VLOOKUP($A$12,Voorraad!$A$2:$J$1001,10)),\"\",VLOOKUP($A$12,Voorraad!$A$2:$J$1001,10))","v":"DISTRELEC: 169-54-689"},{"$f":"IF(ISERROR(VLOOKUP($A$12,Voorraad!$A$2:$G$1001,6)),\"\",VLOOKUP($A$12,Voorraad!$A$2:$G$1001,6))","v":"TME"},{"$f":"IF(ISERROR(VLOOKUP($A$12,Voorraad!$A$2:$G$1001,7)),\"\",VLOOKUP($A$12,Voorraad!$A$2:$G$1001,7))","v":"TRACO POWER"},{"$f":"IF(ISERROR(VLOOKUP($A$12,Voorraad!$A$2:$G$1001,5)),\"\",VLOOKUP($A$12,Voorraad!$A$2:$G$1001,5))","v":"8437/8439"},{"$f":"IF(ISERROR(VLOOKUP($A$12,Voorraad!$A$2:$D$1001,4)),\"\",VLOOKUP($A$12,Voorraad!$A$2:$D$1001,4))","v":37},20,0]
["BR4025",{"$f":"[4]Sheet1!$E$8","v":320},{"$f":"IF(ISERROR(VLOOKUP($A$13,Voorraad!$A$2:$D$1001,1)),\"\",VLOOKUP($A$13,Voorraad!$A$2:$D$1001,1))","v":"BR4025"},{"$f":"IF(ISERROR(VLOOKUP($A$13,Voorraad!$A$2:$D$1001,3)),\"\",VLOOKUP($A$13,Voorraad!$A$2:$D$1001,3))","v":"MFR005"},{"$f":"IF(ISERROR(VLOOKUP($A$13,Voorraad!$A$2:$D$1001,2)),\"\",VLOOKUP($A$13,Voorraad!$A$2:$D$1001,2))","v":"ERF-LX005V2"},{"$f":"IF(ISERROR(VLOOKUP($A$13,Voorraad!$A$2:$H$1001,8)),\"\",VLOOKUP($A$13,Voorraad!$A$2:$H$1001,8))","v":0},{"$f":"IF(ISERROR(VLOOKUP($A$13,Voorraad!$A$2:$I$1001,9)),\"\",VLOOKUP($A$13,Voorraad!$A$2:$I$1001,9))","v":"LX005-V2"},{"$f":"IF(ISERROR(VLOOKUP($A$13,Voorraad!$A$2:$J$1001,10)),\"\",VLOOKUP($A$13,Voorraad!$A$2:$J$1001,10))","v":0},{"$f":"IF(ISERROR(VLOOKUP($A$13,Voorraad!$A$2:$G$1001,6)),\"\",VLOOKUP($A$13,Voorraad!$A$2:$G$1001,6))","v":"TME"},{"$f":"IF(ISERROR(VLOOKUP($A$13,Voorraad!$A$2:$G$1001,7)),\"\",VLOOKUP($A$13,Voorraad!$A$2:$G$1001,7))","v":"ECE"},{"$f":"IF(ISERROR(VLOOKUP($A$13,Voorraad!$A$2:$G$1001,5)),\"\",VLOOKUP($A$13,Voorraad!$A$2:$G$1001,5))","v":8439},{"$f":"IF(ISERROR(VLOOKUP($A$13,Voorraad!$A$2:$D$1001,4)),\"\",VLOOKUP($A$13,Voorraad!$A$2:$D$1001,4))","v":742},320,0]
["BR4030",{"$f":"[4]Sheet1!$E$9","v":40},{"$f":"IF(ISERROR(VLOOKUP($A$14,Voorraad!$A$2:$D$1001,1)),\"\",VLOOKUP($A$14,Voorraad!$A$2:$D$1001,1))","v":"BR4030"},{"$f":"IF(ISERROR(VLOOKUP($A$14,Voorraad!$A$2:$D$1001,3)),\"\",VLOOKUP($A$14,Voorraad!$A$2:$D$1001,3))","v":"100NF50V"},{"$f":"IF(ISERROR(VLOOKUP($A$14,Voorraad!$A$2:$D$1001,2)),\"\",VLOOKUP($A$14,Voorraad!$A$2:$D$1001,2))","v":"CM-100N-Y5V"},{"$f":"IF(ISERROR(VLOOKUP($A$14,Voorraad!$A$2:$H$1001,8)),\"\",VLOOKUP($A$14,Voorraad!$A$2:$H$1001,8))","v":0},{"$f":"IF(ISERROR(VLOOKUP($A$14,Voorraad!$A$2:$I$1001,9)),\"\",VLOOKUP($A$14,Voorraad!$A$2:$I$1001,9))","v":"CM-100N-Y5V"},{"$f":"IF(ISERROR(VLOOKUP($A$14,Voorraad!$A$2:$J$1001,10)),\"\",VLOOKUP($A$14,Voorraad!$A$2:$J$1001,10))","v":0},{"$f":"IF(ISERROR(VLOOKUP($A$14,Voorraad!$A$2:$G$1001,6)),\"\",VLOOKUP($A$14,Voorraad!$A$2:$G$1001,6))","v":"TME"},{"$f":"IF(ISERROR(VLOOKUP($A$14,Voorraad!$A$2:$G$1001,7)),\"\",VLOOKUP($A$14,Voorraad!$A$2:$G$1001,7))","v":"SR Passives"},{"$f":"IF(ISERROR(VLOOKUP($A$14,Voorraad!$A$2:$G$1001,5)),\"\",VLOOKUP($A$14,Voorraad!$A$2:$G$1001,5))","v":"8437/8438/8439"},{"$f":"IF(ISERROR(VLOOKUP($A$14,Voorraad!$A$2:$D$1001,4)),\"\",VLOOKUP($A$14,Voorraad!$A$2:$D$1001,4))","v":184},40,0]
["BR3550",{"$f":"[4]Sheet1!$E$10","v":60},{"$f":"IF(ISERROR(VLOOKUP($A$15,Voorraad!$A$2:$D$1001,1)),\"\",VLOOKUP($A$15,Voorraad!$A$2:$D$1001,1))","v":"BR3550"},{"$f":"IF(ISERROR(VLOOKUP($A$15,Voorraad!$A$2:$D$1001,3)),\"\",VLOOKUP($A$15,Voorraad!$A$2:$D$1001,3))","v":"RV S05K30 100A 0.01W"},{"$f":"IF(ISERROR(VLOOKUP($A$15,Voorraad!$A$2:$D$1001,2)),\"\",VLOOKUP($A$9,Voorraad!$A$2:$D$1001,2))","v":"EEUFC1V221 "},{"$f":"IF(ISERROR(VLOOKUP($A$15,Voorraad!$A$2:$H$1001,8)),\"\",VLOOKUP($A$15,Voorraad!$A$2:$H$1001,8))","v":500088},{"$f":"IF(ISERROR(VLOOKUP($A$15,Voorraad!$A$2:$I$1001,9)),\"\",VLOOKUP($A$15,Voorraad!$A$2:$I$1001,9))","v":"SIOV-S05K30"},{"$f":"IF(ISERROR(VLOOKUP($A$15,Voorraad!$A$2:$J$1001,10)),\"\",VLOOKUP($A$15,Voorraad!$A$2:$J$1001,10))","v":"Groter aantal inkopen "},{"$f":"IF(ISERROR(VLOOKUP($A$15,Voorraad!$A$2:$G$1001,6)),\"\",VLOOKUP($A$15,Voorraad!$A$2:$G$1001,6))","v":"TME"},{"$f":"IF(ISERROR(VLOOKUP($A$15,Voorraad!$A$2:$G$1001,7)),\"\",VLOOKUP($A$15,Voorraad!$A$2:$G$1001,7))","v":"EPCOS"},{"$f":"IF(ISERROR(VLOOKUP($A$15,Voorraad!$A$2:$G$1001,5)),\"\",VLOOKUP($A$15,Voorraad!$A$2:$G$1001,5))","v":"8410/8437/8438/8439/8510"},{"$f":"IF(ISERROR(VLOOKUP($A$15,Voorraad!$A$2:$D$1001,4)),\"\",VLOOKUP($A$15,Voorraad!$A$2:$D$1001,4))","v":86},60,0]
["BR0004",{"$f":"[4]Sheet1!$E$11","v":20},{"$f":"IF(ISERROR(VLOOKUP($A$16,Voorraad!$A$2:$D$1001,1)),\"\",VLOOKUP($A$16,Voorraad!$A$2:$D$1001,1))","v":"BR0004"},{"$f":"IF(ISERROR(VLOOKUP($A$16,Voorraad!$A$2:$D$1001,3)),\"\",VLOOKUP($A$16,Voorraad!$A$2:$D$1001,3))","v":"R 1K00 1% 0.6W 7X2,5MM"},{"$f":"IF(ISERROR(VLOOKUP($A$16,Voorraad!$A$2:$D$1001,2)),\"\",VLOOKUP($A$16,Voorraad!$A$2:$D$1001,2))","v":"#10031001"},{"$f":"IF(ISERROR(VLOOKUP($A$16,Voorraad!$A$2:$H$1001,8)),\"\",VLOOKUP($A$16,Voorraad!$A$2:$H$1001,8))","v":500048},{"$f":"IF(ISERROR(VLOOKUP($A$16,Voorraad!$A$2:$I$1001,9)),\"\",VLOOKUP($A$16,Voorraad!$A$2:$I$1001,9))","v":0},{"$f":"IF(ISERROR(VLOOKUP($A$16,Voorraad!$A$2:$J$1001,10)),\"\",VLOOKUP($A$16,Voorraad!$A$2:$J$1001,10))","v":0},{"$f":"IF(ISERROR(VLOOKUP($A$16,Voorraad!$A$2:$G$1001,6)),\"\",VLOOKUP($A$16,Voorraad!$A$2:$G$1001,6))","v":0},{"$f":"IF(ISERROR(VLOOKUP($A$16,Voorraad!$A$2:$G$1001,7)),\"\",VLOOKUP($A$16,Voorraad!$A$2:$G$1001,7))","v":"BCC"},{"$f":"IF(ISERROR(VLOOKUP($A$16,Voorraad!$A$2:$G$1001,5)),\"\",VLOOKUP($A$16,Voorraad!$A$2:$G$1001,5))","v":"8510/8437/8438/8439/8464"},{"$f":"IF(ISERROR(VLOOKUP($A$16,Voorraad!$A$2:$D$1001,4)),\"\",VLOOKUP($A$16,Voorraad!$A$2:$D$1001,4))","v":208},20,0]
["BR0005",{"$f":"[4]Sheet1!$E$12","v":20},{"$f":"IF(ISERROR(VLOOKUP($A$17,Voorraad!$A$2:$D$1001,1)),\"\",VLOOKUP($A$17,Voorraad!$A$2:$D$1001,1))","v":"BR0005"},{"$f":"IF(ISERROR(VLOOKUP($A$17,Voorraad!$A$2:$D$1001,3)),\"\",VLOOKUP($A$17,Voorraad!$A$2:$D$1001,3))","v":"R 10K0 1% 0.6W 7X2,5MM"},{"$f":"IF(ISERROR(VLOOKUP($A$17,Voorraad!$A$2:$D$1001,2)),\"\",VLOOKUP($A$17,Voorraad!$A$2:$D$1001,2))","v":"#10041001"},{"$f":"IF(ISERROR(VLOOKUP($A$17,Voorraad!$A$2:$H$1001,8)),\"\",VLOOKUP($A$17,Voorraad!$A$2:$H$1001,8))","v":500060},{"$f":"IF(ISERROR(VLOOKUP($A$17,Voorraad!$A$2:$I$1001,9)),\"\",VLOOKUP($A$17,Voorraad!$A$2:$I$1001,9))","v":0},{"$f":"IF(ISERROR(VLOOKUP($A$17,Voorraad!$A$2:$J$1001,10)),\"\",VLOOKUP($A$17,Voorraad!$A$2:$J$1001,10))","v":0},{"$f":"IF(ISERROR(VLOOKUP($A$17,Voorraad!$A$2:$G$1001,6)),\"\",VLOOKUP($A$17,Voorraad!$A$2:$G$1001,6))","v":0},{"$f":"IF(ISERROR(VLOOKUP($A$17,Voorraad!$A$2:$G$1001,7)),\"\",VLOOKUP($A$17,Voorraad!$A$2:$G$1001,7))","v":"BCC"},{"$f":"IF(ISERROR(VLOOKUP($A$17,Voorraad!$A$2:$G$1001,5)),\"\",VLOOKUP($A$17,Voorraad!$A$2:$G$1001,5))","v":"8510/8437/8438/8439"},{"$f":"IF(ISERROR(VLOOKUP($A$17,Voorraad!$A$2:$D$1001,4)),\"\",VLOOKUP($A$17,Voorraad!$A$2:$D$1001,4))","v":1908},20,0]
["BU0010",{"$f":"[4]Sheet1!$E$13","v":20},{"$f":"IF(ISERROR(VLOOKUP($A$18,Voorraad!$A$2:$D$1001,1)),\"\",VLOOKUP($A$18,Voorraad!$A$2:$D$1001,1))","v":"BU0010"},{"$f":"IF(ISERROR(VLOOKUP($A$18,Voorraad!$A$2:$D$1001,3)),\"\",VLOOKUP($A$18,Voorraad!$A$2:$D$1001,3))","v":"22UH"},{"$f":"IF(ISERROR(VLOOKUP($A$18,Voorraad!$A$2:$D$1001,2)),\"\",VLOOKUP($A$18,Voorraad!$A$2:$D$1001,2))","v":"HBCC-220K-02"},{"$f":"IF(ISERROR(VLOOKUP($A$18,Voorraad!$A$2:$H$1001,8)),\"\",VLOOKUP($A$18,Voorraad!$A$2:$H$1001,8))","v":0},{"$f":"IF(ISERROR(VLOOKUP($A$18,Voorraad!$A$2:$I$1001,9)),\"\",VLOOKUP($A$18,Voorraad!$A$2:$I$1001,9))","v":"HBCC-220K-02"},{"$f":"IF(ISERROR(VLOOKUP($A$18,Voorraad!$A$2:$J$1001,10)),\"\",VLOOKUP($A$18,Voorraad!$A$2:$J$1001,10))","v":" MICC-R22M-02"},{"$f":"IF(ISERROR(VLOOKUP($A$18,Voorraad!$A$2:$G$1001,6)),\"\",VLOOKUP($A$18,Voorraad!$A$2:$G$1001,6))","v":"TME"},{"$f":"IF(ISERROR(VLOOKUP($A$18,Voorraad!$A$2:$G$1001,7)),\"\",VLOOKUP($A$18,Voorraad!$A$2:$G$1001,7))","v":"FASTRON"},{"$f":"IF(ISERROR(VLOOKUP($A$18,Voorraad!$A$2:$G$1001,5)),\"\",VLOOKUP($A$18,Voorraad!$A$2:$G$1001,5))","v":"8437/8438/8439"},{"$f":"IF(ISERROR(VLOOKUP($A$18,Voorraad!$A$2:$D$1001,4)),\"\",VLOOKUP($A$18,Voorraad!$A$2:$D$1001,4))","v":60},20,0]
["BU0064",{"$f":"[4]Sheet1!$E$14","v":20},{"$f":"IF(ISERROR(VLOOKUP($A$19,Voorraad!$A$2:$D$1001,1)),\"\",VLOOKUP($A$19,Voorraad!$A$2:$D$1001,1))","v":"BU0064"},{"$f":"IF(ISERROR(VLOOKUP($A$19,Voorraad!$A$2:$D$1001,3)),\"\",VLOOKUP($A$19,Voorraad!$A$2:$D$1001,3))","v":"FKV20M"},{"$f":"IF(ISERROR(VLOOKUP($A$19,Voorraad!$A$2:$D$1001,2)),\"\",VLOOKUP($A$19,Voorraad!$A$2:$D$1001,2))","v":9185206904},{"$f":"IF(ISERROR(VLOOKUP($A$19,Voorraad!$A$2:$H$1001,8)),\"\",VLOOKUP($A$19,Voorraad!$A$2:$H$1001,8))","v":0},{"$f":"IF(ISERROR(VLOOKUP($A$19,Voorraad!$A$2:$I$1001,9)),\"\",VLOOKUP($A$19,Voorraad!$A$2:$I$1001,9))","v":0},{"$f":"IF(ISERROR(VLOOKUP($A$19,Voorraad!$A$2:$J$1001,10)),\"\",VLOOKUP($A$19,Voorraad!$A$2:$J$1001,10))","v":0},{"$f":"IF(ISERROR(VLOOKUP($A$19,Voorraad!$A$2:$G$1001,6)),\"\",VLOOKUP($A$19,Voorraad!$A$2:$G$1001,6))","v":0},{"$f":"IF(ISERROR(VLOOKUP($A$19,Voorraad!$A$2:$G$1001,7)),\"\",VLOOKUP($A$19,Voorraad!$A$2:$G$1001,7))","v":"Harting"},{"$f":"IF(ISERROR(VLOOKUP($A$19,Voorraad!$A$2:$G$1001,5)),\"\",VLOOKUP($A$19,Voorraad!$A$2:$G$1001,5))","v":8439},{"$f":"IF(ISERROR(VLOOKUP($A$19,Voorraad!$A$2:$D$1001,4)),\"\",VLOOKUP($A$19,Voorraad!$A$2:$D$1001,4))","v":54},20,0]
["BU0066",{"$f":"[4]Sheet1!$E$15","v":640},{"$f":"IF(ISERROR(VLOOKUP($A$20,Voorraad!$A$2:$D$1001,1)),\"\",VLOOKUP($A$20,Voorraad!$A$2:$D$1001,1))","v":"BU0066"},{"$f":"IF(ISERROR(VLOOKUP($A$20,Voorraad!$A$2:$D$1001,3)),\"\",VLOOKUP($A$20,Voorraad!$A$2:$D$1001,3))","v":"KDS3 "},{"$f":"IF(ISERROR(VLOOKUP($A$20,Voorraad!$A$2:$D$1001,2)),\"\",VLOOKUP($A$20,Voorraad!$A$2:$D$1001,2))","v":1780015},{"$f":"IF(ISERROR(VLOOKUP($A$20,Voorraad!$A$2:$H$1001,8)),\"\",VLOOKUP($A$20,Voorraad!$A$2:$H$1001,8))","v":0},{"$f":"IF(ISERROR(VLOOKUP($A$20,Voorraad!$A$2:$I$1001,9)),\"\",VLOOKUP($A$20,Voorraad!$A$2:$I$1001,9))","v":1780015},{"$f":"IF(ISERROR(VLOOKUP($A$20,Voorraad!$A$2:$J$1001,10)),\"\",VLOOKUP($A$20,Voorraad!$A$2:$J$1001,10))","v":0},{"$f":"IF(ISERROR(VLOOKUP($A$20,Voorraad!$A$2:$G$1001,6)),\"\",VLOOKUP($A$20,Voorraad!$A$2:$G$1001,6))","v":"Van Egmond Groep"},{"$f":"IF(ISERROR(VLOOKUP($A$20,Voorraad!$A$2:$G$1001,7)),\"\",VLOOKUP($A$20,Voorraad!$A$2:$G$1001,7))","v":"Phoenix"},{"$f":"IF(ISERROR(VLOOKUP($A$20,Voorraad!$A$2:$G$1001,5)),\"\",VLOOKUP($A$20,Voorraad!$A$2:$G$1001,5))","v":"8437/8438/8439"},{"$f":"IF(ISERROR(VLOOKUP($A$20,Voorraad!$A$2:$D$1001,4)),\"\",VLOOKUP($A$20,Voorraad!$A$2:$D$1001,4))","v":546},640,94]
["BU0067",{"$f":"[4]Sheet1!$E$16","v":80},{"$f":"IF(ISERROR(VLOOKUP($A$21,Voorraad!$A$2:$D$1001,1)),\"\",VLOOKUP($A$21,Voorraad!$A$2:$D$1001,1))","v":"BU0067"},{"$f":"IF(ISERROR(VLOOKUP($A$21,Voorraad!$A$2:$D$1001,3)),\"\",VLOOKUP($A$21,Voorraad!$A$2:$D$1001,3))","v":"ZL305-02"},{"$f":"IF(ISERROR(VLOOKUP($A$21,Voorraad!$A$2:$D$1001,2)),\"\",VLOOKUP($A$21,Voorraad!$A$2:$D$1001,2))","v":"ZL305-02"},{"$f":"IF(ISERROR(VLOOKUP($A$21,Voorraad!$A$2:$H$1001,8)),\"\",VLOOKUP($A$21,Voorraad!$A$2:$H$1001,8))","v":0},{"$f":"IF(ISERROR(VLOOKUP($A$21,Voorraad!$A$2:$I$1001,9)),\"\",VLOOKUP($A$21,Voorraad!$A$2:$I$1001,9))","v":"ZL305-02"},{"$f":"IF(ISERROR(VLOOKUP($A$21,Voorraad!$A$2:$J$1001,10)),\"\",VLOOKUP($A$21,Voorraad!$A$2:$J$1001,10))","v":0},{"$f":"IF(ISERROR(VLOOKUP($A$21,Voorraad!$A$2:$G$1001,6)),\"\",VLOOKUP($A$21,Voorraad!$A$2:$G$1001,6))","v":"TME"},{"$f":"IF(ISERROR(VLOOKUP($A$21,Voorraad!$A$2:$G$1001,7)),\"\",VLOOKUP($A$21,Voorraad!$A$2:$G$1001,7))","v":"Nigini"},{"$f":"IF(ISERROR(VLOOKUP($A$21,Voorraad!$A$2:$G$1001,5)),\"\",VLOOKUP($A$21,Voorraad!$A$2:$G$1001,5))","v":8439},{"$f":"IF(ISERROR(VLOOKUP($A$21,Voorraad!$A$2:$D$1001,4)),\"\",VLOOKUP($A$21,Voorraad!$A$2:$D$1001,4))","v":214},80,0]
["BU0068",{"$f":"[4]Sheet1!$E$17","v":320},{"$f":"IF(ISERROR(VLOOKUP($A$22,Voorraad!$A$2:$D$1001,1)),\"\",VLOOKUP($A$22,Voorraad!$A$2:$D$1001,1))","v":"BU0068"},{"$f":"IF(ISERROR(VLOOKUP($A$22,Voorraad!$A$2:$D$1001,3)),\"\",VLOOKUP($A$22,Voorraad!$A$2:$D$1001,3))","v":"ZL201-03G"},{"$f":"IF(ISERROR(VLOOKUP($A$22,Voorraad!$A$2:$D$1001,2)),\"\",VLOOKUP($A$22,Voorraad!$A$2:$D$1001,2))","v":"DS1021-136sf11"},{"$f":"IF(ISERROR(VLOOKUP($A$22,Voorraad!$A$2:$H$1001,8)),\"\",VLOOKUP($A$22,Voorraad!$A$2:$H$1001,8))","v":0},{"$f":"IF(ISERROR(VLOOKUP($A$22,Voorraad!$A$2:$I$1001,9)),\"\",VLOOKUP($A$22,Voorraad!$A$2:$I$1001,9))","v":"ZL201-03G"},{"$f":"IF(ISERROR(VLOOKUP($A$22,Voorraad!$A$2:$J$1001,10)),\"\",VLOOKUP($A$22,Voorraad!$A$2:$J$1001,10))","v":0},{"$f":"IF(ISERROR(VLOOKUP($A$22,Voorraad!$A$2:$G$1001,6)),\"\",VLOOKUP($A$22,Voorraad!$A$2:$G$1001,6))","v":"TME"},{"$f":"IF(ISERROR(VLOOKUP($A$22,Voorraad!$A$2:$G$1001,7)),\"\",VLOOKUP($A$22,Voorraad!$A$2:$G$1001,7))","v":"Connfly"},{"$f":"IF(ISERROR(VLOOKUP($A$22,Voorraad!$A$2:$G$1001,5)),\"\",VLOOKUP($A$22,Voorraad!$A$2:$G$1001,5))","v":"8437/8439/8464/8510"},{"$f":"IF(ISERROR(VLOOKUP($A$22,Voorraad!$A$2:$D$1001,4)),\"\",VLOOKUP($A$22,Voorraad!$A$2:$D$1001,4))","v":931},320,0]
["BU0059",{"$f":"[4]Sheet1!$E$18","v":320},{"$f":"IF(ISERROR(VLOOKUP($A$23,Voorraad!$A$2:$D$1001,1)),\"\",VLOOKUP($A$23,Voorraad!$A$2:$D$1001,1))","v":"BU0059"},{"$f":"IF(ISERROR(VLOOKUP($A$23,Voorraad!$A$2:$D$1001,3)),\"\",VLOOKUP($A$23,Voorraad!$A$2:$D$1001,3))","v":"CON 1-881545-1 SHUNT"},{"$f":"IF(ISERROR(VLOOKUP($A$23,Voorraad!$A$2:$D$1001,2)),\"\",VLOOKUP($A$23,Voorraad!$A$2:$D$1001,2))","v":"#513JUMPOFSW"},{"$f":"IF(ISERROR(VLOOKUP($A$23,Voorraad!$A$2:$H$1001,8)),\"\",VLOOKUP($A$23,Voorraad!$A$2:$H$1001,8))","v":0},{"$f":"IF(ISERROR(VLOOKUP($A$23,Voorraad!$A$2:$I$1001,9)),\"\",VLOOKUP($A$23,Voorraad!$A$2:$I$1001,9))","v":"JUMPER-BL"},{"$f":"IF(ISERROR(VLOOKUP($A$23,Voorraad!$A$2:$J$1001,10)),\"\",VLOOKUP($A$23,Voorraad!$A$2:$J$1001,10))","v":0},{"$f":"IF(ISERROR(VLOOKUP($A$23,Voorraad!$A$2:$G$1001,6)),\"\",VLOOKUP($A$23,Voorraad!$A$2:$G$1001,6))","v":"TME"},{"$f":"IF(ISERROR(VLOOKUP($A$23,Voorraad!$A$2:$G$1001,7)),\"\",VLOOKUP($A$23,Voorraad!$A$2:$G$1001,7))","v":0},{"$f":"IF(ISERROR(VLOOKUP($A$23,Voorraad!$A$2:$G$1001,5)),\"\",VLOOKUP($A$23,Voorraad!$A$2:$G$1001,5))","v":"8437/8439/8464/8510"},{"$f":"IF(ISERROR(VLOOKUP($A$23,Voorraad!$A$2:$D$1001,4)),\"\",VLOOKUP($A$23,Voorraad!$A$2:$D$1001,4))","v":1725},320,0]
["BU0045",{"$f":"[4]Sheet1!$E$19","v":20},{"$f":"IF(ISERROR(VLOOKUP($A$24,Voorraad!$A$2:$D$1001,1)),\"\",VLOOKUP($A$24,Voorraad!$A$2:$D$1001,1))","v":"BU0045"},{"$f":"IF(ISERROR(VLOOKUP($A$24,Voorraad!$A$2:$D$1001,3)),\"\",VLOOKUP($A$24,Voorraad!$A$2:$D$1001,3))","v":"LED TLG124A GROEN 3.18MM"},{"$f":"IF(ISERROR(VLOOKUP($A$24,Voorraad!$A$2:$D$1001,2)),\"\",VLOOKUP($A$24,Voorraad!$A$2:$D$1001,2))","v":"KVD-03-035/G"},{"$f":"IF(ISERROR(VLOOKUP($A$24,Voorraad!$A$2:$H$1001,8)),\"\",VLOOKUP($A$24,Voorraad!$A$2:$H$1001,8))","v":"?"},{"$f":"IF(ISERROR(VLOOKUP($A$24,Voorraad!$A$2:$I$1001,9)),\"\",VLOOKUP($A$24,Voorraad!$A$2:$I$1001,9))","v":"L-934GD"},{"$f":"IF(ISERROR(VLOOKUP($A$24,Voorraad!$A$2:$J$1001,10)),\"\",VLOOKUP($A$24,Voorraad!$A$2:$J$1001,10))","v":0},{"$f":"IF(ISERROR(VLOOKUP($A$24,Voorraad!$A$2:$G$1001,6)),\"\",VLOOKUP($A$24,Voorraad!$A$2:$G$1001,6))","v":"TME"},{"$f":"IF(ISERROR(VLOOKUP($A$24,Voorraad!$A$2:$G$1001,7)),\"\",VLOOKUP($A$24,Voorraad!$A$2:$G$1001,7))","v":"KHATOD / King Bright"},{"$f":"IF(ISERROR(VLOOKUP($A$24,Voorraad!$A$2:$G$1001,5)),\"\",VLOOKUP($A$24,Voorraad!$A$2:$G$1001,5))","v":"8437/8438/8439/8464/8510"},{"$f":"IF(ISERROR(VLOOKUP($A$24,Voorraad!$A$2:$D$1001,4)),\"\",VLOOKUP($A$24,Voorraad!$A$2:$D$1001,4))","v":2},20,18]
["BU0072",{"$f":"[4]Sheet1!$E$20","v":20},{"$f":"IF(ISERROR(VLOOKUP($A$25,Voorraad!$A$2:$D$1001,1)),\"\",VLOOKUP($A$25,Voorraad!$A$2:$D$1001,1))","v":"BU0072"},{"$f":"IF(ISERROR(VLOOKUP($A$25,Voorraad!$A$2:$D$1001,3)),\"\",VLOOKUP($A$25,Voorraad!$A$2:$D$1001,3))","v":"DIPFIX"},{"$f":"IF(ISERROR(VLOOKUP($A$25,Voorraad!$A$2:$D$1001,2)),\"\",VLOOKUP($A$25,Voorraad!$A$2:$D$1001,2))","v":0},{"$f":"IF(ISERROR(VLOOKUP($A$25,Voorraad!$A$2:$H$1001,8)),\"\",VLOOKUP($A$25,Voorraad!$A$2:$H$1001,8))","v":0},{"$f":"IF(ISERROR(VLOOKUP($A$25,Voorraad!$A$2:$I$1001,9)),\"\",VLOOKUP($A$25,Voorraad!$A$2:$I$1001,9))","v":0},{"$f":"IF(ISERROR(VLOOKUP($A$25,Voorraad!$A$2:$J$1001,10)),\"\",VLOOKUP($A$25,Voorraad!$A$2:$J$1001,10))","v":0},{"$f":"IF(ISERROR(VLOOKUP($A$25,Voorraad!$A$2:$G$1001,6)),\"\",VLOOKUP($A$25,Voorraad!$A$2:$G$1001,6))","v":"JvB"},{"$f":"IF(ISERROR(VLOOKUP($A$25,Voorraad!$A$2:$G$1001,7)),\"\",VLOOKUP($A$25,Voorraad!$A$2:$G$1001,7))","v":"JvB"},{"$f":"IF(ISERROR(VLOOKUP($A$25,Voorraad!$A$2:$G$1001,5)),\"\",VLOOKUP($A$25,Voorraad!$A$2:$G$1001,5))","v":8439},{"$f":"IF(ISERROR(VLOOKUP($A$25,Voorraad!$A$2:$D$1001,4)),\"\",VLOOKUP($A$25,Voorraad!$A$2:$D$1001,4))","v":574},20,0]
["BU0073",{"$f":"[4]Sheet1!$E$21","v":20},{"$f":"IF(ISERROR(VLOOKUP($A$26,Voorraad!$A$2:$D$1001,1)),\"\",VLOOKUP($A$26,Voorraad!$A$2:$D$1001,1))","v":"BU0073"},{"$f":"IF(ISERROR(VLOOKUP($A$26,Voorraad!$A$2:$D$1001,3)),\"\",VLOOKUP($A$26,Voorraad!$A$2:$D$1001,3))","v":"EARTH"},{"$f":"IF(ISERROR(VLOOKUP($A$26,Voorraad!$A$2:$D$1001,2)),\"\",VLOOKUP($A$26,Voorraad!$A$2:$D$1001,2))","v":0},{"$f":"IF(ISERROR(VLOOKUP($A$26,Voorraad!$A$2:$H$1001,8)),\"\",VLOOKUP($A$26,Voorraad!$A$2:$H$1001,8))","v":0},{"$f":"IF(ISERROR(VLOOKUP($A$26,Voorraad!$A$2:$I$1001,9)),\"\",VLOOKUP($A$26,Voorraad!$A$2:$I$1001,9))","v":0},{"$f":"IF(ISERROR(VLOOKUP($A$26,Voorraad!$A$2:$J$1001,10)),\"\",VLOOKUP($A$26,Voorraad!$A$2:$J$1001,10))","v":0},{"$f":"IF(ISERROR(VLOOKUP($A$26,Voorraad!$A$2:$G$1001,6)),\"\",VLOOKUP($A$26,Voorraad!$A$2:$G$1001,6))","v":"JvB"},{"$f":"IF(ISERROR(VLOOKUP($A$26,Voorraad!$A$2:$G$1001,7)),\"\",VLOOKUP($A$26,Voorraad!$A$2:$G$1001,7))","v":"JvB"},{"$f":"IF(ISERROR(VLOOKUP($A$26,Voorraad!$A$2:$G$1001,5)),\"\",VLOOKUP($A$26,Voorraad!$A$2:$G$1001,5))","v":8439},{"$f":"IF(ISERROR(VLOOKUP($A$26,Voorraad!$A$2:$D$1001,4)),\"\",VLOOKUP($A$26,Voorraad!$A$2:$D$1001,4))","v":12},20,8]
["BX0002",{"$f":"[4]Sheet1!$E$22","v":20},{"$f":"IF(ISERROR(VLOOKUP($A$27,Voorraad!$A$2:$D$1001,1)),\"\",VLOOKUP($A$27,Voorraad!$A$2:$D$1001,1))","v":"BX0002"},{"$f":"IF(ISERROR(VLOOKUP($A$27,Voorraad!$A$2:$D$1001,3)),\"\",VLOOKUP($A$27,Voorraad!$A$2:$D$1001,3))","v":"SL2 "},{"$f":"IF(ISERROR(VLOOKUP($A$27,Voorraad!$A$2:$D$1001,2)),\"\",VLOOKUP($A$27,Voorraad!$A$2:$D$1001,2))","v":"XY2500V-C(5.08)-2PIN"},{"$f":"IF(ISERROR(VLOOKUP($A$27,Voorraad!$A$2:$H$1001,8)),\"\",VLOOKUP($A$27,Voorraad!$A$2:$H$1001,8))","v":0},{"$f":"IF(ISERROR(VLOOKUP($A$27,Voorraad!$A$2:$I$1001,9)),\"\",VLOOKUP($A$27,Voorraad!$A$2:$I$1001,9))","v":"TBG-5-PB-2P-GN"},{"$f":"IF(ISERROR(VLOOKUP($A$27,Voorraad!$A$2:$J$1001,10)),\"\",VLOOKUP($A$27,Voorraad!$A$2:$J$1001,10))","v":0},{"$f":"IF(ISERROR(VLOOKUP($A$27,Voorraad!$A$2:$G$1001,6)),\"\",VLOOKUP($A$27,Voorraad!$A$2:$G$1001,6))","v":"TME"},{"$f":"IF(ISERROR(VLOOKUP($A$27,Voorraad!$A$2:$G$1001,7)),\"\",VLOOKUP($A$27,Voorraad!$A$2:$G$1001,7))","v":"Xinya"},{"$f":"IF(ISERROR(VLOOKUP($A$27,Voorraad!$A$2:$G$1001,5)),\"\",VLOOKUP($A$27,Voorraad!$A$2:$G$1001,5))","v":"8437/8438/8439"},{"$f":"IF(ISERROR(VLOOKUP($A$27,Voorraad!$A$2:$D$1001,4)),\"\",VLOOKUP($A$27,Voorraad!$A$2:$D$1001,4))","v":92},20,0]
["BX0003",{"$f":"[4]Sheet1!$E$23","v":20},{"$f":"IF(ISERROR(VLOOKUP($A$28,Voorraad!$A$2:$D$1001,1)),\"\",VLOOKUP($A$28,Voorraad!$A$2:$D$1001,1))","v":"BX0003"},{"$f":"IF(ISERROR(VLOOKUP($A$28,Voorraad!$A$2:$D$1001,3)),\"\",VLOOKUP($A$28,Voorraad!$A$2:$D$1001,3))","v":"BL2"},{"$f":"IF(ISERROR(VLOOKUP($A$28,Voorraad!$A$2:$D$1001,2)),\"\",VLOOKUP($A$28,Voorraad!$A$2:$D$1001,2))","v":"TBW-5-2P/GN"},{"$f":"IF(ISERROR(VLOOKUP($A$28,Voorraad!$A$2:$H$1001,8)),\"\",VLOOKUP($A$28,Voorraad!$A$2:$H$1001,8))","v":0},{"$f":"IF(ISERROR(VLOOKUP($A$28,Voorraad!$A$2:$I$1001,9)),\"\",VLOOKUP($A$28,Voorraad!$A$2:$I$1001,9))","v":"TBW-5-2P/GN"},{"$f":"IF(ISERROR(VLOOKUP($A$28,Voorraad!$A$2:$J$1001,10)),\"\",VLOOKUP($A$28,Voorraad!$A$2:$J$1001,10))","v":0},{"$f":"IF(ISERROR(VLOOKUP($A$28,Voorraad!$A$2:$G$1001,6)),\"\",VLOOKUP($A$28,Voorraad!$A$2:$G$1001,6))","v":"TME"},{"$f":"IF(ISERROR(VLOOKUP($A$28,Voorraad!$A$2:$G$1001,7)),\"\",VLOOKUP($A$28,Voorraad!$A$2:$G$1001,7))","v":"Ninigi"},{"$f":"IF(ISERROR(VLOOKUP($A$28,Voorraad!$A$2:$G$1001,5)),\"\",VLOOKUP($A$28,Voorraad!$A$2:$G$1001,5))","v":"8437/8438/8439"},{"$f":"IF(ISERROR(VLOOKUP($A$28,Voorraad!$A$2:$D$1001,4)),\"\",VLOOKUP($A$28,Voorraad!$A$2:$D$1001,4))","v":93},20,0]
["BX0004",{"$f":"[4]Sheet1!$E$24","v":20},{"$f":"IF(ISERROR(VLOOKUP($A$29,Voorraad!$A$2:$D$1001,1)),\"\",VLOOKUP($A$29,Voorraad!$A$2:$D$1001,1))","v":"BX0004"},{"$f":"IF(ISERROR(VLOOKUP($A$29,Voorraad!$A$2:$D$1001,3)),\"\",VLOOKUP($A$29,Voorraad!$A$2:$D$1001,3))","v":"SL4"},{"$f":"IF(ISERROR(VLOOKUP($A$29,Voorraad!$A$2:$D$1001,2)),\"\",VLOOKUP($A$29,Voorraad!$A$2:$D$1001,2))","v":"TBG-5-PB-4P/GN"},{"$f":"IF(ISERROR(VLOOKUP($A$29,Voorraad!$A$2:$H$1001,8)),\"\",VLOOKUP($A$29,Voorraad!$A$2:$H$1001,8))","v":0},{"$f":"IF(ISERROR(VLOOKUP($A$29,Voorraad!$A$2:$I$1001,9)),\"\",VLOOKUP($A$29,Voorraad!$A$2:$I$1001,9))","v":"TBG-5-PB-4P-GN"},{"$f":"IF(ISERROR(VLOOKUP($A$29,Voorraad!$A$2:$J$1001,10)),\"\",VLOOKUP($A$29,Voorraad!$A$2:$J$1001,10))","v":0},{"$f":"IF(ISERROR(VLOOKUP($A$29,Voorraad!$A$2:$G$1001,6)),\"\",VLOOKUP($A$29,Voorraad!$A$2:$G$1001,6))","v":"TME"},{"$f":"IF(ISERROR(VLOOKUP($A$29,Voorraad!$A$2:$G$1001,7)),\"\",VLOOKUP($A$29,Voorraad!$A$2:$G$1001,7))","v":"Nigini"},{"$f":"IF(ISERROR(VLOOKUP($A$29,Voorraad!$A$2:$G$1001,5)),\"\",VLOOKUP($A$29,Voorraad!$A$2:$G$1001,5))","v":8439},{"$f":"IF(ISERROR(VLOOKUP($A$29,Voorraad!$A$2:$D$1001,4)),\"\",VLOOKUP($A$29,Voorraad!$A$2:$D$1001,4))","v":45},20,0]
["BX0005",{"$f":"[4]Sheet1!$E$25","v":20},{"$f":"IF(ISERROR(VLOOKUP($A$30,Voorraad!$A$2:$D$1001,1)),\"\",VLOOKUP($A$30,Voorraad!$A$2:$D$1001,1))","v":"BX0005"},{"$f":"IF(ISERROR(VLOOKUP($A$30,Voorraad!$A$2:$D$1001,3)),\"\",VLOOKUP($A$30,Voorraad!$A$2:$D$1001,3))","v":"BL4"},{"$f":"IF(ISERROR(VLOOKUP($A$30,Voorraad!$A$2:$D$1001,2)),\"\",VLOOKUP($A$30,Voorraad!$A$2:$D$1001,2))","v":"TBW-5-4P/GN"},{"$f":"IF(ISERROR(VLOOKUP($A$30,Voorraad!$A$2:$H$1001,8)),\"\",VLOOKUP($A$30,Voorraad!$A$2:$H$1001,8))","v":0},{"$f":"IF(ISERROR(VLOOKUP($A$30,Voorraad!$A$2:$I$1001,9)),\"\",VLOOKUP($A$30,Voorraad!$A$2:$I$1001,9))","v":"TBW-5-4P/GN"},{"$f":"IF(ISERROR(VLOOKUP($A$30,Voorraad!$A$2:$J$1001,10)),\"\",VLOOKUP($A$30,Voorraad!$A$2:$J$1001,10))","v":0},{"$f":"IF(ISERROR(VLOOKUP($A$30,Voorraad!$A$2:$G$1001,6)),\"\",VLOOKUP($A$30,Voorraad!$A$2:$G$1001,6))","v":"TME"},{"$f":"IF(ISERROR(VLOOKUP($A$30,Voorraad!$A$2:$G$1001,7)),\"\",VLOOKUP($A$30,Voorraad!$A$2:$G$1001,7))","v":"Nigini"},{"$f":"IF(ISERROR(VLOOKUP($A$30,Voorraad!$A$2:$G$1001,5)),\"\",VLOOKUP($A$30,Voorraad!$A$2:$G$1001,5))","v":8439},{"$f":"IF(ISERROR(VLOOKUP($A$30,Voorraad!$A$2:$D$1001,4)),\"\",VLOOKUP($A$30,Voorraad!$A$2:$D$1001,4))","v":-100},20,120]
["BX0017",{"$f":"[4]Sheet1!$E$26","v":20},{"$f":"IF(ISERROR(VLOOKUP($A$31,Voorraad!$A$2:$D$1001,1)),\"\",VLOOKUP($A$31,Voorraad!$A$2:$D$1001,1))","v":"BX0017"},{"$f":"IF(ISERROR(VLOOKUP($A$31,Voorraad!$A$2:$D$1001,3)),\"\",VLOOKUP($A$31,Voorraad!$A$2:$D$1001,3))","v":"UM72-profiel 161MM"},{"$f":"IF(ISERROR(VLOOKUP($A$31,Voorraad!$A$2:$D$1001,2)),\"\",VLOOKUP($A$31,Voorraad!$A$2:$D$1001,2))","v":2952020},{"$f":"IF(ISERROR(VLOOKUP($A$31,Voorraad!$A$2:$H$1001,8)),\"\",VLOOKUP($A$31,Voorraad!$A$2:$H$1001,8))","v":0},{"$f":"IF(ISERROR(VLOOKUP($A$31,Voorraad!$A$2:$I$1001,9)),\"\",VLOOKUP($A$31,Voorraad!$A$2:$I$1001,9))","v":0},{"$f":"IF(ISERROR(VLOOKUP($A$31,Voorraad!$A$2:$J$1001,10)),\"\",VLOOKUP($A$31,Voorraad!$A$2:$J$1001,10))","v":0},{"$f":"IF(ISERROR(VLOOKUP($A$31,Voorraad!$A$2:$G$1001,6)),\"\",VLOOKUP($A$31,Voorraad!$A$2:$G$1001,6))","v":"Phoenix / Overwijn"},{"$f":"IF(ISERROR(VLOOKUP($A$31,Voorraad!$A$2:$G$1001,7)),\"\",VLOOKUP($A$31,Voorraad!$A$2:$G$1001,7))","v":"Phoenix"},{"$f":"IF(ISERROR(VLOOKUP($A$31,Voorraad!$A$2:$G$1001,5)),\"\",VLOOKUP($A$31,Voorraad!$A$2:$G$1001,5))","v":8439},{"$f":"IF(ISERROR(VLOOKUP($A$31,Voorraad!$A$2:$D$1001,4)),\"\",VLOOKUP($A$31,Voorraad!$A$2:$D$1001,4))","v":0},20,20]
["BX0019",{"$f":"[4]Sheet1!$E$27","v":20},{"$f":"IF(ISERROR(VLOOKUP($A$32,Voorraad!$A$2:$D$1001,1)),\"\",VLOOKUP($A$32,Voorraad!$A$2:$D$1001,1))","v":"BX0019"},{"$f":"IF(ISERROR(VLOOKUP($A$32,Voorraad!$A$2:$D$1001,3)),\"\",VLOOKUP($A$32,Voorraad!$A$2:$D$1001,3))","v":"UM72 SEFE/L"},{"$f":"IF(ISERROR(VLOOKUP($A$32,Voorraad!$A$2:$D$1001,2)),\"\",VLOOKUP($A$32,Voorraad!$A$2:$D$1001,2))","v":2959340},{"$f":"IF(ISERROR(VLOOKUP($A$32,Voorraad!$A$2:$H$1001,8)),\"\",VLOOKUP($A$32,Voorraad!$A$2:$H$1001,8))","v":0},{"$f":"IF(ISERROR(VLOOKUP($A$32,Voorraad!$A$2:$I$1001,9)),\"\",VLOOKUP($A$32,Voorraad!$A$2:$I$1001,9))","v":2959340},{"$f":"IF(ISERROR(VLOOKUP($A$32,Voorraad!$A$2:$J$1001,10)),\"\",VLOOKUP($A$32,Voorraad!$A$2:$J$1001,10))","v":0},{"$f":"IF(ISERROR(VLOOKUP($A$32,Voorraad!$A$2:$G$1001,6)),\"\",VLOOKUP($A$32,Voorraad!$A$2:$G$1001,6))","v":"Van Egmond Groep"},{"$f":"IF(ISERROR(VLOOKUP($A$32,Voorraad!$A$2:$G$1001,7)),\"\",VLOOKUP($A$32,Voorraad!$A$2:$G$1001,7))","v":"Phoenix"},{"$f":"IF(ISERROR(VLOOKUP($A$32,Voorraad!$A$2:$G$1001,5)),\"\",VLOOKUP($A$32,Voorraad!$A$2:$G$1001,5))","v":"8437/8438/8439"},{"$f":"IF(ISERROR(VLOOKUP($A$32,Voorraad!$A$2:$D$1001,4)),\"\",VLOOKUP($A$32,Voorraad!$A$2:$D$1001,4))","v":11},20,9]
["BX0020",{"$f":"[4]Sheet1!$E$28","v":20},{"$f":"IF(ISERROR(VLOOKUP($A$33,Voorraad!$A$2:$D$1001,1)),\"\",VLOOKUP($A$33,Voorraad!$A$2:$D$1001,1))","v":"BX0020"},{"$f":"IF(ISERROR(VLOOKUP($A$33,Voorraad!$A$2:$D$1001,3)),\"\",VLOOKUP($A$33,Voorraad!$A$2:$D$1001,3))","v":"UM72 SEFE/R"},{"$f":"IF(ISERROR(VLOOKUP($A$33,Voorraad!$A$2:$D$1001,2)),\"\",VLOOKUP($A$33,Voorraad!$A$2:$D$1001,2))","v":2959353},{"$f":"IF(ISERROR(VLOOKUP($A$33,Voorraad!$A$2:$H$1001,8)),\"\",VLOOKUP($A$33,Voorraad!$A$2:$H$1001,8))","v":0},{"$f":"IF(ISERROR(VLOOKUP($A$33,Voorraad!$A$2:$I$1001,9)),\"\",VLOOKUP($A$33,Voorraad!$A$2:$I$1001,9))","v":2959353},{"$f":"IF(ISERROR(VLOOKUP($A$33,Voorraad!$A$2:$J$1001,10)),\"\",VLOOKUP($A$33,Voorraad!$A$2:$J$1001,10))","v":0},{"$f":"IF(ISERROR(VLOOKUP($A$33,Voorraad!$A$2:$G$1001,6)),\"\",VLOOKUP($A$33,Voorraad!$A$2:$G$1001,6))","v":"Van Egmond Groep"},{"$f":"IF(ISERROR(VLOOKUP($A$33,Voorraad!$A$2:$G$1001,7)),\"\",VLOOKUP($A$33,Voorraad!$A$2:$G$1001,7))","v":"Phoenix"},{"$f":"IF(ISERROR(VLOOKUP($A$33,Voorraad!$A$2:$G$1001,5)),\"\",VLOOKUP($A$33,Voorraad!$A$2:$G$1001,5))","v":"8437/8438/8439"},{"$f":"IF(ISERROR(VLOOKUP($A$33,Voorraad!$A$2:$D$1001,4)),\"\",VLOOKUP($A$33,Voorraad!$A$2:$D$1001,4))","v":13},20,7]
["BX0021",{"$f":"[4]Sheet1!$E$29","v":20},{"$f":"IF(ISERROR(VLOOKUP($A$34,Voorraad!$A$2:$D$1001,1)),\"\",VLOOKUP($A$34,Voorraad!$A$2:$D$1001,1))","v":"BX0021"},{"$f":"IF(ISERROR(VLOOKUP($A$34,Voorraad!$A$2:$D$1001,3)),\"\",VLOOKUP($A$34,Voorraad!$A$2:$D$1001,3))","v":"UM72 FE"},{"$f":"IF(ISERROR(VLOOKUP($A$34,Voorraad!$A$2:$D$1001,2)),\"\",VLOOKUP($A$34,Voorraad!$A$2:$D$1001,2))","v":2959382},{"$f":"IF(ISERROR(VLOOKUP($A$34,Voorraad!$A$2:$H$1001,8)),\"\",VLOOKUP($A$34,Voorraad!$A$2:$H$1001,8))","v":0},{"$f":"IF(ISERROR(VLOOKUP($A$34,Voorraad!$A$2:$I$1001,9)),\"\",VLOOKUP($A$34,Voorraad!$A$2:$I$1001,9))","v":0},{"$f":"IF(ISERROR(VLOOKUP($A$34,Voorraad!$A$2:$J$1001,10)),\"\",VLOOKUP($A$34,Voorraad!$A$2:$J$1001,10))","v":0},{"$f":"IF(ISERROR(VLOOKUP($A$34,Voorraad!$A$2:$G$1001,6)),\"\",VLOOKUP($A$34,Voorraad!$A$2:$G$1001,6))","v":"Phoenix"},{"$f":"IF(ISERROR(VLOOKUP($A$34,Voorraad!$A$2:$G$1001,7)),\"\",VLOOKUP($A$34,Voorraad!$A$2:$G$1001,7))","v":0},{"$f":"IF(ISERROR(VLOOKUP($A$34,Voorraad!$A$2:$G$1001,5)),\"\",VLOOKUP($A$34,Voorraad!$A$2:$G$1001,5))","v":"8438/8439"},{"$f":"IF(ISERROR(VLOOKUP($A$34,Voorraad!$A$2:$D$1001,4)),\"\",VLOOKUP($A$34,Voorraad!$A$2:$D$1001,4))","v":0},20,20]
["BX0043",{"$f":"[4]Sheet1!$E$30","v":20},{"$f":"IF(ISERROR(VLOOKUP($A$35,Voorraad!$A$2:$D$1001,1)),\"\",VLOOKUP($A$35,Voorraad!$A$2:$D$1001,1))","v":"BX0043"},{"$f":"IF(ISERROR(VLOOKUP($A$35,Voorraad!$A$2:$D$1001,3)),\"\",VLOOKUP($A$35,Voorraad!$A$2:$D$1001,3))","v":"PCB 8439L"},{"$f":"IF(ISERROR(VLOOKUP($A$35,Voorraad!$A$2:$D$1001,2)),\"\",VLOOKUP($A$35,Voorraad!$A$2:$D$1001,2))","v":"PCB 8439L"},{"$f":"IF(ISERROR(VLOOKUP($A$35,Voorraad!$A$2:$H$1001,8)),\"\",VLOOKUP($A$35,Voorraad!$A$2:$H$1001,8))","v":0},{"$f":"IF(ISERROR(VLOOKUP($A$35,Voorraad!$A$2:$I$1001,9)),\"\",VLOOKUP($A$35,Voorraad!$A$2:$I$1001,9))","v":0},{"$f":"IF(ISERROR(VLOOKUP($A$35,Voorraad!$A$2:$J$1001,10)),\"\",VLOOKUP($A$35,Voorraad!$A$2:$J$1001,10))","v":0},{"$f":"IF(ISERROR(VLOOKUP($A$35,Voorraad!$A$2:$G$1001,6)),\"\",VLOOKUP($A$35,Voorraad!$A$2:$G$1001,6))","v":"JvB"},{"$f":"IF(ISERROR(VLOOKUP($A$35,Voorraad!$A$2:$G$1001,7)),\"\",VLOOKUP($A$35,Voorraad!$A$2:$G$1001,7))","v":"JvB"},{"$f":"IF(ISERROR(VLOOKUP($A$35,Voorraad!$A$2:$G$1001,5)),\"\",VLOOKUP($A$35,Voorraad!$A$2:$G$1001,5))","v":"PCB 8439L"},{"$f":"IF(ISERROR(VLOOKUP($A$35,Voorraad!$A$2:$D$1001,4)),\"\",VLOOKUP($A$35,Voorraad!$A$2:$D$1001,4))","v":43},20,0]
["BX0044",{"$f":"[4]Sheet1!$E$31","v":0},{"$f":"IF(ISERROR(VLOOKUP($A$36,Voorraad!$A$2:$D$1001,1)),\"\",VLOOKUP($A$36,Voorraad!$A$2:$D$1001,1))","v":"BX0044"},{"$f":"IF(ISERROR(VLOOKUP($A$36,Voorraad!$A$2:$D$1001,3)),\"\",VLOOKUP($A$36,Voorraad!$A$2:$D$1001,3))","v":"PCB 8439R"},{"$f":"IF(ISERROR(VLOOKUP($A$36,Voorraad!$A$2:$D$1001,2)),\"\",VLOOKUP($A$36,Voorraad!$A$2:$D$1001,2))","v":"PCB 8439R"},{"$f":"IF(ISERROR(VLOOKUP($A$36,Voorraad!$A$2:$H$1001,8)),\"\",VLOOKUP($A$36,Voorraad!$A$2:$H$1001,8))","v":0},{"$f":"IF(ISERROR(VLOOKUP($A$36,Voorraad!$A$2:$I$1001,9)),\"\",VLOOKUP($A$36,Voorraad!$A$2:$I$1001,9))","v":0},{"$f":"IF(ISERROR(VLOOKUP($A$36,Voorraad!$A$2:$J$1001,10)),\"\",VLOOKUP($A$36,Voorraad!$A$2:$J$1001,10))","v":0},{"$f":"IF(ISERROR(VLOOKUP($A$36,Voorraad!$A$2:$G$1001,6)),\"\",VLOOKUP($A$36,Voorraad!$A$2:$G$1001,6))","v":"JvB"},{"$f":"IF(ISERROR(VLOOKUP($A$36,Voorraad!$A$2:$G$1001,7)),\"\",VLOOKUP($A$36,Voorraad!$A$2:$G$1001,7))","v":"JvB"},{"$f":"IF(ISERROR(VLOOKUP($A$36,Voorraad!$A$2:$G$1001,5)),\"\",VLOOKUP($A$36,Voorraad!$A$2:$G$1001,5))","v":"PCB 8439R"},{"$f":"IF(ISERROR(VLOOKUP($A$36,Voorraad!$A$2:$D$1001,4)),\"\",VLOOKUP($A$36,Voorraad!$A$2:$D$1001,4))","v":21},0,0]

{"sheet":"Picklijst 8464","index":6,"n_rows":42,"n_cols":14,"rows_kept":42,"cut":false,"hidden":false,"merged":[]}
[]
["Pickorder 8464",null,{"$f":"[5]Sheet1!$D$2","v":10},"X"]
[]
[]
[]
[]
[]
["Art Nr CSI","Benodigd","Art Nr CSI","Omschrijving","Leverancier Nr","Produco Nr","OrderNr","Opmerkingen/Alternatieven","Leverancier","Producent","PCB","Voorraad","Benodigd","Bestellen"]
["BU0002",{"$f":"[5]Sheet1!$E$4","v":10},{"$f":"IF(ISERROR(VLOOKUP($A$9,Voorraad!$A$2:$D$1001,1)),\"\",VLOOKUP($A$9,Voorraad!$A$2:$D$1001,1))","v":"BU0002"},{"$f":"IF(ISERROR(VLOOKUP($A$9,Voorraad!$A$2:$D$1001,3)),\"\",VLOOKUP($A$9,Voorraad!$A$2:$D$1001,3))","v":"47U/40V"},{"$f":"IF(ISERROR(VLOOKUP($A$9,Voorraad!$A$2:$D$1001,2)),\"\",VLOOKUP($A$9,Voorraad!$A$2:$D$1001,2))","v":222202127479},{"$f":"IF(ISERROR(VLOOKUP($A$9,Voorraad!$A$2:$H$1001,8)),\"\",VLOOKUP($A$9,Voorraad!$A$2:$H$1001,8))","v":0},{"$f":"IF(ISERROR(VLOOKUP($A$9,Voorraad!$A$2:$I$1001,9)),\"\",VLOOKUP($A$9,Voorraad!$A$2:$I$1001,9))","v":456556565},{"$f":"IF(ISERROR(VLOOKUP($A$9,Voorraad!$A$2:$J$1001,10)),\"\",VLOOKUP($A$9,Voorraad!$A$2:$J$1001,10))","v":1165428},{"$f":"IF(ISERROR(VLOOKUP($A$9,Voorraad!$A$2:$G$1001,6)),\"\",VLOOKUP($A$9,Voorraad!$A$2:$G$1001,6))","v":"Farnell"},{"$f":"IF(ISERROR(VLOOKUP($A$9,Voorraad!$A$2:$G$1001,7)),\"\",VLOOKUP($A$9,Voorraad!$A$2:$G$1001,7))","v":"Vishay"},{"$f":"IF(ISERROR(VLOOKUP($A$9,Voorraad!$A$2:$G$1001,5)),\"\",VLOOKUP($A$9,Voorraad!$A$2:$G$1001,5))","v":8464},{"$f":"IF(ISERROR(VLOOKUP($A$9,Voorraad!$A$2:$D$1001,4)),\"\",VLOOKUP($A$9,Voorraad!$A$2:$D$1001,4))","v":22},{"$f":"B9","v":10},{"$f":"MAX(0,(SUM(M9-L9)))","v":0}]
["BU0003",{"$f":"[5]Sheet1!$E$5","v":130},{"$f":"IF(ISERROR(VLOOKUP($A$10,Voorraad!$A$2:$D$1001,1)),\"\",VLOOKUP($A$10,Voorraad!$A$2:$D$1001,1))","v":"BU0003"},{"$f":"IF(ISERROR(VLOOKUP($A$10,Voorraad!$A$2:$D$1001,3)),\"\",VLOOKUP($A$10,Voorraad!$A$2:$D$1001,3))","v":"22UF/50V"},{"$f":"IF(ISERROR(VLOOKUP($A$10,Voorraad!$A$2:$D$1001,2)),\"\",VLOOKUP($A$10,Voorraad!$A$2:$D$1001,2))","v":222211651229},{"$f":"IF(ISERROR(VLOOKUP($A$10,Voorraad!$A$2:$H$1001,8)),\"\",VLOOKUP($A$10,Voorraad!$A$2:$H$1001,8))","v":0},{"$f":"IF(ISERROR(VLOOKUP($A$10,Voorraad!$A$2:$I$1001,9)),\"\",VLOOKUP($A$10,Voorraad!$A$2:$I$1001,9))","v":0},{"$f":"IF(ISERROR(VLOOKUP($A$10,Voorraad!$A$2:$J$1001,10)),\"\",VLOOKUP($A$10,Voorraad!$A$2:$J$1001,10))","v":0},{"$f":"IF(ISERROR(VLOOKUP($A$10,Voorraad!$A$2:$G$1001,6)),\"\",VLOOKUP($A$10,Voorraad!$A$2:$G$1001,6))","v":"TME"},{"$f":"IF(ISERROR(VLOOKUP($A$10,Voorraad!$A$2:$G$1001,7)),\"\",VLOOKUP($A$10,Voorraad!$A$2:$G$1001,7))","v":"Philips"},{"$f":"IF(ISERROR(VLOOKUP($A$10,Voorraad!$A$2:$G$1001,5)),\"\",VLOOKUP($A$10,Voorraad!$A$2:$G$1001,5))","v":8464},{"$f":"IF(ISERROR(VLOOKUP($A$10,Voorraad!$A$2:$D$1001,4)),\"\",VLOOKUP($A$10,Voorraad!$A$2:$D$1001,4))","v":0},130,130]
["BU0004",{"$f":"[5]Sheet1!$E$6","v":10},{"$f":"IF(ISERROR(VLOOKUP($A$11,Voorraad!$A$2:$D$1001,1)),\"\",VLOOKUP($A$11,Voorraad!$A$2:$D$1001,1))","v":"BU0004"},{"$f":"IF(ISERROR(VLOOKUP($A$11,Voorraad!$A$2:$D$1001,3)),\"\",VLOOKUP($A$11,Voorraad!$A$2:$D$1001,3))","v":"47NF/100V"},{"$f":"IF(ISERROR(VLOOKUP($A$11,Voorraad!$A$2:$D$1001,2)),\"\",VLOOKUP($A$11,Voorraad!$A$2:$D$1001,2))","v":222237021473},{"$f":"IF(ISERROR(VLOOKUP($A$11,Voorraad!$A$2:$H$1001,8)),\"\",VLOOKUP($A$11,Voorraad!$A$2:$H$1001,8))","v":0},{"$f":"IF(ISERROR(VLOOKUP($A$11,Voorraad!$A$2:$I$1001,9)),\"\",VLOOKUP($A$11,Voorraad!$A$2:$I$1001,9))","v":0},{"$f":"IF(ISERROR(VLOOKUP($A$11,Voorraad!$A$2:$J$1001,10)),\"\",VLOOKUP($A$11,Voorraad!$A$2:$J$1001,10))","v":0},{"$f":"IF(ISERROR(VLOOKUP($A$11,Voorraad!$A$2:$G$1001,6)),\"\",VLOOKUP($A$11,Voorraad!$A$2:$G$1001,6))","v":0},{"$f":"IF(ISERROR(VLOOKUP($A$11,Voorraad!$A$2:$G$1001,7)),\"\",VLOOKUP($A$11,Voorraad!$A$2:$G$1001,7))","v":"Philips"},{"$f":"IF(ISERROR(VLOOKUP($A$11,Voorraad!$A$2:$G$1001,5)),\"\",VLOOKUP($A$11,Voorraad!$A$2:$G$1001,5))","v":8464},{"$f":"IF(ISERROR(VLOOKUP($A$11,Voorraad!$A$2:$D$1001,4)),\"\",VLOOKUP($A$11,Voorraad!$A$2:$D$1001,4))","v":136},10,0]
["BU0006",{"$f":"[5]Sheet1!$E$7","v":90},{"$f":"IF(ISERROR(VLOOKUP($A$12,Voorraad!$A$2:$D$1001,1)),\"\",VLOOKUP($A$12,Voorraad!$A$2:$D$1001,1))","v":"BU0006"},{"$f":"IF(ISERROR(VLOOKUP($A$12,Voorraad!$A$2:$D$1001,3)),\"\",VLOOKUP($A$12,Voorraad!$A$2:$D$1001,3))","v":"BC639"},{"$f":"IF(ISERROR(VLOOKUP($A$12,Voorraad!$A$2:$D$1001,2)),\"\",VLOOKUP($A$12,Voorraad!$A$2:$D$1001,2))","v":0},{"$f":"IF(ISERROR(VLOOKUP($A$12,Voorraad!$A$2:$H$1001,8)),\"\",VLOOKUP($A$12,Voorraad!$A$2:$H$1001,8))","v":0},{"$f":"IF(ISERROR(VLOOKUP($A$12,Voorraad!$A$2:$I$1001,9)),\"\",VLOOKUP($A$12,Voorraad!$A$2:$I$1001,9))","v":0},{"$f":"IF(ISERROR(VLOOKUP($A$12,Voorraad!$A$2:$J$1001,10)),\"\",VLOOKUP($A$12,Voorraad!$A$2:$J$1001,10))","v":0},{"$f":"IF(ISERROR(VLOOKUP($A$12,Voorraad!$A$2:$G$1001,6)),\"\",VLOOKUP($A$12,Voorraad!$A$2:$G$1001,6))","v":"TME "},{"$f":"IF(ISERROR(VLOOKUP($A$12,Voorraad!$A$2:$G$1001,7)),\"\",VLOOKUP($A$12,Voorraad!$A$2:$G$1001,7))","v":"Philips"},{"$f":"IF(ISERROR(VLOOKUP($A$12,Voorraad!$A$2:$G$1001,5)),\"\",VLOOKUP($A$12,Voorraad!$A$2:$G$1001,5))","v":8464},{"$f":"IF(ISERROR(VLOOKUP($A$12,Voorraad!$A$2:$D$1001,4)),\"\",VLOOKUP($A$12,Voorraad!$A$2:$D$1001,4))","v":0},90,90]
["BU0007",{"$f":"[5]Sheet1!$E$8","v":100},{"$f":"IF(ISERROR(VLOOKUP($A$13,Voorraad!$A$2:$D$1001,1)),\"\",VLOOKUP($A$13,Voorraad!$A$2:$D$1001,1))","v":"BU0007"},{"$f":"IF(ISERROR(VLOOKUP($A$13,Voorraad!$A$2:$D$1001,3)),\"\",VLOOKUP($A$13,Voorraad!$A$2:$D$1001,3))","v":"BC640"},{"$f":"IF(ISERROR(VLOOKUP($A$13,Voorraad!$A$2:$D$1001,2)),\"\",VLOOKUP($A$13,Voorraad!$A$2:$D$1001,2))","v":0},{"$f":"IF(ISERROR(VLOOKUP($A$13,Voorraad!$A$2:$H$1001,8)),\"\",VLOOKUP($A$13,Voorraad!$A$2:$H$1001,8))","v":0},{"$f":"IF(ISERROR(VLOOKUP($A$13,Voorraad!$A$2:$I$1001,9)),\"\",VLOOKUP($A$13,Voorraad!$A$2:$I$1001,9))","v":0},{"$f":"IF(ISERROR(VLOOKUP($A$13,Voorraad!$A$2:$J$1001,10)),\"\",VLOOKUP($A$13,Voorraad!$A$2:$J$1001,10))","v":0},{"$f":"IF(ISERROR(VLOOKUP($A$13,Voorraad!$A$2:$G$1001,6)),\"\",VLOOKUP($A$13,Voorraad!$A$2:$G$1001,6))","v":"TME "},{"$f":"IF(ISERROR(VLOOKUP($A$13,Voorraad!$A$2:$G$1001,7)),\"\",VLOOKUP($A$13,Voorraad!$A$2:$G$1001,7))","v":"Philips"},{"$f":"IF(ISERROR(VLOOKUP($A$13,Voorraad!$A$2:$G$1001,5)),\"\",VLOOKUP($A$13,Voorraad!$A$2:$G$1001,5))","v":8464},{"$f":"IF(ISERROR(VLOOKUP($A$13,Voorraad!$A$2:$D$1001,4)),\"\",VLOOKUP($A$13,Voorraad!$A$2:$D$1001,4))","v":0},100,100]
["BU0022",{"$f":"[5]Sheet1!$E$10","v":20},{"$f":"IF(ISERROR(VLOOKUP($A$14,Voorraad!$A$2:$D$1001,1)),\"\",VLOOKUP($A$14,Voorraad!$A$2:$D$1001,1))","v":"BU0022"},{"$f":"IF(ISERROR(VLOOKUP($A$14,Voorraad!$A$2:$D$1001,3)),\"\",VLOOKUP($A$14,Voorraad!$A$2:$D$1001,3))","v":"BZX79-C18"},{"$f":"IF(ISERROR(VLOOKUP($A$14,Voorraad!$A$2:$D$1001,2)),\"\",VLOOKUP($A$14,Voorraad!$A$2:$D$1001,2))","v":"4E"},{"$f":"IF(ISERROR(VLOOKUP($A$14,Voorraad!$A$2:$H$1001,8)),\"\",VLOOKUP($A$14,Voorraad!$A$2:$H$1001,8))","v":0},{"$f":"IF(ISERROR(VLOOKUP($A$14,Voorraad!$A$2:$I$1001,9)),\"\",VLOOKUP($A$14,Voorraad!$A$2:$I$1001,9))","v":"Zener18V 0.5W DO35"},{"$f":"IF(ISERROR(VLOOKUP($A$14,Voorraad!$A$2:$J$1001,10)),\"\",VLOOKUP($A$14,Voorraad!$A$2:$J$1001,10))","v":"I.P.V. BZX55-C18"},{"$f":"IF(ISERROR(VLOOKUP($A$14,Voorraad!$A$2:$G$1001,6)),\"\",VLOOKUP($A$14,Voorraad!$A$2:$G$1001,6))","v":"TME"},{"$f":"IF(ISERROR(VLOOKUP($A$14,Voorraad!$A$2:$G$1001,7)),\"\",VLOOKUP($A$14,Voorraad!$A$2:$G$1001,7))","v":0},{"$f":"IF(ISERROR(VLOOKUP($A$14,Voorraad!$A$2:$G$1001,5)),\"\",VLOOKUP($A$14,Voorraad!$A$2:$G$1001,5))","v":8464},{"$f":"IF(ISERROR(VLOOKUP($A$14,Voorraad!$A$2:$D$1001,4)),\"\",VLOOKUP($A$14,Voorraad!$A$2:$D$1001,4))","v":30},{"$f":"B14","v":20},0]
["BU0015",{"$f":"[5]Sheet1!$E$11","v":50},{"$f":"IF(ISERROR(VLOOKUP($A$14,Voorraad!$A$2:$D$1001,1)),\"\",VLOOKUP($A$14,Voorraad!$A$2:$D$1001,1))","v":"BU0022"},{"$f":"IF(ISERROR(VLOOKUP($A$15,Voorraad!$A$2:$D$1001,3)),\"\",VLOOKUP($A$15,Voorraad!$A$2:$D$1001,3))","v":"D 1N4148PH 75V-200MA"},{"$f":"IF(ISERROR(VLOOKUP($A$15,Voorraad!$A$2:$D$1001,2)),\"\",VLOOKUP($A$15,Voorraad!$A$2:$D$1001,2))","v":"#341N4148P"},{"$f":"IF(ISERROR(VLOOKUP($A$15,Voorraad!$A$2:$H$1001,8)),\"\",VLOOKUP($A$15,Voorraad!$A$2:$H$1001,8))","v":522001},{"$f":"IF(ISERROR(VLOOKUP($A$15,Voorraad!$A$2:$I$1001,9)),\"\",VLOOKUP($A$15,Voorraad!$A$2:$I$1001,9))","v":"1N4148-TAP"},{"$f":"IF(ISERROR(VLOOKUP($A$15,Voorraad!$A$2:$J$1001,10)),\"\",VLOOKUP($A$15,Voorraad!$A$2:$J$1001,10))","v":0},{"$f":"IF(ISERROR(VLOOKUP($A$15,Voorraad!$A$2:$G$1001,6)),\"\",VLOOKUP($A$15,Voorraad!$A$2:$G$1001,6))","v":"TME"},{"$f":"IF(ISERROR(VLOOKUP($A$15,Voorraad!$A$2:$G$1001,7)),\"\",VLOOKUP($A$15,Voorraad!$A$2:$G$1001,7))","v":"PHILIPS"},{"$f":"IF(ISERROR(VLOOKUP($A$15,Voorraad!$A$2:$G$1001,5)),\"\",VLOOKUP($A$15,Voorraad!$A$2:$G$1001,5))","v":"8464/8510"},{"$f":"IF(ISERROR(VLOOKUP($A$15,Voorraad!$A$2:$D$1001,4)),\"\",VLOOKUP($A$15,Voorraad!$A$2:$D$1001,4))","v":-1075},{"$f":"B15","v":50},1125]
["BU0014",{"$f":"[5]Sheet1!$E$9","v":10},{"$f":"IF(ISERROR(VLOOKUP($A$16,Voorraad!$A$2:$D$1001,1)),\"\",VLOOKUP($A$16,Voorraad!$A$2:$D$1001,1))","v":"BU0014"},{"$f":"IF(ISERROR(VLOOKUP($A$16,Voorraad!$A$2:$D$1001,3)),\"\",VLOOKUP($A$16,Voorraad!$A$2:$D$1001,3))","v":"D 1N4004 400V-1A DO-41"},{"$f":"IF(ISERROR(VLOOKUP($A$16,Voorraad!$A$2:$D$1001,2)),\"\",VLOOKUP($A$16,Voorraad!$A$2:$D$1001,2))","v":"#341N4004DC"},{"$f":"IF(ISERROR(VLOOKUP($A$16,Voorraad!$A$2:$H$1001,8)),\"\",VLOOKUP($A$16,Voorraad!$A$2:$H$1001,8))","v":522000},{"$f":"IF(ISERROR(VLOOKUP($A$16,Voorraad!$A$2:$I$1001,9)),\"\",VLOOKUP($A$16,Voorraad!$A$2:$I$1001,9))","v":0},{"$f":"IF(ISERROR(VLOOKUP($A$16,Voorraad!$A$2:$J$1001,10)),\"\",VLOOKUP($A$16,Voorraad!$A$2:$J$1001,10))","v":0},{"$f":"IF(ISERROR(VLOOKUP($A$16,Voorraad!$A$2:$G$1001,6)),\"\",VLOOKUP($A$16,Voorraad!$A$2:$G$1001,6))","v":0},{"$f":"IF(ISERROR(VLOOKUP($A$16,Voorraad!$A$2:$G$1001,7)),\"\",VLOOKUP($A$16,Voorraad!$A$2:$G$1001,7))","v":0},{"$f":"IF(ISERROR(VLOOKUP($A$16,Voorraad!$A$2:$G$1001,5)),\"\",VLOOKUP($A$16,Voorraad!$A$2:$G$1001,5))","v":"8410/8464/8510"},{"$f":"IF(ISERROR(VLOOKUP($A$16,Voorraad!$A$2:$D$1001,4)),\"\",VLOOKUP($A$16,Voorraad!$A$2:$D$1001,4))","v":485},10,0]
["BU0038",{"$f":"[5]Sheet1!$E$12","v":30},{"$f":"IF(ISERROR(VLOOKUP($A$17,Voorraad!$A$2:$D$1001,1)),\"\",VLOOKUP($A$17,Voorraad!$A$2:$D$1001,1))","v":"BU0038"},{"$f":"IF(ISERROR(VLOOKUP($A$17,Voorraad!$A$2:$D$1001,3)),\"\",VLOOKUP($A$17,Voorraad!$A$2:$D$1001,3))","v":"4N35 Optocoupler"},{"$f":"IF(ISERROR(VLOOKUP($A$17,Voorraad!$A$2:$D$1001,2)),\"\",VLOOKUP($A$9,Voorraad!$A$2:$D$1001,2))","v":222202127479},{"$f":"IF(ISERROR(VLOOKUP($A$17,Voorraad!$A$2:$H$1001,8)),\"\",VLOOKUP($A$17,Voorraad!$A$2:$H$1001,8))","v":0},{"$f":"IF(ISERROR(VLOOKUP($A$17,Voorraad!$A$2:$I$1001,9)),\"\",VLOOKUP($A$17,Voorraad!$A$2:$I$1001,9))","v":"4N35"},{"$f":"IF(ISERROR(VLOOKUP($A$17,Voorraad!$A$2:$J$1001,10)),\"\",VLOOKUP($A$17,Voorraad!$A$2:$J$1001,10))","v":0},{"$f":"IF(ISERROR(VLOOKUP($A$17,Voorraad!$A$2:$G$1001,6)),\"\",VLOOKUP($A$17,Voorraad!$A$2:$G$1001,6))","v":"TME "},{"$f":"IF(ISERROR(VLOOKUP($A$17,Voorraad!$A$2:$G$1001,7)),\"\",VLOOKUP($A$17,Voorraad!$A$2:$G$1001,7))","v":"Vishay"},{"$f":"IF(ISERROR(VLOOKUP($A$17,Voorraad!$A$2:$G$1001,5)),\"\",VLOOKUP($A$17,Voorraad!$A$2:$G$1001,5))","v":"8437/8464"},{"$f":"IF(ISERROR(VLOOKUP($A$17,Voorraad!$A$2:$D$1001,4)),\"\",VLOOKUP($A$17,Voorraad!$A$2:$D$1001,4))","v":15},30,15]
["BU0039",{"$f":"[5]Sheet1!$E$13","v":10},{"$f":"IF(ISERROR(VLOOKUP($A$18,Voorraad!$A$2:$D$1001,1)),\"\",VLOOKUP($A$18,Voorraad!$A$2:$D$1001,1))","v":"BU0039"},{"$f":"IF(ISERROR(VLOOKUP($A$18,Voorraad!$A$2:$D$1001,3)),\"\",VLOOKUP($A$18,Voorraad!$A$2:$D$1001,3))","v":"IC 4013 CMOS dual D-flipflop"},{"$f":"IF(ISERROR(VLOOKUP($A$18,Voorraad!$A$2:$D$1001,2)),\"\",VLOOKUP($A$18,Voorraad!$A$2:$D$1001,2))","v":7091968},{"$f":"IF(ISERROR(VLOOKUP($A$18,Voorraad!$A$2:$H$1001,8)),\"\",VLOOKUP($A$18,Voorraad!$A$2:$H$1001,8))","v":0},{"$f":"IF(ISERROR(VLOOKUP($A$18,Voorraad!$A$2:$I$1001,9)),\"\",VLOOKUP($A$18,Voorraad!$A$2:$I$1001,9))","v":"CD4013BE"},{"$f":"IF(ISERROR(VLOOKUP($A$18,Voorraad!$A$2:$J$1001,10)),\"\",VLOOKUP($A$18,Voorraad!$A$2:$J$1001,10))","v":0},{"$f":"IF(ISERROR(VLOOKUP($A$18,Voorraad!$A$2:$G$1001,6)),\"\",VLOOKUP($A$18,Voorraad!$A$2:$G$1001,6))","v":"RS"},{"$f":"IF(ISERROR(VLOOKUP($A$18,Voorraad!$A$2:$G$1001,7)),\"\",VLOOKUP($A$18,Voorraad!$A$2:$G$1001,7))","v":"Div"},{"$f":"IF(ISERROR(VLOOKUP($A$18,Voorraad!$A$2:$G$1001,5)),\"\",VLOOKUP($A$18,Voorraad!$A$2:$G$1001,5))","v":8464},{"$f":"IF(ISERROR(VLOOKUP($A$18,Voorraad!$A$2:$D$1001,4)),\"\",VLOOKUP($A$18,Voorraad!$A$2:$D$1001,4))","v":0},10,10]
["BU0040",{"$f":"[5]Sheet1!$E$14","v":10},{"$f":"IF(ISERROR(VLOOKUP($A$19,Voorraad!$A$2:$D$1001,1)),\"\",VLOOKUP($A$19,Voorraad!$A$2:$D$1001,1))","v":"BU0040"},{"$f":"IF(ISERROR(VLOOKUP($A$19,Voorraad!$A$2:$D$1001,3)),\"\",VLOOKUP($A$19,Voorraad!$A$2:$D$1001,3))","v":"CD40106 CMOS hex inverter"},{"$f":"IF(ISERROR(VLOOKUP($A$19,Voorraad!$A$2:$D$1001,2)),\"\",VLOOKUP($A$19,Voorraad!$A$2:$D$1001,2))","v":0},{"$f":"IF(ISERROR(VLOOKUP($A$19,Voorraad!$A$2:$H$1001,8)),\"\",VLOOKUP($A$19,Voorraad!$A$2:$H$1001,8))","v":0},{"$f":"IF(ISERROR(VLOOKUP($A$19,Voorraad!$A$2:$I$1001,9)),\"\",VLOOKUP($A$19,Voorraad!$A$2:$I$1001,9))","v":"CD40106BE"},{"$f":"IF(ISERROR(VLOOKUP($A$19,Voorraad!$A$2:$J$1001,10)),\"\",VLOOKUP($A$19,Voorraad!$A$2:$J$1001,10))","v":0},{"$f":"IF(ISERROR(VLOOKUP($A$19,Voorraad!$A$2:$G$1001,6)),\"\",VLOOKUP($A$19,Voorraad!$A$2:$G$1001,6))","v":"TME"},{"$f":"IF(ISERROR(VLOOKUP($A$19,Voorraad!$A$2:$G$1001,7)),\"\",VLOOKUP($A$19,Voorraad!$A$2:$G$1001,7))","v":"Div."},{"$f":"IF(ISERROR(VLOOKUP($A$19,Voorraad!$A$2:$G$1001,5)),\"\",VLOOKUP($A$19,Voorraad!$A$2:$G$1001,5))","v":8464},{"$f":"IF(ISERROR(VLOOKUP($A$19,Voorraad!$A$2:$D$1001,4)),\"\",VLOOKUP($A$19,Voorraad!$A$2:$D$1001,4))","v":0},10,10]
["BU0041",{"$f":"[5]Sheet1!$E$15","v":10},{"$f":"IF(ISERROR(VLOOKUP($A$20,Voorraad!$A$2:$D$1001,1)),\"\",VLOOKUP($A$20,Voorraad!$A$2:$D$1001,1))","v":"BU0041"},{"$f":"IF(ISERROR(VLOOKUP($A$20,Voorraad!$A$2:$D$1001,3)),\"\",VLOOKUP($A$20,Voorraad!$A$2:$D$1001,3))","v":"7812 Stabilizer  12V 1A"},{"$f":"IF(ISERROR(VLOOKUP($A$20,Voorraad!$A$2:$D$1001,2)),\"\",VLOOKUP($A$20,Voorraad!$A$2:$D$1001,2))","v":0},{"$f":"IF(ISERROR(VLOOKUP($A$20,Voorraad!$A$2:$H$1001,8)),\"\",VLOOKUP($A$20,Voorraad!$A$2:$H$1001,8))","v":0},{"$f":"IF(ISERROR(VLOOKUP($A$20,Voorraad!$A$2:$I$1001,9)),\"\",VLOOKUP($A$20,Voorraad!$A$2:$I$1001,9))","v":"L7812CV-DG"},{"$f":"IF(ISERROR(VLOOKUP($A$20,Voorraad!$A$2:$J$1001,10)),\"\",VLOOKUP($A$20,Voorraad!$A$2:$J$1001,10))","v":0},{"$f":"IF(ISERROR(VLOOKUP($A$20,Voorraad!$A$2:$G$1001,6)),\"\",VLOOKUP($A$20,Voorraad!$A$2:$G$1001,6))","v":"TME"},{"$f":"IF(ISERROR(VLOOKUP($A$20,Voorraad!$A$2:$G$1001,7)),\"\",VLOOKUP($A$20,Voorraad!$A$2:$G$1001,7))","v":"Div."},{"$f":"IF(ISERROR(VLOOKUP($A$20,Voorraad!$A$2:$G$1001,5)),\"\",VLOOKUP($A$20,Voorraad!$A$2:$G$1001,5))","v":8464},{"$f":"IF(ISERROR(VLOOKUP($A$20,Voorraad!$A$2:$D$1001,4)),\"\",VLOOKUP($A$20,Voorraad!$A$2:$D$1001,4))","v":0},10,10]
["BU0042",{"$f":"[5]Sheet1!$E$16","v":10},{"$f":"IF(ISERROR(VLOOKUP($A$21,Voorraad!$A$2:$D$1001,1)),\"\",VLOOKUP($A$21,Voorraad!$A$2:$D$1001,1))","v":"BU0042"},{"$f":"IF(ISERROR(VLOOKUP($A$21,Voorraad!$A$2:$D$1001,3)),\"\",VLOOKUP($A$21,Voorraad!$A$2:$D$1001,3))","v":"CD4024B CMOS 6 stage ripple counter"},{"$f":"IF(ISERROR(VLOOKUP($A$21,Voorraad!$A$2:$D$1001,2)),\"\",VLOOKUP($A$21,Voorraad!$A$2:$D$1001,2))","v":0},{"$f":"IF(ISERROR(VLOOKUP($A$21,Voorraad!$A$2:$H$1001,8)),\"\",VLOOKUP($A$21,Voorraad!$A$2:$H$1001,8))","v":0},{"$f":"IF(ISERROR(VLOOKUP($A$21,Voorraad!$A$2:$I$1001,9)),\"\",VLOOKUP($A$21,Voorraad!$A$2:$I$1001,9))","v":"CD4024BE"},{"$f":"IF(ISERROR(VLOOKUP($A$21,Voorraad!$A$2:$J$1001,10)),\"\",VLOOKUP($A$21,Voorraad!$A$2:$J$1001,10))","v":0},{"$f":"IF(ISERROR(VLOOKUP($A$21,Voorraad!$A$2:$G$1001,6)),\"\",VLOOKUP($A$21,Voorraad!$A$2:$G$1001,6))","v":"TME"},{"$f":"IF(ISERROR(VLOOKUP($A$21,Voorraad!$A$2:$G$1001,7)),\"\",VLOOKUP($A$21,Voorraad!$A$2:$G$1001,7))","v":"Texas Instruments"},{"$f":"IF(ISERROR(VLOOKUP($A$21,Voorraad!$A$2:$G$1001,5)),\"\",VLOOKUP($A$21,Voorraad!$A$2:$G$1001,5))","v":8464},{"$f":"IF(ISERROR(VLOOKUP($A$21,Voorraad!$A$2:$D$1001,4)),\"\",VLOOKUP($A$21,Voorraad!$A$2:$D$1001,4))","v":1},10,9]
["BU0052",{"$f":"[5]Sheet1!$E$17","v":10},{"$f":"IF(ISERROR(VLOOKUP($A$22,Voorraad!$A$2:$D$1001,1)),\"\",VLOOKUP($A$22,Voorraad!$A$2:$D$1001,1))","v":"BU0052"},{"$f":"IF(ISERROR(VLOOKUP($A$22,Voorraad!$A$2:$D$1001,3)),\"\",VLOOKUP($A$22,Voorraad!$A$2:$D$1001,3))","v":"V23105-A5303-A201 printrelay DPDT 12V dc"},{"$f":"IF(ISERROR(VLOOKUP($A$22,Voorraad!$A$2:$D$1001,2)),\"\",VLOOKUP($A$22,Voorraad!$A$2:$D$1001,2))","v":0},{"$f":"IF(ISERROR(VLOOKUP($A$22,Voorraad!$A$2:$H$1001,8)),\"\",VLOOKUP($A$22,Voorraad!$A$2:$H$1001,8))","v":0},{"$f":"IF(ISERROR(VLOOKUP($A$22,Voorraad!$A$2:$I$1001,9)),\"\",VLOOKUP($A$22,Voorraad!$A$2:$I$1001,9))","v":"V23042 A2003-B101"},{"$f":"IF(ISERROR(VLOOKUP($A$22,Voorraad!$A$2:$J$1001,10)),\"\",VLOOKUP($A$22,Voorraad!$A$2:$J$1001,10))","v":"Alternatief:   DS2Y-S DC12V  /  G5V-2-12V DC"},{"$f":"IF(ISERROR(VLOOKUP($A$22,Voorraad!$A$2:$G$1001,6)),\"\",VLOOKUP($A$22,Voorraad!$A$2:$G$1001,6))","v":"Siemens"},{"$f":"IF(ISERROR(VLOOKUP($A$22,Voorraad!$A$2:$G$1001,7)),\"\",VLOOKUP($A$22,Voorraad!$A$2:$G$1001,7))","v":"Tyco"},{"$f":"IF(ISERROR(VLOOKUP($A$22,Voorraad!$A$2:$G$1001,5)),\"\",VLOOKUP($A$22,Voorraad!$A$2:$G$1001,5))","v":8464},{"$f":"IF(ISERROR(VLOOKUP($A$22,Voorraad!$A$2:$D$1001,4)),\"\",VLOOKUP($A$22,Voorraad!$A$2:$D$1001,4))","v":0},10,10]
["BU0054",{"$f":"[5]Sheet1!$E$18","v":10},{"$f":"IF(ISERROR(VLOOKUP($A$23,Voorraad!$A$2:$D$1001,1)),\"\",VLOOKUP($A$23,Voorraad!$A$2:$D$1001,1))","v":"BU0054"},{"$f":"IF(ISERROR(VLOOKUP($A$23,Voorraad!$A$2:$D$1001,3)),\"\",VLOOKUP($A$23,Voorraad!$A$2:$D$1001,3))","v":"uPd-D114I DC/DC converter 12V/12V isolated"},{"$f":"IF(ISERROR(VLOOKUP($A$23,Voorraad!$A$2:$D$1001,2)),\"\",VLOOKUP($A$23,Voorraad!$A$2:$D$1001,2))","v":0},{"$f":"IF(ISERROR(VLOOKUP($A$23,Voorraad!$A$2:$H$1001,8)),\"\",VLOOKUP($A$23,Voorraad!$A$2:$H$1001,8))","v":0},{"$f":"IF(ISERROR(VLOOKUP($A$23,Voorraad!$A$2:$I$1001,9)),\"\",VLOOKUP($A$23,Voorraad!$A$2:$I$1001,9))","v":"NMV1212SAC"},{"$f":"IF(ISERROR(VLOOKUP($A$23,Voorraad!$A$2:$J$1001,10)),\"\",VLOOKUP($A$23,Voorraad!$A$2:$J$1001,10))","v":0},{"$f":"IF(ISERROR(VLOOKUP($A$23,Voorraad!$A$2:$G$1001,6)),\"\",VLOOKUP($A$23,Voorraad!$A$2:$G$1001,6))","v":0},{"$f":"IF(ISERROR(VLOOKUP($A$23,Voorraad!$A$2:$G$1001,7)),\"\",VLOOKUP($A$23,Voorraad!$A$2:$G$1001,7))","v":"uPd (Alcom)"},{"$f":"IF(ISERROR(VLOOKUP($A$23,Voorraad!$A$2:$G$1001,5)),\"\",VLOOKUP($A$23,Voorraad!$A$2:$G$1001,5))","v":8464},{"$f":"IF(ISERROR(VLOOKUP($A$23,Voorraad!$A$2:$D$1001,4)),\"\",VLOOKUP($A$23,Voorraad!$A$2:$D$1001,4))","v":0},10,10]
["BR0004",{"$f":"[5]Sheet1!$E$19","v":20},{"$f":"IF(ISERROR(VLOOKUP($A$24,Voorraad!$A$2:$D$1001,1)),\"\",VLOOKUP($A$24,Voorraad!$A$2:$D$1001,1))","v":"BR0004"},{"$f":"IF(ISERROR(VLOOKUP($A$24,Voorraad!$A$2:$D$1001,3)),\"\",VLOOKUP($A$24,Voorraad!$A$2:$D$1001,3))","v":"R 1K00 1% 0.6W 7X2,5MM"},{"$f":"IF(ISERROR(VLOOKUP($A$24,Voorraad!$A$2:$D$1001,2)),\"\",VLOOKUP($A$24,Voorraad!$A$2:$D$1001,2))","v":"#10031001"},{"$f":"IF(ISERROR(VLOOKUP($A$24,Voorraad!$A$2:$H$1001,8)),\"\",VLOOKUP($A$24,Voorraad!$A$2:$H$1001,8))","v":500048},{"$f":"IF(ISERROR(VLOOKUP($A$24,Voorraad!$A$2:$I$1001,9)),\"\",VLOOKUP($A$24,Voorraad!$A$2:$I$1001,9))","v":0},{"$f":"IF(ISERROR(VLOOKUP($A$24,Voorraad!$A$2:$J$1001,10)),\"\",VLOOKUP($A$24,Voorraad!$A$2:$J$1001,10))","v":0},{"$f":"IF(ISERROR(VLOOKUP($A$24,Voorraad!$A$2:$G$1001,6)),\"\",VLOOKUP($A$24,Voorraad!$A$2:$G$1001,6))","v":0},{"$f":"IF(ISERROR(VLOOKUP($A$24,Voorraad!$A$2:$G$1001,7)),\"\",VLOOKUP($A$24,Voorraad!$A$2:$G$1001,7))","v":"BCC"},{"$f":"IF(ISERROR(VLOOKUP($A$24,Voorraad!$A$2:$G$1001,5)),\"\",VLOOKUP($A$24,Voorraad!$A$2:$G$1001,5))","v":"8510/8437/8438/8439/8464"},{"$f":"IF(ISERROR(VLOOKUP($A$24,Voorraad!$A$2:$D$1001,4)),\"\",VLOOKUP($A$24,Voorraad!$A$2:$D$1001,4))","v":208},20,0]
["BR0015",{"$f":"[5]Sheet1!$E$20","v":20},{"$f":"IF(ISERROR(VLOOKUP($A$25,Voorraad!$A$2:$D$1001,1)),\"\",VLOOKUP($A$25,Voorraad!$A$2:$D$1001,1))","v":"BR0015"},{"$f":"IF(ISERROR(VLOOKUP($A$25,Voorraad!$A$2:$D$1001,3)),\"\",VLOOKUP($A$25,Voorraad!$A$2:$D$1001,3))","v":"R 2K2"},{"$f":"IF(ISERROR(VLOOKUP($A$25,Voorraad!$A$2:$D$1001,2)),\"\",VLOOKUP($A$25,Voorraad!$A$2:$D$1001,2))","v":0},{"$f":"IF(ISERROR(VLOOKUP($A$25,Voorraad!$A$2:$H$1001,8)),\"\",VLOOKUP($A$25,Voorraad!$A$2:$H$1001,8))","v":0},{"$f":"IF(ISERROR(VLOOKUP($A$25,Voorraad!$A$2:$I$1001,9)),\"\",VLOOKUP($A$25,Voorraad!$A$2:$I$1001,9))","v":0},{"$f":"IF(ISERROR(VLOOKUP($A$25,Voorraad!$A$2:$J$1001,10)),\"\",VLOOKUP($A$25,Voorraad!$A$2:$J$1001,10))","v":0},{"$f":"IF(ISERROR(VLOOKUP($A$25,Voorraad!$A$2:$G$1001,6)),\"\",VLOOKUP($A$25,Voorraad!$A$2:$G$1001,6))","v":0},{"$f":"IF(ISERROR(VLOOKUP($A$25,Voorraad!$A$2:$G$1001,7)),\"\",VLOOKUP($A$25,Voorraad!$A$2:$G$1001,7))","v":"Philips"},{"$f":"IF(ISERROR(VLOOKUP($A$25,Voorraad!$A$2:$G$1001,5)),\"\",VLOOKUP($A$25,Voorraad!$A$2:$G$1001,5))","v":8464},{"$f":"IF(ISERROR(VLOOKUP($A$25,Voorraad!$A$2:$D$1001,4)),\"\",VLOOKUP($A$25,Voorraad!$A$2:$D$1001,4))","v":500},20,0]
["BR0016",{"$f":"[5]Sheet1!$E$21","v":30},{"$f":"IF(ISERROR(VLOOKUP($A$26,Voorraad!$A$2:$D$1001,1)),\"\",VLOOKUP($A$26,Voorraad!$A$2:$D$1001,1))","v":"BR0016"},{"$f":"IF(ISERROR(VLOOKUP($A$26,Voorraad!$A$2:$D$1001,3)),\"\",VLOOKUP($A$26,Voorraad!$A$2:$D$1001,3))","v":"R 27K"},{"$f":"IF(ISERROR(VLOOKUP($A$26,Voorraad!$A$2:$D$1001,2)),\"\",VLOOKUP($A$26,Voorraad!$A$2:$D$1001,2))","v":0},{"$f":"IF(ISERROR(VLOOKUP($A$26,Voorraad!$A$2:$H$1001,8)),\"\",VLOOKUP($A$26,Voorraad!$A$2:$H$1001,8))","v":0},{"$f":"IF(ISERROR(VLOOKUP($A$26,Voorraad!$A$2:$I$1001,9)),\"\",VLOOKUP($A$26,Voorraad!$A$2:$I$1001,9))","v":0},{"$f":"IF(ISERROR(VLOOKUP($A$26,Voorraad!$A$2:$J$1001,10)),\"\",VLOOKUP($A$26,Voorraad!$A$2:$J$1001,10))","v":0},{"$f":"IF(ISERROR(VLOOKUP($A$26,Voorraad!$A$2:$G$1001,6)),\"\",VLOOKUP($A$26,Voorraad!$A$2:$G$1001,6))","v":0},{"$f":"IF(ISERROR(VLOOKUP($A$26,Voorraad!$A$2:$G$1001,7)),\"\",VLOOKUP($A$26,Voorraad!$A$2:$G$1001,7))","v":"Philips"},{"$f":"IF(ISERROR(VLOOKUP($A$26,Voorraad!$A$2:$G$1001,5)),\"\",VLOOKUP($A$26,Voorraad!$A$2:$G$1001,5))","v":8464},{"$f":"IF(ISERROR(VLOOKUP($A$26,Voorraad!$A$2:$D$1001,4)),\"\",VLOOKUP($A$26,Voorraad!$A$2:$D$1001,4))","v":0},30,30]
["BR3020",{"$f":"[5]Sheet1!$E$22","v":0},{"$f":"IF(ISERROR(VLOOKUP($A$27,Voorraad!$A$2:$D$1001,1)),\"\",VLOOKUP($A$27,Voorraad!$A$2:$D$1001,1))","v":"BR3020"},{"$f":"IF(ISERROR(VLOOKUP($A$27,Voorraad!$A$2:$D$1001,3)),\"\",VLOOKUP($A$27,Voorraad!$A$2:$D$1001,3))","v":"R 470k"},{"$f":"IF(ISERROR(VLOOKUP($A$27,Voorraad!$A$2:$D$1001,2)),\"\",VLOOKUP($A$27,Voorraad!$A$2:$D$1001,2))","v":0},{"$f":"IF(ISERROR(VLOOKUP($A$27,Voorraad!$A$2:$H$1001,8)),\"\",VLOOKUP($A$27,Voorraad!$A$2:$H$1001,8))","v":0},{"$f":"IF(ISERROR(VLOOKUP($A$27,Voorraad!$A$2:$I$1001,9)),\"\",VLOOKUP($A$27,Voorraad!$A$2:$I$1001,9))","v":0},{"$f":"IF(ISERROR(VLOOKUP($A$27,Voorraad!$A$2:$J$1001,10)),\"\",VLOOKUP($A$27,Voorraad!$A$2:$J$1001,10))","v":0},{"$f":"IF(ISERROR(VLOOKUP($A$27,Voorraad!$A$2:$G$1001,6)),\"\",VLOOKUP($A$27,Voorraad!$A$2:$G$1001,6))","v":0},{"$f":"IF(ISERROR(VLOOKUP($A$27,Voorraad!$A$2:$G$1001,7)),\"\",VLOOKUP($A$27,Voorraad!$A$2:$G$1001,7))","v":"Philips"},{"$f":"IF(ISERROR(VLOOKUP($A$27,Voorraad!$A$2:$G$1001,5)),\"\",VLOOKUP($A$27,Voorraad!$A$2:$G$1001,5))","v":8464},{"$f":"IF(ISERROR(VLOOKUP($A$27,Voorraad!$A$2:$D$1001,4)),\"\",VLOOKUP($A$27,Voorraad!$A$2:$D$1001,4))","v":1000},0,0]
["BR3030",{"$f":"[5]Sheet1!$E$23","v":10},{"$f":"IF(ISERROR(VLOOKUP($A$28,Voorraad!$A$2:$D$1001,1)),\"\",VLOOKUP($A$28,Voorraad!$A$2:$D$1001,1))","v":"BR3030"},{"$f":"IF(ISERROR(VLOOKUP($A$28,Voorraad!$A$2:$D$1001,3)),\"\",VLOOKUP($A$28,Voorraad!$A$2:$D$1001,3))","v":"R 4K7"},{"$f":"IF(ISERROR(VLOOKUP($A$28,Voorraad!$A$2:$D$1001,2)),\"\",VLOOKUP($A$28,Voorraad!$A$2:$D$1001,2))","v":0},{"$f":"IF(ISERROR(VLOOKUP($A$28,Voorraad!$A$2:$H$1001,8)),\"\",VLOOKUP($A$28,Voorraad!$A$2:$H$1001,8))","v":0},{"$f":"IF(ISERROR(VLOOKUP($A$28,Voorraad!$A$2:$I$1001,9)),\"\",VLOOKUP($A$28,Voorraad!$A$2:$I$1001,9))","v":0},{"$f":"IF(ISERROR(VLOOKUP($A$28,Voorraad!$A$2:$J$1001,10)),\"\",VLOOKUP($A$28,Voorraad!$A$2:$J$1001,10))","v":0},{"$f":"IF(ISERROR(VLOOKUP($A$28,Voorraad!$A$2:$G$1001,6)),\"\",VLOOKUP($A$28,Voorraad!$A$2:$G$1001,6))","v":0},{"$f":"IF(ISERROR(VLOOKUP($A$28,Voorraad!$A$2:$G$1001,7)),\"\",VLOOKUP($A$28,Voorraad!$A$2:$G$1001,7))","v":"Philips"},{"$f":"IF(ISERROR(VLOOKUP($A$28,Voorraad!$A$2:$G$1001,5)),\"\",VLOOKUP($A$28,Voorraad!$A$2:$G$1001,5))","v":8464},{"$f":"IF(ISERROR(VLOOKUP($A$28,Voorraad!$A$2:$D$1001,4)),\"\",VLOOKUP($A$28,Voorraad!$A$2:$D$1001,4))","v":2000},10,0]
["BR3035",{"$f":"[5]Sheet1!$E$24","v":90},{"$f":"IF(ISERROR(VLOOKUP($A$29,Voorraad!$A$2:$D$1001,1)),\"\",VLOOKUP($A$29,Voorraad!$A$2:$D$1001,1))","v":"BR3035"},{"$f":"IF(ISERROR(VLOOKUP($A$29,Voorraad!$A$2:$D$1001,3)),\"\",VLOOKUP($A$29,Voorraad!$A$2:$D$1001,3))","v":"R 33K"},{"$f":"IF(ISERROR(VLOOKUP($A$29,Voorraad!$A$2:$D$1001,2)),\"\",VLOOKUP($A$29,Voorraad!$A$2:$D$1001,2))","v":0},{"$f":"IF(ISERROR(VLOOKUP($A$29,Voorraad!$A$2:$H$1001,8)),\"\",VLOOKUP($A$29,Voorraad!$A$2:$H$1001,8))","v":0},{"$f":"IF(ISERROR(VLOOKUP($A$29,Voorraad!$A$2:$I$1001,9)),\"\",VLOOKUP($A$29,Voorraad!$A$2:$I$1001,9))","v":0},{"$f":"IF(ISERROR(VLOOKUP($A$29,Voorraad!$A$2:$J$1001,10)),\"\",VLOOKUP($A$29,Voorraad!$A$2:$J$1001,10))","v":0},{"$f":"IF(ISERROR(VLOOKUP($A$29,Voorraad!$A$2:$G$1001,6)),\"\",VLOOKUP($A$29,Voorraad!$A$2:$G$1001,6))","v":0},{"$f":"IF(ISERROR(VLOOKUP($A$29,Voorraad!$A$2:$G$1001,7)),\"\",VLOOKUP($A$29,Voorraad!$A$2:$G$1001,7))","v":"Philips"},{"$f":"IF(ISERROR(VLOOKUP($A$29,Voorraad!$A$2:$G$1001,5)),\"\",VLOOKUP($A$29,Voorraad!$A$2:$G$1001,5))","v":8464},{"$f":"IF(ISERROR(VLOOKUP($A$29,Voorraad!$A$2:$D$1001,4)),\"\",VLOOKUP($A$29,Voorraad!$A$2:$D$1001,4))","v":3000},90,0]
["BR0009",{"$f":"[5]Sheet1!$E$25","v":10},{"$f":"IF(ISERROR(VLOOKUP($A$30,Voorraad!$A$2:$D$1001,1)),\"\",VLOOKUP($A$30,Voorraad!$A$2:$D$1001,1))","v":"BR0009"},{"$f":"IF(ISERROR(VLOOKUP($A$30,Voorraad!$A$2:$D$1001,3)),\"\",VLOOKUP($A$30,Voorraad!$A$2:$D$1001,3))","v":"R 56E 1% 0.6W 7X2,5MM"},{"$f":"IF(ISERROR(VLOOKUP($A$30,Voorraad!$A$2:$D$1001,2)),\"\",VLOOKUP($A$30,Voorraad!$A$2:$D$1001,2))","v":"#10015601"},{"$f":"IF(ISERROR(VLOOKUP($A$30,Voorraad!$A$2:$H$1001,8)),\"\",VLOOKUP($A$30,Voorraad!$A$2:$H$1001,8))","v":500033},{"$f":"IF(ISERROR(VLOOKUP($A$30,Voorraad!$A$2:$I$1001,9)),\"\",VLOOKUP($A$30,Voorraad!$A$2:$I$1001,9))","v":0},{"$f":"IF(ISERROR(VLOOKUP($A$30,Voorraad!$A$2:$J$1001,10)),\"\",VLOOKUP($A$30,Voorraad!$A$2:$J$1001,10))","v":0},{"$f":"IF(ISERROR(VLOOKUP($A$30,Voorraad!$A$2:$G$1001,6)),\"\",VLOOKUP($A$30,Voorraad!$A$2:$G$1001,6))","v":0},{"$f":"IF(ISERROR(VLOOKUP($A$30,Voorraad!$A$2:$G$1001,7)),\"\",VLOOKUP($A$30,Voorraad!$A$2:$G$1001,7))","v":"BCC"},{"$f":"IF(ISERROR(VLOOKUP($A$30,Voorraad!$A$2:$G$1001,5)),\"\",VLOOKUP($A$30,Voorraad!$A$2:$G$1001,5))","v":"8510/8464"},{"$f":"IF(ISERROR(VLOOKUP($A$30,Voorraad!$A$2:$D$1001,4)),\"\",VLOOKUP($A$30,Voorraad!$A$2:$D$1001,4))","v":1125},10,0]
["BR0003",{"$f":"[5]Sheet1!$E$26","v":10},{"$f":"IF(ISERROR(VLOOKUP($A$31,Voorraad!$A$2:$D$1001,1)),\"\",VLOOKUP($A$31,Voorraad!$A$2:$D$1001,1))","v":"BR0003"},{"$f":"IF(ISERROR(VLOOKUP($A$31,Voorraad!$A$2:$D$1001,3)),\"\",VLOOKUP($A$31,Voorraad!$A$2:$D$1001,3))","v":"R 100E 1% 0.6W 7X2,5MM"},{"$f":"IF(ISERROR(VLOOKUP($A$31,Voorraad!$A$2:$D$1001,2)),\"\",VLOOKUP($A$31,Voorraad!$A$2:$D$1001,2))","v":"#10021001"},{"$f":"IF(ISERROR(VLOOKUP($A$31,Voorraad!$A$2:$H$1001,8)),\"\",VLOOKUP($A$31,Voorraad!$A$2:$H$1001,8))","v":500036},{"$f":"IF(ISERROR(VLOOKUP($A$31,Voorraad!$A$2:$I$1001,9)),\"\",VLOOKUP($A$31,Voorraad!$A$2:$I$1001,9))","v":0},{"$f":"IF(ISERROR(VLOOKUP($A$31,Voorraad!$A$2:$J$1001,10)),\"\",VLOOKUP($A$31,Voorraad!$A$2:$J$1001,10))","v":0},{"$f":"IF(ISERROR(VLOOKUP($A$31,Voorraad!$A$2:$G$1001,6)),\"\",VLOOKUP($A$31,Voorraad!$A$2:$G$1001,6))","v":0},{"$f":"IF(ISERROR(VLOOKUP($A$31,Voorraad!$A$2:$G$1001,7)),\"\",VLOOKUP($A$31,Voorraad!$A$2:$G$1001,7))","v":"BCC"},{"$f":"IF(ISERROR(VLOOKUP($A$31,Voorraad!$A$2:$G$1001,5)),\"\",VLOOKUP($A$31,Voorraad!$A$2:$G$1001,5))","v":"8510/8464"},{"$f":"IF(ISERROR(VLOOKUP($A$31,Voorraad!$A$2:$D$1001,4)),\"\",VLOOKUP($A$31,Voorraad!$A$2:$D$1001,4))","v":1725},10,0]
["BR3517",{"$f":"[5]Sheet1!$E$27","v":80},{"$f":"IF(ISERROR(VLOOKUP($A$32,Voorraad!$A$2:$D$1001,1)),\"\",VLOOKUP($A$32,Voorraad!$A$2:$D$1001,1))","v":"BR3517"},{"$f":"IF(ISERROR(VLOOKUP($A$32,Voorraad!$A$2:$D$1001,3)),\"\",VLOOKUP($A$32,Voorraad!$A$2:$D$1001,3))","v":"R 6K8"},{"$f":"IF(ISERROR(VLOOKUP($A$32,Voorraad!$A$2:$D$1001,2)),\"\",VLOOKUP($A$32,Voorraad!$A$2:$D$1001,2))","v":0},{"$f":"IF(ISERROR(VLOOKUP($A$32,Voorraad!$A$2:$H$1001,8)),\"\",VLOOKUP($A$32,Voorraad!$A$2:$H$1001,8))","v":0},{"$f":"IF(ISERROR(VLOOKUP($A$32,Voorraad!$A$2:$I$1001,9)),\"\",VLOOKUP($A$32,Voorraad!$A$2:$I$1001,9))","v":0},{"$f":"IF(ISERROR(VLOOKUP($A$32,Voorraad!$A$2:$J$1001,10)),\"\",VLOOKUP($A$32,Voorraad!$A$2:$J$1001,10))","v":0},{"$f":"IF(ISERROR(VLOOKUP($A$32,Voorraad!$A$2:$G$1001,6)),\"\",VLOOKUP($A$32,Voorraad!$A$2:$G$1001,6))","v":0},{"$f":"IF(ISERROR(VLOOKUP($A$32,Voorraad!$A$2:$G$1001,7)),\"\",VLOOKUP($A$32,Voorraad!$A$2:$G$1001,7))","v":"Philips"},{"$f":"IF(ISERROR(VLOOKUP($A$32,Voorraad!$A$2:$G$1001,5)),\"\",VLOOKUP($A$32,Voorraad!$A$2:$G$1001,5))","v":8464},{"$f":"IF(ISERROR(VLOOKUP($A$32,Voorraad!$A$2:$D$1001,4)),\"\",VLOOKUP($A$32,Voorraad!$A$2:$D$1001,4))","v":4000},80,0]
["BU0063",{"$f":"[5]Sheet1!$E$28","v":20},{"$f":"IF(ISERROR(VLOOKUP($A$33,Voorraad!$A$2:$D$1001,1)),\"\",VLOOKUP($A$33,Voorraad!$A$2:$D$1001,1))","v":"BU0063"},{"$f":"IF(ISERROR(VLOOKUP($A$33,Voorraad!$A$2:$D$1001,3)),\"\",VLOOKUP($A$33,Voorraad!$A$2:$D$1001,3))","v":"MKDS1/8-3.81 Printconnector"},{"$f":"IF(ISERROR(VLOOKUP($A$33,Voorraad!$A$2:$D$1001,2)),\"\",VLOOKUP($A$33,Voorraad!$A$2:$D$1001,2))","v":1727078},{"$f":"IF(ISERROR(VLOOKUP($A$33,Voorraad!$A$2:$H$1001,8)),\"\",VLOOKUP($A$33,Voorraad!$A$2:$H$1001,8))","v":0},{"$f":"IF(ISERROR(VLOOKUP($A$33,Voorraad!$A$2:$I$1001,9)),\"\",VLOOKUP($A$33,Voorraad!$A$2:$I$1001,9))","v":1727078},{"$f":"IF(ISERROR(VLOOKUP($A$33,Voorraad!$A$2:$J$1001,10)),\"\",VLOOKUP($A$33,Voorraad!$A$2:$J$1001,10))","v":0},{"$f":"IF(ISERROR(VLOOKUP($A$33,Voorraad!$A$2:$G$1001,6)),\"\",VLOOKUP($A$33,Voorraad!$A$2:$G$1001,6))","v":0},{"$f":"IF(ISERROR(VLOOKUP($A$33,Voorraad!$A$2:$G$1001,7)),\"\",VLOOKUP($A$33,Voorraad!$A$2:$G$1001,7))","v":"Phoenix"},{"$f":"IF(ISERROR(VLOOKUP($A$33,Voorraad!$A$2:$G$1001,5)),\"\",VLOOKUP($A$33,Voorraad!$A$2:$G$1001,5))","v":8464},{"$f":"IF(ISERROR(VLOOKUP($A$33,Voorraad!$A$2:$D$1001,4)),\"\",VLOOKUP($A$33,Voorraad!$A$2:$D$1001,4))","v":0},20,20]
["BU0068",{"$f":"[5]Sheet1!$E$29","v":10},{"$f":"IF(ISERROR(VLOOKUP($A$34,Voorraad!$A$2:$D$1001,1)),\"\",VLOOKUP($A$34,Voorraad!$A$2:$D$1001,1))","v":"BU0068"},{"$f":"IF(ISERROR(VLOOKUP($A$34,Voorraad!$A$2:$D$1001,3)),\"\",VLOOKUP($A$34,Voorraad!$A$2:$D$1001,3))","v":"ZL201-03G"},{"$f":"IF(ISERROR(VLOOKUP($A$34,Voorraad!$A$2:$D$1001,2)),\"\",VLOOKUP($A$34,Voorraad!$A$2:$D$1001,2))","v":"DS1021-136sf11"},{"$f":"IF(ISERROR(VLOOKUP($A$34,Voorraad!$A$2:$H$1001,8)),\"\",VLOOKUP($A$34,Voorraad!$A$2:$H$1001,8))","v":0},{"$f":"IF(ISERROR(VLOOKUP($A$34,Voorraad!$A$2:$I$1001,9)),\"\",VLOOKUP($A$34,Voorraad!$A$2:$I$1001,9))","v":"ZL201-03G"},{"$f":"IF(ISERROR(VLOOKUP($A$34,Voorraad!$A$2:$J$1001,10)),\"\",VLOOKUP($A$34,Voorraad!$A$2:$J$1001,10))","v":0},{"$f":"IF(ISERROR(VLOOKUP($A$34,Voorraad!$A$2:$G$1001,6)),\"\",VLOOKUP($A$34,Voorraad!$A$2:$G$1001,6))","v":"TME"},{"$f":"IF(ISERROR(VLOOKUP($A$34,Voorraad!$A$2:$G$1001,7)),\"\",VLOOKUP($A$34,Voorraad!$A$2:$G$1001,7))","v":"Connfly"},{"$f":"IF(ISERROR(VLOOKUP($A$34,Voorraad!$A$2:$G$1001,5)),\"\",VLOOKUP($A$34,Voorraad!$A$2:$G$1001,5))","v":"8437/8439/8464/8510"},{"$f":"IF(ISERROR(VLOOKUP($A$34,Voorraad!$A$2:$D$1001,4)),\"\",VLOOKUP($A$34,Voorraad!$A$2:$D$1001,4))","v":931},10,0]
["BU0059",{"$f":"[5]Sheet1!$E$30","v":10},{"$f":"IF(ISERROR(VLOOKUP($A$35,Voorraad!$A$2:$D$1001,1)),\"\",VLOOKUP($A$35,Voorraad!$A$2:$D$1001,1))","v":"BU0059"},{"$f":"IF(ISERROR(VLOOKUP($A$35,Voorraad!$A$2:$D$1001,3)),\"\",VLOOKUP($A$35,Voorraad!$A$2:$D$1001,3))","v":"CON 1-881545-1 SHUNT"},{"$f":"IF(ISERROR(VLOOKUP($A$35,Voorraad!$A$2:$D$1001,2)),\"\",VLOOKUP($A$35,Voorraad!$A$2:$D$1001,2))","v":"#513JUMPOFSW"},{"$f":"IF(ISERROR(VLOOKUP($A$35,Voorraad!$A$2:$H$1001,8)),\"\",VLOOKUP($A$35,Voorraad!$A$2:$H$1001,8))","v":0},{"$f":"IF(ISERROR(VLOOKUP($A$35,Voorraad!$A$2:$I$1001,9)),\"\",VLOOKUP($A$35,Voorraad!$A$2:$I$1001,9))","v":"JUMPER-BL"},{"$f":"IF(ISERROR(VLOOKUP($A$35,Voorraad!$A$2:$J$1001,10)),\"\",VLOOKUP($A$35,Voorraad!$A$2:$J$1001,10))","v":0},{"$f":"IF(ISERROR(VLOOKUP($A$35,Voorraad!$A$2:$G$1001,6)),\"\",VLOOKUP($A$35,Voorraad!$A$2:$G$1001,6))","v":"TME"},{"$f":"IF(ISERROR(VLOOKUP($A$35,Voorraad!$A$2:$G$1001,7)),\"\",VLOOKUP($A$35,Voorraad!$A$2:$G$1001,7))","v":0},{"$f":"IF(ISERROR(VLOOKUP($A$35,Voorraad!$A$2:$G$1001,5)),\"\",VLOOKUP($A$35,Voorraad!$A$2:$G$1001,5))","v":"8437/8439/8464/8510"},{"$f":"IF(ISERROR(VLOOKUP($A$35,Voorraad!$A$2:$D$1001,4)),\"\",VLOOKUP($A$35,Voorraad!$A$2:$D$1001,4))","v":1725},10,0]
["BU0045",{"$f":"[5]Sheet1!$E$31","v":10},{"$f":"IF(ISERROR(VLOOKUP($A$36,Voorraad!$A$2:$D$1001,1)),\"\",VLOOKUP($A$36,Voorraad!$A$2:$D$1001,1))","v":"BU0045"},{"$f":"IF(ISERROR(VLOOKUP($A$36,Voorraad!$A$2:$D$1001,3)),\"\",VLOOKUP($A$36,Voorraad!$A$2:$D$1001,3))","v":"LED TLG124A GROEN 3.18MM"},{"$f":"IF(ISERROR(VLOOKUP($A$36,Voorraad!$A$2:$D$1001,2)),\"\",VLOOKUP($A$36,Voorraad!$A$2:$D$1001,2))","v":"KVD-03-035/G"},{"$f":"IF(ISERROR(VLOOKUP($A$36,Voorraad!$A$2:$H$1001,8)),\"\",VLOOKUP($A$36,Voorraad!$A$2:$H$1001,8))","v":"?"},{"$f":"IF(ISERROR(VLOOKUP($A$36,Voorraad!$A$2:$I$1001,9)),\"\",VLOOKUP($A$36,Voorraad!$A$2:$I$1001,9))","v":"L-934GD"},{"$f":"IF(ISERROR(VLOOKUP($A$36,Voorraad!$A$2:$J$1001,10)),\"\",VLOOKUP($A$36,Voorraad!$A$2:$J$1001,10))","v":0},{"$f":"IF(ISERROR(VLOOKUP($A$36,Voorraad!$A$2:$G$1001,6)),\"\",VLOOKUP($A$36,Voorraad!$A$2:$G$1001,6))","v":"TME"},{"$f":"IF(ISERROR(VLOOKUP($A$36,Voorraad!$A$2:$G$1001,7)),\"\",VLOOKUP($A$36,Voorraad!$A$2:$G$1001,7))","v":"KHATOD / King Bright"},{"$f":"IF(ISERROR(VLOOKUP($A$36,Voorraad!$A$2:$G$1001,5)),\"\",VLOOKUP($A$36,Voorraad!$A$2:$G$1001,5))","v":"8437/8438/8439/8464/8510"},{"$f":"IF(ISERROR(VLOOKUP($A$36,Voorraad!$A$2:$D$1001,4)),\"\",VLOOKUP($A$36,Voorraad!$A$2:$D$1001,4))","v":2},10,8]
["BU0050",{"$f":"[5]Sheet1!$E$32","v":170},{"$f":"IF(ISERROR(VLOOKUP($A$37,Voorraad!$A$2:$D$1001,1)),\"\",VLOOKUP($A$37,Voorraad!$A$2:$D$1001,1))","v":"BU0050"},{"$f":"IF(ISERROR(VLOOKUP($A$37,Voorraad!$A$2:$D$1001,3)),\"\",VLOOKUP($A$37,Voorraad!$A$2:$D$1001,3))","v":"LED-RED"},{"$f":"IF(ISERROR(VLOOKUP($A$37,Voorraad!$A$2:$D$1001,2)),\"\",VLOOKUP($A$37,Voorraad!$A$2:$D$1001,2))","v":"KVD-03-035/R"},{"$f":"IF(ISERROR(VLOOKUP($A$37,Voorraad!$A$2:$H$1001,8)),\"\",VLOOKUP($A$37,Voorraad!$A$2:$H$1001,8))","v":0},{"$f":"IF(ISERROR(VLOOKUP($A$37,Voorraad!$A$2:$I$1001,9)),\"\",VLOOKUP($A$37,Voorraad!$A$2:$I$1001,9))","v":"L-934LSRD"},{"$f":"IF(ISERROR(VLOOKUP($A$37,Voorraad!$A$2:$J$1001,10)),\"\",VLOOKUP($A$37,Voorraad!$A$2:$J$1001,10))","v":0},{"$f":"IF(ISERROR(VLOOKUP($A$37,Voorraad!$A$2:$G$1001,6)),\"\",VLOOKUP($A$37,Voorraad!$A$2:$G$1001,6))","v":"TME"},{"$f":"IF(ISERROR(VLOOKUP($A$37,Voorraad!$A$2:$G$1001,7)),\"\",VLOOKUP($A$37,Voorraad!$A$2:$G$1001,7))","v":"KHATOD / King Bright"},{"$f":"IF(ISERROR(VLOOKUP($A$37,Voorraad!$A$2:$G$1001,5)),\"\",VLOOKUP($A$37,Voorraad!$A$2:$G$1001,5))","v":8464},{"$f":"IF(ISERROR(VLOOKUP($A$37,Voorraad!$A$2:$D$1001,4)),\"\",VLOOKUP($A$37,Voorraad!$A$2:$D$1001,4))","v":32},170,138]
["BX0022",{"$f":"[5]Sheet1!$E$33","v":10},{"$f":"IF(ISERROR(VLOOKUP($A$38,Voorraad!$A$2:$D$1001,1)),\"\",VLOOKUP($A$38,Voorraad!$A$2:$D$1001,1))","v":"BX0022"},{"$f":"IF(ISERROR(VLOOKUP($A$38,Voorraad!$A$2:$D$1001,3)),\"\",VLOOKUP($A$38,Voorraad!$A$2:$D$1001,3))","v":"UMK-BE 22.5"},{"$f":"IF(ISERROR(VLOOKUP($A$38,Voorraad!$A$2:$D$1001,2)),\"\",VLOOKUP($A$38,Voorraad!$A$2:$D$1001,2))","v":2970028},{"$f":"IF(ISERROR(VLOOKUP($A$37,Voorraad!$A$2:$H$1001,8)),\"\",VLOOKUP($A$37,Voorraad!$A$2:$H$1001,8))","v":0},{"$f":"IF(ISERROR(VLOOKUP($A$38,Voorraad!$A$2:$I$1001,9)),\"\",VLOOKUP($A$38,Voorraad!$A$2:$I$1001,9))","v":"2970028 / 1620255"},{"$f":"IF(ISERROR(VLOOKUP($A$38,Voorraad!$A$2:$J$1001,10)),\"\",VLOOKUP($A$38,Voorraad!$A$2:$J$1001,10))","v":0},{"$f":"IF(ISERROR(VLOOKUP($A$38,Voorraad!$A$2:$G$1001,6)),\"\",VLOOKUP($A$38,Voorraad!$A$2:$G$1001,6))","v":0},{"$f":"IF(ISERROR(VLOOKUP($A$38,Voorraad!$A$2:$G$1001,7)),\"\",VLOOKUP($A$38,Voorraad!$A$2:$G$1001,7))","v":"Phoenix "},{"$f":"IF(ISERROR(VLOOKUP($A$38,Voorraad!$A$2:$G$1001,5)),\"\",VLOOKUP($A$38,Voorraad!$A$2:$G$1001,5))","v":8464},{"$f":"IF(ISERROR(VLOOKUP($A$38,Voorraad!$A$2:$D$1001,4)),\"\",VLOOKUP($A$38,Voorraad!$A$2:$D$1001,4))","v":5},10,5]
["BX0023",{"$f":"[5]Sheet1!$E$34","v":20},{"$f":"IF(ISERROR(VLOOKUP($A$39,Voorraad!$A$2:$D$1001,1)),\"\",VLOOKUP($A$39,Voorraad!$A$2:$D$1001,1))","v":"BX0023"},{"$f":"IF(ISERROR(VLOOKUP($A$39,Voorraad!$A$2:$D$1001,3)),\"\",VLOOKUP($A$39,Voorraad!$A$2:$D$1001,3))","v":"UMK-BE 45"},{"$f":"IF(ISERROR(VLOOKUP($A$39,Voorraad!$A$2:$D$1001,2)),\"\",VLOOKUP($A$39,Voorraad!$A$2:$D$1001,2))","v":2970015},{"$f":"IF(ISERROR(VLOOKUP($A$37,Voorraad!$A$2:$H$1001,8)),\"\",VLOOKUP($A$37,Voorraad!$A$2:$H$1001,8))","v":0},{"$f":"IF(ISERROR(VLOOKUP($A$39,Voorraad!$A$2:$I$1001,9)),\"\",VLOOKUP($A$39,Voorraad!$A$2:$I$1001,9))","v":0},{"$f":"IF(ISERROR(VLOOKUP($A$39,Voorraad!$A$2:$J$1001,10)),\"\",VLOOKUP($A$39,Voorraad!$A$2:$J$1001,10))","v":0},{"$f":"IF(ISERROR(VLOOKUP($A$39,Voorraad!$A$2:$G$1001,6)),\"\",VLOOKUP($A$39,Voorraad!$A$2:$G$1001,6))","v":0},{"$f":"IF(ISERROR(VLOOKUP($A$39,Voorraad!$A$2:$G$1001,7)),\"\",VLOOKUP($A$39,Voorraad!$A$2:$G$1001,7))","v":"Phoenix"},{"$f":"IF(ISERROR(VLOOKUP($A$39,Voorraad!$A$2:$G$1001,5)),\"\",VLOOKUP($A$39,Voorraad!$A$2:$G$1001,5))","v":"8410/8464"},{"$f":"IF(ISERROR(VLOOKUP($A$39,Voorraad!$A$2:$D$1001,4)),\"\",VLOOKUP($A$39,Voorraad!$A$2:$D$1001,4))","v":0},20,20]
["BX0024",{"$f":"[5]Sheet1!$E$35","v":20},{"$f":"IF(ISERROR(VLOOKUP($A$40,Voorraad!$A$2:$D$1001,1)),\"\",VLOOKUP($A$40,Voorraad!$A$2:$D$1001,1))","v":"BX0024"},{"$f":"IF(ISERROR(VLOOKUP($A$40,Voorraad!$A$2:$D$1001,3)),\"\",VLOOKUP($A$40,Voorraad!$A$2:$D$1001,3))","v":"UMK-SE 11.25"},{"$f":"IF(ISERROR(VLOOKUP($A$40,Voorraad!$A$2:$D$1001,2)),\"\",VLOOKUP($A$40,Voorraad!$A$2:$D$1001,2))","v":2970002},{"$f":"IF(ISERROR(VLOOKUP($A$37,Voorraad!$A$2:$H$1001,8)),\"\",VLOOKUP($A$37,Voorraad!$A$2:$H$1001,8))","v":0},{"$f":"IF(ISERROR(VLOOKUP($A$40,Voorraad!$A$2:$I$1001,9)),\"\",VLOOKUP($A$40,Voorraad!$A$2:$I$1001,9))","v":0},{"$f":"IF(ISERROR(VLOOKUP($A$40,Voorraad!$A$2:$J$1001,10)),\"\",VLOOKUP($A$40,Voorraad!$A$2:$J$1001,10))","v":0},{"$f":"IF(ISERROR(VLOOKUP($A$40,Voorraad!$A$2:$G$1001,6)),\"\",VLOOKUP($A$40,Voorraad!$A$2:$G$1001,6))","v":0},{"$f":"IF(ISERROR(VLOOKUP($A$40,Voorraad!$A$2:$G$1001,7)),\"\",VLOOKUP($A$40,Voorraad!$A$2:$G$1001,7))","v":"Phoenix "},{"$f":"IF(ISERROR(VLOOKUP($A$40,Voorraad!$A$2:$G$1001,5)),\"\",VLOOKUP($A$40,Voorraad!$A$2:$G$1001,5))","v":"8410/8464"},{"$f":"IF(ISERROR(VLOOKUP($A$40,Voorraad!$A$2:$D$1001,4)),\"\",VLOOKUP($A$40,Voorraad!$A$2:$D$1001,4))","v":0},20,20]
["BX0025",{"$f":"[5]Sheet1!$E$36","v":20},{"$f":"IF(ISERROR(VLOOKUP($A$41,Voorraad!$A$2:$D$1001,1)),\"\",VLOOKUP($A$41,Voorraad!$A$2:$D$1001,1))","v":"BX0025"},{"$f":"IF(ISERROR(VLOOKUP($A$41,Voorraad!$A$2:$D$1001,3)),\"\",VLOOKUP($A$41,Voorraad!$A$2:$D$1001,3))","v":"UMK-FE"},{"$f":"IF(ISERROR(VLOOKUP($A$41,Voorraad!$A$2:$D$1001,2)),\"\",VLOOKUP($A$41,Voorraad!$A$2:$D$1001,2))","v":2970031},{"$f":"IF(ISERROR(VLOOKUP($A$37,Voorraad!$A$2:$H$1001,8)),\"\",VLOOKUP($A$37,Voorraad!$A$2:$H$1001,8))","v":0},{"$f":"IF(ISERROR(VLOOKUP($A$41,Voorraad!$A$2:$I$1001,9)),\"\",VLOOKUP($A$41,Voorraad!$A$2:$I$1001,9))","v":0},{"$f":"IF(ISERROR(VLOOKUP($A$41,Voorraad!$A$2:$J$1001,10)),\"\",VLOOKUP($A$41,Voorraad!$A$2:$J$1001,10))","v":0},{"$f":"IF(ISERROR(VLOOKUP($A$41,Voorraad!$A$2:$G$1001,6)),\"\",VLOOKUP($A$41,Voorraad!$A$2:$G$1001,6))","v":0},{"$f":"IF(ISERROR(VLOOKUP($A$41,Voorraad!$A$2:$G$1001,7)),\"\",VLOOKUP($A$41,Voorraad!$A$2:$G$1001,7))","v":"Phoenix "},{"$f":"IF(ISERROR(VLOOKUP($A$41,Voorraad!$A$2:$G$1001,5)),\"\",VLOOKUP($A$41,Voorraad!$A$2:$G$1001,5))","v":"8410/8464"},{"$f":"IF(ISERROR(VLOOKUP($A$41,Voorraad!$A$2:$D$1001,4)),\"\",VLOOKUP($A$41,Voorraad!$A$2:$D$1001,4))","v":0},20,20]
["BX0045",{"$f":"[5]Sheet1!$E$37","v":10},{"$f":"IF(ISERROR(VLOOKUP($A$42,Voorraad!$A$2:$D$1001,1)),\"\",VLOOKUP($A$42,Voorraad!$A$2:$D$1001,1))","v":"BX0045"},{"$f":"IF(ISERROR(VLOOKUP($A$42,Voorraad!$A$2:$D$1001,3)),\"\",VLOOKUP($A$42,Voorraad!$A$2:$D$1001,3))","v":"PCB 8464"},{"$f":"IF(ISERROR(VLOOKUP($A$42,Voorraad!$A$2:$D$1001,2)),\"\",VLOOKUP($A$42,Voorraad!$A$2:$D$1001,2))","v":"PCB 8464"},{"$f":"IF(ISERROR(VLOOKUP($A$42,Voorraad!$A$2:$H$1001,8)),\"\",VLOOKUP($A$42,Voorraad!$A$2:$H$1001,8))","v":0},{"$f":"IF(ISERROR(VLOOKUP($A$42,Voorraad!$A$2:$I$1001,9)),\"\",VLOOKUP($A$42,Voorraad!$A$2:$I$1001,9))","v":0},{"$f":"IF(ISERROR(VLOOKUP($A$42,Voorraad!$A$2:$J$1001,10)),\"\",VLOOKUP($A$42,Voorraad!$A$2:$J$1001,10))","v":0},{"$f":"IF(ISERROR(VLOOKUP($A$42,Voorraad!$A$2:$G$1001,6)),\"\",VLOOKUP($A$42,Voorraad!$A$2:$G$1001,6))","v":"JvB"},{"$f":"IF(ISERROR(VLOOKUP($A$42,Voorraad!$A$2:$G$1001,7)),\"\",VLOOKUP($A$42,Voorraad!$A$2:$G$1001,7))","v":"JvB"},{"$f":"IF(ISERROR(VLOOKUP($A$42,Voorraad!$A$2:$G$1001,5)),\"\",VLOOKUP($A$42,Voorraad!$A$2:$G$1001,5))","v":"PCB 8464"},{"$f":"IF(ISERROR(VLOOKUP($A$42,Voorraad!$A$2:$D$1001,4)),\"\",VLOOKUP($A$42,Voorraad!$A$2:$D$1001,4))","v":1},10,9]

{"sheet":"Picklijst 8510","index":7,"n_rows":100,"n_cols":14,"rows_kept":100,"cut":false,"hidden":false,"merged":[]}
[]
["Pickorder 8510",null,{"$f":"[6]Sheet1!$D$2","v":75},"X"]
[]
[]
[]
[]
[]
["Art Nr CSI","Benodigd","Art Nr CSI","Omschrijving","Leverancier Nr","Produco Nr","OrderNr","Opmerkingen/Alternatieven","Leverancier","Producent","PCB","Voorraad","Benodigd","Bestellen"]
["BR0001",{"$f":"[6]Sheet1!$E$4","v":75},{"$f":"IF(ISERROR(VLOOKUP($A$9,Voorraad!$A$2:$D$1001,1)),\"\",VLOOKUP($A$9,Voorraad!$A$2:$D$1001,1))","v":"BR0001"},{"$f":"IF(ISERROR(VLOOKUP($A$9,Voorraad!$A$2:$D$1001,3)),\"\",VLOOKUP($A$9,Voorraad!$A$2:$D$1001,3))","v":"R 22E 1% 0.6W 7X2,5MM"},{"$f":"IF(ISERROR(VLOOKUP($A$9,Voorraad!$A$2:$D$1001,2)),\"\",VLOOKUP($A$9,Voorraad!$A$2:$D$1001,2))","v":"#10012201"},{"$f":"IF(ISERROR(VLOOKUP($A$9,Voorraad!$A$2:$H$1001,8)),\"\",VLOOKUP($A$9,Voorraad!$A$2:$H$1001,8))","v":500028},{"$f":"IF(ISERROR(VLOOKUP($A$9,Voorraad!$A$2:$I$1001,9)),\"\",VLOOKUP($A$9,Voorraad!$A$2:$I$1001,9))","v":0},{"$f":"IF(ISERROR(VLOOKUP($A$9,Voorraad!$A$2:$J$1001,10)),\"\",VLOOKUP($A$9,Voorraad!$A$2:$J$1001,10))","v":0},{"$f":"IF(ISERROR(VLOOKUP($A$9,Voorraad!$A$2:$G$1001,6)),\"\",VLOOKUP($A$9,Voorraad!$A$2:$G$1001,6))","v":0},{"$f":"IF(ISERROR(VLOOKUP($A$9,Voorraad!$A$2:$G$1001,7)),\"\",VLOOKUP($A$9,Voorraad!$A$2:$G$1001,7))","v":"BCC"},{"$f":"IF(ISERROR(VLOOKUP($A$9,Voorraad!$A$2:$G$1001,5)),\"\",VLOOKUP($A$9,Voorraad!$A$2:$G$1001,5))","v":8510},{"$f":"IF(ISERROR(VLOOKUP($A$9,Voorraad!$A$2:$D$1001,4)),\"\",VLOOKUP($A$9,Voorraad!$A$2:$D$1001,4))","v":425},{"$f":"B9","v":75},{"$f":"MAX(0,(SUM(M9-L9)))","v":0}]
["BR0002",{"$f":"[6]Sheet1!$E$5","v":150},{"$f":"IF(ISERROR(VLOOKUP($A$10,Voorraad!$A$2:$D$1001,1)),\"\",VLOOKUP($A$10,Voorraad!$A$2:$D$1001,1))","v":"BR0002"},{"$f":"IF(ISERROR(VLOOKUP($A$10,Voorraad!$A$2:$D$1001,3)),\"\",VLOOKUP($A$10,Voorraad!$A$2:$D$1001,3))","v":"R 47E 1% 0.6W 7X2,5MM"},{"$f":"IF(ISERROR(VLOOKUP($A$10,Voorraad!$A$2:$D$1001,2)),\"\",VLOOKUP($A$10,Voorraad!$A$2:$D$1001,2))","v":"#10014701"},{"$f":"IF(ISERROR(VLOOKUP($A$10,Voorraad!$A$2:$H$1001,8)),\"\",VLOOKUP($A$10,Voorraad!$A$2:$H$1001,8))","v":500032},{"$f":"IF(ISERROR(VLOOKUP($A$10,Voorraad!$A$2:$I$1001,9)),\"\",VLOOKUP($A$10,Voorraad!$A$2:$I$1001,9))","v":"M0.6W-47R"},{"$f":"IF(ISERROR(VLOOKUP($A$10,Voorraad!$A$2:$J$1001,10)),\"\",VLOOKUP($A$10,Voorraad!$A$2:$J$1001,10))","v":0},{"$f":"IF(ISERROR(VLOOKUP($A$10,Voorraad!$A$2:$G$1001,6)),\"\",VLOOKUP($A$10,Voorraad!$A$2:$G$1001,6))","v":"TME"},{"$f":"IF(ISERROR(VLOOKUP($A$10,Voorraad!$A$2:$G$1001,7)),\"\",VLOOKUP($A$10,Voorraad!$A$2:$G$1001,7))","v":"BCC"},{"$f":"IF(ISERROR(VLOOKUP($A$10,Voorraad!$A$2:$G$1001,5)),\"\",VLOOKUP($A$10,Voorraad!$A$2:$G$1001,5))","v":8510},{"$f":"IF(ISERROR(VLOOKUP($A$10,Voorraad!$A$2:$D$1001,4)),\"\",VLOOKUP($A$10,Voorraad!$A$2:$D$1001,4))","v":350},150,0]
["BR0003",{"$f":"[6]Sheet1!$E$6","v":75},{"$f":"IF(ISERROR(VLOOKUP($A$11,Voorraad!$A$2:$D$1001,1)),\"\",VLOOKUP($A$11,Voorraad!$A$2:$D$1001,1))","v":"BR0003"},{"$f":"IF(ISERROR(VLOOKUP($A$11,Voorraad!$A$2:$D$1001,3)),\"\",VLOOKUP($A$11,Voorraad!$A$2:$D$1001,3))","v":"R 100E 1% 0.6W 7X2,5MM"},{"$f":"IF(ISERROR(VLOOKUP($A$11,Voorraad!$A$2:$D$1001,2)),\"\",VLOOKUP($A$11,Voorraad!$A$2:$D$1001,2))","v":"#10021001"},{"$f":"IF(ISERROR(VLOOKUP($A$11,Voorraad!$A$2:$H$1001,8)),\"\",VLOOKUP($A$11,Voorraad!$A$2:$H$1001,8))","v":500036},{"$f":"IF(ISERROR(VLOOKUP($A$11,Voorraad!$A$2:$I$1001,9)),\"\",VLOOKUP($A$11,Voorraad!$A$2:$I$1001,9))","v":0},{"$f":"IF(ISERROR(VLOOKUP($A$11,Voorraad!$A$2:$J$1001,10)),\"\",VLOOKUP($A$11,Voorraad!$A$2:$J$1001,10))","v":0},{"$f":"IF(ISERROR(VLOOKUP($A$11,Voorraad!$A$2:$G$1001,6)),\"\",VLOOKUP($A$11,Voorraad!$A$2:$G$1001,6))","v":0},{"$f":"IF(ISERROR(VLOOKUP($A$11,Voorraad!$A$2:$G$1001,7)),\"\",VLOOKUP($A$11,Voorraad!$A$2:$G$1001,7))","v":"BCC"},{"$f":"IF(ISERROR(VLOOKUP($A$11,Voorraad!$A$2:$G$1001,5)),\"\",VLOOKUP($A$11,Voorraad!$A$2:$G$1001,5))","v":"8510/8464"},{"$f":"IF(ISERROR(VLOOKUP($A$11,Voorraad!$A$2:$D$1001,4)),\"\",VLOOKUP($A$11,Voorraad!$A$2:$D$1001,4))","v":1725},75,0]
["BR0004",{"$f":"[6]Sheet1!$E$7","v":75},{"$f":"IF(ISERROR(VLOOKUP($A$12,Voorraad!$A$2:$D$1001,1)),\"\",VLOOKUP($A$12,Voorraad!$A$2:$D$1001,1))","v":"BR0004"},{"$f":"IF(ISERROR(VLOOKUP($A$12,Voorraad!$A$2:$D$1001,3)),\"\",VLOOKUP($A$12,Voorraad!$A$2:$D$1001,3))","v":"R 1K00 1% 0.6W 7X2,5MM"},{"$f":"IF(ISERROR(VLOOKUP($A$12,Voorraad!$A$2:$D$1001,2)),\"\",VLOOKUP($A$12,Voorraad!$A$2:$D$1001,2))","v":"#10031001"},{"$f":"IF(ISERROR(VLOOKUP($A$12,Voorraad!$A$2:$H$1001,8)),\"\",VLOOKUP($A$12,Voorraad!$A$2:$H$1001,8))","v":500048},{"$f":"IF(ISERROR(VLOOKUP($A$12,Voorraad!$A$2:$I$1001,9)),\"\",VLOOKUP($A$12,Voorraad!$A$2:$I$1001,9))","v":0},{"$f":"IF(ISERROR(VLOOKUP($A$12,Voorraad!$A$2:$J$1001,10)),\"\",VLOOKUP($A$12,Voorraad!$A$2:$J$1001,10))","v":0},{"$f":"IF(ISERROR(VLOOKUP($A$12,Voorraad!$A$2:$G$1001,6)),\"\",VLOOKUP($A$12,Voorraad!$A$2:$G$1001,6))","v":0},{"$f":"IF(ISERROR(VLOOKUP($A$12,Voorraad!$A$2:$G$1001,7)),\"\",VLOOKUP($A$12,Voorraad!$A$2:$G$1001,7))","v":"BCC"},{"$f":"IF(ISERROR(VLOOKUP($A$12,Voorraad!$A$2:$G$1001,5)),\"\",VLOOKUP($A$12,Voorraad!$A$2:$G$1001,5))","v":"8510/8437/8438/8439/8464"},{"$f":"IF(ISERROR(VLOOKUP($A$12,Voorraad!$A$2:$D$1001,4)),\"\",VLOOKUP($A$12,Voorraad!$A$2:$D$1001,4))","v":208},75,0]
["BR0005",{"$f":"[6]Sheet1!$E$8","v":75},{"$f":"IF(ISERROR(VLOOKUP($A$13,Voorraad!$A$2:$D$1001,1)),\"\",VLOOKUP($A$13,Voorraad!$A$2:$D$1001,1))","v":"BR0005"},{"$f":"IF(ISERROR(VLOOKUP($A$13,Voorraad!$A$2:$D$1001,3)),\"\",VLOOKUP($A$13,Voorraad!$A$2:$D$1001,3))","v":"R 10K0 1% 0.6W 7X2,5MM"},{"$f":"IF(ISERROR(VLOOKUP($A$13,Voorraad!$A$2:$D$1001,2)),\"\",VLOOKUP($A$13,Voorraad!$A$2:$D$1001,2))","v":"#10041001"},{"$f":"IF(ISERROR(VLOOKUP($A$13,Voorraad!$A$2:$H$1001,8)),\"\",VLOOKUP($A$13,Voorraad!$A$2:$H$1001,8))","v":500060},{"$f":"IF(ISERROR(VLOOKUP($A$13,Voorraad!$A$2:$I$1001,9)),\"\",VLOOKUP($A$13,Voorraad!$A$2:$I$1001,9))","v":0},{"$f":"IF(ISERROR(VLOOKUP($A$13,Voorraad!$A$2:$J$1001,10)),\"\",VLOOKUP($A$13,Voorraad!$A$2:$J$1001,10))","v":0},{"$f":"IF(ISERROR(VLOOKUP($A$13,Voorraad!$A$2:$G$1001,6)),\"\",VLOOKUP($A$13,Voorraad!$A$2:$G$1001,6))","v":0},{"$f":"IF(ISERROR(VLOOKUP($A$13,Voorraad!$A$2:$G$1001,7)),\"\",VLOOKUP($A$13,Voorraad!$A$2:$G$1001,7))","v":"BCC"},{"$f":"IF(ISERROR(VLOOKUP($A$13,Voorraad!$A$2:$G$1001,5)),\"\",VLOOKUP($A$13,Voorraad!$A$2:$G$1001,5))","v":"8510/8437/8438/8439"},{"$f":"IF(ISERROR(VLOOKUP($A$13,Voorraad!$A$2:$D$1001,4)),\"\",VLOOKUP($A$13,Voorraad!$A$2:$D$1001,4))","v":1908},75,0]
["BR0006",{"$f":"[6]Sheet1!$E$9","v":225},{"$f":"IF(ISERROR(VLOOKUP($A$14,Voorraad!$A$2:$D$1001,1)),\"\",VLOOKUP($A$14,Voorraad!$A$2:$D$1001,1))","v":"BR0006"},{"$f":"IF(ISERROR(VLOOKUP($A$14,Voorraad!$A$2:$D$1001,3)),\"\",VLOOKUP($A$14,Voorraad!$A$2:$D$1001,3))","v":"R 15K0 1% 0.6W 7X2,5MM"},{"$f":"IF(ISERROR(VLOOKUP($A$14,Voorraad!$A$2:$D$1001,2)),\"\",VLOOKUP($A$14,Voorraad!$A$2:$D$1001,2))","v":"#10041501"},{"$f":"IF(ISERROR(VLOOKUP($A$14,Voorraad!$A$2:$H$1001,8)),\"\",VLOOKUP($A$14,Voorraad!$A$2:$H$1001,8))","v":500062},{"$f":"IF(ISERROR(VLOOKUP($A$14,Voorraad!$A$2:$I$1001,9)),\"\",VLOOKUP($A$14,Voorraad!$A$2:$I$1001,9))","v":0},{"$f":"IF(ISERROR(VLOOKUP($A$14,Voorraad!$A$2:$J$1001,10)),\"\",VLOOKUP($A$14,Voorraad!$A$2:$J$1001,10))","v":0},{"$f":"IF(ISERROR(VLOOKUP($A$14,Voorraad!$A$2:$G$1001,6)),\"\",VLOOKUP($A$14,Voorraad!$A$2:$G$1001,6))","v":0},{"$f":"IF(ISERROR(VLOOKUP($A$14,Voorraad!$A$2:$G$1001,7)),\"\",VLOOKUP($A$14,Voorraad!$A$2:$G$1001,7))","v":"BCC"},{"$f":"IF(ISERROR(VLOOKUP($A$14,Voorraad!$A$2:$G$1001,5)),\"\",VLOOKUP($A$14,Voorraad!$A$2:$G$1001,5))","v":8510},{"$f":"IF(ISERROR(VLOOKUP($A$14,Voorraad!$A$2:$D$1001,4)),\"\",VLOOKUP($A$14,Voorraad!$A$2:$D$1001,4))","v":1775},225,0]
["BR0007",{"$f":"[6]Sheet1!$E$10","v":75},{"$f":"IF(ISERROR(VLOOKUP($A$15,Voorraad!$A$2:$D$1001,1)),\"\",VLOOKUP($A$15,Voorraad!$A$2:$D$1001,1))","v":"BR0007"},{"$f":"IF(ISERROR(VLOOKUP($A$15,Voorraad!$A$2:$D$1001,3)),\"\",VLOOKUP($A$15,Voorraad!$A$2:$D$1001,3))","v":"R 22K0 1% 0.6W 7X2,5MM"},{"$f":"IF(ISERROR(VLOOKUP($A$15,Voorraad!$A$2:$D$1001,2)),\"\",VLOOKUP($A$9,Voorraad!$A$2:$D$1001,2))","v":"#10012201"},{"$f":"IF(ISERROR(VLOOKUP($A$15,Voorraad!$A$2:$H$1001,8)),\"\",VLOOKUP($A$15,Voorraad!$A$2:$H$1001,8))","v":500064},{"$f":"IF(ISERROR(VLOOKUP($A$15,Voorraad!$A$2:$I$1001,9)),\"\",VLOOKUP($A$15,Voorraad!$A$2:$I$1001,9))","v":0},{"$f":"IF(ISERROR(VLOOKUP($A$15,Voorraad!$A$2:$J$1001,10)),\"\",VLOOKUP($A$15,Voorraad!$A$2:$J$1001,10))","v":0},{"$f":"IF(ISERROR(VLOOKUP($A$15,Voorraad!$A$2:$G$1001,6)),\"\",VLOOKUP($A$15,Voorraad!$A$2:$G$1001,6))","v":0},{"$f":"IF(ISERROR(VLOOKUP($A$15,Voorraad!$A$2:$G$1001,7)),\"\",VLOOKUP($A$15,Voorraad!$A$2:$G$1001,7))","v":"BCC"},{"$f":"IF(ISERROR(VLOOKUP($A$15,Voorraad!$A$2:$G$1001,5)),\"\",VLOOKUP($A$15,Voorraad!$A$2:$G$1001,5))","v":8510},{"$f":"IF(ISERROR(VLOOKUP($A$15,Voorraad!$A$2:$D$1001,4)),\"\",VLOOKUP($A$15,Voorraad!$A$2:$D$1001,4))","v":1025},75,0]
["BR0008",{"$f":"[6]Sheet1!$E$11","v":150},{"$f":"IF(ISERROR(VLOOKUP($A$16,Voorraad!$A$2:$D$1001,1)),\"\",VLOOKUP($A$16,Voorraad!$A$2:$D$1001,1))","v":"BR0008"},{"$f":"IF(ISERROR(VLOOKUP($A$16,Voorraad!$A$2:$D$1001,3)),\"\",VLOOKUP($A$16,Voorraad!$A$2:$D$1001,3))","v":"R 100K 1% 0.6W 7X2,5MM"},{"$f":"IF(ISERROR(VLOOKUP($A$16,Voorraad!$A$2:$D$1001,2)),\"\",VLOOKUP($A$16,Voorraad!$A$2:$D$1001,2))","v":"#10051001"},{"$f":"IF(ISERROR(VLOOKUP($A$16,Voorraad!$A$2:$H$1001,8)),\"\",VLOOKUP($A$16,Voorraad!$A$2:$H$1001,8))","v":500072},{"$f":"IF(ISERROR(VLOOKUP($A$16,Voorraad!$A$2:$I$1001,9)),\"\",VLOOKUP($A$16,Voorraad!$A$2:$I$1001,9))","v":0},{"$f":"IF(ISERROR(VLOOKUP($A$16,Voorraad!$A$2:$J$1001,10)),\"\",VLOOKUP($A$16,Voorraad!$A$2:$J$1001,10))","v":0},{"$f":"IF(ISERROR(VLOOKUP($A$16,Voorraad!$A$2:$G$1001,6)),\"\",VLOOKUP($A$16,Voorraad!$A$2:$G$1001,6))","v":0},{"$f":"IF(ISERROR(VLOOKUP($A$16,Voorraad!$A$2:$G$1001,7)),\"\",VLOOKUP($A$16,Voorraad!$A$2:$G$1001,7))","v":"BCC"},{"$f":"IF(ISERROR(VLOOKUP($A$16,Voorraad!$A$2:$G$1001,5)),\"\",VLOOKUP($A$16,Voorraad!$A$2:$G$1001,5))","v":8510},{"$f":"IF(ISERROR(VLOOKUP($A$16,Voorraad!$A$2:$D$1001,4)),\"\",VLOOKUP($A$16,Voorraad!$A$2:$D$1001,4))","v":1350},150,0]
["BR0009",{"$f":"[6]Sheet1!$E$12","v":75},{"$f":"IF(ISERROR(VLOOKUP($A$17,Voorraad!$A$2:$D$1001,1)),\"\",VLOOKUP($A$17,Voorraad!$A$2:$D$1001,1))","v":"BR0009"},{"$f":"IF(ISERROR(VLOOKUP($A$17,Voorraad!$A$2:$D$1001,3)),\"\",VLOOKUP($A$17,Voorraad!$A$2:$D$1001,3))","v":"R 56E 1% 0.6W 7X2,5MM"},{"$f":"IF(ISERROR(VLOOKUP($A$17,Voorraad!$A$2:$D$1001,2)),\"\",VLOOKUP($A$17,Voorraad!$A$2:$D$1001,2))","v":"#10015601"},{"$f":"IF(ISERROR(VLOOKUP($A$17,Voorraad!$A$2:$H$1001,8)),\"\",VLOOKUP($A$17,Voorraad!$A$2:$H$1001,8))","v":500033},{"$f":"IF(ISERROR(VLOOKUP($A$17,Voorraad!$A$2:$I$1001,9)),\"\",VLOOKUP($A$17,Voorraad!$A$2:$I$1001,9))","v":0},{"$f":"IF(ISERROR(VLOOKUP($A$17,Voorraad!$A$2:$J$1001,10)),\"\",VLOOKUP($A$17,Voorraad!$A$2:$J$1001,10))","v":0},{"$f":"IF(ISERROR(VLOOKUP($A$17,Voorraad!$A$2:$G$1001,6)),\"\",VLOOKUP($A$17,Voorraad!$A$2:$G$1001,6))","v":0},{"$f":"IF(ISERROR(VLOOKUP($A$17,Voorraad!$A$2:$G$1001,7)),\"\",VLOOKUP($A$17,Voorraad!$A$2:$G$1001,7))","v":"BCC"},{"$f":"IF(ISERROR(VLOOKUP($A$17,Voorraad!$A$2:$G$1001,5)),\"\",VLOOKUP($A$17,Voorraad!$A$2:$G$1001,5))","v":"8510/8464"},{"$f":"IF(ISERROR(VLOOKUP($A$17,Voorraad!$A$2:$D$1001,4)),\"\",VLOOKUP($A$17,Voorraad!$A$2:$D$1001,4))","v":1125},75,0]
["BR0010",{"$f":"[6]Sheet1!$E$13","v":75},{"$f":"IF(ISERROR(VLOOKUP($A$18,Voorraad!$A$2:$D$1001,1)),\"\",VLOOKUP($A$18,Voorraad!$A$2:$D$1001,1))","v":"BR0010"},{"$f":"IF(ISERROR(VLOOKUP($A$18,Voorraad!$A$2:$D$1001,3)),\"\",VLOOKUP($A$18,Voorraad!$A$2:$D$1001,3))","v":"R 180E 1% 0.6W 7X2,5MM"},{"$f":"IF(ISERROR(VLOOKUP($A$18,Voorraad!$A$2:$D$1001,2)),\"\",VLOOKUP($A$18,Voorraad!$A$2:$D$1001,2))","v":"#10021801"},{"$f":"IF(ISERROR(VLOOKUP($A$18,Voorraad!$A$2:$H$1001,8)),\"\",VLOOKUP($A$18,Voorraad!$A$2:$H$1001,8))","v":500039},{"$f":"IF(ISERROR(VLOOKUP($A$18,Voorraad!$A$2:$I$1001,9)),\"\",VLOOKUP($A$18,Voorraad!$A$2:$I$1001,9))","v":"MO.6W-180R"},{"$f":"IF(ISERROR(VLOOKUP($A$18,Voorraad!$A$2:$J$1001,10)),\"\",VLOOKUP($A$18,Voorraad!$A$2:$J$1001,10))","v":0},{"$f":"IF(ISERROR(VLOOKUP($A$18,Voorraad!$A$2:$G$1001,6)),\"\",VLOOKUP($A$18,Voorraad!$A$2:$G$1001,6))","v":"TME"},{"$f":"IF(ISERROR(VLOOKUP($A$18,Voorraad!$A$2:$G$1001,7)),\"\",VLOOKUP($A$18,Voorraad!$A$2:$G$1001,7))","v":"BCC"},{"$f":"IF(ISERROR(VLOOKUP($A$18,Voorraad!$A$2:$G$1001,5)),\"\",VLOOKUP($A$18,Voorraad!$A$2:$G$1001,5))","v":8510},{"$f":"IF(ISERROR(VLOOKUP($A$18,Voorraad!$A$2:$D$1001,4)),\"\",VLOOKUP($A$18,Voorraad!$A$2:$D$1001,4))","v":125},75,0]
["BR0011",{"$f":"[6]Sheet1!$E$14","v":150},{"$f":"IF(ISERROR(VLOOKUP($A$19,Voorraad!$A$2:$D$1001,1)),\"\",VLOOKUP($A$19,Voorraad!$A$2:$D$1001,1))","v":"BR0011"},{"$f":"IF(ISERROR(VLOOKUP($A$19,Voorraad!$A$2:$D$1001,3)),\"\",VLOOKUP($A$19,Voorraad!$A$2:$D$1001,3))","v":"R 1K8 1% 0.6W 7X2,5MM"},{"$f":"IF(ISERROR(VLOOKUP($A$19,Voorraad!$A$2:$D$1001,2)),\"\",VLOOKUP($A$19,Voorraad!$A$2:$D$1001,2))","v":"#10031801"},{"$f":"IF(ISERROR(VLOOKUP($A$19,Voorraad!$A$2:$H$1001,8)),\"\",VLOOKUP($A$19,Voorraad!$A$2:$H$1001,8))","v":500051},{"$f":"IF(ISERROR(VLOOKUP($A$19,Voorraad!$A$2:$I$1001,9)),\"\",VLOOKUP($A$19,Voorraad!$A$2:$I$1001,9))","v":0},{"$f":"IF(ISERROR(VLOOKUP($A$19,Voorraad!$A$2:$J$1001,10)),\"\",VLOOKUP($A$19,Voorraad!$A$2:$J$1001,10))","v":0},{"$f":"IF(ISERROR(VLOOKUP($A$19,Voorraad!$A$2:$G$1001,6)),\"\",VLOOKUP($A$19,Voorraad!$A$2:$G$1001,6))","v":0},{"$f":"IF(ISERROR(VLOOKUP($A$19,Voorraad!$A$2:$G$1001,7)),\"\",VLOOKUP($A$19,Voorraad!$A$2:$G$1001,7))","v":"BCC"},{"$f":"IF(ISERROR(VLOOKUP($A$19,Voorraad!$A$2:$G$1001,5)),\"\",VLOOKUP($A$19,Voorraad!$A$2:$G$1001,5))","v":8510},{"$f":"IF(ISERROR(VLOOKUP($A$19,Voorraad!$A$2:$D$1001,4)),\"\",VLOOKUP($A$19,Voorraad!$A$2:$D$1001,4))","v":1050},150,0]
["BR0012",{"$f":"[6]Sheet1!$E$15","v":75},{"$f":"IF(ISERROR(VLOOKUP($A$20,Voorraad!$A$2:$D$1001,1)),\"\",VLOOKUP($A$20,Voorraad!$A$2:$D$1001,1))","v":"BR0012"},{"$f":"IF(ISERROR(VLOOKUP($A$20,Voorraad!$A$2:$D$1001,3)),\"\",VLOOKUP($A$20,Voorraad!$A$2:$D$1001,3))","v":"R 2K7 1% 0.6W 7X2,5MM"},{"$f":"IF(ISERROR(VLOOKUP($A$20,Voorraad!$A$2:$D$1001,2)),\"\",VLOOKUP($A$20,Voorraad!$A$2:$D$1001,2))","v":"#10032701"},{"$f":"IF(ISERROR(VLOOKUP($A$20,Voorraad!$A$2:$H$1001,8)),\"\",VLOOKUP($A$20,Voorraad!$A$2:$H$1001,8))","v":500053},{"$f":"IF(ISERROR(VLOOKUP($A$20,Voorraad!$A$2:$I$1001,9)),\"\",VLOOKUP($A$20,Voorraad!$A$2:$I$1001,9))","v":0},{"$f":"IF(ISERROR(VLOOKUP($A$20,Voorraad!$A$2:$J$1001,10)),\"\",VLOOKUP($A$20,Voorraad!$A$2:$J$1001,10))","v":0},{"$f":"IF(ISERROR(VLOOKUP($A$20,Voorraad!$A$2:$G$1001,6)),\"\",VLOOKUP($A$20,Voorraad!$A$2:$G$1001,6))","v":0},{"$f":"IF(ISERROR(VLOOKUP($A$20,Voorraad!$A$2:$G$1001,7)),\"\",VLOOKUP($A$20,Voorraad!$A$2:$G$1001,7))","v":"BCC"},{"$f":"IF(ISERROR(VLOOKUP($A$20,Voorraad!$A$2:$G$1001,5)),\"\",VLOOKUP($A$20,Voorraad!$A$2:$G$1001,5))","v":8510},{"$f":"IF(ISERROR(VLOOKUP($A$20,Voorraad!$A$2:$D$1001,4)),\"\",VLOOKUP($A$20,Voorraad!$A$2:$D$1001,4))","v":2225},75,0]
["BR0013",{"$f":"[6]Sheet1!$E$16","v":75},{"$f":"IF(ISERROR(VLOOKUP($A$21,Voorraad!$A$2:$D$1001,1)),\"\",VLOOKUP($A$21,Voorraad!$A$2:$D$1001,1))","v":"BR0013"},{"$f":"IF(ISERROR(VLOOKUP($A$21,Voorraad!$A$2:$D$1001,3)),\"\",VLOOKUP($A$21,Voorraad!$A$2:$D$1001,3))","v":"R 56K 1% 0.6W 7X2,5MM"},{"$f":"IF(ISERROR(VLOOKUP($A$21,Voorraad!$A$2:$D$1001,2)),\"\",VLOOKUP($A$21,Voorraad!$A$2:$D$1001,2))","v":"#10045601"},{"$f":"IF(ISERROR(VLOOKUP($A$21,Voorraad!$A$2:$H$1001,8)),\"\",VLOOKUP($A$21,Voorraad!$A$2:$H$1001,8))","v":500069},{"$f":"IF(ISERROR(VLOOKUP($A$21,Voorraad!$A$2:$I$1001,9)),\"\",VLOOKUP($A$21,Voorraad!$A$2:$I$1001,9))","v":0},{"$f":"IF(ISERROR(VLOOKUP($A$21,Voorraad!$A$2:$J$1001,10)),\"\",VLOOKUP($A$21,Voorraad!$A$2:$J$1001,10))","v":0},{"$f":"IF(ISERROR(VLOOKUP($A$21,Voorraad!$A$2:$G$1001,6)),\"\",VLOOKUP($A$21,Voorraad!$A$2:$G$1001,6))","v":0},{"$f":"IF(ISERROR(VLOOKUP($A$21,Voorraad!$A$2:$G$1001,7)),\"\",VLOOKUP($A$21,Voorraad!$A$2:$G$1001,7))","v":"BCC"},{"$f":"IF(ISERROR(VLOOKUP($A$21,Voorraad!$A$2:$G$1001,5)),\"\",VLOOKUP($A$21,Voorraad!$A$2:$G$1001,5))","v":8510},{"$f":"IF(ISERROR(VLOOKUP($A$21,Voorraad!$A$2:$D$1001,4)),\"\",VLOOKUP($A$21,Voorraad!$A$2:$D$1001,4))","v":1925},75,0]
["BR0014",{"$f":"[6]Sheet1!$E$17","v":150},{"$f":"IF(ISERROR(VLOOKUP($A$22,Voorraad!$A$2:$D$1001,1)),\"\",VLOOKUP($A$22,Voorraad!$A$2:$D$1001,1))","v":"BR0014"},{"$f":"IF(ISERROR(VLOOKUP($A$22,Voorraad!$A$2:$D$1001,3)),\"\",VLOOKUP($A$22,Voorraad!$A$2:$D$1001,3))","v":"R 680K 1% 0.6W 7X2,5MM"},{"$f":"IF(ISERROR(VLOOKUP($A$22,Voorraad!$A$2:$D$1001,2)),\"\",VLOOKUP($A$22,Voorraad!$A$2:$D$1001,2))","v":"#10056801"},{"$f":"IF(ISERROR(VLOOKUP($A$22,Voorraad!$A$2:$H$1001,8)),\"\",VLOOKUP($A$22,Voorraad!$A$2:$H$1001,8))","v":500082},{"$f":"IF(ISERROR(VLOOKUP($A$22,Voorraad!$A$2:$I$1001,9)),\"\",VLOOKUP($A$22,Voorraad!$A$2:$I$1001,9))","v":0},{"$f":"IF(ISERROR(VLOOKUP($A$22,Voorraad!$A$2:$J$1001,10)),\"\",VLOOKUP($A$22,Voorraad!$A$2:$J$1001,10))","v":0},{"$f":"IF(ISERROR(VLOOKUP($A$22,Voorraad!$A$2:$G$1001,6)),\"\",VLOOKUP($A$22,Voorraad!$A$2:$G$1001,6))","v":0},{"$f":"IF(ISERROR(VLOOKUP($A$22,Voorraad!$A$2:$G$1001,7)),\"\",VLOOKUP($A$22,Voorraad!$A$2:$G$1001,7))","v":"BCC"},{"$f":"IF(ISERROR(VLOOKUP($A$22,Voorraad!$A$2:$G$1001,5)),\"\",VLOOKUP($A$22,Voorraad!$A$2:$G$1001,5))","v":8510},{"$f":"IF(ISERROR(VLOOKUP($A$22,Voorraad!$A$2:$D$1001,4)),\"\",VLOOKUP($A$22,Voorraad!$A$2:$D$1001,4))","v":1100},150,0]
["BR3525",{"$f":"[6]Sheet1!$E$18","v":75},{"$f":"IF(ISERROR(VLOOKUP($A$23,Voorraad!$A$2:$D$1001,1)),\"\",VLOOKUP($A$23,Voorraad!$A$2:$D$1001,1))","v":"BR3525"},{"$f":"IF(ISERROR(VLOOKUP($A$23,Voorraad!$A$2:$D$1001,3)),\"\",VLOOKUP($A$23,Voorraad!$A$2:$D$1001,3))","v":"RT 1K 450MW 10% NTC 2E"},{"$f":"IF(ISERROR(VLOOKUP($A$23,Voorraad!$A$2:$D$1001,2)),\"\",VLOOKUP($A$23,Voorraad!$A$2:$D$1001,2))","v":"#120164K102JE"},{"$f":"IF(ISERROR(VLOOKUP($A$23,Voorraad!$A$2:$H$1001,8)),\"\",VLOOKUP($A$23,Voorraad!$A$2:$H$1001,8))","v":500277},{"$f":"IF(ISERROR(VLOOKUP($A$23,Voorraad!$A$2:$I$1001,9)),\"\",VLOOKUP($A$23,Voorraad!$A$2:$I$1001,9))","v":0},{"$f":"IF(ISERROR(VLOOKUP($A$23,Voorraad!$A$2:$J$1001,10)),\"\",VLOOKUP($A$23,Voorraad!$A$2:$J$1001,10))","v":0},{"$f":"IF(ISERROR(VLOOKUP($A$23,Voorraad!$A$2:$G$1001,6)),\"\",VLOOKUP($A$23,Voorraad!$A$2:$G$1001,6))","v":0},{"$f":"IF(ISERROR(VLOOKUP($A$23,Voorraad!$A$2:$G$1001,7)),\"\",VLOOKUP($A$23,Voorraad!$A$2:$G$1001,7))","v":"EPCOS"},{"$f":"IF(ISERROR(VLOOKUP($A$23,Voorraad!$A$2:$G$1001,5)),\"\",VLOOKUP($A$23,Voorraad!$A$2:$G$1001,5))","v":8510},{"$f":"IF(ISERROR(VLOOKUP($A$23,Voorraad!$A$2:$D$1001,4)),\"\",VLOOKUP($A$23,Voorraad!$A$2:$D$1001,4))","v":725},75,0]
["BR3530",{"$f":"[6]Sheet1!$E$19","v":975},{"$f":"IF(ISERROR(VLOOKUP($A$24,Voorraad!$A$2:$D$1001,1)),\"\",VLOOKUP($A$24,Voorraad!$A$2:$D$1001,1))","v":"BR3530"},{"$f":"IF(ISERROR(VLOOKUP($A$24,Voorraad!$A$2:$D$1001,3)),\"\",VLOOKUP($A$24,Voorraad!$A$2:$D$1001,3))","v":"RT 13E PTC 2E WPT2390-995"},{"$f":"IF(ISERROR(VLOOKUP($A$24,Voorraad!$A$2:$D$1001,2)),\"\",VLOOKUP($A$24,Voorraad!$A$2:$D$1001,2))","v":"#120995120A"},{"$f":"IF(ISERROR(VLOOKUP($A$24,Voorraad!$A$2:$H$1001,8)),\"\",VLOOKUP($A$24,Voorraad!$A$2:$H$1001,8))","v":500248},{"$f":"IF(ISERROR(VLOOKUP($A$24,Voorraad!$A$2:$I$1001,9)),\"\",VLOOKUP($A$24,Voorraad!$A$2:$I$1001,9))","v":"B59995-C120-A70"},{"$f":"IF(ISERROR(VLOOKUP($A$24,Voorraad!$A$2:$J$1001,10)),\"\",VLOOKUP($A$24,Voorraad!$A$2:$J$1001,10))","v":0},{"$f":"IF(ISERROR(VLOOKUP($A$24,Voorraad!$A$2:$G$1001,6)),\"\",VLOOKUP($A$24,Voorraad!$A$2:$G$1001,6))","v":"DISTRELEC"},{"$f":"IF(ISERROR(VLOOKUP($A$24,Voorraad!$A$2:$G$1001,7)),\"\",VLOOKUP($A$24,Voorraad!$A$2:$G$1001,7))","v":"EPCOS"},{"$f":"IF(ISERROR(VLOOKUP($A$24,Voorraad!$A$2:$G$1001,5)),\"\",VLOOKUP($A$24,Voorraad!$A$2:$G$1001,5))","v":8510},{"$f":"IF(ISERROR(VLOOKUP($A$24,Voorraad!$A$2:$D$1001,4)),\"\",VLOOKUP($A$24,Voorraad!$A$2:$D$1001,4))","v":5},975,970]
["BR3550",{"$f":"[6]Sheet1!$E$20","v":75},{"$f":"IF(ISERROR(VLOOKUP($A$25,Voorraad!$A$2:$D$1001,1)),\"\",VLOOKUP($A$25,Voorraad!$A$2:$D$1001,1))","v":"BR3550"},{"$f":"IF(ISERROR(VLOOKUP($A$25,Voorraad!$A$2:$D$1001,3)),\"\",VLOOKUP($A$25,Voorraad!$A$2:$D$1001,3))","v":"RV S05K30 100A 0.01W"},{"$f":"IF(ISERROR(VLOOKUP($A$25,Voorraad!$A$2:$D$1001,2)),\"\",VLOOKUP($A$25,Voorraad!$A$2:$D$1001,2))","v":"#122S05K30"},{"$f":"IF(ISERROR(VLOOKUP($A$25,Voorraad!$A$2:$H$1001,8)),\"\",VLOOKUP($A$25,Voorraad!$A$2:$H$1001,8))","v":500088},{"$f":"IF(ISERROR(VLOOKUP($A$25,Voorraad!$A$2:$I$1001,9)),\"\",VLOOKUP($A$25,Voorraad!$A$2:$I$1001,9))","v":"SIOV-S05K30"},{"$f":"IF(ISERROR(VLOOKUP($A$25,Voorraad!$A$2:$J$1001,10)),\"\",VLOOKUP($A$25,Voorraad!$A$2:$J$1001,10))","v":"Groter aantal inkopen "},{"$f":"IF(ISERROR(VLOOKUP($A$25,Voorraad!$A$2:$G$1001,6)),\"\",VLOOKUP($A$25,Voorraad!$A$2:$G$1001,6))","v":"TME"},{"$f":"IF(ISERROR(VLOOKUP($A$25,Voorraad!$A$2:$G$1001,7)),\"\",VLOOKUP($A$25,Voorraad!$A$2:$G$1001,7))","v":"EPCOS"},{"$f":"IF(ISERROR(VLOOKUP($A$25,Voorraad!$A$2:$G$1001,5)),\"\",VLOOKUP($A$25,Voorraad!$A$2:$G$1001,5))","v":"8410/8437/8438/8439/8510"},{"$f":"IF(ISERROR(VLOOKUP($A$25,Voorraad!$A$2:$D$1001,4)),\"\",VLOOKUP($A$25,Voorraad!$A$2:$D$1001,4))","v":86},75,0]
["BR4008",{"$f":"[6]Sheet1!$E$21","v":150},{"$f":"IF(ISERROR(VLOOKUP($A$26,Voorraad!$A$2:$D$1001,1)),\"\",VLOOKUP($A$26,Voorraad!$A$2:$D$1001,1))","v":"BR4008"},{"$f":"IF(ISERROR(VLOOKUP($A$26,Voorraad!$A$2:$D$1001,3)),\"\",VLOOKUP($A$26,Voorraad!$A$2:$D$1001,3))","v":"RV S05K385 385V 0.10W"},{"$f":"IF(ISERROR(VLOOKUP($A$26,Voorraad!$A$2:$D$1001,2)),\"\",VLOOKUP($A$26,Voorraad!$A$2:$D$1001,2))","v":"#122S05K385"},{"$f":"IF(ISERROR(VLOOKUP($A$26,Voorraad!$A$2:$H$1001,8)),\"\",VLOOKUP($A$26,Voorraad!$A$2:$H$1001,8))","v":0},{"$f":"IF(ISERROR(VLOOKUP($A$26,Voorraad!$A$2:$I$1001,9)),\"\",VLOOKUP($A$26,Voorraad!$A$2:$I$1001,9))","v":"B72207-S 381K101"},{"$f":"IF(ISERROR(VLOOKUP($A$26,Voorraad!$A$2:$J$1001,10)),\"\",VLOOKUP($A$26,Voorraad!$A$2:$J$1001,10))","v":"RS COMPONENTS NR: 138-9254"},{"$f":"IF(ISERROR(VLOOKUP($A$26,Voorraad!$A$2:$G$1001,6)),\"\",VLOOKUP($A$26,Voorraad!$A$2:$G$1001,6))","v":"DISTRELEC"},{"$f":"IF(ISERROR(VLOOKUP($A$26,Voorraad!$A$2:$G$1001,7)),\"\",VLOOKUP($A$26,Voorraad!$A$2:$G$1001,7))","v":"EPCOS"},{"$f":"IF(ISERROR(VLOOKUP($A$26,Voorraad!$A$2:$G$1001,5)),\"\",VLOOKUP($A$26,Voorraad!$A$2:$G$1001,5))","v":"8410/8510"},{"$f":"IF(ISERROR(VLOOKUP($A$26,Voorraad!$A$2:$D$1001,4)),\"\",VLOOKUP($A$26,Voorraad!$A$2:$D$1001,4))","v":-142},150,292]
["BR4016",{"$f":"[6]Sheet1!$E$22","v":75},{"$f":"IF(ISERROR(VLOOKUP($A$27,Voorraad!$A$2:$D$1001,1)),\"\",VLOOKUP($A$27,Voorraad!$A$2:$D$1001,1))","v":"BR4016"},{"$f":"IF(ISERROR(VLOOKUP($A$27,Voorraad!$A$2:$D$1001,3)),\"\",VLOOKUP($A$27,Voorraad!$A$2:$D$1001,3))","v":"F MF-R020 0.20A 60V"},{"$f":"IF(ISERROR(VLOOKUP($A$27,Voorraad!$A$2:$D$1001,2)),\"\",VLOOKUP($A$27,Voorraad!$A$2:$D$1001,2))","v":"#679MFR020"},{"$f":"IF(ISERROR(VLOOKUP($A$27,Voorraad!$A$2:$H$1001,8)),\"\",VLOOKUP($A$27,Voorraad!$A$2:$H$1001,8))","v":0},{"$f":"IF(ISERROR(VLOOKUP($A$27,Voorraad!$A$2:$I$1001,9)),\"\",VLOOKUP($A$27,Voorraad!$A$2:$I$1001,9))","v":9350373},{"$f":"IF(ISERROR(VLOOKUP($A$27,Voorraad!$A$2:$J$1001,10)),\"\",VLOOKUP($A$27,Voorraad!$A$2:$J$1001,10))","v":0},{"$f":"IF(ISERROR(VLOOKUP($A$27,Voorraad!$A$2:$G$1001,6)),\"\",VLOOKUP($A$27,Voorraad!$A$2:$G$1001,6))","v":"FARNELL"},{"$f":"IF(ISERROR(VLOOKUP($A$27,Voorraad!$A$2:$G$1001,7)),\"\",VLOOKUP($A$27,Voorraad!$A$2:$G$1001,7))","v":"BOURNS"},{"$f":"IF(ISERROR(VLOOKUP($A$27,Voorraad!$A$2:$G$1001,5)),\"\",VLOOKUP($A$27,Voorraad!$A$2:$G$1001,5))","v":8510},{"$f":"IF(ISERROR(VLOOKUP($A$27,Voorraad!$A$2:$D$1001,4)),\"\",VLOOKUP($A$27,Voorraad!$A$2:$D$1001,4))","v":-51},75,126]
["BR4040",{"$f":"[6]Sheet1!$E$23","v":75},{"$f":"IF(ISERROR(VLOOKUP($A$28,Voorraad!$A$2:$D$1001,1)),\"\",VLOOKUP($A$28,Voorraad!$A$2:$D$1001,1))","v":"BR4040"},{"$f":"IF(ISERROR(VLOOKUP($A$28,Voorraad!$A$2:$D$1001,3)),\"\",VLOOKUP($A$28,Voorraad!$A$2:$D$1001,3))","v":"RA 1K-4X SIL08 4608X-2"},{"$f":"IF(ISERROR(VLOOKUP($A$28,Voorraad!$A$2:$D$1001,2)),\"\",VLOOKUP($A$28,Voorraad!$A$2:$D$1001,2))","v":"#138X2310B"},{"$f":"IF(ISERROR(VLOOKUP($A$28,Voorraad!$A$2:$H$1001,8)),\"\",VLOOKUP($A$28,Voorraad!$A$2:$H$1001,8))","v":500209},{"$f":"IF(ISERROR(VLOOKUP($A$28,Voorraad!$A$2:$I$1001,9)),\"\",VLOOKUP($A$28,Voorraad!$A$2:$I$1001,9))","v":0},{"$f":"IF(ISERROR(VLOOKUP($A$28,Voorraad!$A$2:$J$1001,10)),\"\",VLOOKUP($A$28,Voorraad!$A$2:$J$1001,10))","v":0},{"$f":"IF(ISERROR(VLOOKUP($A$28,Voorraad!$A$2:$G$1001,6)),\"\",VLOOKUP($A$28,Voorraad!$A$2:$G$1001,6))","v":0},{"$f":"IF(ISERROR(VLOOKUP($A$28,Voorraad!$A$2:$G$1001,7)),\"\",VLOOKUP($A$28,Voorraad!$A$2:$G$1001,7))","v":"BOURNS"},{"$f":"IF(ISERROR(VLOOKUP($A$28,Voorraad!$A$2:$G$1001,5)),\"\",VLOOKUP($A$28,Voorraad!$A$2:$G$1001,5))","v":8510},{"$f":"IF(ISERROR(VLOOKUP($A$28,Voorraad!$A$2:$D$1001,4)),\"\",VLOOKUP($A$28,Voorraad!$A$2:$D$1001,4))","v":225},75,0]
["BR4045",{"$f":"[6]Sheet1!$E$24","v":75},{"$f":"IF(ISERROR(VLOOKUP($A$29,Voorraad!$A$2:$D$1001,1)),\"\",VLOOKUP($A$29,Voorraad!$A$2:$D$1001,1))","v":"BR4045"},{"$f":"IF(ISERROR(VLOOKUP($A$29,Voorraad!$A$2:$D$1001,3)),\"\",VLOOKUP($A$29,Voorraad!$A$2:$D$1001,3))","v":"RA 2K7 4X SIL8 4608X-2"},{"$f":"IF(ISERROR(VLOOKUP($A$29,Voorraad!$A$2:$D$1001,2)),\"\",VLOOKUP($A$29,Voorraad!$A$2:$D$1001,2))","v":"#138X23270B"},{"$f":"IF(ISERROR(VLOOKUP($A$29,Voorraad!$A$2:$H$1001,8)),\"\",VLOOKUP($A$29,Voorraad!$A$2:$H$1001,8))","v":500340},{"$f":"IF(ISERROR(VLOOKUP($A$29,Voorraad!$A$2:$I$1001,9)),\"\",VLOOKUP($A$29,Voorraad!$A$2:$I$1001,9))","v":"4608X-102-272LF"},{"$f":"IF(ISERROR(VLOOKUP($A$29,Voorraad!$A$2:$J$1001,10)),\"\",VLOOKUP($A$29,Voorraad!$A$2:$J$1001,10))","v":0},{"$f":"IF(ISERROR(VLOOKUP($A$29,Voorraad!$A$2:$G$1001,6)),\"\",VLOOKUP($A$29,Voorraad!$A$2:$G$1001,6))","v":"TME"},{"$f":"IF(ISERROR(VLOOKUP($A$29,Voorraad!$A$2:$G$1001,7)),\"\",VLOOKUP($A$29,Voorraad!$A$2:$G$1001,7))","v":"BOURNS"},{"$f":"IF(ISERROR(VLOOKUP($A$29,Voorraad!$A$2:$G$1001,5)),\"\",VLOOKUP($A$29,Voorraad!$A$2:$G$1001,5))","v":8510},{"$f":"IF(ISERROR(VLOOKUP($A$29,Voorraad!$A$2:$D$1001,4)),\"\",VLOOKUP($A$29,Voorraad!$A$2:$D$1001,4))","v":15},75,60]
["BR4050",{"$f":"[6]Sheet1!$E$25","v":225},{"$f":"IF(ISERROR(VLOOKUP($A$30,Voorraad!$A$2:$D$1001,1)),\"\",VLOOKUP($A$30,Voorraad!$A$2:$D$1001,1))","v":"BR4050"},{"$f":"IF(ISERROR(VLOOKUP($A$30,Voorraad!$A$2:$D$1001,3)),\"\",VLOOKUP($A$30,Voorraad!$A$2:$D$1001,3))","v":"RA 10K-4X SIL08 4608X-2"},{"$f":"IF(ISERROR(VLOOKUP($A$30,Voorraad!$A$2:$D$1001,2)),\"\",VLOOKUP($A$30,Voorraad!$A$2:$D$1001,2))","v":"#138X24100B"},{"$f":"IF(ISERROR(VLOOKUP($A$30,Voorraad!$A$2:$H$1001,8)),\"\",VLOOKUP($A$30,Voorraad!$A$2:$H$1001,8))","v":500342},{"$f":"IF(ISERROR(VLOOKUP($A$30,Voorraad!$A$2:$I$1001,9)),\"\",VLOOKUP($A$30,Voorraad!$A$2:$I$1001,9))","v":"4608X-102-103LF"},{"$f":"IF(ISERROR(VLOOKUP($A$30,Voorraad!$A$2:$J$1001,10)),\"\",VLOOKUP($A$30,Voorraad!$A$2:$J$1001,10))","v":0},{"$f":"IF(ISERROR(VLOOKUP($A$30,Voorraad!$A$2:$G$1001,6)),\"\",VLOOKUP($A$30,Voorraad!$A$2:$G$1001,6))","v":"MOUSER"},{"$f":"IF(ISERROR(VLOOKUP($A$30,Voorraad!$A$2:$G$1001,7)),\"\",VLOOKUP($A$30,Voorraad!$A$2:$G$1001,7))","v":"BOURNS"},{"$f":"IF(ISERROR(VLOOKUP($A$30,Voorraad!$A$2:$G$1001,5)),\"\",VLOOKUP($A$30,Voorraad!$A$2:$G$1001,5))","v":8510},{"$f":"IF(ISERROR(VLOOKUP($A$30,Voorraad!$A$2:$D$1001,4)),\"\",VLOOKUP($A$30,Voorraad!$A$2:$D$1001,4))","v":-101},225,326]
["BR4060",{"$f":"[6]Sheet1!$E$26","v":225},{"$f":"IF(ISERROR(VLOOKUP($A$31,Voorraad!$A$2:$D$1001,1)),\"\",VLOOKUP($A$31,Voorraad!$A$2:$D$1001,1))","v":"BR4060"},{"$f":"IF(ISERROR(VLOOKUP($A$31,Voorraad!$A$2:$D$1001,3)),\"\",VLOOKUP($A$31,Voorraad!$A$2:$D$1001,3))","v":"RA 1K-9X SIL10 4610X-1"},{"$f":"IF(ISERROR(VLOOKUP($A$31,Voorraad!$A$2:$D$1001,2)),\"\",VLOOKUP($A$31,Voorraad!$A$2:$D$1001,2))","v":"#140X13100B"},{"$f":"IF(ISERROR(VLOOKUP($A$31,Voorraad!$A$2:$H$1001,8)),\"\",VLOOKUP($A$31,Voorraad!$A$2:$H$1001,8))","v":500361},{"$f":"IF(ISERROR(VLOOKUP($A$31,Voorraad!$A$2:$I$1001,9)),\"\",VLOOKUP($A$31,Voorraad!$A$2:$I$1001,9))","v":0},{"$f":"IF(ISERROR(VLOOKUP($A$31,Voorraad!$A$2:$J$1001,10)),\"\",VLOOKUP($A$31,Voorraad!$A$2:$J$1001,10))","v":0},{"$f":"IF(ISERROR(VLOOKUP($A$31,Voorraad!$A$2:$G$1001,6)),\"\",VLOOKUP($A$31,Voorraad!$A$2:$G$1001,6))","v":0},{"$f":"IF(ISERROR(VLOOKUP($A$31,Voorraad!$A$2:$G$1001,7)),\"\",VLOOKUP($A$31,Voorraad!$A$2:$G$1001,7))","v":"BOURNS"},{"$f":"IF(ISERROR(VLOOKUP($A$31,Voorraad!$A$2:$G$1001,5)),\"\",VLOOKUP($A$31,Voorraad!$A$2:$G$1001,5))","v":8510},{"$f":"IF(ISERROR(VLOOKUP($A$31,Voorraad!$A$2:$D$1001,4)),\"\",VLOOKUP($A$31,Voorraad!$A$2:$D$1001,4))","v":-142},225,367]
["BR4070",{"$f":"[6]Sheet1!$E$27","v":150},{"$f":"IF(ISERROR(VLOOKUP($A$32,Voorraad!$A$2:$D$1001,1)),\"\",VLOOKUP($A$32,Voorraad!$A$2:$D$1001,1))","v":"BR4070"},{"$f":"IF(ISERROR(VLOOKUP($A$32,Voorraad!$A$2:$D$1001,3)),\"\",VLOOKUP($A$32,Voorraad!$A$2:$D$1001,3))","v":"RA 27K 9X SIL10 4610X-101"},{"$f":"IF(ISERROR(VLOOKUP($A$32,Voorraad!$A$2:$D$1001,2)),\"\",VLOOKUP($A$32,Voorraad!$A$2:$D$1001,2))","v":"#140X14270B"},{"$f":"IF(ISERROR(VLOOKUP($A$32,Voorraad!$A$2:$H$1001,8)),\"\",VLOOKUP($A$32,Voorraad!$A$2:$H$1001,8))","v":500202},{"$f":"IF(ISERROR(VLOOKUP($A$32,Voorraad!$A$2:$I$1001,9)),\"\",VLOOKUP($A$32,Voorraad!$A$2:$I$1001,9))","v":"652-4610X-1LF-27K"},{"$f":"IF(ISERROR(VLOOKUP($A$32,Voorraad!$A$2:$J$1001,10)),\"\",VLOOKUP($A$32,Voorraad!$A$2:$J$1001,10))","v":0},{"$f":"IF(ISERROR(VLOOKUP($A$32,Voorraad!$A$2:$G$1001,6)),\"\",VLOOKUP($A$32,Voorraad!$A$2:$G$1001,6))","v":"MOUSER"},{"$f":"IF(ISERROR(VLOOKUP($A$32,Voorraad!$A$2:$G$1001,7)),\"\",VLOOKUP($A$32,Voorraad!$A$2:$G$1001,7))","v":"BOURNS"},{"$f":"IF(ISERROR(VLOOKUP($A$32,Voorraad!$A$2:$G$1001,5)),\"\",VLOOKUP($A$32,Voorraad!$A$2:$G$1001,5))","v":8510},{"$f":"IF(ISERROR(VLOOKUP($A$32,Voorraad!$A$2:$D$1001,4)),\"\",VLOOKUP($A$32,Voorraad!$A$2:$D$1001,4))","v":1},150,149]
["BR4530G",{"$f":"[6]Sheet1!$E$28","v":150},{"$f":"IF(ISERROR(VLOOKUP($A$33,Voorraad!$A$2:$D$1001,1)),\"\",VLOOKUP($A$33,Voorraad!$A$2:$D$1001,1))","v":"BR4530G"},{"$f":"IF(ISERROR(VLOOKUP($A$33,Voorraad!$A$2:$D$1001,3)),\"\",VLOOKUP($A$33,Voorraad!$A$2:$D$1001,3))","v":"RA 100K-9X SIL10 4610X-1"},{"$f":"IF(ISERROR(VLOOKUP($A$33,Voorraad!$A$2:$D$1001,2)),\"\",VLOOKUP($A$33,Voorraad!$A$2:$D$1001,2))","v":"#140X1510B"},{"$f":"IF(ISERROR(VLOOKUP($A$33,Voorraad!$A$2:$H$1001,8)),\"\",VLOOKUP($A$33,Voorraad!$A$2:$H$1001,8))","v":500302},{"$f":"IF(ISERROR(VLOOKUP($A$33,Voorraad!$A$2:$I$1001,9)),\"\",VLOOKUP($A$33,Voorraad!$A$2:$I$1001,9))","v":0},{"$f":"IF(ISERROR(VLOOKUP($A$33,Voorraad!$A$2:$J$1001,10)),\"\",VLOOKUP($A$33,Voorraad!$A$2:$J$1001,10))","v":0},{"$f":"IF(ISERROR(VLOOKUP($A$33,Voorraad!$A$2:$G$1001,6)),\"\",VLOOKUP($A$33,Voorraad!$A$2:$G$1001,6))","v":0},{"$f":"IF(ISERROR(VLOOKUP($A$33,Voorraad!$A$2:$G$1001,7)),\"\",VLOOKUP($A$33,Voorraad!$A$2:$G$1001,7))","v":"BOURNS"},{"$f":"IF(ISERROR(VLOOKUP($A$33,Voorraad!$A$2:$G$1001,5)),\"\",VLOOKUP($A$33,Voorraad!$A$2:$G$1001,5))","v":8510},{"$f":"IF(ISERROR(VLOOKUP($A$33,Voorraad!$A$2:$D$1001,4)),\"\",VLOOKUP($A$33,Voorraad!$A$2:$D$1001,4))","v":-46},150,196]
["BR4535G",{"$f":"[6]Sheet1!$E$29","v":150},{"$f":"IF(ISERROR(VLOOKUP($A$34,Voorraad!$A$2:$D$1001,1)),\"\",VLOOKUP($A$34,Voorraad!$A$2:$D$1001,1))","v":"BR4535G"},{"$f":"IF(ISERROR(VLOOKUP($A$34,Voorraad!$A$2:$D$1001,3)),\"\",VLOOKUP($A$34,Voorraad!$A$2:$D$1001,3))","v":"RA 100K-8X SIL8 4116R-001"},{"$f":"IF(ISERROR(VLOOKUP($A$34,Voorraad!$A$2:$D$1001,2)),\"\",VLOOKUP($A$34,Voorraad!$A$2:$D$1001,2))","v":"#152R15100B"},{"$f":"IF(ISERROR(VLOOKUP($A$34,Voorraad!$A$2:$H$1001,8)),\"\",VLOOKUP($A$34,Voorraad!$A$2:$H$1001,8))","v":500204},{"$f":"IF(ISERROR(VLOOKUP($A$34,Voorraad!$A$2:$I$1001,9)),\"\",VLOOKUP($A$34,Voorraad!$A$2:$I$1001,9))","v":"4116R-001-104"},{"$f":"IF(ISERROR(VLOOKUP($A$34,Voorraad!$A$2:$J$1001,10)),\"\",VLOOKUP($A$34,Voorraad!$A$2:$J$1001,10))","v":0},{"$f":"IF(ISERROR(VLOOKUP($A$34,Voorraad!$A$2:$G$1001,6)),\"\",VLOOKUP($A$34,Voorraad!$A$2:$G$1001,6))","v":"UT SOURCE"},{"$f":"IF(ISERROR(VLOOKUP($A$34,Voorraad!$A$2:$G$1001,7)),\"\",VLOOKUP($A$34,Voorraad!$A$2:$G$1001,7))","v":"BOURNS"},{"$f":"IF(ISERROR(VLOOKUP($A$34,Voorraad!$A$2:$G$1001,5)),\"\",VLOOKUP($A$34,Voorraad!$A$2:$G$1001,5))","v":8510},{"$f":"IF(ISERROR(VLOOKUP($A$34,Voorraad!$A$2:$D$1001,4)),\"\",VLOOKUP($A$34,Voorraad!$A$2:$D$1001,4))","v":0},150,150]
["BR4540",{"$f":"[6]Sheet1!$E$30","v":75},{"$f":"IF(ISERROR(VLOOKUP($A$35,Voorraad!$A$2:$D$1001,1)),\"\",VLOOKUP($A$35,Voorraad!$A$2:$D$1001,1))","v":"BR4540"},{"$f":"IF(ISERROR(VLOOKUP($A$35,Voorraad!$A$2:$D$1001,3)),\"\",VLOOKUP($A$35,Voorraad!$A$2:$D$1001,3))","v":"CC 220P 3KV 20% 3E"},{"$f":"IF(ISERROR(VLOOKUP($A$35,Voorraad!$A$2:$D$1001,2)),\"\",VLOOKUP($A$35,Voorraad!$A$2:$D$1001,2))","v":"#29222100020P"},{"$f":"IF(ISERROR(VLOOKUP($A$35,Voorraad!$A$2:$H$1001,8)),\"\",VLOOKUP($A$35,Voorraad!$A$2:$H$1001,8))","v":500131},{"$f":"IF(ISERROR(VLOOKUP($A$35,Voorraad!$A$2:$I$1001,9)),\"\",VLOOKUP($A$35,Voorraad!$A$2:$I$1001,9))","v":0},{"$f":"IF(ISERROR(VLOOKUP($A$35,Voorraad!$A$2:$J$1001,10)),\"\",VLOOKUP($A$35,Voorraad!$A$2:$J$1001,10))","v":0},{"$f":"IF(ISERROR(VLOOKUP($A$35,Voorraad!$A$2:$G$1001,6)),\"\",VLOOKUP($A$35,Voorraad!$A$2:$G$1001,6))","v":0},{"$f":"IF(ISERROR(VLOOKUP($A$35,Voorraad!$A$2:$G$1001,7)),\"\",VLOOKUP($A$35,Voorraad!$A$2:$G$1001,7))","v":"AVX / PANASONIC"},{"$f":"IF(ISERROR(VLOOKUP($A$35,Voorraad!$A$2:$G$1001,5)),\"\",VLOOKUP($A$35,Voorraad!$A$2:$G$1001,5))","v":8510},{"$f":"IF(ISERROR(VLOOKUP($A$35,Voorraad!$A$2:$D$1001,4)),\"\",VLOOKUP($A$35,Voorraad!$A$2:$D$1001,4))","v":-75},75,150]
["BR45810",{"$f":"[6]Sheet1!$E$31","v":225},{"$f":"IF(ISERROR(VLOOKUP($A$36,Voorraad!$A$2:$D$1001,1)),\"\",VLOOKUP($A$36,Voorraad!$A$2:$D$1001,1))","v":"BR45810"},{"$f":"IF(ISERROR(VLOOKUP($A$36,Voorraad!$A$2:$D$1001,3)),\"\",VLOOKUP($A$36,Voorraad!$A$2:$D$1001,3))","v":"CC 1N 100V +/- 10% 2E"},{"$f":"IF(ISERROR(VLOOKUP($A$36,Voorraad!$A$2:$D$1001,2)),\"\",VLOOKUP($A$36,Voorraad!$A$2:$D$1001,2))","v":"#2231010K"},{"$f":"IF(ISERROR(VLOOKUP($A$36,Voorraad!$A$2:$H$1001,8)),\"\",VLOOKUP($A$36,Voorraad!$A$2:$H$1001,8))","v":500135},{"$f":"IF(ISERROR(VLOOKUP($A$36,Voorraad!$A$2:$I$1001,9)),\"\",VLOOKUP($A$36,Voorraad!$A$2:$I$1001,9))","v":"FG28X7R1H102KNT6"},{"$f":"IF(ISERROR(VLOOKUP($A$36,Voorraad!$A$2:$J$1001,10)),\"\",VLOOKUP($A$36,Voorraad!$A$2:$J$1001,10))","v":0},{"$f":"IF(ISERROR(VLOOKUP($A$36,Voorraad!$A$2:$G$1001,6)),\"\",VLOOKUP($A$36,Voorraad!$A$2:$G$1001,6))","v":"MOUSER"},{"$f":"IF(ISERROR(VLOOKUP($A$36,Voorraad!$A$2:$G$1001,7)),\"\",VLOOKUP($A$36,Voorraad!$A$2:$G$1001,7))","v":"PHILIPS"},{"$f":"IF(ISERROR(VLOOKUP($A$36,Voorraad!$A$2:$G$1001,5)),\"\",VLOOKUP($A$36,Voorraad!$A$2:$G$1001,5))","v":8510},{"$f":"IF(ISERROR(VLOOKUP($A$36,Voorraad!$A$2:$D$1001,4)),\"\",VLOOKUP($A$36,Voorraad!$A$2:$D$1001,4))","v":7},225,218]
["BR45812",{"$f":"[6]Sheet1!$E$32","v":75},{"$f":"IF(ISERROR(VLOOKUP($A$37,Voorraad!$A$2:$D$1001,1)),\"\",VLOOKUP($A$37,Voorraad!$A$2:$D$1001,1))","v":"BR45812"},{"$f":"IF(ISERROR(VLOOKUP($A$37,Voorraad!$A$2:$D$1001,3)),\"\",VLOOKUP($A$37,Voorraad!$A$2:$D$1001,3))","v":"CC 2N2 100V 10% 2E K2000"},{"$f":"IF(ISERROR(VLOOKUP($A$37,Voorraad!$A$2:$D$1001,2)),\"\",VLOOKUP($A$37,Voorraad!$A$2:$D$1001,2))","v":"#2202210KR"},{"$f":"IF(ISERROR(VLOOKUP($A$37,Voorraad!$A$2:$H$1001,8)),\"\",VLOOKUP($A$37,Voorraad!$A$2:$H$1001,8))","v":500325},{"$f":"IF(ISERROR(VLOOKUP($A$37,Voorraad!$A$2:$I$1001,9)),\"\",VLOOKUP($A$37,Voorraad!$A$2:$I$1001,9))","v":"594-K222K15X7RH5UL2"},{"$f":"IF(ISERROR(VLOOKUP($A$37,Voorraad!$A$2:$J$1001,10)),\"\",VLOOKUP($A$37,Voorraad!$A$2:$J$1001,10))","v":0},{"$f":"IF(ISERROR(VLOOKUP($A$37,Voorraad!$A$2:$G$1001,6)),\"\",VLOOKUP($A$37,Voorraad!$A$2:$G$1001,6))","v":"MOUSER"},{"$f":"IF(ISERROR(VLOOKUP($A$37,Voorraad!$A$2:$G$1001,7)),\"\",VLOOKUP($A$37,Voorraad!$A$2:$G$1001,7))","v":"BCE"},{"$f":"IF(ISERROR(VLOOKUP($A$37,Voorraad!$A$2:$G$1001,5)),\"\",VLOOKUP($A$37,Voorraad!$A$2:$G$1001,5))","v":8510},{"$f":"IF(ISERROR(VLOOKUP($A$37,Voorraad!$A$2:$D$1001,4)),\"\",VLOOKUP($A$37,Voorraad!$A$2:$D$1001,4))","v":0},75,75]
["BR5010",{"$f":"[6]Sheet1!$E$33","v":450},{"$f":"IF(ISERROR(VLOOKUP($A$38,Voorraad!$A$2:$D$1001,1)),\"\",VLOOKUP($A$38,Voorraad!$A$2:$D$1001,1))","v":"BR5010"},{"$f":"IF(ISERROR(VLOOKUP($A$38,Voorraad!$A$2:$D$1001,3)),\"\",VLOOKUP($A$38,Voorraad!$A$2:$D$1001,3))","v":"CC 47N 63V +80 -20% 2E 55'"},{"$f":"IF(ISERROR(VLOOKUP($A$38,Voorraad!$A$2:$D$1001,2)),\"\",VLOOKUP($A$38,Voorraad!$A$2:$D$1001,2))","v":"#2344710KKE"},{"$f":"IF(ISERROR(VLOOKUP($A$38,Voorraad!$A$2:$H$1001,8)),\"\",VLOOKUP($A$38,Voorraad!$A$2:$H$1001,8))","v":500138},{"$f":"IF(ISERROR(VLOOKUP($A$38,Voorraad!$A$2:$I$1001,9)),\"\",VLOOKUP($A$38,Voorraad!$A$2:$I$1001,9))","v":0},{"$f":"IF(ISERROR(VLOOKUP($A$38,Voorraad!$A$2:$J$1001,10)),\"\",VLOOKUP($A$38,Voorraad!$A$2:$J$1001,10))","v":"Alternatief: 47NF/100V"},{"$f":"IF(ISERROR(VLOOKUP($A$38,Voorraad!$A$2:$G$1001,6)),\"\",VLOOKUP($A$38,Voorraad!$A$2:$G$1001,6))","v":0},{"$f":"IF(ISERROR(VLOOKUP($A$38,Voorraad!$A$2:$G$1001,7)),\"\",VLOOKUP($A$38,Voorraad!$A$2:$G$1001,7))","v":"BCC"},{"$f":"IF(ISERROR(VLOOKUP($A$38,Voorraad!$A$2:$G$1001,5)),\"\",VLOOKUP($A$38,Voorraad!$A$2:$G$1001,5))","v":"8410/8510"},{"$f":"IF(ISERROR(VLOOKUP($A$38,Voorraad!$A$2:$D$1001,4)),\"\",VLOOKUP($A$38,Voorraad!$A$2:$D$1001,4))","v":-450},450,900]
["BR5060",{"$f":"[6]Sheet1!$E$34","v":150},{"$f":"IF(ISERROR(VLOOKUP($A$39,Voorraad!$A$2:$D$1001,1)),\"\",VLOOKUP($A$39,Voorraad!$A$2:$D$1001,1))","v":"BR5060"},{"$f":"IF(ISERROR(VLOOKUP($A$39,Voorraad!$A$2:$D$1001,3)),\"\",VLOOKUP($A$39,Voorraad!$A$2:$D$1001,3))","v":"CC 27P 100V 2% 2E NPO 85'"},{"$f":"IF(ISERROR(VLOOKUP($A$39,Voorraad!$A$2:$D$1001,2)),\"\",VLOOKUP($A$39,Voorraad!$A$2:$D$1001,2))","v":"#2112710GB"},{"$f":"IF(ISERROR(VLOOKUP($A$39,Voorraad!$A$2:$H$1001,8)),\"\",VLOOKUP($A$39,Voorraad!$A$2:$H$1001,8))","v":500125},{"$f":"IF(ISERROR(VLOOKUP($A$39,Voorraad!$A$2:$I$1001,9)),\"\",VLOOKUP($A$39,Voorraad!$A$2:$I$1001,9))","v":"CCK-27P"},{"$f":"IF(ISERROR(VLOOKUP($A$39,Voorraad!$A$2:$J$1001,10)),\"\",VLOOKUP($A$39,Voorraad!$A$2:$J$1001,10))","v":0},{"$f":"IF(ISERROR(VLOOKUP($A$39,Voorraad!$A$2:$G$1001,6)),\"\",VLOOKUP($A$39,Voorraad!$A$2:$G$1001,6))","v":"TME"},{"$f":"IF(ISERROR(VLOOKUP($A$39,Voorraad!$A$2:$G$1001,7)),\"\",VLOOKUP($A$39,Voorraad!$A$2:$G$1001,7))","v":"BCC"},{"$f":"IF(ISERROR(VLOOKUP($A$39,Voorraad!$A$2:$G$1001,5)),\"\",VLOOKUP($A$39,Voorraad!$A$2:$G$1001,5))","v":8510},{"$f":"IF(ISERROR(VLOOKUP($A$39,Voorraad!$A$2:$D$1001,4)),\"\",VLOOKUP($A$39,Voorraad!$A$2:$D$1001,4))","v":-2},150,152]
["BR5070",{"$f":"[6]Sheet1!$E$35","v":75},{"$f":"IF(ISERROR(VLOOKUP($A$40,Voorraad!$A$2:$D$1001,1)),\"\",VLOOKUP($A$40,Voorraad!$A$2:$D$1001,1))","v":"BR5070"},{"$f":"IF(ISERROR(VLOOKUP($A$40,Voorraad!$A$2:$D$1001,3)),\"\",VLOOKUP($A$40,Voorraad!$A$2:$D$1001,3))","v":"CC 39P 100V +/- 0,25 2E"},{"$f":"IF(ISERROR(VLOOKUP($A$40,Voorraad!$A$2:$D$1001,2)),\"\",VLOOKUP($A$40,Voorraad!$A$2:$D$1001,2))","v":"#2113910GB"},{"$f":"IF(ISERROR(VLOOKUP($A$40,Voorraad!$A$2:$H$1001,8)),\"\",VLOOKUP($A$40,Voorraad!$A$2:$H$1001,8))","v":599999},{"$f":"IF(ISERROR(VLOOKUP($A$40,Voorraad!$A$2:$I$1001,9)),\"\",VLOOKUP($A$40,Voorraad!$A$2:$I$1001,9))","v":0},{"$f":"IF(ISERROR(VLOOKUP($A$40,Voorraad!$A$2:$J$1001,10)),\"\",VLOOKUP($A$40,Voorraad!$A$2:$J$1001,10))","v":0},{"$f":"IF(ISERROR(VLOOKUP($A$40,Voorraad!$A$2:$G$1001,6)),\"\",VLOOKUP($A$40,Voorraad!$A$2:$G$1001,6))","v":0},{"$f":"IF(ISERROR(VLOOKUP($A$40,Voorraad!$A$2:$G$1001,7)),\"\",VLOOKUP($A$40,Voorraad!$A$2:$G$1001,7))","v":"BCE"},{"$f":"IF(ISERROR(VLOOKUP($A$40,Voorraad!$A$2:$G$1001,5)),\"\",VLOOKUP($A$40,Voorraad!$A$2:$G$1001,5))","v":8510},{"$f":"IF(ISERROR(VLOOKUP($A$40,Voorraad!$A$2:$D$1001,4)),\"\",VLOOKUP($A$40,Voorraad!$A$2:$D$1001,4))","v":232},{"$f":"B40","v":75},0]
["BR5080",{"$f":"[6]Sheet1!$E$36","v":150},{"$f":"IF(ISERROR(VLOOKUP($A$41,Voorraad!$A$2:$D$1001,1)),\"\",VLOOKUP($A$41,Voorraad!$A$2:$D$1001,1))","v":"BR5080"},{"$f":"IF(ISERROR(VLOOKUP($A$41,Voorraad!$A$2:$D$1001,3)),\"\",VLOOKUP($A$41,Voorraad!$A$2:$D$1001,3))","v":"CC 10N 100V 10% 2E X7R"},{"$f":"IF(ISERROR(VLOOKUP($A$41,Voorraad!$A$2:$D$1001,2)),\"\",VLOOKUP($A$41,Voorraad!$A$2:$D$1001,2))","v":"#2341010KS"},{"$f":"IF(ISERROR(VLOOKUP($A$41,Voorraad!$A$2:$H$1001,8)),\"\",VLOOKUP($A$41,Voorraad!$A$2:$H$1001,8))","v":500241},{"$f":"IF(ISERROR(VLOOKUP($A$41,Voorraad!$A$2:$I$1001,9)),\"\",VLOOKUP($A$41,Voorraad!$A$2:$I$1001,9))","v":"C317C103K1R5TA"},{"$f":"IF(ISERROR(VLOOKUP($A$41,Voorraad!$A$2:$J$1001,10)),\"\",VLOOKUP($A$41,Voorraad!$A$2:$J$1001,10))","v":0},{"$f":"IF(ISERROR(VLOOKUP($A$41,Voorraad!$A$2:$G$1001,6)),\"\",VLOOKUP($A$41,Voorraad!$A$2:$G$1001,6))","v":"TME"},{"$f":"IF(ISERROR(VLOOKUP($A$41,Voorraad!$A$2:$G$1001,7)),\"\",VLOOKUP($A$41,Voorraad!$A$2:$G$1001,7))","v":"KEMET"},{"$f":"IF(ISERROR(VLOOKUP($A$41,Voorraad!$A$2:$G$1001,5)),\"\",VLOOKUP($A$41,Voorraad!$A$2:$G$1001,5))","v":8510},{"$f":"IF(ISERROR(VLOOKUP($A$41,Voorraad!$A$2:$D$1001,4)),\"\",VLOOKUP($A$41,Voorraad!$A$2:$D$1001,4))","v":0},150,150]
["BR5090",{"$f":"[6]Sheet1!$E$37","v":225},{"$f":"IF(ISERROR(VLOOKUP($A$42,Voorraad!$A$2:$D$1001,1)),\"\",VLOOKUP($A$42,Voorraad!$A$2:$D$1001,1))","v":"BR5090"},{"$f":"IF(ISERROR(VLOOKUP($A$42,Voorraad!$A$2:$D$1001,3)),\"\",VLOOKUP($A$42,Voorraad!$A$2:$D$1001,3))","v":"CC 22N 100V 10% X7R 2E"},{"$f":"IF(ISERROR(VLOOKUP($A$42,Voorraad!$A$2:$D$1001,2)),\"\",VLOOKUP($A$42,Voorraad!$A$2:$D$1001,2))","v":"#2242210KSX"},{"$f":"IF(ISERROR(VLOOKUP($A$42,Voorraad!$A$2:$H$1001,8)),\"\",VLOOKUP($A$42,Voorraad!$A$2:$H$1001,8))","v":500137},{"$f":"IF(ISERROR(VLOOKUP($A$42,Voorraad!$A$2:$I$1001,9)),\"\",VLOOKUP($A$42,Voorraad!$A$2:$I$1001,9))","v":"80-C322C223K1R-TR"},{"$f":"IF(ISERROR(VLOOKUP($A$42,Voorraad!$A$2:$J$1001,10)),\"\",VLOOKUP($A$42,Voorraad!$A$2:$J$1001,10))","v":0},{"$f":"IF(ISERROR(VLOOKUP($A$42,Voorraad!$A$2:$G$1001,6)),\"\",VLOOKUP($A$42,Voorraad!$A$2:$G$1001,6))","v":"MOUSER"},{"$f":"IF(ISERROR(VLOOKUP($A$42,Voorraad!$A$2:$G$1001,7)),\"\",VLOOKUP($A$42,Voorraad!$A$2:$G$1001,7))","v":"KEMET"},{"$f":"IF(ISERROR(VLOOKUP($A$42,Voorraad!$A$2:$G$1001,5)),\"\",VLOOKUP($A$42,Voorraad!$A$2:$G$1001,5))","v":8510},{"$f":"IF(ISERROR(VLOOKUP($A$42,Voorraad!$A$2:$D$1001,4)),\"\",VLOOKUP($A$42,Voorraad!$A$2:$D$1001,4))","v":2},225,223]
["BR6060",{"$f":"[6]Sheet1!$E$38","v":1575},{"$f":"IF(ISERROR(VLOOKUP($A$43,Voorraad!$A$2:$D$1001,1)),\"\",VLOOKUP($A$43,Voorraad!$A$2:$D$1001,1))","v":"BR6060"},{"$f":"IF(ISERROR(VLOOKUP($A$43,Voorraad!$A$2:$D$1001,3)),\"\",VLOOKUP($A$43,Voorraad!$A$2:$D$1001,3))","v":"CF 330N 63V 10% 2E MKS22"},{"$f":"IF(ISERROR(VLOOKUP($A$43,Voorraad!$A$2:$D$1001,2)),\"\",VLOOKUP($A$43,Voorraad!$A$2:$D$1001,2))","v":"#25053305KW1"},{"$f":"IF(ISERROR(VLOOKUP($A$43,Voorraad!$A$2:$H$1001,8)),\"\",VLOOKUP($A$43,Voorraad!$A$2:$H$1001,8))","v":500324},{"$f":"IF(ISERROR(VLOOKUP($A$43,Voorraad!$A$2:$I$1001,9)),\"\",VLOOKUP($A$43,Voorraad!$A$2:$I$1001,9))","v":0},{"$f":"IF(ISERROR(VLOOKUP($A$43,Voorraad!$A$2:$J$1001,10)),\"\",VLOOKUP($A$43,Voorraad!$A$2:$J$1001,10))","v":0},{"$f":"IF(ISERROR(VLOOKUP($A$43,Voorraad!$A$2:$G$1001,6)),\"\",VLOOKUP($A$43,Voorraad!$A$2:$G$1001,6))","v":0},{"$f":"IF(ISERROR(VLOOKUP($A$43,Voorraad!$A$2:$G$1001,7)),\"\",VLOOKUP($A$43,Voorraad!$A$2:$G$1001,7))","v":"WIMA"},{"$f":"IF(ISERROR(VLOOKUP($A$43,Voorraad!$A$2:$G$1001,5)),\"\",VLOOKUP($A$43,Voorraad!$A$2:$G$1001,5))","v":8510},{"$f":"IF(ISERROR(VLOOKUP($A$43,Voorraad!$A$2:$D$1001,4)),\"\",VLOOKUP($A$43,Voorraad!$A$2:$D$1001,4))","v":-1575},1575,3150]
["BR6070",{"$f":"[6]Sheet1!$E$39","v":75},{"$f":"IF(ISERROR(VLOOKUP($A$44,Voorraad!$A$2:$D$1001,1)),\"\",VLOOKUP($A$44,Voorraad!$A$2:$D$1001,1))","v":"BR6070"},{"$f":"IF(ISERROR(VLOOKUP($A$44,Voorraad!$A$2:$D$1001,3)),\"\",VLOOKUP($A$44,Voorraad!$A$2:$D$1001,3))","v":"CF 100P630V 2,5% 6E 300'"},{"$f":"IF(ISERROR(VLOOKUP($A$44,Voorraad!$A$2:$D$1001,2)),\"\",VLOOKUP($A$44,Voorraad!$A$2:$D$1001,2))","v":"#2921063025EMZ"},{"$f":"IF(ISERROR(VLOOKUP($A$44,Voorraad!$A$2:$H$1001,8)),\"\",VLOOKUP($A$44,Voorraad!$A$2:$H$1001,8))","v":0},{"$f":"IF(ISERROR(VLOOKUP($A$44,Voorraad!$A$2:$I$1001,9)),\"\",VLOOKUP($A$44,Voorraad!$A$2:$I$1001,9))","v":9520015},{"$f":"IF(ISERROR(VLOOKUP($A$44,Voorraad!$A$2:$J$1001,10)),\"\",VLOOKUP($A$44,Voorraad!$A$2:$J$1001,10))","v":0},{"$f":"IF(ISERROR(VLOOKUP($A$44,Voorraad!$A$2:$G$1001,6)),\"\",VLOOKUP($A$44,Voorraad!$A$2:$G$1001,6))","v":"FARNELL"},{"$f":"IF(ISERROR(VLOOKUP($A$44,Voorraad!$A$2:$G$1001,7)),\"\",VLOOKUP($A$44,Voorraad!$A$2:$G$1001,7))","v":"EMZ"},{"$f":"IF(ISERROR(VLOOKUP($A$44,Voorraad!$A$2:$G$1001,5)),\"\",VLOOKUP($A$44,Voorraad!$A$2:$G$1001,5))","v":8510},{"$f":"IF(ISERROR(VLOOKUP($A$44,Voorraad!$A$2:$D$1001,4)),\"\",VLOOKUP($A$44,Voorraad!$A$2:$D$1001,4))","v":-75},75,150]
["BR6080",{"$f":"[6]Sheet1!$E$40","v":75},{"$f":"IF(ISERROR(VLOOKUP($A$45,Voorraad!$A$2:$D$1001,1)),\"\",VLOOKUP($A$45,Voorraad!$A$2:$D$1001,1))","v":"BR6080"},{"$f":"IF(ISERROR(VLOOKUP($A$45,Voorraad!$A$2:$D$1001,3)),\"\",VLOOKUP($A$45,Voorraad!$A$2:$D$1001,3))","v":"CE 220U 40V -10 +50% AX"},{"$f":"IF(ISERROR(VLOOKUP($A$45,Voorraad!$A$2:$D$1001,2)),\"\",VLOOKUP($A$45,Voorraad!$A$2:$D$1001,2))","v":"#27722040V"},{"$f":"IF(ISERROR(VLOOKUP($A$45,Voorraad!$A$2:$H$1001,8)),\"\",VLOOKUP($A$45,Voorraad!$A$2:$H$1001,8))","v":500225},{"$f":"IF(ISERROR(VLOOKUP($A$45,Voorraad!$A$2:$I$1001,9)),\"\",VLOOKUP($A$45,Voorraad!$A$2:$I$1001,9))","v":0},{"$f":"IF(ISERROR(VLOOKUP($A$45,Voorraad!$A$2:$J$1001,10)),\"\",VLOOKUP($A$45,Voorraad!$A$2:$J$1001,10))","v":0},{"$f":"IF(ISERROR(VLOOKUP($A$45,Voorraad!$A$2:$G$1001,6)),\"\",VLOOKUP($A$45,Voorraad!$A$2:$G$1001,6))","v":0},{"$f":"IF(ISERROR(VLOOKUP($A$45,Voorraad!$A$2:$G$1001,7)),\"\",VLOOKUP($A$45,Voorraad!$A$2:$G$1001,7))","v":"BCC"},{"$f":"IF(ISERROR(VLOOKUP($A$45,Voorraad!$A$2:$G$1001,5)),\"\",VLOOKUP($A$45,Voorraad!$A$2:$G$1001,5))","v":8510},{"$f":"IF(ISERROR(VLOOKUP($A$45,Voorraad!$A$2:$D$1001,4)),\"\",VLOOKUP($A$45,Voorraad!$A$2:$D$1001,4))","v":0},75,75]
["BR6090",{"$f":"[6]Sheet1!$E$41","v":75},{"$f":"IF(ISERROR(VLOOKUP($A$46,Voorraad!$A$2:$D$1001,1)),\"\",VLOOKUP($A$46,Voorraad!$A$2:$D$1001,1))","v":"BR6090"},{"$f":"IF(ISERROR(VLOOKUP($A$46,Voorraad!$A$2:$D$1001,3)),\"\",VLOOKUP($A$46,Voorraad!$A$2:$D$1001,3))","v":"CE 1U5 40V 20% 175' SAL"},{"$f":"IF(ISERROR(VLOOKUP($A$46,Voorraad!$A$2:$D$1001,2)),\"\",VLOOKUP($A$46,Voorraad!$A$2:$D$1001,2))","v":"#30515040BC"},{"$f":"IF(ISERROR(VLOOKUP($A$46,Voorraad!$A$2:$H$1001,8)),\"\",VLOOKUP($A$46,Voorraad!$A$2:$H$1001,8))","v":0},{"$f":"IF(ISERROR(VLOOKUP($A$46,Voorraad!$A$2:$I$1001,9)),\"\",VLOOKUP($A$46,Voorraad!$A$2:$I$1001,9))","v":0},{"$f":"IF(ISERROR(VLOOKUP($A$46,Voorraad!$A$2:$J$1001,10)),\"\",VLOOKUP($A$46,Voorraad!$A$2:$J$1001,10))","v":"2.2UF mag ook, is beter verkrijgbaar"},{"$f":"IF(ISERROR(VLOOKUP($A$46,Voorraad!$A$2:$G$1001,6)),\"\",VLOOKUP($A$46,Voorraad!$A$2:$G$1001,6))","v":0},{"$f":"IF(ISERROR(VLOOKUP($A$46,Voorraad!$A$2:$G$1001,7)),\"\",VLOOKUP($A$46,Voorraad!$A$2:$G$1001,7))","v":"BCC"},{"$f":"IF(ISERROR(VLOOKUP($A$46,Voorraad!$A$2:$G$1001,5)),\"\",VLOOKUP($A$46,Voorraad!$A$2:$G$1001,5))","v":8510},{"$f":"IF(ISERROR(VLOOKUP($A$46,Voorraad!$A$2:$D$1001,4)),\"\",VLOOKUP($A$46,Voorraad!$A$2:$D$1001,4))","v":108},75,0]
["BSH001",{"$f":"[6]Sheet1!$E$42","v":525},{"$f":"IF(ISERROR(VLOOKUP($A$47,Voorraad!$A$2:$D$1001,1)),\"\",VLOOKUP($A$47,Voorraad!$A$2:$D$1001,1))","v":"BSH001"},{"$f":"IF(ISERROR(VLOOKUP($A$47,Voorraad!$A$2:$D$1001,3)),\"\",VLOOKUP($A$47,Voorraad!$A$2:$D$1001,3))","v":"CE 68U 6V3 20% 175' SAL"},{"$f":"IF(ISERROR(VLOOKUP($A$47,Voorraad!$A$2:$D$1001,2)),\"\",VLOOKUP($A$47,Voorraad!$A$2:$D$1001,2))","v":"#2816680062M"},{"$f":"IF(ISERROR(VLOOKUP($A$47,Voorraad!$A$2:$H$1001,8)),\"\",VLOOKUP($A$47,Voorraad!$A$2:$H$1001,8))","v":500119},{"$f":"IF(ISERROR(VLOOKUP($A$47,Voorraad!$A$2:$I$1001,9)),\"\",VLOOKUP($A$47,Voorraad!$A$2:$I$1001,9))","v":"EEUFM1E101"},{"$f":"IF(ISERROR(VLOOKUP($A$47,Voorraad!$A$2:$J$1001,10)),\"\",VLOOKUP($A$47,Voorraad!$A$2:$J$1001,10))","v":0},{"$f":"IF(ISERROR(VLOOKUP($A$47,Voorraad!$A$2:$G$1001,6)),\"\",VLOOKUP($A$47,Voorraad!$A$2:$G$1001,6))","v":"TME"},{"$f":"IF(ISERROR(VLOOKUP($A$47,Voorraad!$A$2:$G$1001,7)),\"\",VLOOKUP($A$47,Voorraad!$A$2:$G$1001,7))","v":"VISHAY"},{"$f":"IF(ISERROR(VLOOKUP($A$47,Voorraad!$A$2:$G$1001,5)),\"\",VLOOKUP($A$47,Voorraad!$A$2:$G$1001,5))","v":8510},{"$f":"IF(ISERROR(VLOOKUP($A$47,Voorraad!$A$2:$D$1001,4)),\"\",VLOOKUP($A$47,Voorraad!$A$2:$D$1001,4))","v":-495},525,1020]
["BX0026",{"$f":"[6]Sheet1!$E$43","v":75},{"$f":"IF(ISERROR(VLOOKUP($A$48,Voorraad!$A$2:$D$1001,1)),\"\",VLOOKUP($A$48,Voorraad!$A$2:$D$1001,1))","v":"BX0026"},{"$f":"IF(ISERROR(VLOOKUP($A$48,Voorraad!$A$2:$D$1001,3)),\"\",VLOOKUP($A$48,Voorraad!$A$2:$D$1001,3))","v":"XT 12.000000MHZ HC49U"},{"$f":"IF(ISERROR(VLOOKUP($A$48,Voorraad!$A$2:$D$1001,2)),\"\",VLOOKUP($A$48,Voorraad!$A$2:$D$1001,2))","v":"#320120000M"},{"$f":"IF(ISERROR(VLOOKUP($A$48,Voorraad!$A$2:$H$1001,8)),\"\",VLOOKUP($A$48,Voorraad!$A$2:$H$1001,8))","v":500246},{"$f":"IF(ISERROR(VLOOKUP($A$48,Voorraad!$A$2:$I$1001,9)),\"\",VLOOKUP($A$48,Voorraad!$A$2:$I$1001,9))","v":"173-4735"},{"$f":"IF(ISERROR(VLOOKUP($A$48,Voorraad!$A$2:$J$1001,10)),\"\",VLOOKUP($A$48,Voorraad!$A$2:$J$1001,10))","v":0},{"$f":"IF(ISERROR(VLOOKUP($A$48,Voorraad!$A$2:$G$1001,6)),\"\",VLOOKUP($A$48,Voorraad!$A$2:$G$1001,6))","v":"RS COMPONENTS"},{"$f":"IF(ISERROR(VLOOKUP($A$48,Voorraad!$A$2:$G$1001,7)),\"\",VLOOKUP($A$48,Voorraad!$A$2:$G$1001,7))","v":0},{"$f":"IF(ISERROR(VLOOKUP($A$48,Voorraad!$A$2:$G$1001,5)),\"\",VLOOKUP($A$48,Voorraad!$A$2:$G$1001,5))","v":8510},{"$f":"IF(ISERROR(VLOOKUP($A$48,Voorraad!$A$2:$D$1001,4)),\"\",VLOOKUP($A$48,Voorraad!$A$2:$D$1001,4))","v":29},75,46]
["BU0008",{"$f":"[6]Sheet1!$E$44","v":75},{"$f":"IF(ISERROR(VLOOKUP($A$49,Voorraad!$A$2:$D$1001,1)),\"\",VLOOKUP($A$49,Voorraad!$A$2:$D$1001,1))","v":"BU0008"},{"$f":"IF(ISERROR(VLOOKUP($A$49,Voorraad!$A$2:$D$1001,3)),\"\",VLOOKUP($A$49,Voorraad!$A$2:$D$1001,3))","v":"L 1000UH 100MA 10% AX 85'"},{"$f":"IF(ISERROR(VLOOKUP($A$49,Voorraad!$A$2:$D$1001,2)),\"\",VLOOKUP($A$49,Voorraad!$A$2:$D$1001,2))","v":"#33108S1105J"},{"$f":"IF(ISERROR(VLOOKUP($A$49,Voorraad!$A$2:$H$1001,8)),\"\",VLOOKUP($A$49,Voorraad!$A$2:$H$1001,8))","v":500210},{"$f":"IF(ISERROR(VLOOKUP($A$49,Voorraad!$A$2:$I$1001,9)),\"\",VLOOKUP($A$49,Voorraad!$A$2:$I$1001,9))","v":608609},{"$f":"IF(ISERROR(VLOOKUP($A$49,Voorraad!$A$2:$J$1001,10)),\"\",VLOOKUP($A$49,Voorraad!$A$2:$J$1001,10))","v":0},{"$f":"IF(ISERROR(VLOOKUP($A$49,Voorraad!$A$2:$G$1001,6)),\"\",VLOOKUP($A$49,Voorraad!$A$2:$G$1001,6))","v":"FARNELL"},{"$f":"IF(ISERROR(VLOOKUP($A$49,Voorraad!$A$2:$G$1001,7)),\"\",VLOOKUP($A$49,Voorraad!$A$2:$G$1001,7))","v":"EPCOS"},{"$f":"IF(ISERROR(VLOOKUP($A$49,Voorraad!$A$2:$G$1001,5)),\"\",VLOOKUP($A$49,Voorraad!$A$2:$G$1001,5))","v":8510},{"$f":"IF(ISERROR(VLOOKUP($A$49,Voorraad!$A$2:$D$1001,4)),\"\",VLOOKUP($A$49,Voorraad!$A$2:$D$1001,4))","v":0},75,75]
["BU0009",{"$f":"[6]Sheet1!$E$45","v":150},{"$f":"IF(ISERROR(VLOOKUP($A$50,Voorraad!$A$2:$D$1001,1)),\"\",VLOOKUP($A$50,Voorraad!$A$2:$D$1001,1))","v":"BU0009"},{"$f":"IF(ISERROR(VLOOKUP($A$50,Voorraad!$A$2:$D$1001,3)),\"\",VLOOKUP($A$50,Voorraad!$A$2:$D$1001,3))","v":"L 47UH 340MA 10% AX 85'"},{"$f":"IF(ISERROR(VLOOKUP($A$50,Voorraad!$A$2:$D$1001,2)),\"\",VLOOKUP($A$50,Voorraad!$A$2:$D$1001,2))","v":"#33108S1473J"},{"$f":"IF(ISERROR(VLOOKUP($A$50,Voorraad!$A$2:$H$1001,8)),\"\",VLOOKUP($A$50,Voorraad!$A$2:$H$1001,8))","v":500214},{"$f":"IF(ISERROR(VLOOKUP($A$50,Voorraad!$A$2:$I$1001,9)),\"\",VLOOKUP($A$50,Voorraad!$A$2:$I$1001,9))","v":0},{"$f":"IF(ISERROR(VLOOKUP($A$50,Voorraad!$A$2:$J$1001,10)),\"\",VLOOKUP($A$50,Voorraad!$A$2:$J$1001,10))","v":0},{"$f":"IF(ISERROR(VLOOKUP($A$50,Voorraad!$A$2:$G$1001,6)),\"\",VLOOKUP($A$50,Voorraad!$A$2:$G$1001,6))","v":0},{"$f":"IF(ISERROR(VLOOKUP($A$50,Voorraad!$A$2:$G$1001,7)),\"\",VLOOKUP($A$50,Voorraad!$A$2:$G$1001,7))","v":"EPCOS"},{"$f":"IF(ISERROR(VLOOKUP($A$50,Voorraad!$A$2:$G$1001,5)),\"\",VLOOKUP($A$50,Voorraad!$A$2:$G$1001,5))","v":8510},{"$f":"IF(ISERROR(VLOOKUP($A$50,Voorraad!$A$2:$D$1001,4)),\"\",VLOOKUP($A$50,Voorraad!$A$2:$D$1001,4))","v":750},150,0]
["BU0014",{"$f":"[6]Sheet1!$E$46","v":75},{"$f":"IF(ISERROR(VLOOKUP($A$51,Voorraad!$A$2:$D$1001,1)),\"\",VLOOKUP($A$51,Voorraad!$A$2:$D$1001,1))","v":"BU0014"},{"$f":"IF(ISERROR(VLOOKUP($A$51,Voorraad!$A$2:$D$1001,3)),\"\",VLOOKUP($A$51,Voorraad!$A$2:$D$1001,3))","v":"D 1N4004 400V-1A DO-41"},{"$f":"IF(ISERROR(VLOOKUP($A$51,Voorraad!$A$2:$D$1001,2)),\"\",VLOOKUP($A$51,Voorraad!$A$2:$D$1001,2))","v":"#341N4004DC"},{"$f":"IF(ISERROR(VLOOKUP($A$51,Voorraad!$A$2:$H$1001,8)),\"\",VLOOKUP($A$51,Voorraad!$A$2:$H$1001,8))","v":522000},{"$f":"IF(ISERROR(VLOOKUP($A$51,Voorraad!$A$2:$I$1001,9)),\"\",VLOOKUP($A$51,Voorraad!$A$2:$I$1001,9))","v":0},{"$f":"IF(ISERROR(VLOOKUP($A$51,Voorraad!$A$2:$J$1001,10)),\"\",VLOOKUP($A$51,Voorraad!$A$2:$J$1001,10))","v":0},{"$f":"IF(ISERROR(VLOOKUP($A$51,Voorraad!$A$2:$G$1001,6)),\"\",VLOOKUP($A$51,Voorraad!$A$2:$G$1001,6))","v":0},{"$f":"IF(ISERROR(VLOOKUP($A$51,Voorraad!$A$2:$G$1001,7)),\"\",VLOOKUP($A$51,Voorraad!$A$2:$G$1001,7))","v":0},{"$f":"IF(ISERROR(VLOOKUP($A$51,Voorraad!$A$2:$G$1001,5)),\"\",VLOOKUP($A$51,Voorraad!$A$2:$G$1001,5))","v":"8410/8464/8510"},{"$f":"IF(ISERROR(VLOOKUP($A$51,Voorraad!$A$2:$D$1001,4)),\"\",VLOOKUP($A$51,Voorraad!$A$2:$D$1001,4))","v":485},75,0]
["BU0015",{"$f":"[6]Sheet1!$E$47","v":2175},{"$f":"IF(ISERROR(VLOOKUP($A$52,Voorraad!$A$2:$D$1001,1)),\"\",VLOOKUP($A$52,Voorraad!$A$2:$D$1001,1))","v":"BU0015"},{"$f":"IF(ISERROR(VLOOKUP($A$52,Voorraad!$A$2:$D$1001,3)),\"\",VLOOKUP($A$52,Voorraad!$A$2:$D$1001,3))","v":"D 1N4148PH 75V-200MA"},{"$f":"IF(ISERROR(VLOOKUP($A$52,Voorraad!$A$2:$D$1001,2)),\"\",VLOOKUP($A$52,Voorraad!$A$2:$D$1001,2))","v":"#341N4148P"},{"$f":"IF(ISERROR(VLOOKUP($A$52,Voorraad!$A$2:$H$1001,8)),\"\",VLOOKUP($A$52,Voorraad!$A$2:$H$1001,8))","v":522001},{"$f":"IF(ISERROR(VLOOKUP($A$52,Voorraad!$A$2:$I$1001,9)),\"\",VLOOKUP($A$52,Voorraad!$A$2:$I$1001,9))","v":"1N4148-TAP"},{"$f":"IF(ISERROR(VLOOKUP($A$52,Voorraad!$A$2:$J$1001,10)),\"\",VLOOKUP($A$52,Voorraad!$A$2:$J$1001,10))","v":0},{"$f":"IF(ISERROR(VLOOKUP($A$52,Voorraad!$A$2:$G$1001,6)),\"\",VLOOKUP($A$52,Voorraad!$A$2:$G$1001,6))","v":"TME"},{"$f":"IF(ISERROR(VLOOKUP($A$52,Voorraad!$A$2:$G$1001,7)),\"\",VLOOKUP($A$52,Voorraad!$A$2:$G$1001,7))","v":"PHILIPS"},{"$f":"IF(ISERROR(VLOOKUP($A$52,Voorraad!$A$2:$G$1001,5)),\"\",VLOOKUP($A$52,Voorraad!$A$2:$G$1001,5))","v":"8464/8510"},{"$f":"IF(ISERROR(VLOOKUP($A$52,Voorraad!$A$2:$D$1001,4)),\"\",VLOOKUP($A$52,Voorraad!$A$2:$D$1001,4))","v":-1075},2175,3250]
["BU0016",{"$f":"[6]Sheet1!$E$48","v":150},{"$f":"IF(ISERROR(VLOOKUP($A$53,Voorraad!$A$2:$D$1001,1)),\"\",VLOOKUP($A$53,Voorraad!$A$2:$D$1001,1))","v":"BU0016"},{"$f":"IF(ISERROR(VLOOKUP($A$53,Voorraad!$A$2:$D$1001,3)),\"\",VLOOKUP($A$53,Voorraad!$A$2:$D$1001,3))","v":"D BYV27-150-TAP"},{"$f":"IF(ISERROR(VLOOKUP($A$53,Voorraad!$A$2:$D$1001,2)),\"\",VLOOKUP($A$53,Voorraad!$A$2:$D$1001,2))","v":0},{"$f":"IF(ISERROR(VLOOKUP($A$53,Voorraad!$A$2:$H$1001,8)),\"\",VLOOKUP($A$53,Voorraad!$A$2:$H$1001,8))","v":520005},{"$f":"IF(ISERROR(VLOOKUP($A$53,Voorraad!$A$2:$I$1001,9)),\"\",VLOOKUP($A$53,Voorraad!$A$2:$I$1001,9))","v":"BYV27-150-TAP"},{"$f":"IF(ISERROR(VLOOKUP($A$53,Voorraad!$A$2:$J$1001,10)),\"\",VLOOKUP($A$53,Voorraad!$A$2:$J$1001,10))","v":0},{"$f":"IF(ISERROR(VLOOKUP($A$53,Voorraad!$A$2:$G$1001,6)),\"\",VLOOKUP($A$53,Voorraad!$A$2:$G$1001,6))","v":"MOUSER"},{"$f":"IF(ISERROR(VLOOKUP($A$53,Voorraad!$A$2:$G$1001,7)),\"\",VLOOKUP($A$53,Voorraad!$A$2:$G$1001,7))","v":"PHILIPS"},{"$f":"IF(ISERROR(VLOOKUP($A$53,Voorraad!$A$2:$G$1001,5)),\"\",VLOOKUP($A$53,Voorraad!$A$2:$G$1001,5))","v":"8437/8438/8439/8510"},{"$f":"IF(ISERROR(VLOOKUP($A$53,Voorraad!$A$2:$D$1001,4)),\"\",VLOOKUP($A$53,Voorraad!$A$2:$D$1001,4))","v":-7},150,157]
["BU0017",{"$f":"[6]Sheet1!$E$49","v":75},{"$f":"IF(ISERROR(VLOOKUP($A$54,Voorraad!$A$2:$D$1001,1)),\"\",VLOOKUP($A$54,Voorraad!$A$2:$D$1001,1))","v":"BU0017"},{"$f":"IF(ISERROR(VLOOKUP($A$54,Voorraad!$A$2:$D$1001,3)),\"\",VLOOKUP($A$54,Voorraad!$A$2:$D$1001,3))","v":"DZ BZX79C20 20V 0.5W DO35"},{"$f":"IF(ISERROR(VLOOKUP($A$54,Voorraad!$A$2:$D$1001,2)),\"\",VLOOKUP($A$54,Voorraad!$A$2:$D$1001,2))","v":"#35BZX55C29"},{"$f":"IF(ISERROR(VLOOKUP($A$54,Voorraad!$A$2:$H$1001,8)),\"\",VLOOKUP($A$54,Voorraad!$A$2:$H$1001,8))","v":522023},{"$f":"IF(ISERROR(VLOOKUP($A$54,Voorraad!$A$2:$I$1001,9)),\"\",VLOOKUP($A$54,Voorraad!$A$2:$I$1001,9))","v":0},{"$f":"IF(ISERROR(VLOOKUP($A$54,Voorraad!$A$2:$J$1001,10)),\"\",VLOOKUP($A$54,Voorraad!$A$2:$J$1001,10))","v":0},{"$f":"IF(ISERROR(VLOOKUP($A$54,Voorraad!$A$2:$G$1001,6)),\"\",VLOOKUP($A$54,Voorraad!$A$2:$G$1001,6))","v":0},{"$f":"IF(ISERROR(VLOOKUP($A$54,Voorraad!$A$2:$G$1001,7)),\"\",VLOOKUP($A$54,Voorraad!$A$2:$G$1001,7))","v":0},{"$f":"IF(ISERROR(VLOOKUP($A$54,Voorraad!$A$2:$G$1001,5)),\"\",VLOOKUP($A$54,Voorraad!$A$2:$G$1001,5))","v":8510},{"$f":"IF(ISERROR(VLOOKUP($A$54,Voorraad!$A$2:$D$1001,4)),\"\",VLOOKUP($A$54,Voorraad!$A$2:$D$1001,4))","v":1925},75,0]
["BU0018",{"$f":"[6]Sheet1!$E$50","v":75},{"$f":"IF(ISERROR(VLOOKUP($A$55,Voorraad!$A$2:$D$1001,1)),\"\",VLOOKUP($A$55,Voorraad!$A$2:$D$1001,1))","v":"BU0018"},{"$f":"IF(ISERROR(VLOOKUP($A$55,Voorraad!$A$2:$D$1001,3)),\"\",VLOOKUP($A$55,Voorraad!$A$2:$D$1001,3))","v":"DZ ZPD3V9 500MW 2%"},{"$f":"IF(ISERROR(VLOOKUP($A$55,Voorraad!$A$2:$D$1001,2)),\"\",VLOOKUP($A$55,Voorraad!$A$2:$D$1001,2))","v":"#35ZPD3V9D"},{"$f":"IF(ISERROR(VLOOKUP($A$55,Voorraad!$A$2:$H$1001,8)),\"\",VLOOKUP($A$55,Voorraad!$A$2:$H$1001,8))","v":522011},{"$f":"IF(ISERROR(VLOOKUP($A$55,Voorraad!$A$2:$I$1001,9)),\"\",VLOOKUP($A$55,Voorraad!$A$2:$I$1001,9))","v":0},{"$f":"IF(ISERROR(VLOOKUP($A$55,Voorraad!$A$2:$J$1001,10)),\"\",VLOOKUP($A$55,Voorraad!$A$2:$J$1001,10))","v":0},{"$f":"IF(ISERROR(VLOOKUP($A$55,Voorraad!$A$2:$G$1001,6)),\"\",VLOOKUP($A$55,Voorraad!$A$2:$G$1001,6))","v":0},{"$f":"IF(ISERROR(VLOOKUP($A$55,Voorraad!$A$2:$G$1001,7)),\"\",VLOOKUP($A$55,Voorraad!$A$2:$G$1001,7))","v":"GSI"},{"$f":"IF(ISERROR(VLOOKUP($A$55,Voorraad!$A$2:$G$1001,5)),\"\",VLOOKUP($A$55,Voorraad!$A$2:$G$1001,5))","v":8510},{"$f":"IF(ISERROR(VLOOKUP($A$55,Voorraad!$A$2:$D$1001,4)),\"\",VLOOKUP($A$55,Voorraad!$A$2:$D$1001,4))","v":125},75,0]
["BU0019",{"$f":"[6]Sheet1!$E$51","v":225},{"$f":"IF(ISERROR(VLOOKUP($A$56,Voorraad!$A$2:$D$1001,1)),\"\",VLOOKUP($A$56,Voorraad!$A$2:$D$1001,1))","v":"BU0019"},{"$f":"IF(ISERROR(VLOOKUP($A$56,Voorraad!$A$2:$D$1001,3)),\"\",VLOOKUP($A$56,Voorraad!$A$2:$D$1001,3))","v":"DZ BZX79C5V6 5V6 0.5W DO"},{"$f":"IF(ISERROR(VLOOKUP($A$56,Voorraad!$A$2:$D$1001,2)),\"\",VLOOKUP($A$56,Voorraad!$A$2:$D$1001,2))","v":"#35BZX79C5V6"},{"$f":"IF(ISERROR(VLOOKUP($A$56,Voorraad!$A$2:$H$1001,8)),\"\",VLOOKUP($A$56,Voorraad!$A$2:$H$1001,8))","v":520014},{"$f":"IF(ISERROR(VLOOKUP($A$56,Voorraad!$A$2:$I$1001,9)),\"\",VLOOKUP($A$56,Voorraad!$A$2:$I$1001,9))","v":0},{"$f":"IF(ISERROR(VLOOKUP($A$56,Voorraad!$A$2:$J$1001,10)),\"\",VLOOKUP($A$56,Voorraad!$A$2:$J$1001,10))","v":0},{"$f":"IF(ISERROR(VLOOKUP($A$56,Voorraad!$A$2:$G$1001,6)),\"\",VLOOKUP($A$56,Voorraad!$A$2:$G$1001,6))","v":0},{"$f":"IF(ISERROR(VLOOKUP($A$56,Voorraad!$A$2:$G$1001,7)),\"\",VLOOKUP($A$56,Voorraad!$A$2:$G$1001,7))","v":0},{"$f":"IF(ISERROR(VLOOKUP($A$56,Voorraad!$A$2:$G$1001,5)),\"\",VLOOKUP($A$56,Voorraad!$A$2:$G$1001,5))","v":8510},{"$f":"IF(ISERROR(VLOOKUP($A$56,Voorraad!$A$2:$D$1001,4)),\"\",VLOOKUP($A$56,Voorraad!$A$2:$D$1001,4))","v":103},225,122]
["BU0024",{"$f":"[6]Sheet1!$E$52","v":75},{"$f":"IF(ISERROR(VLOOKUP($A$57,Voorraad!$A$2:$D$1001,1)),\"\",VLOOKUP($A$57,Voorraad!$A$2:$D$1001,1))","v":"BU0024"},{"$f":"IF(ISERROR(VLOOKUP($A$57,Voorraad!$A$2:$D$1001,3)),\"\",VLOOKUP($A$57,Voorraad!$A$2:$D$1001,3))","v":"T 2N2222A TO-18 NPO"},{"$f":"IF(ISERROR(VLOOKUP($A$57,Voorraad!$A$2:$D$1001,2)),\"\",VLOOKUP($A$57,Voorraad!$A$2:$D$1001,2))","v":"#372N2222ASTM"},{"$f":"IF(ISERROR(VLOOKUP($A$57,Voorraad!$A$2:$H$1001,8)),\"\",VLOOKUP($A$57,Voorraad!$A$2:$H$1001,8))","v":520033},{"$f":"IF(ISERROR(VLOOKUP($A$57,Voorraad!$A$2:$I$1001,9)),\"\",VLOOKUP($A$57,Voorraad!$A$2:$I$1001,9))","v":9207120},{"$f":"IF(ISERROR(VLOOKUP($A$57,Voorraad!$A$2:$J$1001,10)),\"\",VLOOKUP($A$57,Voorraad!$A$2:$J$1001,10))","v":0},{"$f":"IF(ISERROR(VLOOKUP($A$57,Voorraad!$A$2:$G$1001,6)),\"\",VLOOKUP($A$57,Voorraad!$A$2:$G$1001,6))","v":"FARNELL"},{"$f":"IF(ISERROR(VLOOKUP($A$57,Voorraad!$A$2:$G$1001,7)),\"\",VLOOKUP($A$57,Voorraad!$A$2:$G$1001,7))","v":"ST"},{"$f":"IF(ISERROR(VLOOKUP($A$57,Voorraad!$A$2:$G$1001,5)),\"\",VLOOKUP($A$57,Voorraad!$A$2:$G$1001,5))","v":8510},{"$f":"IF(ISERROR(VLOOKUP($A$57,Voorraad!$A$2:$D$1001,4)),\"\",VLOOKUP($A$57,Voorraad!$A$2:$D$1001,4))","v":0},75,75]
["BU0025",{"$f":"[6]Sheet1!$E$53","v":75},{"$f":"IF(ISERROR(VLOOKUP($A$58,Voorraad!$A$2:$D$1001,1)),\"\",VLOOKUP($A$58,Voorraad!$A$2:$D$1001,1))","v":"BU0025"},{"$f":"IF(ISERROR(VLOOKUP($A$58,Voorraad!$A$2:$D$1001,3)),\"\",VLOOKUP($A$58,Voorraad!$A$2:$D$1001,3))","v":"T IRFF310 MOSFET T05"},{"$f":"IF(ISERROR(VLOOKUP($A$58,Voorraad!$A$2:$D$1001,2)),\"\",VLOOKUP($A$58,Voorraad!$A$2:$D$1001,2))","v":"#37IRFF310i"},{"$f":"IF(ISERROR(VLOOKUP($A$58,Voorraad!$A$2:$H$1001,8)),\"\",VLOOKUP($A$58,Voorraad!$A$2:$H$1001,8))","v":520039},{"$f":"IF(ISERROR(VLOOKUP($A$58,Voorraad!$A$2:$I$1001,9)),\"\",VLOOKUP($A$58,Voorraad!$A$2:$I$1001,9))","v":0},{"$f":"IF(ISERROR(VLOOKUP($A$58,Voorraad!$A$2:$J$1001,10)),\"\",VLOOKUP($A$58,Voorraad!$A$2:$J$1001,10))","v":"1000 stuks extra inkopen voor vervolgen!"},{"$f":"IF(ISERROR(VLOOKUP($A$58,Voorraad!$A$2:$G$1001,6)),\"\",VLOOKUP($A$58,Voorraad!$A$2:$G$1001,6))","v":"UT SOURCE"},{"$f":"IF(ISERROR(VLOOKUP($A$58,Voorraad!$A$2:$G$1001,7)),\"\",VLOOKUP($A$58,Voorraad!$A$2:$G$1001,7))","v":"HARRIS"},{"$f":"IF(ISERROR(VLOOKUP($A$58,Voorraad!$A$2:$G$1001,5)),\"\",VLOOKUP($A$58,Voorraad!$A$2:$G$1001,5))","v":8510},{"$f":"IF(ISERROR(VLOOKUP($A$58,Voorraad!$A$2:$D$1001,4)),\"\",VLOOKUP($A$58,Voorraad!$A$2:$D$1001,4))","v":0},75,75]
["BU0026",{"$f":"[6]Sheet1!$E$54","v":75},{"$f":"IF(ISERROR(VLOOKUP($A$59,Voorraad!$A$2:$D$1001,1)),\"\",VLOOKUP($A$59,Voorraad!$A$2:$D$1001,1))","v":"BU0026"},{"$f":"IF(ISERROR(VLOOKUP($A$59,Voorraad!$A$2:$D$1001,3)),\"\",VLOOKUP($A$59,Voorraad!$A$2:$D$1001,3))","v":"IS MS184-25 TRANS. VOET"},{"$f":"IF(ISERROR(VLOOKUP($A$59,Voorraad!$A$2:$D$1001,2)),\"\",VLOOKUP($A$59,Voorraad!$A$2:$D$1001,2))","v":"#661MS18425"},{"$f":"IF(ISERROR(VLOOKUP($A$59,Voorraad!$A$2:$H$1001,8)),\"\",VLOOKUP($A$59,Voorraad!$A$2:$H$1001,8))","v":0},{"$f":"IF(ISERROR(VLOOKUP($A$59,Voorraad!$A$2:$I$1001,9)),\"\",VLOOKUP($A$59,Voorraad!$A$2:$I$1001,9))","v":0},{"$f":"IF(ISERROR(VLOOKUP($A$59,Voorraad!$A$2:$J$1001,10)),\"\",VLOOKUP($A$59,Voorraad!$A$2:$J$1001,10))","v":0},{"$f":"IF(ISERROR(VLOOKUP($A$59,Voorraad!$A$2:$G$1001,6)),\"\",VLOOKUP($A$59,Voorraad!$A$2:$G$1001,6))","v":0},{"$f":"IF(ISERROR(VLOOKUP($A$59,Voorraad!$A$2:$G$1001,7)),\"\",VLOOKUP($A$59,Voorraad!$A$2:$G$1001,7))","v":"FISCHER"},{"$f":"IF(ISERROR(VLOOKUP($A$59,Voorraad!$A$2:$G$1001,5)),\"\",VLOOKUP($A$59,Voorraad!$A$2:$G$1001,5))","v":8510},{"$f":"IF(ISERROR(VLOOKUP($A$59,Voorraad!$A$2:$D$1001,4)),\"\",VLOOKUP($A$59,Voorraad!$A$2:$D$1001,4))","v":925},75,0]
["BU0027",{"$f":"[6]Sheet1!$E$55","v":75},{"$f":"IF(ISERROR(VLOOKUP($A$60,Voorraad!$A$2:$D$1001,1)),\"\",VLOOKUP($A$60,Voorraad!$A$2:$D$1001,1))","v":"BU0027"},{"$f":"IF(ISERROR(VLOOKUP($A$60,Voorraad!$A$2:$D$1001,3)),\"\",VLOOKUP($A$60,Voorraad!$A$2:$D$1001,3))","v":"IS MS34-518 T05/18 Isol"},{"$f":"IF(ISERROR(VLOOKUP($A$60,Voorraad!$A$2:$D$1001,2)),\"\",VLOOKUP($A$60,Voorraad!$A$2:$D$1001,2))","v":"#665MS34518"},{"$f":"IF(ISERROR(VLOOKUP($A$60,Voorraad!$A$2:$H$1001,8)),\"\",VLOOKUP($A$60,Voorraad!$A$2:$H$1001,8))","v":0},{"$f":"IF(ISERROR(VLOOKUP($A$60,Voorraad!$A$2:$I$1001,9)),\"\",VLOOKUP($A$60,Voorraad!$A$2:$I$1001,9))","v":"TO-5/TO-18PU"},{"$f":"IF(ISERROR(VLOOKUP($A$60,Voorraad!$A$2:$J$1001,10)),\"\",VLOOKUP($A$60,Voorraad!$A$2:$J$1001,10))","v":0},{"$f":"IF(ISERROR(VLOOKUP($A$60,Voorraad!$A$2:$G$1001,6)),\"\",VLOOKUP($A$60,Voorraad!$A$2:$G$1001,6))","v":"DISTRELEC"},{"$f":"IF(ISERROR(VLOOKUP($A$60,Voorraad!$A$2:$G$1001,7)),\"\",VLOOKUP($A$60,Voorraad!$A$2:$G$1001,7))","v":"FISCHER"},{"$f":"IF(ISERROR(VLOOKUP($A$60,Voorraad!$A$2:$G$1001,5)),\"\",VLOOKUP($A$60,Voorraad!$A$2:$G$1001,5))","v":8510},{"$f":"IF(ISERROR(VLOOKUP($A$60,Voorraad!$A$2:$D$1001,4)),\"\",VLOOKUP($A$60,Voorraad!$A$2:$D$1001,4))","v":1},75,74]
["BU0028",{"$f":"[6]Sheet1!$E$56","v":75},{"$f":"IF(ISERROR(VLOOKUP($A$61,Voorraad!$A$2:$D$1001,1)),\"\",VLOOKUP($A$61,Voorraad!$A$2:$D$1001,1))","v":"BU0028"},{"$f":"IF(ISERROR(VLOOKUP($A$61,Voorraad!$A$2:$D$1001,3)),\"\",VLOOKUP($A$61,Voorraad!$A$2:$D$1001,3))","v":"SN74HC373N DIP-20 Ti"},{"$f":"IF(ISERROR(VLOOKUP($A$61,Voorraad!$A$2:$D$1001,2)),\"\",VLOOKUP($A$61,Voorraad!$A$2:$D$1001,2))","v":"#432373NCTI"},{"$f":"IF(ISERROR(VLOOKUP($A$61,Voorraad!$A$2:$H$1001,8)),\"\",VLOOKUP($A$61,Voorraad!$A$2:$H$1001,8))","v":0},{"$f":"IF(ISERROR(VLOOKUP($A$61,Voorraad!$A$2:$I$1001,9)),\"\",VLOOKUP($A$61,Voorraad!$A$2:$I$1001,9))","v":"SN74HC373N"},{"$f":"IF(ISERROR(VLOOKUP($A$61,Voorraad!$A$2:$J$1001,10)),\"\",VLOOKUP($A$61,Voorraad!$A$2:$J$1001,10))","v":0},{"$f":"IF(ISERROR(VLOOKUP($A$61,Voorraad!$A$2:$G$1001,6)),\"\",VLOOKUP($A$61,Voorraad!$A$2:$G$1001,6))","v":"TME"},{"$f":"IF(ISERROR(VLOOKUP($A$61,Voorraad!$A$2:$G$1001,7)),\"\",VLOOKUP($A$61,Voorraad!$A$2:$G$1001,7))","v":"Ti"},{"$f":"IF(ISERROR(VLOOKUP($A$61,Voorraad!$A$2:$G$1001,5)),\"\",VLOOKUP($A$61,Voorraad!$A$2:$G$1001,5))","v":8510},{"$f":"IF(ISERROR(VLOOKUP($A$61,Voorraad!$A$2:$D$1001,4)),\"\",VLOOKUP($A$61,Voorraad!$A$2:$D$1001,4))","v":-1},75,76]
["BU0029",{"$f":"[6]Sheet1!$E$57","v":75},{"$f":"IF(ISERROR(VLOOKUP($A$62,Voorraad!$A$2:$D$1001,1)),\"\",VLOOKUP($A$62,Voorraad!$A$2:$D$1001,1))","v":"BU0029"},{"$f":"IF(ISERROR(VLOOKUP($A$62,Voorraad!$A$2:$D$1001,3)),\"\",VLOOKUP($A$62,Voorraad!$A$2:$D$1001,3))","v":"IC MAX693EPE -20/+85'"},{"$f":"IF(ISERROR(VLOOKUP($A$62,Voorraad!$A$2:$D$1001,2)),\"\",VLOOKUP($A$62,Voorraad!$A$2:$D$1001,2))","v":"#41693EPEM"},{"$f":"IF(ISERROR(VLOOKUP($A$62,Voorraad!$A$2:$H$1001,8)),\"\",VLOOKUP($A$62,Voorraad!$A$2:$H$1001,8))","v":522301},{"$f":"IF(ISERROR(VLOOKUP($A$62,Voorraad!$A$2:$I$1001,9)),\"\",VLOOKUP($A$62,Voorraad!$A$2:$I$1001,9))","v":0},{"$f":"IF(ISERROR(VLOOKUP($A$62,Voorraad!$A$2:$J$1001,10)),\"\",VLOOKUP($A$62,Voorraad!$A$2:$J$1001,10))","v":"alternatief van ADM of LTC mag ook, opvragen!"},{"$f":"IF(ISERROR(VLOOKUP($A$62,Voorraad!$A$2:$G$1001,6)),\"\",VLOOKUP($A$62,Voorraad!$A$2:$G$1001,6))","v":"UT SOURCE"},{"$f":"IF(ISERROR(VLOOKUP($A$62,Voorraad!$A$2:$G$1001,7)),\"\",VLOOKUP($A$62,Voorraad!$A$2:$G$1001,7))","v":"AD"},{"$f":"IF(ISERROR(VLOOKUP($A$62,Voorraad!$A$2:$G$1001,5)),\"\",VLOOKUP($A$62,Voorraad!$A$2:$G$1001,5))","v":8510},{"$f":"IF(ISERROR(VLOOKUP($A$62,Voorraad!$A$2:$D$1001,4)),\"\",VLOOKUP($A$62,Voorraad!$A$2:$D$1001,4))","v":-75},75,150]
["BU0030",{"$f":"[6]Sheet1!$E$58","v":450},{"$f":"IF(ISERROR(VLOOKUP($A$63,Voorraad!$A$2:$D$1001,1)),\"\",VLOOKUP($A$63,Voorraad!$A$2:$D$1001,1))","v":"BU0030"},{"$f":"IF(ISERROR(VLOOKUP($A$63,Voorraad!$A$2:$D$1001,3)),\"\",VLOOKUP($A$63,Voorraad!$A$2:$D$1001,3))","v":"IC P74HC374N"},{"$f":"IF(ISERROR(VLOOKUP($A$63,Voorraad!$A$2:$D$1001,2)),\"\",VLOOKUP($A$63,Voorraad!$A$2:$D$1001,2))","v":"#432374NCPH"},{"$f":"IF(ISERROR(VLOOKUP($A$63,Voorraad!$A$2:$H$1001,8)),\"\",VLOOKUP($A$63,Voorraad!$A$2:$H$1001,8))","v":520343},{"$f":"IF(ISERROR(VLOOKUP($A$63,Voorraad!$A$2:$I$1001,9)),\"\",VLOOKUP($A$63,Voorraad!$A$2:$I$1001,9))","v":"SN74HC374N"},{"$f":"IF(ISERROR(VLOOKUP($A$63,Voorraad!$A$2:$J$1001,10)),\"\",VLOOKUP($A$63,Voorraad!$A$2:$J$1001,10))","v":0},{"$f":"IF(ISERROR(VLOOKUP($A$63,Voorraad!$A$2:$G$1001,6)),\"\",VLOOKUP($A$63,Voorraad!$A$2:$G$1001,6))","v":"TME"},{"$f":"IF(ISERROR(VLOOKUP($A$63,Voorraad!$A$2:$G$1001,7)),\"\",VLOOKUP($A$63,Voorraad!$A$2:$G$1001,7))","v":"NXP"},{"$f":"IF(ISERROR(VLOOKUP($A$63,Voorraad!$A$2:$G$1001,5)),\"\",VLOOKUP($A$63,Voorraad!$A$2:$G$1001,5))","v":8510},{"$f":"IF(ISERROR(VLOOKUP($A$63,Voorraad!$A$2:$D$1001,4)),\"\",VLOOKUP($A$63,Voorraad!$A$2:$D$1001,4))","v":-36},450,486]
["BU0031",{"$f":"[6]Sheet1!$E$59","v":150},{"$f":"IF(ISERROR(VLOOKUP($A$64,Voorraad!$A$2:$D$1001,1)),\"\",VLOOKUP($A$64,Voorraad!$A$2:$D$1001,1))","v":"BU0031"},{"$f":"IF(ISERROR(VLOOKUP($A$64,Voorraad!$A$2:$D$1001,3)),\"\",VLOOKUP($A$64,Voorraad!$A$2:$D$1001,3))","v":"IC P74HCT04N DIP-14"},{"$f":"IF(ISERROR(VLOOKUP($A$64,Voorraad!$A$2:$D$1001,2)),\"\",VLOOKUP($A$64,Voorraad!$A$2:$D$1001,2))","v":"#43404CPH"},{"$f":"IF(ISERROR(VLOOKUP($A$64,Voorraad!$A$2:$H$1001,8)),\"\",VLOOKUP($A$64,Voorraad!$A$2:$H$1001,8))","v":520013},{"$f":"IF(ISERROR(VLOOKUP($A$64,Voorraad!$A$2:$I$1001,9)),\"\",VLOOKUP($A$64,Voorraad!$A$2:$I$1001,9))","v":"TISSN74HCT04N"},{"$f":"IF(ISERROR(VLOOKUP($A$64,Voorraad!$A$2:$J$1001,10)),\"\",VLOOKUP($A$64,Voorraad!$A$2:$J$1001,10))","v":0},{"$f":"IF(ISERROR(VLOOKUP($A$64,Voorraad!$A$2:$G$1001,6)),\"\",VLOOKUP($A$64,Voorraad!$A$2:$G$1001,6))","v":"AVNET"},{"$f":"IF(ISERROR(VLOOKUP($A$64,Voorraad!$A$2:$G$1001,7)),\"\",VLOOKUP($A$64,Voorraad!$A$2:$G$1001,7))","v":"NXP"},{"$f":"IF(ISERROR(VLOOKUP($A$64,Voorraad!$A$2:$G$1001,5)),\"\",VLOOKUP($A$64,Voorraad!$A$2:$G$1001,5))","v":8510},{"$f":"IF(ISERROR(VLOOKUP($A$64,Voorraad!$A$2:$D$1001,4)),\"\",VLOOKUP($A$64,Voorraad!$A$2:$D$1001,4))","v":23},150,127]
["BU0032",{"$f":"[6]Sheet1!$E$60","v":75},{"$f":"IF(ISERROR(VLOOKUP($A$65,Voorraad!$A$2:$D$1001,1)),\"\",VLOOKUP($A$65,Voorraad!$A$2:$D$1001,1))","v":"BU0032"},{"$f":"IF(ISERROR(VLOOKUP($A$65,Voorraad!$A$2:$D$1001,3)),\"\",VLOOKUP($A$65,Voorraad!$A$2:$D$1001,3))","v":"IC TS80C31X2-MIA"},{"$f":"IF(ISERROR(VLOOKUP($A$65,Voorraad!$A$2:$D$1001,2)),\"\",VLOOKUP($A$65,Voorraad!$A$2:$D$1001,2))","v":"#4680C31X2A"},{"$f":"IF(ISERROR(VLOOKUP($A$65,Voorraad!$A$2:$H$1001,8)),\"\",VLOOKUP($A$65,Voorraad!$A$2:$H$1001,8))","v":522300},{"$f":"IF(ISERROR(VLOOKUP($A$65,Voorraad!$A$2:$I$1001,9)),\"\",VLOOKUP($A$65,Voorraad!$A$2:$I$1001,9))","v":"TS80C31X2-MIA"},{"$f":"IF(ISERROR(VLOOKUP($A$65,Voorraad!$A$2:$J$1001,10)),\"\",VLOOKUP($A$65,Voorraad!$A$2:$J$1001,10))","v":0},{"$f":"IF(ISERROR(VLOOKUP($A$65,Voorraad!$A$2:$G$1001,6)),\"\",VLOOKUP($A$65,Voorraad!$A$2:$G$1001,6))","v":"UT SOURCE"},{"$f":"IF(ISERROR(VLOOKUP($A$65,Voorraad!$A$2:$G$1001,7)),\"\",VLOOKUP($A$65,Voorraad!$A$2:$G$1001,7))","v":"TEMIC"},{"$f":"IF(ISERROR(VLOOKUP($A$65,Voorraad!$A$2:$G$1001,5)),\"\",VLOOKUP($A$65,Voorraad!$A$2:$G$1001,5))","v":8510},{"$f":"IF(ISERROR(VLOOKUP($A$65,Voorraad!$A$2:$D$1001,4)),\"\",VLOOKUP($A$65,Voorraad!$A$2:$D$1001,4))","v":0},75,75]
["BU0033",{"$f":"[6]Sheet1!$E$61","v":75},{"$f":"IF(ISERROR(VLOOKUP($A$66,Voorraad!$A$2:$D$1001,1)),\"\",VLOOKUP($A$66,Voorraad!$A$2:$D$1001,1))","v":"BU0033"},{"$f":"IF(ISERROR(VLOOKUP($A$66,Voorraad!$A$2:$D$1001,3)),\"\",VLOOKUP($A$66,Voorraad!$A$2:$D$1001,3))","v":"IC M27C256B-12F1 EPROM"},{"$f":"IF(ISERROR(VLOOKUP($A$66,Voorraad!$A$2:$D$1001,2)),\"\",VLOOKUP($A$66,Voorraad!$A$2:$D$1001,2))","v":"#47256B12F1GP"},{"$f":"IF(ISERROR(VLOOKUP($A$66,Voorraad!$A$2:$H$1001,8)),\"\",VLOOKUP($A$66,Voorraad!$A$2:$H$1001,8))","v":522216},{"$f":"IF(ISERROR(VLOOKUP($A$66,Voorraad!$A$2:$I$1001,9)),\"\",VLOOKUP($A$66,Voorraad!$A$2:$I$1001,9))","v":"UT8BGCHB2117"},{"$f":"IF(ISERROR(VLOOKUP($A$66,Voorraad!$A$2:$J$1001,10)),\"\",VLOOKUP($A$66,Voorraad!$A$2:$J$1001,10))","v":0},{"$f":"IF(ISERROR(VLOOKUP($A$66,Voorraad!$A$2:$G$1001,6)),\"\",VLOOKUP($A$66,Voorraad!$A$2:$G$1001,6))","v":"MOUSER"},{"$f":"IF(ISERROR(VLOOKUP($A$66,Voorraad!$A$2:$G$1001,7)),\"\",VLOOKUP($A$66,Voorraad!$A$2:$G$1001,7))","v":"ST"},{"$f":"IF(ISERROR(VLOOKUP($A$66,Voorraad!$A$2:$G$1001,5)),\"\",VLOOKUP($A$66,Voorraad!$A$2:$G$1001,5))","v":8510},{"$f":"IF(ISERROR(VLOOKUP($A$66,Voorraad!$A$2:$D$1001,4)),\"\",VLOOKUP($A$66,Voorraad!$A$2:$D$1001,4))","v":-75},75,150]
["BU0034",{"$f":"[6]Sheet1!$E$62","v":75},{"$f":"IF(ISERROR(VLOOKUP($A$67,Voorraad!$A$2:$D$1001,1)),\"\",VLOOKUP($A$67,Voorraad!$A$2:$D$1001,1))","v":"BU0034"},{"$f":"IF(ISERROR(VLOOKUP($A$67,Voorraad!$A$2:$D$1001,3)),\"\",VLOOKUP($A$67,Voorraad!$A$2:$D$1001,3))","v":"IC DS1225Y-200"},{"$f":"IF(ISERROR(VLOOKUP($A$67,Voorraad!$A$2:$D$1001,2)),\"\",VLOOKUP($A$67,Voorraad!$A$2:$D$1001,2))","v":"#411225Y150PM"},{"$f":"IF(ISERROR(VLOOKUP($A$67,Voorraad!$A$2:$H$1001,8)),\"\",VLOOKUP($A$67,Voorraad!$A$2:$H$1001,8))","v":522224},{"$f":"IF(ISERROR(VLOOKUP($A$67,Voorraad!$A$2:$I$1001,9)),\"\",VLOOKUP($A$67,Voorraad!$A$2:$I$1001,9))","v":0},{"$f":"IF(ISERROR(VLOOKUP($A$67,Voorraad!$A$2:$J$1001,10)),\"\",VLOOKUP($A$67,Voorraad!$A$2:$J$1001,10))","v":0},{"$f":"IF(ISERROR(VLOOKUP($A$67,Voorraad!$A$2:$G$1001,6)),\"\",VLOOKUP($A$67,Voorraad!$A$2:$G$1001,6))","v":0},{"$f":"IF(ISERROR(VLOOKUP($A$67,Voorraad!$A$2:$G$1001,7)),\"\",VLOOKUP($A$67,Voorraad!$A$2:$G$1001,7))","v":"DALLAS/HANBIT / MAXIM"},{"$f":"IF(ISERROR(VLOOKUP($A$67,Voorraad!$A$2:$G$1001,5)),\"\",VLOOKUP($A$67,Voorraad!$A$2:$G$1001,5))","v":8510},{"$f":"IF(ISERROR(VLOOKUP($A$67,Voorraad!$A$2:$D$1001,4)),\"\",VLOOKUP($A$67,Voorraad!$A$2:$D$1001,4))","v":-75},75,150]
["BU0035",{"$f":"[6]Sheet1!$E$63","v":300},{"$f":"IF(ISERROR(VLOOKUP($A$68,Voorraad!$A$2:$D$1001,1)),\"\",VLOOKUP($A$68,Voorraad!$A$2:$D$1001,1))","v":"BU0035"},{"$f":"IF(ISERROR(VLOOKUP($A$68,Voorraad!$A$2:$D$1001,3)),\"\",VLOOKUP($A$68,Voorraad!$A$2:$D$1001,3))","v":"IC TLP626 OPTOCOUPLER"},{"$f":"IF(ISERROR(VLOOKUP($A$68,Voorraad!$A$2:$D$1001,2)),\"\",VLOOKUP($A$68,Voorraad!$A$2:$D$1001,2))","v":"#94TLP626T"},{"$f":"IF(ISERROR(VLOOKUP($A$68,Voorraad!$A$2:$H$1001,8)),\"\",VLOOKUP($A$68,Voorraad!$A$2:$H$1001,8))","v":552112},{"$f":"IF(ISERROR(VLOOKUP($A$68,Voorraad!$A$2:$I$1001,9)),\"\",VLOOKUP($A$68,Voorraad!$A$2:$I$1001,9))","v":"TLP626"},{"$f":"IF(ISERROR(VLOOKUP($A$68,Voorraad!$A$2:$J$1001,10)),\"\",VLOOKUP($A$68,Voorraad!$A$2:$J$1001,10))","v":"AVNET ORDERCODE - XYETOSTLP626(F)"},{"$f":"IF(ISERROR(VLOOKUP($A$68,Voorraad!$A$2:$G$1001,6)),\"\",VLOOKUP($A$68,Voorraad!$A$2:$G$1001,6))","v":"TME"},{"$f":"IF(ISERROR(VLOOKUP($A$68,Voorraad!$A$2:$G$1001,7)),\"\",VLOOKUP($A$68,Voorraad!$A$2:$G$1001,7))","v":"TOSHIBA"},{"$f":"IF(ISERROR(VLOOKUP($A$68,Voorraad!$A$2:$G$1001,5)),\"\",VLOOKUP($A$68,Voorraad!$A$2:$G$1001,5))","v":8510},{"$f":"IF(ISERROR(VLOOKUP($A$68,Voorraad!$A$2:$D$1001,4)),\"\",VLOOKUP($A$68,Voorraad!$A$2:$D$1001,4))","v":-188},300,488]
["BU0036",{"$f":"[6]Sheet1!$E$64","v":225},{"$f":"IF(ISERROR(VLOOKUP($A$69,Voorraad!$A$2:$D$1001,1)),\"\",VLOOKUP($A$69,Voorraad!$A$2:$D$1001,1))","v":"BU0036"},{"$f":"IF(ISERROR(VLOOKUP($A$69,Voorraad!$A$2:$D$1001,3)),\"\",VLOOKUP($A$69,Voorraad!$A$2:$D$1001,3))","v":"IC TLP627 OPTOCOUPLER DIL-4"},{"$f":"IF(ISERROR(VLOOKUP($A$69,Voorraad!$A$2:$D$1001,2)),\"\",VLOOKUP($A$69,Voorraad!$A$2:$D$1001,2))","v":"#94TLP627TO"},{"$f":"IF(ISERROR(VLOOKUP($A$69,Voorraad!$A$2:$H$1001,8)),\"\",VLOOKUP($A$69,Voorraad!$A$2:$H$1001,8))","v":552114},{"$f":"IF(ISERROR(VLOOKUP($A$69,Voorraad!$A$2:$I$1001,9)),\"\",VLOOKUP($A$69,Voorraad!$A$2:$I$1001,9))","v":0},{"$f":"IF(ISERROR(VLOOKUP($A$69,Voorraad!$A$2:$J$1001,10)),\"\",VLOOKUP($A$69,Voorraad!$A$2:$J$1001,10))","v":0},{"$f":"IF(ISERROR(VLOOKUP($A$69,Voorraad!$A$2:$G$1001,6)),\"\",VLOOKUP($A$69,Voorraad!$A$2:$G$1001,6))","v":0},{"$f":"IF(ISERROR(VLOOKUP($A$69,Voorraad!$A$2:$G$1001,7)),\"\",VLOOKUP($A$69,Voorraad!$A$2:$G$1001,7))","v":"TOSHIBA"},{"$f":"IF(ISERROR(VLOOKUP($A$69,Voorraad!$A$2:$G$1001,5)),\"\",VLOOKUP($A$69,Voorraad!$A$2:$G$1001,5))","v":8510},{"$f":"IF(ISERROR(VLOOKUP($A$69,Voorraad!$A$2:$D$1001,4)),\"\",VLOOKUP($A$69,Voorraad!$A$2:$D$1001,4))","v":-171},225,396]
["BU0037",{"$f":"[6]Sheet1!$E$65","v":225},{"$f":"IF(ISERROR(VLOOKUP($A$70,Voorraad!$A$2:$D$1001,1)),\"\",VLOOKUP($A$70,Voorraad!$A$2:$D$1001,1))","v":"BU0037"},{"$f":"IF(ISERROR(VLOOKUP($A$70,Voorraad!$A$2:$D$1001,3)),\"\",VLOOKUP($A$70,Voorraad!$A$2:$D$1001,3))","v":"IC TLP627 OPTOCOUPLER DIL-16"},{"$f":"IF(ISERROR(VLOOKUP($A$70,Voorraad!$A$2:$D$1001,2)),\"\",VLOOKUP($A$70,Voorraad!$A$2:$D$1001,2))","v":"?"},{"$f":"IF(ISERROR(VLOOKUP($A$70,Voorraad!$A$2:$H$1001,8)),\"\",VLOOKUP($A$70,Voorraad!$A$2:$H$1001,8))","v":552116},{"$f":"IF(ISERROR(VLOOKUP($A$70,Voorraad!$A$2:$I$1001,9)),\"\",VLOOKUP($A$70,Voorraad!$A$2:$I$1001,9))","v":0},{"$f":"IF(ISERROR(VLOOKUP($A$70,Voorraad!$A$2:$J$1001,10)),\"\",VLOOKUP($A$70,Voorraad!$A$2:$J$1001,10))","v":0},{"$f":"IF(ISERROR(VLOOKUP($A$70,Voorraad!$A$2:$G$1001,6)),\"\",VLOOKUP($A$70,Voorraad!$A$2:$G$1001,6))","v":0},{"$f":"IF(ISERROR(VLOOKUP($A$70,Voorraad!$A$2:$G$1001,7)),\"\",VLOOKUP($A$70,Voorraad!$A$2:$G$1001,7))","v":0},{"$f":"IF(ISERROR(VLOOKUP($A$70,Voorraad!$A$2:$G$1001,5)),\"\",VLOOKUP($A$70,Voorraad!$A$2:$G$1001,5))","v":8510},{"$f":"IF(ISERROR(VLOOKUP($A$70,Voorraad!$A$2:$D$1001,4)),\"\",VLOOKUP($A$70,Voorraad!$A$2:$D$1001,4))","v":-152},225,377]
["BU0043",{"$f":"[6]Sheet1!$E$66","v":75},{"$f":"IF(ISERROR(VLOOKUP($A$71,Voorraad!$A$2:$D$1001,1)),\"\",VLOOKUP($A$71,Voorraad!$A$2:$D$1001,1))","v":"BU0043"},{"$f":"IF(ISERROR(VLOOKUP($A$71,Voorraad!$A$2:$D$1001,3)),\"\",VLOOKUP($A$71,Voorraad!$A$2:$D$1001,3))","v":"LED HOUDER DH3W HAAKS"},{"$f":"IF(ISERROR(VLOOKUP($A$71,Voorraad!$A$2:$D$1001,2)),\"\",VLOOKUP($A$71,Voorraad!$A$2:$D$1001,2))","v":"#50DH3WF"},{"$f":"IF(ISERROR(VLOOKUP($A$71,Voorraad!$A$2:$H$1001,8)),\"\",VLOOKUP($A$71,Voorraad!$A$2:$H$1001,8))","v":552122},{"$f":"IF(ISERROR(VLOOKUP($A$71,Voorraad!$A$2:$I$1001,9)),\"\",VLOOKUP($A$71,Voorraad!$A$2:$I$1001,9))","v":"175-07-513"},{"$f":"IF(ISERROR(VLOOKUP($A$71,Voorraad!$A$2:$J$1001,10)),\"\",VLOOKUP($A$71,Voorraad!$A$2:$J$1001,10))","v":0},{"$f":"IF(ISERROR(VLOOKUP($A$71,Voorraad!$A$2:$G$1001,6)),\"\",VLOOKUP($A$71,Voorraad!$A$2:$G$1001,6))","v":"DISTELEC"},{"$f":"IF(ISERROR(VLOOKUP($A$71,Voorraad!$A$2:$G$1001,7)),\"\",VLOOKUP($A$71,Voorraad!$A$2:$G$1001,7))","v":"FISCHER"},{"$f":"IF(ISERROR(VLOOKUP($A$71,Voorraad!$A$2:$G$1001,5)),\"\",VLOOKUP($A$71,Voorraad!$A$2:$G$1001,5))","v":8510},{"$f":"IF(ISERROR(VLOOKUP($A$71,Voorraad!$A$2:$D$1001,4)),\"\",VLOOKUP($A$71,Voorraad!$A$2:$D$1001,4))","v":-1},75,76]
["BU0044",{"$f":"[6]Sheet1!$E$67","v":900},{"$f":"IF(ISERROR(VLOOKUP($A$72,Voorraad!$A$2:$D$1001,1)),\"\",VLOOKUP($A$72,Voorraad!$A$2:$D$1001,1))","v":"BU0044"},{"$f":"IF(ISERROR(VLOOKUP($A$72,Voorraad!$A$2:$D$1001,3)),\"\",VLOOKUP($A$72,Voorraad!$A$2:$D$1001,3))","v":"LED HOUDER DH5W HAAKSE"},{"$f":"IF(ISERROR(VLOOKUP($A$72,Voorraad!$A$2:$D$1001,2)),\"\",VLOOKUP($A$72,Voorraad!$A$2:$D$1001,2))","v":"#50DH5WF"},{"$f":"IF(ISERROR(VLOOKUP($A$72,Voorraad!$A$2:$H$1001,8)),\"\",VLOOKUP($A$72,Voorraad!$A$2:$H$1001,8))","v":552123},{"$f":"IF(ISERROR(VLOOKUP($A$72,Voorraad!$A$2:$I$1001,9)),\"\",VLOOKUP($A$72,Voorraad!$A$2:$I$1001,9))","v":"175-07-515"},{"$f":"IF(ISERROR(VLOOKUP($A$72,Voorraad!$A$2:$J$1001,10)),\"\",VLOOKUP($A$72,Voorraad!$A$2:$J$1001,10))","v":0},{"$f":"IF(ISERROR(VLOOKUP($A$72,Voorraad!$A$2:$G$1001,6)),\"\",VLOOKUP($A$72,Voorraad!$A$2:$G$1001,6))","v":"DISTRELEC"},{"$f":"IF(ISERROR(VLOOKUP($A$72,Voorraad!$A$2:$G$1001,7)),\"\",VLOOKUP($A$72,Voorraad!$A$2:$G$1001,7))","v":"FISCHER"},{"$f":"IF(ISERROR(VLOOKUP($A$72,Voorraad!$A$2:$G$1001,5)),\"\",VLOOKUP($A$72,Voorraad!$A$2:$G$1001,5))","v":8510},{"$f":"IF(ISERROR(VLOOKUP($A$72,Voorraad!$A$2:$D$1001,4)),\"\",VLOOKUP($A$72,Voorraad!$A$2:$D$1001,4))","v":109},{"$f":"B72","v":900},{"$f":"MAX(0,(SUM(M72-L72)))","v":791}]
["BU0045",{"$f":"[6]Sheet1!$E$68","v":75},{"$f":"IF(ISERROR(VLOOKUP($A$73,Voorraad!$A$2:$D$1001,1)),\"\",VLOOKUP($A$73,Voorraad!$A$2:$D$1001,1))","v":"BU0045"},{"$f":"IF(ISERROR(VLOOKUP($A$73,Voorraad!$A$2:$D$1001,3)),\"\",VLOOKUP($A$73,Voorraad!$A$2:$D$1001,3))","v":"LED TLG124A GROEN 3.18MM"},{"$f":"IF(ISERROR(VLOOKUP($A$73,Voorraad!$A$2:$D$1001,2)),\"\",VLOOKUP($A$73,Voorraad!$A$2:$D$1001,2))","v":"KVD-03-035/G"},{"$f":"IF(ISERROR(VLOOKUP($A$73,Voorraad!$A$2:$H$1001,8)),\"\",VLOOKUP($A$73,Voorraad!$A$2:$H$1001,8))","v":"?"},{"$f":"IF(ISERROR(VLOOKUP($A$73,Voorraad!$A$2:$I$1001,9)),\"\",VLOOKUP($A$73,Voorraad!$A$2:$I$1001,9))","v":"L-934GD"},{"$f":"IF(ISERROR(VLOOKUP($A$73,Voorraad!$A$2:$J$1001,10)),\"\",VLOOKUP($A$73,Voorraad!$A$2:$J$1001,10))","v":0},{"$f":"IF(ISERROR(VLOOKUP($A$73,Voorraad!$A$2:$G$1001,6)),\"\",VLOOKUP($A$73,Voorraad!$A$2:$G$1001,6))","v":"TME"},{"$f":"IF(ISERROR(VLOOKUP($A$73,Voorraad!$A$2:$G$1001,7)),\"\",VLOOKUP($A$73,Voorraad!$A$2:$G$1001,7))","v":"KHATOD / King Bright"},{"$f":"IF(ISERROR(VLOOKUP($A$73,Voorraad!$A$2:$G$1001,5)),\"\",VLOOKUP($A$73,Voorraad!$A$2:$G$1001,5))","v":"8437/8438/8439/8464/8510"},{"$f":"IF(ISERROR(VLOOKUP($A$73,Voorraad!$A$2:$D$1001,4)),\"\",VLOOKUP($A$73,Voorraad!$A$2:$D$1001,4))","v":2},75,73]
["BU0046",{"$f":"[6]Sheet1!$E$69","v":75},{"$f":"IF(ISERROR(VLOOKUP($A$74,Voorraad!$A$2:$D$1001,1)),\"\",VLOOKUP($A$74,Voorraad!$A$2:$D$1001,1))","v":"BU0046"},{"$f":"IF(ISERROR(VLOOKUP($A$74,Voorraad!$A$2:$D$1001,3)),\"\",VLOOKUP($A$74,Voorraad!$A$2:$D$1001,3))","v":"LED TLY124 AMBER 3.18MM"},{"$f":"IF(ISERROR(VLOOKUP($A$74,Voorraad!$A$2:$D$1001,2)),\"\",VLOOKUP($A$74,Voorraad!$A$2:$D$1001,2))","v":"#900TLHY4400"},{"$f":"IF(ISERROR(VLOOKUP($A$74,Voorraad!$A$2:$H$1001,8)),\"\",VLOOKUP($A$74,Voorraad!$A$2:$H$1001,8))","v":552102},{"$f":"IF(ISERROR(VLOOKUP($A$74,Voorraad!$A$2:$I$1001,9)),\"\",VLOOKUP($A$74,Voorraad!$A$2:$I$1001,9))","v":0},{"$f":"IF(ISERROR(VLOOKUP($A$74,Voorraad!$A$2:$J$1001,10)),\"\",VLOOKUP($A$74,Voorraad!$A$2:$J$1001,10))","v":0},{"$f":"IF(ISERROR(VLOOKUP($A$74,Voorraad!$A$2:$G$1001,6)),\"\",VLOOKUP($A$74,Voorraad!$A$2:$G$1001,6))","v":0},{"$f":"IF(ISERROR(VLOOKUP($A$74,Voorraad!$A$2:$G$1001,7)),\"\",VLOOKUP($A$74,Voorraad!$A$2:$G$1001,7))","v":"TOSHIBA"},{"$f":"IF(ISERROR(VLOOKUP($A$74,Voorraad!$A$2:$G$1001,5)),\"\",VLOOKUP($A$74,Voorraad!$A$2:$G$1001,5))","v":8510},{"$f":"IF(ISERROR(VLOOKUP($A$74,Voorraad!$A$2:$D$1001,4)),\"\",VLOOKUP($A$74,Voorraad!$A$2:$D$1001,4))","v":-63},75,138]
["BU0047",{"$f":"[6]Sheet1!$E$70","v":75},{"$f":"IF(ISERROR(VLOOKUP($A$75,Voorraad!$A$2:$D$1001,1)),\"\",VLOOKUP($A$75,Voorraad!$A$2:$D$1001,1))","v":"BU0047"},{"$f":"IF(ISERROR(VLOOKUP($A$75,Voorraad!$A$2:$D$1001,3)),\"\",VLOOKUP($A$75,Voorraad!$A$2:$D$1001,3))","v":"LED L63GD 5MM GROEN"},{"$f":"IF(ISERROR(VLOOKUP($A$75,Voorraad!$A$2:$D$1001,2)),\"\",VLOOKUP($A$75,Voorraad!$A$2:$D$1001,2))","v":"#901L63GDK"},{"$f":"IF(ISERROR(VLOOKUP($A$75,Voorraad!$A$2:$H$1001,8)),\"\",VLOOKUP($A$75,Voorraad!$A$2:$H$1001,8))","v":552103},{"$f":"IF(ISERROR(VLOOKUP($A$75,Voorraad!$A$2:$I$1001,9)),\"\",VLOOKUP($A$75,Voorraad!$A$2:$I$1001,9))","v":"TLHG5205"},{"$f":"IF(ISERROR(VLOOKUP($A$75,Voorraad!$A$2:$J$1001,10)),\"\",VLOOKUP($A$75,Voorraad!$A$2:$J$1001,10))","v":0},{"$f":"IF(ISERROR(VLOOKUP($A$75,Voorraad!$A$2:$G$1001,6)),\"\",VLOOKUP($A$75,Voorraad!$A$2:$G$1001,6))","v":"TME"},{"$f":"IF(ISERROR(VLOOKUP($A$75,Voorraad!$A$2:$G$1001,7)),\"\",VLOOKUP($A$75,Voorraad!$A$2:$G$1001,7))","v":"VISHAY"},{"$f":"IF(ISERROR(VLOOKUP($A$75,Voorraad!$A$2:$G$1001,5)),\"\",VLOOKUP($A$75,Voorraad!$A$2:$G$1001,5))","v":8510},{"$f":"IF(ISERROR(VLOOKUP($A$75,Voorraad!$A$2:$D$1001,4)),\"\",VLOOKUP($A$75,Voorraad!$A$2:$D$1001,4))","v":0},75,75]
["BU0048",{"$f":"[6]Sheet1!$E$71","v":750},{"$f":"IF(ISERROR(VLOOKUP($A$76,Voorraad!$A$2:$D$1001,1)),\"\",VLOOKUP($A$76,Voorraad!$A$2:$D$1001,1))","v":"BU0048"},{"$f":"IF(ISERROR(VLOOKUP($A$76,Voorraad!$A$2:$D$1001,3)),\"\",VLOOKUP($A$76,Voorraad!$A$2:$D$1001,3))","v":"LED TLRE263AP ROOD 2E"},{"$f":"IF(ISERROR(VLOOKUP($A$76,Voorraad!$A$2:$D$1001,2)),\"\",VLOOKUP($A$76,Voorraad!$A$2:$D$1001,2))","v":"#49TLRE263APT"},{"$f":"IF(ISERROR(VLOOKUP($A$76,Voorraad!$A$2:$H$1001,8)),\"\",VLOOKUP($A$76,Voorraad!$A$2:$H$1001,8))","v":552104},{"$f":"IF(ISERROR(VLOOKUP($A$76,Voorraad!$A$2:$I$1001,9)),\"\",VLOOKUP($A$76,Voorraad!$A$2:$I$1001,9))","v":"WP63iT"},{"$f":"IF(ISERROR(VLOOKUP($A$76,Voorraad!$A$2:$J$1001,10)),\"\",VLOOKUP($A$76,Voorraad!$A$2:$J$1001,10))","v":"TME: L-1502EC  /  FARNELL: 2335729"},{"$f":"IF(ISERROR(VLOOKUP($A$76,Voorraad!$A$2:$G$1001,6)),\"\",VLOOKUP($A$76,Voorraad!$A$2:$G$1001,6))","v":"TME"},{"$f":"IF(ISERROR(VLOOKUP($A$76,Voorraad!$A$2:$G$1001,7)),\"\",VLOOKUP($A$76,Voorraad!$A$2:$G$1001,7))","v":"KINGBRIGHT"},{"$f":"IF(ISERROR(VLOOKUP($A$76,Voorraad!$A$2:$G$1001,5)),\"\",VLOOKUP($A$76,Voorraad!$A$2:$G$1001,5))","v":8510},{"$f":"IF(ISERROR(VLOOKUP($A$76,Voorraad!$A$2:$D$1001,4)),\"\",VLOOKUP($A$76,Voorraad!$A$2:$D$1001,4))","v":-501},750,1251]
["BU0051",{"$f":"[6]Sheet1!$E$72","v":75},{"$f":"IF(ISERROR(VLOOKUP($A$77,Voorraad!$A$2:$D$1001,1)),\"\",VLOOKUP($A$77,Voorraad!$A$2:$D$1001,1))","v":"BU0051"},{"$f":"IF(ISERROR(VLOOKUP($A$77,Voorraad!$A$2:$D$1001,3)),\"\",VLOOKUP($A$77,Voorraad!$A$2:$D$1001,3))","v":"REL G6RN1-24VDC 24V"},{"$f":"IF(ISERROR(VLOOKUP($A$77,Voorraad!$A$2:$D$1001,2)),\"\",VLOOKUP($A$77,Voorraad!$A$2:$D$1001,2))","v":"#502G6RN124VO"},{"$f":"IF(ISERROR(VLOOKUP($A$77,Voorraad!$A$2:$H$1001,8)),\"\",VLOOKUP($A$77,Voorraad!$A$2:$H$1001,8))","v":536001},{"$f":"IF(ISERROR(VLOOKUP($A$77,Voorraad!$A$2:$I$1001,9)),\"\",VLOOKUP($A$77,Voorraad!$A$2:$I$1001,9))","v":"G6RN-1-24"},{"$f":"IF(ISERROR(VLOOKUP($A$77,Voorraad!$A$2:$J$1001,10)),\"\",VLOOKUP($A$77,Voorraad!$A$2:$J$1001,10))","v":"alternatief:   y23061-b1007    siemens "},{"$f":"IF(ISERROR(VLOOKUP($A$77,Voorraad!$A$2:$G$1001,6)),\"\",VLOOKUP($A$77,Voorraad!$A$2:$G$1001,6))","v":"TME"},{"$f":"IF(ISERROR(VLOOKUP($A$77,Voorraad!$A$2:$G$1001,7)),\"\",VLOOKUP($A$77,Voorraad!$A$2:$G$1001,7))","v":"OMRON"},{"$f":"IF(ISERROR(VLOOKUP($A$77,Voorraad!$A$2:$G$1001,5)),\"\",VLOOKUP($A$77,Voorraad!$A$2:$G$1001,5))","v":"8410/8510"},{"$f":"IF(ISERROR(VLOOKUP($A$77,Voorraad!$A$2:$D$1001,4)),\"\",VLOOKUP($A$77,Voorraad!$A$2:$D$1001,4))","v":-75},75,150]
["BU0056",{"$f":"[6]Sheet1!$E$73","v":75},{"$f":"IF(ISERROR(VLOOKUP($A$78,Voorraad!$A$2:$D$1001,1)),\"\",VLOOKUP($A$78,Voorraad!$A$2:$D$1001,1))","v":"BU0056"},{"$f":"IF(ISERROR(VLOOKUP($A$78,Voorraad!$A$2:$D$1001,3)),\"\",VLOOKUP($A$78,Voorraad!$A$2:$D$1001,3))","v":"CON ICV 20P 0-0345721-6"},{"$f":"IF(ISERROR(VLOOKUP($A$78,Voorraad!$A$2:$D$1001,2)),\"\",VLOOKUP($A$78,Voorraad!$A$2:$D$1001,2))","v":"#511020PRE"},{"$f":"IF(ISERROR(VLOOKUP($A$78,Voorraad!$A$2:$H$1001,8)),\"\",VLOOKUP($A$78,Voorraad!$A$2:$H$1001,8))","v":516245},{"$f":"IF(ISERROR(VLOOKUP($A$78,Voorraad!$A$2:$I$1001,9)),\"\",VLOOKUP($A$78,Voorraad!$A$2:$I$1001,9))","v":"ICVT-20P"},{"$f":"IF(ISERROR(VLOOKUP($A$78,Voorraad!$A$2:$J$1001,10)),\"\",VLOOKUP($A$78,Voorraad!$A$2:$J$1001,10))","v":0},{"$f":"IF(ISERROR(VLOOKUP($A$78,Voorraad!$A$2:$G$1001,6)),\"\",VLOOKUP($A$78,Voorraad!$A$2:$G$1001,6))","v":"TME"},{"$f":"IF(ISERROR(VLOOKUP($A$78,Voorraad!$A$2:$G$1001,7)),\"\",VLOOKUP($A$78,Voorraad!$A$2:$G$1001,7))","v":"EURODIP"},{"$f":"IF(ISERROR(VLOOKUP($A$78,Voorraad!$A$2:$G$1001,5)),\"\",VLOOKUP($A$78,Voorraad!$A$2:$G$1001,5))","v":8510},{"$f":"IF(ISERROR(VLOOKUP($A$78,Voorraad!$A$2:$D$1001,4)),\"\",VLOOKUP($A$78,Voorraad!$A$2:$D$1001,4))","v":-75},75,150]
["BU0057",{"$f":"[6]Sheet1!$E$74","v":150},{"$f":"IF(ISERROR(VLOOKUP($A$79,Voorraad!$A$2:$D$1001,1)),\"\",VLOOKUP($A$79,Voorraad!$A$2:$D$1001,1))","v":"BU0057"},{"$f":"IF(ISERROR(VLOOKUP($A$79,Voorraad!$A$2:$D$1001,3)),\"\",VLOOKUP($A$79,Voorraad!$A$2:$D$1001,3))","v":"CON ICV 28P 0-0345728-6"},{"$f":"IF(ISERROR(VLOOKUP($A$79,Voorraad!$A$2:$D$1001,2)),\"\",VLOOKUP($A$79,Voorraad!$A$2:$D$1001,2))","v":"#511028PRE"},{"$f":"IF(ISERROR(VLOOKUP($A$79,Voorraad!$A$2:$H$1001,8)),\"\",VLOOKUP($A$79,Voorraad!$A$2:$H$1001,8))","v":516231},{"$f":"IF(ISERROR(VLOOKUP($A$79,Voorraad!$A$2:$I$1001,9)),\"\",VLOOKUP($A$79,Voorraad!$A$2:$I$1001,9))","v":"ICVT-28P"},{"$f":"IF(ISERROR(VLOOKUP($A$79,Voorraad!$A$2:$J$1001,10)),\"\",VLOOKUP($A$79,Voorraad!$A$2:$J$1001,10))","v":0},{"$f":"IF(ISERROR(VLOOKUP($A$79,Voorraad!$A$2:$G$1001,6)),\"\",VLOOKUP($A$79,Voorraad!$A$2:$G$1001,6))","v":"TME"},{"$f":"IF(ISERROR(VLOOKUP($A$79,Voorraad!$A$2:$G$1001,7)),\"\",VLOOKUP($A$79,Voorraad!$A$2:$G$1001,7))","v":"CONNFLY"},{"$f":"IF(ISERROR(VLOOKUP($A$79,Voorraad!$A$2:$G$1001,5)),\"\",VLOOKUP($A$79,Voorraad!$A$2:$G$1001,5))","v":8510},{"$f":"IF(ISERROR(VLOOKUP($A$79,Voorraad!$A$2:$D$1001,4)),\"\",VLOOKUP($A$79,Voorraad!$A$2:$D$1001,4))","v":-142},150,292]
["BU0058",{"$f":"[6]Sheet1!$E$75","v":75},{"$f":"IF(ISERROR(VLOOKUP($A$80,Voorraad!$A$2:$D$1001,1)),\"\",VLOOKUP($A$80,Voorraad!$A$2:$D$1001,1))","v":"BU0058"},{"$f":"IF(ISERROR(VLOOKUP($A$80,Voorraad!$A$2:$D$1001,3)),\"\",VLOOKUP($A$80,Voorraad!$A$2:$D$1001,3))","v":"CON ICV 40P 0-0345730-6"},{"$f":"IF(ISERROR(VLOOKUP($A$80,Voorraad!$A$2:$D$1001,2)),\"\",VLOOKUP($A$80,Voorraad!$A$2:$D$1001,2))","v":"#511040PRE"},{"$f":"IF(ISERROR(VLOOKUP($A$80,Voorraad!$A$2:$H$1001,8)),\"\",VLOOKUP($A$80,Voorraad!$A$2:$H$1001,8))","v":516232},{"$f":"IF(ISERROR(VLOOKUP($A$80,Voorraad!$A$2:$I$1001,9)),\"\",VLOOKUP($A$80,Voorraad!$A$2:$I$1001,9))","v":"ICVT-40P"},{"$f":"IF(ISERROR(VLOOKUP($A$80,Voorraad!$A$2:$J$1001,10)),\"\",VLOOKUP($A$80,Voorraad!$A$2:$J$1001,10))","v":0},{"$f":"IF(ISERROR(VLOOKUP($A$80,Voorraad!$A$2:$G$1001,6)),\"\",VLOOKUP($A$80,Voorraad!$A$2:$G$1001,6))","v":"TME"},{"$f":"IF(ISERROR(VLOOKUP($A$80,Voorraad!$A$2:$G$1001,7)),\"\",VLOOKUP($A$80,Voorraad!$A$2:$G$1001,7))","v":"CONNFLY"},{"$f":"IF(ISERROR(VLOOKUP($A$80,Voorraad!$A$2:$G$1001,5)),\"\",VLOOKUP($A$80,Voorraad!$A$2:$G$1001,5))","v":8510},{"$f":"IF(ISERROR(VLOOKUP($A$80,Voorraad!$A$2:$D$1001,4)),\"\",VLOOKUP($A$80,Voorraad!$A$2:$D$1001,4))","v":-74},75,149]
["BU0059",{"$f":"[6]Sheet1!$E$76","v":75},{"$f":"IF(ISERROR(VLOOKUP($A$81,Voorraad!$A$2:$D$1001,1)),\"\",VLOOKUP($A$81,Voorraad!$A$2:$D$1001,1))","v":"BU0059"},{"$f":"IF(ISERROR(VLOOKUP($A$81,Voorraad!$A$2:$D$1001,3)),\"\",VLOOKUP($A$81,Voorraad!$A$2:$D$1001,3))","v":"CON 1-881545-1 SHUNT"},{"$f":"IF(ISERROR(VLOOKUP($A$81,Voorraad!$A$2:$D$1001,2)),\"\",VLOOKUP($A$81,Voorraad!$A$2:$D$1001,2))","v":"#513JUMPOFSW"},{"$f":"IF(ISERROR(VLOOKUP($A$81,Voorraad!$A$2:$H$1001,8)),\"\",VLOOKUP($A$81,Voorraad!$A$2:$H$1001,8))","v":0},{"$f":"IF(ISERROR(VLOOKUP($A$81,Voorraad!$A$2:$I$1001,9)),\"\",VLOOKUP($A$81,Voorraad!$A$2:$I$1001,9))","v":"JUMPER-BL"},{"$f":"IF(ISERROR(VLOOKUP($A$81,Voorraad!$A$2:$J$1001,10)),\"\",VLOOKUP($A$81,Voorraad!$A$2:$J$1001,10))","v":0},{"$f":"IF(ISERROR(VLOOKUP($A$81,Voorraad!$A$2:$G$1001,6)),\"\",VLOOKUP($A$81,Voorraad!$A$2:$G$1001,6))","v":"TME"},{"$f":"IF(ISERROR(VLOOKUP($A$81,Voorraad!$A$2:$G$1001,7)),\"\",VLOOKUP($A$81,Voorraad!$A$2:$G$1001,7))","v":0},{"$f":"IF(ISERROR(VLOOKUP($A$81,Voorraad!$A$2:$G$1001,5)),\"\",VLOOKUP($A$81,Voorraad!$A$2:$G$1001,5))","v":"8437/8439/8464/8510"},{"$f":"IF(ISERROR(VLOOKUP($A$81,Voorraad!$A$2:$D$1001,4)),\"\",VLOOKUP($A$81,Voorraad!$A$2:$D$1001,4))","v":1725},75,0]
["BU0060",{"$f":"[6]Sheet1!$E$77","v":75},{"$f":"IF(ISERROR(VLOOKUP($A$82,Voorraad!$A$2:$D$1001,1)),\"\",VLOOKUP($A$82,Voorraad!$A$2:$D$1001,1))","v":"BU0060"},{"$f":"IF(ISERROR(VLOOKUP($A$82,Voorraad!$A$2:$D$1001,3)),\"\",VLOOKUP($A$82,Voorraad!$A$2:$D$1001,3))","v":"CON 8280224-03-02 3P MALE"},{"$f":"IF(ISERROR(VLOOKUP($A$82,Voorraad!$A$2:$D$1001,2)),\"\",VLOOKUP($A$82,Voorraad!$A$2:$D$1001,2))","v":"#514890003811"},{"$f":"IF(ISERROR(VLOOKUP($A$82,Voorraad!$A$2:$H$1001,8)),\"\",VLOOKUP($A$82,Voorraad!$A$2:$H$1001,8))","v":0},{"$f":"IF(ISERROR(VLOOKUP($A$82,Voorraad!$A$2:$I$1001,9)),\"\",VLOOKUP($A$82,Voorraad!$A$2:$I$1001,9))","v":0},{"$f":"IF(ISERROR(VLOOKUP($A$82,Voorraad!$A$2:$J$1001,10)),\"\",VLOOKUP($A$82,Voorraad!$A$2:$J$1001,10))","v":0},{"$f":"IF(ISERROR(VLOOKUP($A$82,Voorraad!$A$2:$G$1001,6)),\"\",VLOOKUP($A$82,Voorraad!$A$2:$G$1001,6))","v":0},{"$f":"IF(ISERROR(VLOOKUP($A$82,Voorraad!$A$2:$G$1001,7)),\"\",VLOOKUP($A$82,Voorraad!$A$2:$G$1001,7))","v":"PRECIDIP"},{"$f":"IF(ISERROR(VLOOKUP($A$82,Voorraad!$A$2:$G$1001,5)),\"\",VLOOKUP($A$82,Voorraad!$A$2:$G$1001,5))","v":8510},{"$f":"IF(ISERROR(VLOOKUP($A$82,Voorraad!$A$2:$D$1001,4)),\"\",VLOOKUP($A$82,Voorraad!$A$2:$D$1001,4))","v":272},75,0]
["BU0068",{"$f":"[6]Sheet1!$E$78","v":75},{"$f":"IF(ISERROR(VLOOKUP($A$83,Voorraad!$A$2:$D$1001,1)),\"\",VLOOKUP($A$83,Voorraad!$A$2:$D$1001,1))","v":"BU0068"},{"$f":"IF(ISERROR(VLOOKUP($A$83,Voorraad!$A$2:$D$1001,3)),\"\",VLOOKUP($A$83,Voorraad!$A$2:$D$1001,3))","v":"ZL201-03G"},{"$f":"IF(ISERROR(VLOOKUP($A$83,Voorraad!$A$2:$D$1001,2)),\"\",VLOOKUP($A$83,Voorraad!$A$2:$D$1001,2))","v":"DS1021-136sf11"},{"$f":"IF(ISERROR(VLOOKUP($A$83,Voorraad!$A$2:$H$1001,8)),\"\",VLOOKUP($A$83,Voorraad!$A$2:$H$1001,8))","v":0},{"$f":"IF(ISERROR(VLOOKUP($A$83,Voorraad!$A$2:$I$1001,9)),\"\",VLOOKUP($A$83,Voorraad!$A$2:$I$1001,9))","v":"ZL201-03G"},{"$f":"IF(ISERROR(VLOOKUP($A$83,Voorraad!$A$2:$J$1001,10)),\"\",VLOOKUP($A$83,Voorraad!$A$2:$J$1001,10))","v":0},{"$f":"IF(ISERROR(VLOOKUP($A$83,Voorraad!$A$2:$G$1001,6)),\"\",VLOOKUP($A$83,Voorraad!$A$2:$G$1001,6))","v":"TME"},{"$f":"IF(ISERROR(VLOOKUP($A$83,Voorraad!$A$2:$G$1001,7)),\"\",VLOOKUP($A$83,Voorraad!$A$2:$G$1001,7))","v":"Connfly"},{"$f":"IF(ISERROR(VLOOKUP($A$83,Voorraad!$A$2:$G$1001,5)),\"\",VLOOKUP($A$83,Voorraad!$A$2:$G$1001,5))","v":"8437/8439/8464/8510"},{"$f":"IF(ISERROR(VLOOKUP($A$83,Voorraad!$A$2:$D$1001,4)),\"\",VLOOKUP($A$83,Voorraad!$A$2:$D$1001,4))","v":931},75,0]
["BU0062",{"$f":"[6]Sheet1!$E$79","v":75},{"$f":"IF(ISERROR(VLOOKUP($A$84,Voorraad!$A$2:$D$1001,1)),\"\",VLOOKUP($A$84,Voorraad!$A$2:$D$1001,1))","v":"BU0062"},{"$f":"IF(ISERROR(VLOOKUP($A$84,Voorraad!$A$2:$D$1001,3)),\"\",VLOOKUP($A$84,Voorraad!$A$2:$D$1001,3))","v":"CON 09031646921 64P A+C"},{"$f":"IF(ISERROR(VLOOKUP($A$84,Voorraad!$A$2:$D$1001,2)),\"\",VLOOKUP($A$84,Voorraad!$A$2:$D$1001,2))","v":"#5B031646921"},{"$f":"IF(ISERROR(VLOOKUP($A$84,Voorraad!$A$2:$H$1001,8)),\"\",VLOOKUP($A$84,Voorraad!$A$2:$H$1001,8))","v":516129},{"$f":"IF(ISERROR(VLOOKUP($A$84,Voorraad!$A$2:$I$1001,9)),\"\",VLOOKUP($A$84,Voorraad!$A$2:$I$1001,9))","v":9031646921},{"$f":"IF(ISERROR(VLOOKUP($A$84,Voorraad!$A$2:$J$1001,10)),\"\",VLOOKUP($A$84,Voorraad!$A$2:$J$1001,10))","v":0},{"$f":"IF(ISERROR(VLOOKUP($A$84,Voorraad!$A$2:$G$1001,6)),\"\",VLOOKUP($A$84,Voorraad!$A$2:$G$1001,6))","v":"TME"},{"$f":"IF(ISERROR(VLOOKUP($A$84,Voorraad!$A$2:$G$1001,7)),\"\",VLOOKUP($A$84,Voorraad!$A$2:$G$1001,7))","v":"HARTING"},{"$f":"IF(ISERROR(VLOOKUP($A$84,Voorraad!$A$2:$G$1001,5)),\"\",VLOOKUP($A$84,Voorraad!$A$2:$G$1001,5))","v":8510},{"$f":"IF(ISERROR(VLOOKUP($A$84,Voorraad!$A$2:$D$1001,4)),\"\",VLOOKUP($A$84,Voorraad!$A$2:$D$1001,4))","v":-75},75,150]
["BU0074",{"$f":"[6]Sheet1!$E$80","v":75},{"$f":"IF(ISERROR(VLOOKUP($A$85,Voorraad!$A$2:$D$1001,1)),\"\",VLOOKUP($A$85,Voorraad!$A$2:$D$1001,1))","v":"BU0074"},{"$f":"IF(ISERROR(VLOOKUP($A$85,Voorraad!$A$2:$D$1001,3)),\"\",VLOOKUP($A$85,Voorraad!$A$2:$D$1001,3))","v":"SW TP33W0030 drukknopschakelaar"},{"$f":"IF(ISERROR(VLOOKUP($A$85,Voorraad!$A$2:$D$1001,2)),\"\",VLOOKUP($A$85,Voorraad!$A$2:$D$1001,2))","v":"#552TP33W003000"},{"$f":"IF(ISERROR(VLOOKUP($A$85,Voorraad!$A$2:$H$1001,8)),\"\",VLOOKUP($A$85,Voorraad!$A$2:$H$1001,8))","v":530220},{"$f":"IF(ISERROR(VLOOKUP($A$85,Voorraad!$A$2:$I$1001,9)),\"\",VLOOKUP($A$85,Voorraad!$A$2:$I$1001,9))","v":"642-TP33W003000"},{"$f":"IF(ISERROR(VLOOKUP($A$85,Voorraad!$A$2:$J$1001,10)),\"\",VLOOKUP($A$85,Voorraad!$A$2:$J$1001,10))","v":0},{"$f":"IF(ISERROR(VLOOKUP($A$85,Voorraad!$A$2:$G$1001,6)),\"\",VLOOKUP($A$85,Voorraad!$A$2:$G$1001,6))","v":"MOUSER"},{"$f":"IF(ISERROR(VLOOKUP($A$85,Voorraad!$A$2:$G$1001,7)),\"\",VLOOKUP($A$85,Voorraad!$A$2:$G$1001,7))","v":"APEM"},{"$f":"IF(ISERROR(VLOOKUP($A$85,Voorraad!$A$2:$G$1001,5)),\"\",VLOOKUP($A$85,Voorraad!$A$2:$G$1001,5))","v":8510},{"$f":"IF(ISERROR(VLOOKUP($A$85,Voorraad!$A$2:$D$1001,4)),\"\",VLOOKUP($A$85,Voorraad!$A$2:$D$1001,4))","v":-75},75,150]
["BU0075",{"$f":"[6]Sheet1!$E$81","v":300},{"$f":"IF(ISERROR(VLOOKUP($A$86,Voorraad!$A$2:$D$1001,1)),\"\",VLOOKUP($A$86,Voorraad!$A$2:$D$1001,1))","v":"BU0075"},{"$f":"IF(ISERROR(VLOOKUP($A$86,Voorraad!$A$2:$D$1001,3)),\"\",VLOOKUP($A$86,Voorraad!$A$2:$D$1001,3))","v":"SW P65-101L254 kodeerschakelaar"},{"$f":"IF(ISERROR(VLOOKUP($A$86,Voorraad!$A$2:$D$1001,2)),\"\",VLOOKUP($A$86,Voorraad!$A$2:$D$1001,2))","v":"#553PT65101L1"},{"$f":"IF(ISERROR(VLOOKUP($A$86,Voorraad!$A$2:$H$1001,8)),\"\",VLOOKUP($A$86,Voorraad!$A$2:$H$1001,8))","v":536219},{"$f":"IF(ISERROR(VLOOKUP($A$86,Voorraad!$A$2:$I$1001,9)),\"\",VLOOKUP($A$86,Voorraad!$A$2:$I$1001,9))","v":"642-PT65101L254"},{"$f":"IF(ISERROR(VLOOKUP($A$86,Voorraad!$A$2:$J$1001,10)),\"\",VLOOKUP($A$86,Voorraad!$A$2:$J$1001,10))","v":0},{"$f":"IF(ISERROR(VLOOKUP($A$86,Voorraad!$A$2:$G$1001,6)),\"\",VLOOKUP($A$86,Voorraad!$A$2:$G$1001,6))","v":"MOUSER"},{"$f":"IF(ISERROR(VLOOKUP($A$86,Voorraad!$A$2:$G$1001,7)),\"\",VLOOKUP($A$86,Voorraad!$A$2:$G$1001,7))","v":"HARTMAN"},{"$f":"IF(ISERROR(VLOOKUP($A$86,Voorraad!$A$2:$G$1001,5)),\"\",VLOOKUP($A$86,Voorraad!$A$2:$G$1001,5))","v":8510},{"$f":"IF(ISERROR(VLOOKUP($A$86,Voorraad!$A$2:$D$1001,4)),\"\",VLOOKUP($A$86,Voorraad!$A$2:$D$1001,4))","v":-277},300,577]
["BU0076",{"$f":"[6]Sheet1!$E$82","v":75},{"$f":"IF(ISERROR(VLOOKUP($A$87,Voorraad!$A$2:$D$1001,1)),\"\",VLOOKUP($A$87,Voorraad!$A$2:$D$1001,1))","v":"BU0076"},{"$f":"IF(ISERROR(VLOOKUP($A$87,Voorraad!$A$2:$D$1001,3)),\"\",VLOOKUP($A$87,Voorraad!$A$2:$D$1001,3))","v":"LTRM5RD 25/13W"},{"$f":"IF(ISERROR(VLOOKUP($A$87,Voorraad!$A$2:$D$1001,2)),\"\",VLOOKUP($A$87,Voorraad!$A$2:$D$1001,2))","v":"#611RM5RD"},{"$f":"IF(ISERROR(VLOOKUP($A$87,Voorraad!$A$2:$H$1001,8)),\"\",VLOOKUP($A$87,Voorraad!$A$2:$H$1001,8))","v":0},{"$f":"IF(ISERROR(VLOOKUP($A$87,Voorraad!$A$2:$I$1001,9)),\"\",VLOOKUP($A$87,Voorraad!$A$2:$I$1001,9))","v":0},{"$f":"IF(ISERROR(VLOOKUP($A$87,Voorraad!$A$2:$J$1001,10)),\"\",VLOOKUP($A$87,Voorraad!$A$2:$J$1001,10))","v":"groter aantal inkopen voor vervolgen 100x"},{"$f":"IF(ISERROR(VLOOKUP($A$87,Voorraad!$A$2:$G$1001,6)),\"\",VLOOKUP($A$87,Voorraad!$A$2:$G$1001,6))","v":0},{"$f":"IF(ISERROR(VLOOKUP($A$87,Voorraad!$A$2:$G$1001,7)),\"\",VLOOKUP($A$87,Voorraad!$A$2:$G$1001,7))","v":"TRAFA"},{"$f":"IF(ISERROR(VLOOKUP($A$87,Voorraad!$A$2:$G$1001,5)),\"\",VLOOKUP($A$87,Voorraad!$A$2:$G$1001,5))","v":8510},{"$f":"IF(ISERROR(VLOOKUP($A$87,Voorraad!$A$2:$D$1001,4)),\"\",VLOOKUP($A$87,Voorraad!$A$2:$D$1001,4))","v":-28},75,103]
["BU0049",{"$f":"[6]Sheet1!$E$83","v":75},{"$f":"IF(ISERROR(VLOOKUP($A$88,Voorraad!$A$2:$D$1001,1)),\"\",VLOOKUP($A$88,Voorraad!$A$2:$D$1001,1))","v":"BU0049"},{"$f":"IF(ISERROR(VLOOKUP($A$88,Voorraad!$A$2:$D$1001,3)),\"\",VLOOKUP($A$88,Voorraad!$A$2:$D$1001,3))","v":"LDR 550 NM TO-18"},{"$f":"IF(ISERROR(VLOOKUP($A$88,Voorraad!$A$2:$D$1001,2)),\"\",VLOOKUP($A$88,Voorraad!$A$2:$D$1001,2))","v":0},{"$f":"IF(ISERROR(VLOOKUP($A$88,Voorraad!$A$2:$H$1001,8)),\"\",VLOOKUP($A$88,Voorraad!$A$2:$H$1001,8))","v":0},{"$f":"IF(ISERROR(VLOOKUP($A$88,Voorraad!$A$2:$I$1001,9)),\"\",VLOOKUP($A$88,Voorraad!$A$2:$I$1001,9))","v":3168335},{"$f":"IF(ISERROR(VLOOKUP($A$88,Voorraad!$A$2:$J$1001,10)),\"\",VLOOKUP($A$88,Voorraad!$A$2:$J$1001,10))","v":0},{"$f":"IF(ISERROR(VLOOKUP($A$88,Voorraad!$A$2:$G$1001,6)),\"\",VLOOKUP($A$88,Voorraad!$A$2:$G$1001,6))","v":"FARNELL"},{"$f":"IF(ISERROR(VLOOKUP($A$88,Voorraad!$A$2:$G$1001,7)),\"\",VLOOKUP($A$88,Voorraad!$A$2:$G$1001,7))","v":"ADVANCED"},{"$f":"IF(ISERROR(VLOOKUP($A$88,Voorraad!$A$2:$G$1001,5)),\"\",VLOOKUP($A$88,Voorraad!$A$2:$G$1001,5))","v":8510},{"$f":"IF(ISERROR(VLOOKUP($A$88,Voorraad!$A$2:$D$1001,4)),\"\",VLOOKUP($A$88,Voorraad!$A$2:$D$1001,4))","v":24},75,51]
["BX0027",{"$f":"[6]Sheet1!$E$84","v":300},{"$f":"IF(ISERROR(VLOOKUP($A$89,Voorraad!$A$2:$D$1001,1)),\"\",VLOOKUP($A$89,Voorraad!$A$2:$D$1001,1))","v":"BX0027"},{"$f":"IF(ISERROR(VLOOKUP($A$89,Voorraad!$A$2:$D$1001,3)),\"\",VLOOKUP($A$89,Voorraad!$A$2:$D$1001,3))","v":"BOUT M2X10"},{"$f":"IF(ISERROR(VLOOKUP($A$89,Voorraad!$A$2:$D$1001,2)),\"\",VLOOKUP($A$89,Voorraad!$A$2:$D$1001,2))","v":"#65124665210"},{"$f":"IF(ISERROR(VLOOKUP($A$89,Voorraad!$A$2:$H$1001,8)),\"\",VLOOKUP($A$89,Voorraad!$A$2:$H$1001,8))","v":0},{"$f":"IF(ISERROR(VLOOKUP($A$89,Voorraad!$A$2:$I$1001,9)),\"\",VLOOKUP($A$89,Voorraad!$A$2:$I$1001,9))","v":0},{"$f":"IF(ISERROR(VLOOKUP($A$89,Voorraad!$A$2:$J$1001,10)),\"\",VLOOKUP($A$89,Voorraad!$A$2:$J$1001,10))","v":0},{"$f":"IF(ISERROR(VLOOKUP($A$89,Voorraad!$A$2:$G$1001,6)),\"\",VLOOKUP($A$89,Voorraad!$A$2:$G$1001,6))","v":0},{"$f":"IF(ISERROR(VLOOKUP($A$89,Voorraad!$A$2:$G$1001,7)),\"\",VLOOKUP($A$89,Voorraad!$A$2:$G$1001,7))","v":"FABORY"},{"$f":"IF(ISERROR(VLOOKUP($A$89,Voorraad!$A$2:$G$1001,5)),\"\",VLOOKUP($A$89,Voorraad!$A$2:$G$1001,5))","v":8510},{"$f":"IF(ISERROR(VLOOKUP($A$89,Voorraad!$A$2:$D$1001,4)),\"\",VLOOKUP($A$89,Voorraad!$A$2:$D$1001,4))","v":1700},{"$f":"B89","v":300},0]
["BX0028",{"$f":"[6]Sheet1!$E$85","v":75},{"$f":"IF(ISERROR(VLOOKUP($A$90,Voorraad!$A$2:$D$1001,1)),\"\",VLOOKUP($A$90,Voorraad!$A$2:$D$1001,1))","v":"BX0028"},{"$f":"IF(ISERROR(VLOOKUP($A$90,Voorraad!$A$2:$D$1001,3)),\"\",VLOOKUP($A$90,Voorraad!$A$2:$D$1001,3))","v":"DIN achterwand 8510 bewerkt"},{"$f":"IF(ISERROR(VLOOKUP($A$90,Voorraad!$A$2:$D$1001,2)),\"\",VLOOKUP($A$90,Voorraad!$A$2:$D$1001,2))","v":"#680ACHTER8510B"},{"$f":"IF(ISERROR(VLOOKUP($A$90,Voorraad!$A$2:$H$1001,8)),\"\",VLOOKUP($A$90,Voorraad!$A$2:$H$1001,8))","v":0},{"$f":"IF(ISERROR(VLOOKUP($A$90,Voorraad!$A$2:$I$1001,9)),\"\",VLOOKUP($A$90,Voorraad!$A$2:$I$1001,9))","v":"445-273-01"},{"$f":"IF(ISERROR(VLOOKUP($A$90,Voorraad!$A$2:$J$1001,10)),\"\",VLOOKUP($A$90,Voorraad!$A$2:$J$1001,10))","v":0},{"$f":"IF(ISERROR(VLOOKUP($A$90,Voorraad!$A$2:$G$1001,6)),\"\",VLOOKUP($A$90,Voorraad!$A$2:$G$1001,6))","v":0},{"$f":"IF(ISERROR(VLOOKUP($A$90,Voorraad!$A$2:$G$1001,7)),\"\",VLOOKUP($A$90,Voorraad!$A$2:$G$1001,7))","v":"APRANORM"},{"$f":"IF(ISERROR(VLOOKUP($A$90,Voorraad!$A$2:$G$1001,5)),\"\",VLOOKUP($A$90,Voorraad!$A$2:$G$1001,5))","v":8510},{"$f":"IF(ISERROR(VLOOKUP($A$90,Voorraad!$A$2:$D$1001,4)),\"\",VLOOKUP($A$90,Voorraad!$A$2:$D$1001,4))","v":-55},75,130]
["BX0029",{"$f":"[6]Sheet1!$E$86","v":75},{"$f":"IF(ISERROR(VLOOKUP($A$91,Voorraad!$A$2:$D$1001,1)),\"\",VLOOKUP($A$91,Voorraad!$A$2:$D$1001,1))","v":"BX0029"},{"$f":"IF(ISERROR(VLOOKUP($A$91,Voorraad!$A$2:$D$1001,3)),\"\",VLOOKUP($A$91,Voorraad!$A$2:$D$1001,3))","v":"DIN behuizing 8510 CSI"},{"$f":"IF(ISERROR(VLOOKUP($A$91,Voorraad!$A$2:$D$1001,2)),\"\",VLOOKUP($A$91,Voorraad!$A$2:$D$1001,2))","v":"#680KAST8510"},{"$f":"IF(ISERROR(VLOOKUP($A$91,Voorraad!$A$2:$H$1001,8)),\"\",VLOOKUP($A$91,Voorraad!$A$2:$H$1001,8))","v":0},{"$f":"IF(ISERROR(VLOOKUP($A$91,Voorraad!$A$2:$I$1001,9)),\"\",VLOOKUP($A$91,Voorraad!$A$2:$I$1001,9))","v":0},{"$f":"IF(ISERROR(VLOOKUP($A$91,Voorraad!$A$2:$J$1001,10)),\"\",VLOOKUP($A$91,Voorraad!$A$2:$J$1001,10))","v":0},{"$f":"IF(ISERROR(VLOOKUP($A$91,Voorraad!$A$2:$G$1001,6)),\"\",VLOOKUP($A$91,Voorraad!$A$2:$G$1001,6))","v":0},{"$f":"IF(ISERROR(VLOOKUP($A$91,Voorraad!$A$2:$G$1001,7)),\"\",VLOOKUP($A$91,Voorraad!$A$2:$G$1001,7))","v":"APRANORM"},{"$f":"IF(ISERROR(VLOOKUP($A$91,Voorraad!$A$2:$G$1001,5)),\"\",VLOOKUP($A$91,Voorraad!$A$2:$G$1001,5))","v":8510},{"$f":"IF(ISERROR(VLOOKUP($A$91,Voorraad!$A$2:$D$1001,4)),\"\",VLOOKUP($A$91,Voorraad!$A$2:$D$1001,4))","v":7},75,68]
["BX0030",{"$f":"[6]Sheet1!$E$87","v":150},{"$f":"IF(ISERROR(VLOOKUP($A$92,Voorraad!$A$2:$D$1001,1)),\"\",VLOOKUP($A$92,Voorraad!$A$2:$D$1001,1))","v":"BX0030"},{"$f":"IF(ISERROR(VLOOKUP($A$92,Voorraad!$A$2:$D$1001,3)),\"\",VLOOKUP($A$92,Voorraad!$A$2:$D$1001,3))","v":"DIN montagebeugel 8510 CSI"},{"$f":"IF(ISERROR(VLOOKUP($A$92,Voorraad!$A$2:$D$1001,2)),\"\",VLOOKUP($A$92,Voorraad!$A$2:$D$1001,2))","v":"#680MONTBE8510"},{"$f":"IF(ISERROR(VLOOKUP($A$92,Voorraad!$A$2:$H$1001,8)),\"\",VLOOKUP($A$92,Voorraad!$A$2:$H$1001,8))","v":0},{"$f":"IF(ISERROR(VLOOKUP($A$92,Voorraad!$A$2:$I$1001,9)),\"\",VLOOKUP($A$92,Voorraad!$A$2:$I$1001,9))","v":"440-001"},{"$f":"IF(ISERROR(VLOOKUP($A$92,Voorraad!$A$2:$J$1001,10)),\"\",VLOOKUP($A$92,Voorraad!$A$2:$J$1001,10))","v":0},{"$f":"IF(ISERROR(VLOOKUP($A$92,Voorraad!$A$2:$G$1001,6)),\"\",VLOOKUP($A$92,Voorraad!$A$2:$G$1001,6))","v":0},{"$f":"IF(ISERROR(VLOOKUP($A$92,Voorraad!$A$2:$G$1001,7)),\"\",VLOOKUP($A$92,Voorraad!$A$2:$G$1001,7))","v":"APRANORM"},{"$f":"IF(ISERROR(VLOOKUP($A$92,Voorraad!$A$2:$G$1001,5)),\"\",VLOOKUP($A$92,Voorraad!$A$2:$G$1001,5))","v":8510},{"$f":"IF(ISERROR(VLOOKUP($A$92,Voorraad!$A$2:$D$1001,4)),\"\",VLOOKUP($A$92,Voorraad!$A$2:$D$1001,4))","v":87},150,63]
["BX0031",{"$f":"[6]Sheet1!$E$88","v":75},{"$f":"IF(ISERROR(VLOOKUP($A$93,Voorraad!$A$2:$D$1001,1)),\"\",VLOOKUP($A$93,Voorraad!$A$2:$D$1001,1))","v":"BX0031"},{"$f":"IF(ISERROR(VLOOKUP($A$93,Voorraad!$A$2:$D$1001,3)),\"\",VLOOKUP($A$93,Voorraad!$A$2:$D$1001,3))","v":"FRONTJE INCL RAAM (DE NAAMPL)"},{"$f":"IF(ISERROR(VLOOKUP($A$93,Voorraad!$A$2:$D$1001,2)),\"\",VLOOKUP($A$93,Voorraad!$A$2:$D$1001,2))","v":"#686940035CSI"},{"$f":"IF(ISERROR(VLOOKUP($A$93,Voorraad!$A$2:$H$1001,8)),\"\",VLOOKUP($A$93,Voorraad!$A$2:$H$1001,8))","v":0},{"$f":"IF(ISERROR(VLOOKUP($A$93,Voorraad!$A$2:$I$1001,9)),\"\",VLOOKUP($A$93,Voorraad!$A$2:$I$1001,9))","v":0},{"$f":"IF(ISERROR(VLOOKUP($A$93,Voorraad!$A$2:$J$1001,10)),\"\",VLOOKUP($A$93,Voorraad!$A$2:$J$1001,10))","v":0},{"$f":"IF(ISERROR(VLOOKUP($A$93,Voorraad!$A$2:$G$1001,6)),\"\",VLOOKUP($A$93,Voorraad!$A$2:$G$1001,6))","v":0},{"$f":"IF(ISERROR(VLOOKUP($A$93,Voorraad!$A$2:$G$1001,7)),\"\",VLOOKUP($A$93,Voorraad!$A$2:$G$1001,7))","v":0},{"$f":"IF(ISERROR(VLOOKUP($A$93,Voorraad!$A$2:$G$1001,5)),\"\",VLOOKUP($A$93,Voorraad!$A$2:$G$1001,5))","v":8510},{"$f":"IF(ISERROR(VLOOKUP($A$93,Voorraad!$A$2:$D$1001,4)),\"\",VLOOKUP($A$93,Voorraad!$A$2:$D$1001,4))","v":-44},75,119]
["BX0032",{"$f":"[6]Sheet1!$E$89","v":75},{"$f":"IF(ISERROR(VLOOKUP($A$94,Voorraad!$A$2:$D$1001,1)),\"\",VLOOKUP($A$94,Voorraad!$A$2:$D$1001,1))","v":"BX0032"},{"$f":"IF(ISERROR(VLOOKUP($A$94,Voorraad!$A$2:$D$1001,3)),\"\",VLOOKUP($A$94,Voorraad!$A$2:$D$1001,3))","v":"IC 18CV8P-15 PEEL GEPROGR. V1.2"},{"$f":"IF(ISERROR(VLOOKUP($A$94,Voorraad!$A$2:$D$1001,2)),\"\",VLOOKUP($A$94,Voorraad!$A$2:$D$1001,2))","v":"#4818CV8P15Li"},{"$f":"IF(ISERROR(VLOOKUP($A$94,Voorraad!$A$2:$H$1001,8)),\"\",VLOOKUP($A$94,Voorraad!$A$2:$H$1001,8))","v":0},{"$f":"IF(ISERROR(VLOOKUP($A$94,Voorraad!$A$2:$I$1001,9)),\"\",VLOOKUP($A$94,Voorraad!$A$2:$I$1001,9))","v":0},{"$f":"IF(ISERROR(VLOOKUP($A$94,Voorraad!$A$2:$J$1001,10)),\"\",VLOOKUP($A$94,Voorraad!$A$2:$J$1001,10))","v":"Ongeprogrammeerd. Graag 15Z versie nemen."},{"$f":"IF(ISERROR(VLOOKUP($A$94,Voorraad!$A$2:$G$1001,6)),\"\",VLOOKUP($A$94,Voorraad!$A$2:$G$1001,6))","v":0},{"$f":"IF(ISERROR(VLOOKUP($A$94,Voorraad!$A$2:$G$1001,7)),\"\",VLOOKUP($A$94,Voorraad!$A$2:$G$1001,7))","v":"ICT"},{"$f":"IF(ISERROR(VLOOKUP($A$94,Voorraad!$A$2:$G$1001,5)),\"\",VLOOKUP($A$94,Voorraad!$A$2:$G$1001,5))","v":8510},{"$f":"IF(ISERROR(VLOOKUP($A$94,Voorraad!$A$2:$D$1001,4)),\"\",VLOOKUP($A$94,Voorraad!$A$2:$D$1001,4))","v":-75},75,150]
["BX0033",{"$f":"[6]Sheet1!$E$90","v":75},{"$f":"IF(ISERROR(VLOOKUP($A$95,Voorraad!$A$2:$D$1001,1)),\"\",VLOOKUP($A$95,Voorraad!$A$2:$D$1001,1))","v":"BX0033"},{"$f":"IF(ISERROR(VLOOKUP($A$95,Voorraad!$A$2:$D$1001,3)),\"\",VLOOKUP($A$95,Voorraad!$A$2:$D$1001,3))","v":"IC 18CV8P-15 PEEL GEPROGR. V1.2"},{"$f":"IF(ISERROR(VLOOKUP($A$95,Voorraad!$A$2:$D$1001,2)),\"\",VLOOKUP($A$95,Voorraad!$A$2:$D$1001,2))","v":"#4818CV8P15LiPR"},{"$f":"IF(ISERROR(VLOOKUP($A$95,Voorraad!$A$2:$H$1001,8)),\"\",VLOOKUP($A$95,Voorraad!$A$2:$H$1001,8))","v":0},{"$f":"IF(ISERROR(VLOOKUP($A$95,Voorraad!$A$2:$I$1001,9)),\"\",VLOOKUP($A$95,Voorraad!$A$2:$I$1001,9))","v":"UT8IC89M5530"},{"$f":"IF(ISERROR(VLOOKUP($A$95,Voorraad!$A$2:$J$1001,10)),\"\",VLOOKUP($A$95,Voorraad!$A$2:$J$1001,10))","v":"Geprogrammeerd. Z versie beter programmeerbaar"},{"$f":"IF(ISERROR(VLOOKUP($A$95,Voorraad!$A$2:$G$1001,6)),\"\",VLOOKUP($A$95,Voorraad!$A$2:$G$1001,6))","v":"MOUSER"},{"$f":"IF(ISERROR(VLOOKUP($A$95,Voorraad!$A$2:$G$1001,7)),\"\",VLOOKUP($A$95,Voorraad!$A$2:$G$1001,7))","v":"ICT"},{"$f":"IF(ISERROR(VLOOKUP($A$95,Voorraad!$A$2:$G$1001,5)),\"\",VLOOKUP($A$95,Voorraad!$A$2:$G$1001,5))","v":8510},{"$f":"IF(ISERROR(VLOOKUP($A$95,Voorraad!$A$2:$D$1001,4)),\"\",VLOOKUP($A$95,Voorraad!$A$2:$D$1001,4))","v":-75},75,150]
["BX0034",{"$f":"[6]Sheet1!$E$91","v":75},{"$f":"IF(ISERROR(VLOOKUP($A$96,Voorraad!$A$2:$D$1001,1)),\"\",VLOOKUP($A$96,Voorraad!$A$2:$D$1001,1))","v":"BX0034"},{"$f":"IF(ISERROR(VLOOKUP($A$96,Voorraad!$A$2:$D$1001,3)),\"\",VLOOKUP($A$96,Voorraad!$A$2:$D$1001,3))","v":"IC 8510 EPROM PROG V2.71"},{"$f":"IF(ISERROR(VLOOKUP($A$96,Voorraad!$A$2:$D$1001,2)),\"\",VLOOKUP($A$96,Voorraad!$A$2:$D$1001,2))","v":"#TDSTICK8510A3"},{"$f":"IF(ISERROR(VLOOKUP($A$96,Voorraad!$A$2:$H$1001,8)),\"\",VLOOKUP($A$96,Voorraad!$A$2:$H$1001,8))","v":0},{"$f":"IF(ISERROR(VLOOKUP($A$96,Voorraad!$A$2:$I$1001,9)),\"\",VLOOKUP($A$96,Voorraad!$A$2:$I$1001,9))","v":0},{"$f":"IF(ISERROR(VLOOKUP($A$96,Voorraad!$A$2:$J$1001,10)),\"\",VLOOKUP($A$96,Voorraad!$A$2:$J$1001,10))","v":0},{"$f":"IF(ISERROR(VLOOKUP($A$96,Voorraad!$A$2:$G$1001,6)),\"\",VLOOKUP($A$96,Voorraad!$A$2:$G$1001,6))","v":0},{"$f":"IF(ISERROR(VLOOKUP($A$96,Voorraad!$A$2:$G$1001,7)),\"\",VLOOKUP($A$96,Voorraad!$A$2:$G$1001,7))","v":"NSD"},{"$f":"IF(ISERROR(VLOOKUP($A$96,Voorraad!$A$2:$G$1001,5)),\"\",VLOOKUP($A$96,Voorraad!$A$2:$G$1001,5))","v":8510},{"$f":"IF(ISERROR(VLOOKUP($A$96,Voorraad!$A$2:$D$1001,4)),\"\",VLOOKUP($A$96,Voorraad!$A$2:$D$1001,4))","v":12},75,63]
["BU0078",{"$f":"[6]Sheet1!$E$92","v":75},{"$f":"IF(ISERROR(VLOOKUP($A$97,Voorraad!$A$2:$D$1001,1)),\"\",VLOOKUP($A$97,Voorraad!$A$2:$D$1001,1))","v":"BU0078"},{"$f":"IF(ISERROR(VLOOKUP($A$97,Voorraad!$A$2:$D$1001,3)),\"\",VLOOKUP($A$97,Voorraad!$A$2:$D$1001,3))","v":"BL5.08/3 "},{"$f":"IF(ISERROR(VLOOKUP($A$97,Voorraad!$A$2:$D$1001,2)),\"\",VLOOKUP($A$97,Voorraad!$A$2:$D$1001,2))","v":"#5F171633"},{"$f":"IF(ISERROR(VLOOKUP($A$97,Voorraad!$A$2:$H$1001,8)),\"\",VLOOKUP($A$97,Voorraad!$A$2:$H$1001,8))","v":0},{"$f":"IF(ISERROR(VLOOKUP($A$97,Voorraad!$A$2:$I$1001,9)),\"\",VLOOKUP($A$97,Voorraad!$A$2:$I$1001,9))","v":0},{"$f":"IF(ISERROR(VLOOKUP($A$97,Voorraad!$A$2:$J$1001,10)),\"\",VLOOKUP($A$97,Voorraad!$A$2:$J$1001,10))","v":0},{"$f":"IF(ISERROR(VLOOKUP($A$97,Voorraad!$A$2:$G$1001,6)),\"\",VLOOKUP($A$97,Voorraad!$A$2:$G$1001,6))","v":0},{"$f":"IF(ISERROR(VLOOKUP($A$97,Voorraad!$A$2:$G$1001,7)),\"\",VLOOKUP($A$97,Voorraad!$A$2:$G$1001,7))","v":"PHOENIX"},"Stuk",{"$f":"IF(ISERROR(VLOOKUP($A$97,Voorraad!$A$2:$D$1001,4)),\"\",VLOOKUP($A$97,Voorraad!$A$2:$D$1001,4))","v":-75},75,150]
["BX0005",{"$f":"[6]Sheet1!$E$93","v":150},{"$f":"IF(ISERROR(VLOOKUP($A$98,Voorraad!$A$2:$D$1001,1)),\"\",VLOOKUP($A$98,Voorraad!$A$2:$D$1001,1))","v":"BX0005"},{"$f":"IF(ISERROR(VLOOKUP($A$98,Voorraad!$A$2:$D$1001,3)),\"\",VLOOKUP($A$98,Voorraad!$A$2:$D$1001,3))","v":"BL4"},{"$f":"IF(ISERROR(VLOOKUP($A$98,Voorraad!$A$2:$D$1001,2)),\"\",VLOOKUP($A$98,Voorraad!$A$2:$D$1001,2))","v":"TBW-5-4P/GN"},{"$f":"IF(ISERROR(VLOOKUP($A$98,Voorraad!$A$2:$H$1001,8)),\"\",VLOOKUP($A$98,Voorraad!$A$2:$H$1001,8))","v":0},{"$f":"IF(ISERROR(VLOOKUP($A$98,Voorraad!$A$2:$I$1001,9)),\"\",VLOOKUP($A$98,Voorraad!$A$2:$I$1001,9))","v":"TBW-5-4P/GN"},{"$f":"IF(ISERROR(VLOOKUP($A$98,Voorraad!$A$2:$J$1001,10)),\"\",VLOOKUP($A$98,Voorraad!$A$2:$J$1001,10))","v":0},{"$f":"IF(ISERROR(VLOOKUP($A$98,Voorraad!$A$2:$G$1001,6)),\"\",VLOOKUP($A$98,Voorraad!$A$2:$G$1001,6))","v":"TME"},{"$f":"IF(ISERROR(VLOOKUP($A$98,Voorraad!$A$2:$G$1001,7)),\"\",VLOOKUP($A$98,Voorraad!$A$2:$G$1001,7))","v":"Nigini"},{"$f":"IF(ISERROR(VLOOKUP($A$98,Voorraad!$A$2:$G$1001,5)),\"\",VLOOKUP($A$98,Voorraad!$A$2:$G$1001,5))","v":8439},{"$f":"IF(ISERROR(VLOOKUP($A$98,Voorraad!$A$2:$D$1001,4)),\"\",VLOOKUP($A$98,Voorraad!$A$2:$D$1001,4))","v":-100},150,250]
["BX0001",{"$f":"[6]Sheet1!$E$94","v":225},{"$f":"IF(ISERROR(VLOOKUP($A$99,Voorraad!$A$2:$D$1001,1)),\"\",VLOOKUP($A$99,Voorraad!$A$2:$D$1001,1))","v":"BX0001"},{"$f":"IF(ISERROR(VLOOKUP($A$99,Voorraad!$A$2:$D$1001,3)),\"\",VLOOKUP($A$99,Voorraad!$A$2:$D$1001,3))","v":"BL5.08/12 "},{"$f":"IF(ISERROR(VLOOKUP($A$99,Voorraad!$A$2:$D$1001,2)),\"\",VLOOKUP($A$99,Voorraad!$A$2:$D$1001,2))","v":"#5F171642"},{"$f":"IF(ISERROR(VLOOKUP($A$99,Voorraad!$A$2:$H$1001,8)),\"\",VLOOKUP($A$99,Voorraad!$A$2:$H$1001,8))","v":0},{"$f":"IF(ISERROR(VLOOKUP($A$99,Voorraad!$A$2:$I$1001,9)),\"\",VLOOKUP($A$99,Voorraad!$A$2:$I$1001,9))","v":0},{"$f":"IF(ISERROR(VLOOKUP($A$99,Voorraad!$A$2:$J$1001,10)),\"\",VLOOKUP($A$99,Voorraad!$A$2:$J$1001,10))","v":0},{"$f":"IF(ISERROR(VLOOKUP($A$99,Voorraad!$A$2:$G$1001,6)),\"\",VLOOKUP($A$99,Voorraad!$A$2:$G$1001,6))","v":0},{"$f":"IF(ISERROR(VLOOKUP($A$99,Voorraad!$A$2:$G$1001,7)),\"\",VLOOKUP($A$99,Voorraad!$A$2:$G$1001,7))","v":"PHOENIX"},{"$f":"IF(ISERROR(VLOOKUP($A$99,Voorraad!$A$2:$G$1001,5)),\"\",VLOOKUP($A$99,Voorraad!$A$2:$G$1001,5))","v":8510},{"$f":"IF(ISERROR(VLOOKUP($A$99,Voorraad!$A$2:$D$1001,4)),\"\",VLOOKUP($A$99,Voorraad!$A$2:$D$1001,4))","v":-210},225,435]
["BX0046",{"$f":"[6]Sheet1!$E$95","v":75},{"$f":"IF(ISERROR(VLOOKUP($A$100,Voorraad!$A$2:$D$1001,1)),\"\",VLOOKUP($A$100,Voorraad!$A$2:$D$1001,1))","v":"BX0046"},{"$f":"IF(ISERROR(VLOOKUP($A$100,Voorraad!$A$2:$D$1001,3)),\"\",VLOOKUP($A$100,Voorraad!$A$2:$D$1001,3))","v":"PCB 8510"},{"$f":"IF(ISERROR(VLOOKUP($A$100,Voorraad!$A$2:$D$1001,2)),\"\",VLOOKUP($A$100,Voorraad!$A$2:$D$1001,2))","v":"PCB 8510"},{"$f":"IF(ISERROR(VLOOKUP($A$100,Voorraad!$A$2:$H$1001,8)),\"\",VLOOKUP($A$100,Voorraad!$A$2:$H$1001,8))","v":548187},{"$f":"IF(ISERROR(VLOOKUP($A$100,Voorraad!$A$2:$I$1001,9)),\"\",VLOOKUP($A$100,Voorraad!$A$2:$I$1001,9))","v":0},{"$f":"IF(ISERROR(VLOOKUP($A$100,Voorraad!$A$2:$J$1001,10)),\"\",VLOOKUP($A$100,Voorraad!$A$2:$J$1001,10))","v":0},{"$f":"IF(ISERROR(VLOOKUP($A$100,Voorraad!$A$2:$G$1001,6)),\"\",VLOOKUP($A$100,Voorraad!$A$2:$G$1001,6))","v":"JvB"},{"$f":"IF(ISERROR(VLOOKUP($A$100,Voorraad!$A$2:$G$1001,7)),\"\",VLOOKUP($A$100,Voorraad!$A$2:$G$1001,7))","v":"JvB"},{"$f":"IF(ISERROR(VLOOKUP($A$100,Voorraad!$A$2:$G$1001,5)),\"\",VLOOKUP($A$100,Voorraad!$A$2:$G$1001,5))","v":"PCB 8510"},{"$f":"IF(ISERROR(VLOOKUP($A$100,Voorraad!$A$2:$D$1001,4)),\"\",VLOOKUP($A$100,Voorraad!$A$2:$D$1001,4))","v":130},{"$f":"B100","v":75},0]

{"sheet":"Mutaties","index":8,"n_rows":3,"n_cols":4,"rows_kept":3,"cut":false,"hidden":false,"merged":[]}
[]
["Datum/Tijd","Art Nr CSI","Omschrijving","Mutatie"]
["2019-02-22T14:14:22","BX0043","PCB 8439L",20]