{"text_format":"1","workbook":"xlsx","n_sheets":9,"sheets":["Bij- en afboeken","Voorraad","Picklijst 8410","Picklijst 8437","Picklijst 8438","Picklijst 8439","Picklijst 8464","Picklijst 8510","Mutaties"],"not_rendered":{"charts":0,"images":3,"macros":1,"external_links":6,"defined_names":11,"comments":0,"pivot_tables":0},"unopened":[],"bounds":{"document_bytes":16777216,"sheet_cells":100000,"rows_first":2000,"rows_last":500,"rows_between":2000,"halvings":0,"cell_chars":16384,"cell_head_chars":4096},"cells_cut":0,"cells_raw":0,"read":"whole","date_system":"1900"}

{"sheet":"Bij- en afboeken","index":0,"n_rows":29,"n_cols":5,"rows_kept":29,"cut":false,"hidden":false,"merged":[]}
[]
[null,"Artikelnummer CSI","Art Nr Leverancier","Omschrijving","Voorraad"]
[null,{"$f":"VLOOKUP($B$8,Voorraad!$A$2:$D$1001,1)","v":"BX0043"},{"$f":"VLOOKUP($B$8,Voorraad!$A$2:$D$1001,2)","v":"PCB 8439L"},{"$f":"VLOOKUP($B$8,Voorraad!$A$2:$E$1001,3)","v":"PCB 8439L"},{"$f":"VLOOKUP($B$8,Voorraad!$A$2:$D$1002,4)","v":43}]
[]
[]
[]
[null,"Artikel nummer CSI","Aantal"]
[null,"BX0043",50]
[]
[]
{"$rows_left_out":20}
{"sheet":"Voorraad","index":1,"n_rows":795,"n_cols":24,"rows_kept":795,"cut":false,"hidden":false,"merged":[]}
[]
[" Artikel Nr CSI","Art Nr Leverancier","Omschrijving","Voorraad","PCB","Leverancier","Producent","Produco Nr","Order Nr","Opmerkingen/Alternatieven","Min. Voorraad","Bestellen","Locatie","EH Prijs","Waarde"]
["BR0001","#10012201","R 22E 1% 0.6W 7X2,5MM",425,8510,null,"BCC",500028,null,null,100,{"$f":"IF(K3>D3,$U$3,$U$5)","v":"Nee"},"-",0,{"$f":"N3*D3","v":0},null,null,null,null,null,"Ja",null,null,"totaal"]
["BR0002","#10014701","R 47E 1% 0.6W 7X2,5MM",350,8510,"TME","BCC",500032,"M0.6W-47R",null,100,"Nee","-",0,0,null,null,null,null,null,null,null,null,{"$f":"SUM(O3:O999)","v":0}]
["BR0003","#10021001","R 100E 1% 0.6W 7X2,5MM",1725,"8510/8464",null,"BCC",500036,null,null,100,"Nee","-",0,0,null,null,null,null,null,"Nee"]
["BR0004","#10031001","R 1K00 1% 0.6W 7X2,5MM",208,"8510/8437/8438/8439/8464",null,"BCC",500048,null,null,100,"Nee","-",0,0]
["BR0005","#10041001","R 10K0 1% 0.6W 7X2,5MM",1908,"8510/8437/8438/8439",null,"BCC",500060,null,null,100,"Nee","-",0,0]
["BR0006","#10041501","R 15K0 1% 0.6W 7X2,5MM",1775,8510,null,"BCC",500062,null,null,100,"Nee","-",0,0]
["BR0007","#10042201","R 22K0 1% 0.6W 7X2,5MM",1025,8510,null,"BCC",500064,null,null,100,"Nee","-",0,0]
["BR0008","#10051001","R 100K 1% 0.6W 7X2,5MM",1350,8510,null,"BCC",500072,null,null,100,"Nee","-",0,0]
{"$rows_left_out":786}
{"sheet":"Picklijst 8410","index":2,"n_rows":33,"n_cols":14,"rows_kept":33,"cut":false,"hidden":false,"merged":[]}
[]
["Pickorder 8410",null,{"$f":"[1]Sheet1!$D$2","v":5},"X"]
[]
[]
[]
[]
[]
["Art Nr CSI","Benodigd","Art Nr CSI","Omschrijving","Leverancier Nr","Produco Nr","OrderNr","Opmerkingen/Alternatieven","Leverancier","Producent","PCB","Voorraad","Benodigd","Bestellen"]
["BX0014",{"$f":"[1]Sheet1!$E$4","v":140},{"$f":"IF(ISERROR(VLOOKUP($A$9,Voorraad!$A$2:$D$1001,1)),\"\",VLOOKUP($A$9,Voorraad!$A$2:$D$1001,1))","v":"BX0014"},{"$f":"IF(ISERROR(VLOOKUP($A$9,Voorraad!$A$2:$D$1001,3)),\"\",VLOOKUP($A$9,Voorraad!$A$2:$D$1001,3))","v":"MSTB 2.5/2ST-5.08 AANSLUITBLOK"},{"$f":"IF(ISERROR(VLOOKUP($A$9,Voorraad!$A$2:$D$1001,2)),\"\",VLOOKUP($A$9,Voorraad!$A$2:$D$1001,2))","v":101280},{"$f":"IF(ISERROR(VLOOKUP($A$9,Voorraad!$A$2:$H$1001,8)),\"\",VLOOKUP($A$9,Voorraad!$A$2:$H$1001,8))","v":0},{"$f":"IF(ISERROR(VLOOKUP($A$9,Voorraad!$A$2:$I$1001,9)),\"\",VLOOKUP($A$9,Voorraad!$A$2:$I$1001,9))","v":1757019},{"$f":"IF(ISERROR(VLOOKUP($A$9,Voorraad!$A$2:$J$1001,10)),\"\",VLOOKUP($A$9,Voorraad!$A$2:$J$1001,10))","v":0},{"$f":"IF(ISERROR(VLOOKUP($A$9,Voorraad!$A$2:$G$1001,6)),\"\",VLOOKUP($A$9,Voorraad!$A$2:$G$1001,6))","v":0},{"$f":"IF(ISERROR(VLOOKUP($A$9,Voorraad!$A$2:$G$1001,7)),\"\",VLOOKUP($A$9,Voorraad!$A$2:$G$1001,7))","v":"PHOENIX"},{"$f":"IF(ISERROR(VLOOKUP($A$9,Voorraad!$A$2:$G$1001,5)),\"\",VLOOKUP($A$9,Voorraad!$A$2:$G$1001,5))","v":8410},{"$f":"IF(ISERROR(VLOOKUP($A$9,Voorraad!$A$2:$D$1001,4)),\"\",VLOOKUP($A$9,Voorraad!$A$2:$D$1001,4))","v":0},{"$f":"B9","v":140},{"$f":"MAX(0,(SUM(M9-L9)))","v":140}]
["BX0015",{"$f":"[1]Sheet1!$E$5","v":70},{"$f":"IF(ISERROR(VLOOKUP($A$10,Voorraad!$A$2:$D$1001,1)),\"\",VLOOKUP($A$10,Voorraad!$A$2:$D$1001,1))","v":"BX0015"},{"$f":"IF(ISERROR(VLOOKUP($A$10,Voorraad!$A$2:$D$1001,3)),\"\",VLOOKUP($A$10,Voorraad!$A$2:$D$1001,3))","v":"MDSTBW 2.5/2 PRINTPLAATCONNECTOR"},{"$f":"IF(ISERROR(VLOOKUP($A$10,Voorraad!$A$2:$D$1001,2)),\"\",VLOOKUP($A$10,Voorraad!$A$2:$D$1001,2))","v":101300},{"$f":"IF(ISERROR(VLOOKUP($A$10,Voorraad!$A$2:$H$1001,8)),\"\",VLOOKUP($A$10,Voorraad!$A$2:$H$1001,8))","v":0},{"$f":"IF(ISERROR(VLOOKUP($A$10,Voorraad!$A$2:$I$1001,9)),\"\",VLOOKUP($A$10,Voorraad!$A$2:$I$1001,9))","v":1802430},{"$f":"IF(ISERROR(VLOOKUP($A$10,Voorraad!$A$2:$J$1001,10)),\"\",VLOOKUP($A$10,Voorraad!$A$2:$J$1001,10))","v":0},{"$f":"IF(ISERROR(VLOOKUP($A$10,Voorraad!$A$2:$G$1001,6)),\"\",VLOOKUP($A$10,Voorraad!$A$2:$G$1001,6))","v":0},{"$f":"IF(ISERROR(VLOOKUP($A$10,Voorraad!$A$2:$G$1001,7)),\"\",VLOOKUP($A$10,Voorraad!$A$2:$G$1001,7))","v":"PHOENIX"},{"$f":"IF(ISERROR(VLOOKUP($A$10,Voorraad!$A$2:$G$1001,5)),\"\",VLOOKUP($A$10,Voorraad!$A$2:$G$1001,5))","v":8410},{"$f":"IF(ISERROR(VLOOKUP($A$10,Voorraad!$A$2:$D$1001,4)),\"\",VLOOKUP($A$10,Voorraad!$A$2:$D$1001,4))","v":0},70,70]
{"$rows_left_out":24}
{"sheet":"Picklijst 8437","index":3,"n_rows":33,"n_cols":14,"rows_kept":33,"cut":false,"hidden":false,"merged":[]}
[]
["Pickorder 8437",null,{"$f":"[2]Sheet1!$D$2","v":10},"X"]
[]
[]
[]
[]
[]
["Art Nr CSI","Benodigd","Art Nr CSI","Omschrijving","Leverancier Nr","Produco Nr","OrderNr","Opmerkingen/Alternatieven","Leverancier","Producent","PCB","Voorraad","Benodigd","Bestellen"]
["BSH002",{"$f":"[2]Sheet1!$E$4","v":40},{"$f":"IF(ISERROR(VLOOKUP($A$9,Voorraad!$A$2:$D$1001,1)),\"\",VLOOKUP($A$9,Voorraad!$A$2:$D$1001,1))","v":"BSH002"},{"$f":"IF(ISERROR(VLOOKUP($A$9,Voorraad!$A$2:$D$1001,3)),\"\",VLOOKUP($A$9,Voorraad!$A$2:$D$1001,3))","v":"220U / 35V "},{"$f":"IF(ISERROR(VLOOKUP($A$9,Voorraad!$A$2:$D$1001,2)),\"\",VLOOKUP($A$9,Voorraad!$A$2:$D$1001,2))","v":"EEUFC1V221 "},{"$f":"IF(ISERROR(VLOOKUP($A$9,Voorraad!$A$2:$H$1001,8)),\"\",VLOOKUP($A$9,Voorraad!$A$2:$H$1001,8))","v":0},{"$f":"IF(ISERROR(VLOOKUP($A$9,Voorraad!$A$2:$I$1001,9)),\"\",VLOOKUP($A$9,Voorraad!$A$2:$I$1001,9))","v":"EEUFC1V221 "},{"$f":"IF(ISERROR(VLOOKUP($A$9,Voorraad!$A$2:$J$1001,10)),\"\",VLOOKUP($A$9,Voorraad!$A$2:$J$1001,10))","v":"Alternatief: SE050M0220-1012"},{"$f":"IF(ISERROR(VLOOKUP($A$9,Voorraad!$A$2:$G$1001,6)),\"\",VLOOKUP($A$9,Voorraad!$A$2:$G$1001,6))","v":"TME"},{"$f":"IF(ISERROR(VLOOKUP($A$9,Voorraad!$A$2:$G$1001,7)),\"\",VLOOKUP($A$9,Voorraad!$A$2:$G$1001,7))","v":"Panasonic"},{"$f":"IF(ISERROR(VLOOKUP($A$9,Voorraad!$A$2:$G$1001,5)),\"\",VLOOKUP($A$9,Voorraad!$A$2:$G$1001,5))","v":"8437/8438/8439"},{"$f":"IF(ISERROR(VLOOKUP($A$9,Voorraad!$A$2:$D$1001,4)),\"\",VLOOKUP($A$9,Voorraad!$A$2:$D$1001,4))","v":178},{"$f":"B9","v":40},{"$f":"MAX(0,(SUM(M9-L9)))","v":0}]
["BU0005",{"$f":"[2]Sheet1!$E$5","v":10},{"$f":"IF(ISERROR(VLOOKUP($A$10,Voorraad!$A$2:$D$1001,1)),\"\",VLOOKUP($A$10,Voorraad!$A$2:$D$1001,1))","v":"BU0005"},{"$f":"IF(ISERROR(VLOOKUP($A$10,Voorraad!$A$2:$D$1001,3)),\"\",VLOOKUP($A$10,Voorraad!$A$2:$D$1001,3))","v":"T83-A90X "},{"$f":"IF(ISERROR(VLOOKUP($A$10,Voorraad!$A$2:$D$1001,2)),\"\",VLOOKUP($A$10,Voorraad!$A$2:$D$1001,2))","v":"2046-09-C2LF"},{"$f":"IF(ISERROR(VLOOKUP($A$10,Voorraad!$A$2:$H$1001,8)),\"\",VLOOKUP($A$10,Voorraad!$A$2:$H$1001,8))","v":0},{"$f":"IF(ISERROR(VLOOKUP($A$10,Voorraad!$A$2:$I$1001,9)),\"\",VLOOKUP($A$10,Voorraad!$A$2:$I$1001,9))","v":2335982},{"$f":"IF(ISERROR(VLOOKUP($A$10,Voorraad!$A$2:$J$1001,10)),\"\",VLOOKUP($A$10,Voorraad!$A$2:$J$1001,10))","v":0},{"$f":"IF(ISERROR(VLOOKUP($A$10,Voorraad!$A$2:$G$1001,6)),\"\",VLOOKUP($A$10,Voorraad!$A$2:$G$1001,6))","v":"Farnell"},{"$f":"IF(ISERROR(VLOOKUP($A$10,Voorraad!$A$2:$G$1001,7)),\"\",VLOOKUP($A$10,Voorraad!$A$2:$G$1001,7))","v":"Bourns"},{"$f":"IF(ISERROR(VLOOKUP($A$10,Voorraad!$A$2:$G$1001,5)),\"\",VLOOKUP($A$10,Voorraad!$A$2:$G$1001,5))","v":"8437/8438/8439"},{"$f":"IF(ISERROR(VLOOKUP($A$10,Voorraad!$A$2:$D$1001,4)),\"\",VLOOKUP($A$10,Voorraad!$A$2:$D$1001,4))","v":57},10,0]
{"$rows_left_out":24}
{"sheet":"Picklijst 8438","index":4,"n_rows":31,"n_cols":14,"rows_kept":31,"cut":false,"hidden":false,"merged":[]}
[]
["Pickorder 8438",null,{"$f":"[3]Sheet1!$D$2","v":1},"X"]
[]
[]
[]
[]
[]
["Art Nr CSI","Benodigd","Art Nr CSI","Omschrijving","Leverancier Nr","Produco Nr","OrderNr","Opmerkingen/Alternatieven","Leverancier","Producent","PCB","Voorraad","Benodigd","Bestellen"]
["BSH002",{"$f":"[3]Sheet1!$E$4","v":2},{"$f":"IF(ISERROR(VLOOKUP($A$9,Voorraad!$A$2:$D$1001,1)),\"\",VLOOKUP($A$9,Voorraad!$A$2:$D$1001,1))","v":"BSH002"},{"$f":"IF(ISERROR(VLOOKUP($A$9,Voorraad!$A$2:$D$1001,3)),\"\",VLOOKUP($A$9,Voorraad!$A$2:$D$1001,3))","v":"220U / 35V "},{"$f":"IF(ISERROR(VLOOKUP($A$9,Voorraad!$A$2:$D$1001,2)),\"\",VLOOKUP($A$9,Voorraad!$A$2:$D$1001,2))","v":"EEUFC1V221 "},{"$f":"IF(ISERROR(VLOOKUP($A$9,Voorraad!$A$2:$H$1001,8)),\"\",VLOOKUP($A$9,Voorraad!$A$2:$H$1001,8))","v":0},{"$f":"IF(ISERROR(VLOOKUP($A$9,Voorraad!$A$2:$I$1001,9)),\"\",VLOOKUP($A$9,Voorraad!$A$2:$I$1001,9))","v":"EEUFC1V221 "},{"$f":"IF(ISERROR(VLOOKUP($A$9,Voorraad!$A$2:$J$1001,10)),\"\",VLOOKUP($A$9,Voorraad!$A$2:$J$1001,10))","v":"Alternatief: SE050M0220-1012"},{"$f":"IF(ISERROR(VLOOKUP($A$9,Voorraad!$A$2:$G$1001,6)),\"\",VLOOKUP($A$9,Voorraad!$A$2:$G$1001,6))","v":"TME"},{"$f":"IF(ISERROR(VLOOKUP($A$9,Voorraad!$A$2:$G$1001,7)),\"\",VLOOKUP($A$9,Voorraad!$A$2:$G$1001,7))","v":"Panasonic"},{"$f":"IF(ISERROR(VLOOKUP($A$9,Voorraad!$A$2:$G$1001,5)),\"\",VLOOKUP($A$9,Voorraad!$A$2:$G$1001,5))","v":"8437/8438/8439"},{"$f":"IF(ISERROR(VLOOKUP($A$9,Voorraad!$A$2:$D$1001,4)),\"\",VLOOKUP($A$9,Voorraad!$A$2:$D$1001,4))","v":178},{"$f":"B9","v":2},{"$f":"MAX(0,(SUM(M9-L9)))","v":0}]
["BU0001",{"$f":"[3]Sheet1!$E$5","v":1},{"$f":"IF(ISERROR(VLOOKUP($A$10,Voorraad!$A$2:$D$1001,1)),\"\",VLOOKUP($A$10,Voorraad!$A$2:$D$1001,1))","v":"BU0001"},{"$f":"IF(ISERROR(VLOOKUP($A$10,Voorraad!$A$2:$D$1001,3)),\"\",VLOOKUP($A$10,Voorraad!$A$2:$D$1001,3))","v":"100U /35V "},{"$f":"IF(ISERROR(VLOOKUP($A$10,Voorraad!$A$2:$D$1001,2)),\"\",VLOOKUP($A$10,Voorraad!$A$2:$D$1001,2))","v":0},{"$f":"IF(ISERROR(VLOOKUP($A$10,Voorraad!$A$2:$H$1001,8)),\"\",VLOOKUP($A$10,Voorraad!$A$2:$H$1001,8))","v":0},{"$f":"IF(ISERROR(VLOOKUP($A$10,Voorraad!$A$2:$I$1001,9)),\"\",VLOOKUP($A$10,Voorraad!$A$2:$I$1001,9))","v":0},{"$f":"IF(ISERROR(VLOOKUP($A$10,Voorraad!$A$2:$J$1001,10)),\"\",VLOOKUP($A$10,Voorraad!$A$2:$J$1001,10))","v":0},{"$f":"IF(ISERROR(VLOOKUP($A$10,Voorraad!$A$2:$G$1001,6)),\"\",VLOOKUP($A$10,Voorraad!$A$2:$G$1001,6))","v":0},{"$f":"IF(ISERROR(VLOOKUP($A$10,Voorraad!$A$2:$G$1001,7)),\"\",VLOOKUP($A$10,Voorraad!$A$2:$G$1001,7))","v":0},{"$f":"IF(ISERROR(VLOOKUP($A$10,Voorraad!$A$2:$G$1001,5)),\"\",VLOOKUP($A$10,Voorraad!$A$2:$G$1001,5))","v":8438},{"$f":"IF(ISERROR(VLOOKUP($A$10,Voorraad!$A$2:$D$1001,4)),\"\",VLOOKUP($A$10,Voorraad!$A$2:$D$1001,4))","v":21},1,0]
{"$rows_left_out":22}
{"sheet":"Picklijst 8439","index":5,"n_rows":36,"n_cols":14,"rows_kept":36,"cut":false,"hidden":false,"merged":[]}
[]
["Pickorder 8439",null,{"$f":"[4]Sheet1!$D$2","v":20},"X"]
[]
[]
[]
[]
[]
["Art Nr CSI","Benodigd","Art Nr CSI","Omschrijving","Leverancier Nr","Produco Nr","OrderNr","Opmerkingen/Alternatieven","Leverancier","Producent","PCB","Voorraad","Benodigd","Bestellen"]
["BSH002",{"$f":"[4]Sheet1!$E$4","v":60},{"$f":"IF(ISERROR(VLOOKUP($A$9,Voorraad!$A$2:$D$1001,1)),\"\",VLOOKUP($A$9,Voorraad!$A$2:$D$1001,1))","v":"BSH002"},{"$f":"IF(ISERROR(VLOOKUP($A$9,Voorraad!$A$2:$D$1001,3)),\"\",VLOOKUP($A$9,Voorraad!$A$2:$D$1001,3))","v":"220U / 35V "},{"$f":"IF(ISERROR(VLOOKUP($A$9,Voorraad!$A$2:$D$1001,2)),\"\",VLOOKUP($A$9,Voorraad!$A$2:$D$1001,2))","v":"EEUFC1V221 "},{"$f":"IF(ISERROR(VLOOKUP($A$9,Voorraad!$A$2:$H$1001,8)),\"\",VLOOKUP($A$9,Voorraad!$A$2:$H$1001,8))","v":0},{"$f":"IF(ISERROR(VLOOKUP($A$9,Voorraad!$A$2:$I$1001,9)),\"\",VLOOKUP($A$9,Voorraad!$A$2:$I$1001,9))","v":"EEUFC1V221 "},{"$f":"IF(ISERROR(VLOOKUP($A$9,Voorraad!$A$2:$J$1001,10)),\"\",VLOOKUP($A$9,Voorraad!$A$2:$J$1001,10))","v":"Alternatief: SE050M0220-1012"},{"$f":"IF(ISERROR(VLOOKUP($A$9,Voorraad!$A$2:$G$1001,6)),\"\",VLOOKUP($A$9,Voorraad!$A$2:$G$1001,6))","v":"TME"},{"$f":"IF(ISERROR(VLOOKUP($A$9,Voorraad!$A$2:$G$1001,7)),\"\",VLOOKUP($A$9,Voorraad!$A$2:$G$1001,7))","v":"Panasonic"},{"$f":"IF(ISERROR(VLOOKUP($A$9,Voorraad!$A$2:$G$1001,5)),\"\",VLOOKUP($A$9,Voorraad!$A$2:$G$1001,5))","v":"8437/8438/8439"},{"$f":"IF(ISERROR(VLOOKUP($A$9,Voorraad!$A$2:$D$1001,4)),\"\",VLOOKUP($A$9,Voorraad!$A$2:$D$1001,4))","v":178},{"$f":"B9","v":60},{"$f":"MAX(0,(SUM(M9-L9)))","v":0}]
["BU0005",{"$f":"[4]Sheet1!$E$5","v":20},{"$f":"IF(ISERROR(VLOOKUP($A$10,Voorraad!$A$2:$D$1001,1)),\"\",VLOOKUP($A$10,Voorraad!$A$2:$D$1001,1))","v":"BU0005"},{"$f":"IF(ISERROR(VLOOKUP($A$10,Voorraad!$A$2:$D$1001,3)),\"\",VLOOKUP($A$10,Voorraad!$A$2:$D$1001,3))","v":"T83-A90X "},{"$f":"IF(ISERROR(VLOOKUP($A$10,Voorraad!$A$2:$D$1001,2)),\"\",VLOOKUP($A$10,Voorraad!$A$2:$D$1001,2))","v":"2046-09-C2LF"},{"$f":"IF(ISERROR(VLOOKUP($A$10,Voorraad!$A$2:$H$1001,8)),\"\",VLOOKUP($A$10,Voorraad!$A$2:$H$1001,8))","v":0},{"$f":"IF(ISERROR(VLOOKUP($A$10,Voorraad!$A$2:$I$1001,9)),\"\",VLOOKUP($A$10,Voorraad!$A$2:$I$1001,9))","v":2335982},{"$f":"IF(ISERROR(VLOOKUP($A$10,Voorraad!$A$2:$J$1001,10)),\"\",VLOOKUP($A$10,Voorraad!$A$2:$J$1001,10))","v":0},{"$f":"IF(ISERROR(VLOOKUP($A$10,Voorraad!$A$2:$G$1001,6)),\"\",VLOOKUP($A$10,Voorraad!$A$2:$G$1001,6))","v":"Farnell"},{"$f":"IF(ISERROR(VLOOKUP($A$10,Voorraad!$A$2:$G$1001,7)),\"\",VLOOKUP($A$10,Voorraad!$A$2:$G$1001,7))","v":"Bourns"},{"$f":"IF(ISERROR(VLOOKUP($A$10,Voorraad!$A$2:$G$1001,5)),\"\",VLOOKUP($A$10,Voorraad!$A$2:$G$1001,5))","v":"8437/8438/8439"},{"$f":"IF(ISERROR(VLOOKUP($A$10,Voorraad!$A$2:$D$1001,4)),\"\",VLOOKUP($A$10,Voorraad!$A$2:$D$1001,4))","v":57},20,0]
{"$rows_left_out":27}
{"sheet":"Picklijst 8464","index":6,"n_rows":42,"n_cols":14,"rows_kept":42,"cut":false,"hidden":false,"merged":[]}
[]
["Pickorder 8464",null,{"$f":"[5]Sheet1!$D$2","v":10},"X"]
[]
[]
[]
[]
[]
["Art Nr CSI","Benodigd","Art Nr CSI","Omschrijving","Leverancier Nr","Produco Nr","OrderNr","Opmerkingen/Alternatieven","Leverancier","Producent","PCB","Voorraad","Benodigd","Bestellen"]
["BU0002",{"$f":"[5]Sheet1!$E$4","v":10},{"$f":"IF(ISERROR(VLOOKUP($A$9,Voorraad!$A$2:$D$1001,1)),\"\",VLOOKUP($A$9,Voorraad!$A$2:$D$1001,1))","v":"BU0002"},{"$f":"IF(ISERROR(VLOOKUP($A$9,Voorraad!$A$2:$D$1001,3)),\"\",VLOOKUP($A$9,Voorraad!$A$2:$D$1001,3))","v":"47U/40V"},{"$f":"IF(ISERROR(VLOOKUP($A$9,Voorraad!$A$2:$D$1001,2)),\"\",VLOOKUP($A$9,Voorraad!$A$2:$D$1001,2))","v":222202127479},{"$f":"IF(ISERROR(VLOOKUP($A$9,Voorraad!$A$2:$H$1001,8)),\"\",VLOOKUP($A$9,Voorraad!$A$2:$H$1001,8))","v":0},{"$f":"IF(ISERROR(VLOOKUP($A$9,Voorraad!$A$2:$I$1001,9)),\"\",VLOOKUP($A$9,Voorraad!$A$2:$I$1001,9))","v":456556565},{"$f":"IF(ISERROR(VLOOKUP($A$9,Voorraad!$A$2:$J$1001,10)),\"\",VLOOKUP($A$9,Voorraad!$A$2:$J$1001,10))","v":1165428},{"$f":"IF(ISERROR(VLOOKUP($A$9,Voorraad!$A$2:$G$1001,6)),\"\",VLOOKUP($A$9,Voorraad!$A$2:$G$1001,6))","v":"Farnell"},{"$f":"IF(ISERROR(VLOOKUP($A$9,Voorraad!$A$2:$G$1001,7)),\"\",VLOOKUP($A$9,Voorraad!$A$2:$G$1001,7))","v":"Vishay"},{"$f":"IF(ISERROR(VLOOKUP($A$9,Voorraad!$A$2:$G$1001,5)),\"\",VLOOKUP($A$9,Voorraad!$A$2:$G$1001,5))","v":8464},{"$f":"IF(ISERROR(VLOOKUP($A$9,Voorraad!$A$2:$D$1001,4)),\"\",VLOOKUP($A$9,Voorraad!$A$2:$D$1001,4))","v":22},{"$f":"B9","v":10},{"$f":"MAX(0,(SUM(M9-L9)))","v":0}]
["BU0003",{"$f":"[5]Sheet1!$E$5","v":130},{"$f":"IF(ISERROR(VLOOKUP($A$10,Voorraad!$A$2:$D$1001,1)),\"\",VLOOKUP($A$10,Voorraad!$A$2:$D$1001,1))","v":"BU0003"},{"$f":"IF(ISERROR(VLOOKUP($A$10,Voorraad!$A$2:$D$1001,3)),\"\",VLOOKUP($A$10,Voorraad!$A$2:$D$1001,3))","v":"22UF/50V"},{"$f":"IF(ISERROR(VLOOKUP($A$10,Voorraad!$A$2:$D$1001,2)),\"\",VLOOKUP($A$10,Voorraad!$A$2:$D$1001,2))","v":222211651229},{"$f":"IF(ISERROR(VLOOKUP($A$10,Voorraad!$A$2:$H$1001,8)),\"\",VLOOKUP($A$10,Voorraad!$A$2:$H$1001,8))","v":0},{"$f":"IF(ISERROR(VLOOKUP($A$10,Voorraad!$A$2:$I$1001,9)),\"\",VLOOKUP($A$10,Voorraad!$A$2:$I$1001,9))","v":0},{"$f":"IF(ISERROR(VLOOKUP($A$10,Voorraad!$A$2:$J$1001,10)),\"\",VLOOKUP($A$10,Voorraad!$A$2:$J$1001,10))","v":0},{"$f":"IF(ISERROR(VLOOKUP($A$10,Voorraad!$A$2:$G$1001,6)),\"\",VLOOKUP($A$10,Voorraad!$A$2:$G$1001,6))","v":"TME"},{"$f":"IF(ISERROR(VLOOKUP($A$10,Voorraad!$A$2:$G$1001,7)),\"\",VLOOKUP($A$10,Voorraad!$A$2:$G$1001,7))","v":"Philips"},{"$f":"IF(ISERROR(VLOOKUP($A$10,Voorraad!$A$2:$G$1001,5)),\"\",VLOOKUP($A$10,Voorraad!$A$2:$G$1001,5))","v":8464},{"$f":"IF(ISERROR(VLOOKUP($A$10,Voorraad!$A$2:$D$1001,4)),\"\",VLOOKUP($A$10,Voorraad!$A$2:$D$1001,4))","v":0},130,130]
{"$rows_left_out":33}
{"sheet":"Picklijst 8510","index":7,"n_rows":100,"n_cols":14,"rows_kept":100,"cut":false,"hidden":false,"merged":[]}
[]
["Pickorder 8510",null,{"$f":"[6]Sheet1!$D$2","v":75},"X"]
[]
[]
[]
[]
[]
["Art Nr CSI","Benodigd","Art Nr CSI","Omschrijving","Leverancier Nr","Produco Nr","OrderNr","Opmerkingen/Alternatieven","Leverancier","Producent","PCB","Voorraad","Benodigd","Bestellen"]
["BR0001",{"$f":"[6]Sheet1!$E$4","v":75},{"$f":"IF(ISERROR(VLOOKUP($A$9,Voorraad!$A$2:$D$1001,1)),\"\",VLOOKUP($A$9,Voorraad!$A$2:$D$1001,1))","v":"BR0001"},{"$f":"IF(ISERROR(VLOOKUP($A$9,Voorraad!$A$2:$D$1001,3)),\"\",VLOOKUP($A$9,Voorraad!$A$2:$D$1001,3))","v":"R 22E 1% 0.6W 7X2,5MM"},{"$f":"IF(ISERROR(VLOOKUP($A$9,Voorraad!$A$2:$D$1001,2)),\"\",VLOOKUP($A$9,Voorraad!$A$2:$D$1001,2))","v":"#10012201"},{"$f":"IF(ISERROR(VLOOKUP($A$9,Voorraad!$A$2:$H$1001,8)),\"\",VLOOKUP($A$9,Voorraad!$A$2:$H$1001,8))","v":500028},{"$f":"IF(ISERROR(VLOOKUP($A$9,Voorraad!$A$2:$I$1001,9)),\"\",VLOOKUP($A$9,Voorraad!$A$2:$I$1001,9))","v":0},{"$f":"IF(ISERROR(VLOOKUP($A$9,Voorraad!$A$2:$J$1001,10)),\"\",VLOOKUP($A$9,Voorraad!$A$2:$J$1001,10))","v":0},{"$f":"IF(ISERROR(VLOOKUP($A$9,Voorraad!$A$2:$G$1001,6)),\"\",VLOOKUP($A$9,Voorraad!$A$2:$G$1001,6))","v":0},{"$f":"IF(ISERROR(VLOOKUP($A$9,Voorraad!$A$2:$G$1001,7)),\"\",VLOOKUP($A$9,Voorraad!$A$2:$G$1001,7))","v":"BCC"},{"$f":"IF(ISERROR(VLOOKUP($A$9,Voorraad!$A$2:$G$1001,5)),\"\",VLOOKUP($A$9,Voorraad!$A$2:$G$1001,5))","v":8510},{"$f":"IF(ISERROR(VLOOKUP($A$9,Voorraad!$A$2:$D$1001,4)),\"\",VLOOKUP($A$9,Voorraad!$A$2:$D$1001,4))","v":425},{"$f":"B9","v":75},{"$f":"MAX(0,(SUM(M9-L9)))","v":0}]
["BR0002",{"$f":"[6]Sheet1!$E$5","v":150},{"$f":"IF(ISERROR(VLOOKUP($A$10,Voorraad!$A$2:$D$1001,1)),\"\",VLOOKUP($A$10,Voorraad!$A$2:$D$1001,1))","v":"BR0002"},{"$f":"IF(ISERROR(VLOOKUP($A$10,Voorraad!$A$2:$D$1001,3)),\"\",VLOOKUP($A$10,Voorraad!$A$2:$D$1001,3))","v":"R 47E 1% 0.6W 7X2,5MM"},{"$f":"IF(ISERROR(VLOOKUP($A$10,Voorraad!$A$2:$D$1001,2)),\"\",VLOOKUP($A$10,Voorraad!$A$2:$D$1001,2))","v":"#10014701"},{"$f":"IF(ISERROR(VLOOKUP($A$10,Voorraad!$A$2:$H$1001,8)),\"\",VLOOKUP($A$10,Voorraad!$A$2:$H$1001,8))","v":500032},{"$f":"IF(ISERROR(VLOOKUP($A$10,Voorraad!$A$2:$I$1001,9)),\"\",VLOOKUP($A$10,Voorraad!$A$2:$I$1001,9))","v":"M0.6W-47R"},{"$f":"IF(ISERROR(VLOOKUP($A$10,Voorraad!$A$2:$J$1001,10)),\"\",VLOOKUP($A$10,Voorraad!$A$2:$J$1001,10))","v":0},{"$f":"IF(ISERROR(VLOOKUP($A$10,Voorraad!$A$2:$G$1001,6)),\"\",VLOOKUP($A$10,Voorraad!$A$2:$G$1001,6))","v":"TME"},{"$f":"IF(ISERROR(VLOOKUP($A$10,Voorraad!$A$2:$G$1001,7)),\"\",VLOOKUP($A$10,Voorraad!$A$2:$G$1001,7))","v":"BCC"},{"$f":"IF(ISERROR(VLOOKUP($A$10,Voorraad!$A$2:$G$1001,5)),\"\",VLOOKUP($A$10,Voorraad!$A$2:$G$1001,5))","v":8510},{"$f":"IF(ISERROR(VLOOKUP($A$10,Voorraad!$A$2:$D$1001,4)),\"\",VLOOKUP($A$10,Voorraad!$A$2:$D$1001,4))","v":350},150,0]
{"$rows_left_out":91}
{"sheet":"Mutaties","index":8,"n_rows":3,"n_cols":4,"rows_kept":3,"cut":false,"hidden":false,"merged":[]}
[]
["Datum/Tijd","Art Nr CSI","Omschrijving","Mutatie"]
["2019-02-22T14:14:22","BX0043","PCB 8439L",20]