{"text_format":"1","workbook":"xlsx","n_sheets":3,"sheets":["1e","2e","Blad3"],"not_rendered":{"charts":0,"images":0,"macros":1,"external_links":0,"defined_names":9,"comments":0,"pivot_tables":0},"unopened":[],"bounds":{"document_bytes":16777216,"sheet_cells":100000,"rows_first":2000,"rows_last":500,"rows_between":2000,"halvings":0,"cell_chars":16384,"cell_head_chars":4096},"cells_cut":0,"cells_raw":0,"read":"whole","date_system":"1900"}

{"sheet":"1e","index":0,"n_rows":452,"n_cols":41,"rows_kept":452,"cut":false,"hidden":false,"merged":[[24,11,24,17],[24,18,24,24],[24,25,24,32],[51,15,51,16],[51,13,51,14]]}
[null,null,null,null,null,null,null,"Enjoy Biljart"]
[null,null,null,null,null,null,null,"Stand",null,null,null,null,null,null,null,null,null,null,"<table class=\"rand\">"]
[null,null,null,null,null,null,null,"#","Team",null,"G","W","GL","V","P","GT","VT","PNC","<tr><th scope=\"col\">&nbsp;</th><th scope=\"col\">Team</th><th scope=\"col\">G</th><th scope=\"col\">W</th><th scope=\"col\">GL</th><th scope=\"col\">V</th><th scope=\"col\">P</th><th scope=\"col\">DPV</th><th scope=\"col\">DPT</th><th scope=\"col\">PM</th></tr>"]
[null,null,null,null,null,null,null,{"$f":"IF(ISBLANK(I27),\"\",H27)","v":1},{"$f":"IF(H4=\"\",\"\",VLOOKUP(H4,$AN$27:$AO$46,2,0))","v":{"$error":"#N/A"}},null,{"$f":"IF(H4=\"\",\"\",VLOOKUP(I4,$I$27:$AG$46,17,0))","v":{"$error":"#N/A"}},{"$f":"IF(H4=\"\",\"\",VLOOKUP(I4,$I$27:$AG$46,18,0))","v":{"$error":"#N/A"}},{"$f":"IF(H4=\"\",\"\",VLOOKUP(I4,$I$27:$AG$46,19,0))","v":{"$error":"#N/A"}},{"$f":"IF(H4=\"\",\"\",VLOOKUP(I4,$I$27:$AG$46,20,0))","v":{"$error":"#N/A"}},{"$f":"IF(H4=\"\",\"\",VLOOKUP(I4,$I$27:$AG$46,21,0))","v":{"$error":"#N/A"}},{"$f":"IF(H4=\"\",\"\",VLOOKUP(I4,$I$27:$AG$46,22,0))","v":{"$error":"#N/A"}},{"$f":"IF(H4=\"\",\"\",VLOOKUP(I4,$I$27:$AG$46,23,0))","v":{"$error":"#N/A"}},{"$f":"IF(H4=\"\",\"\",VLOOKUP(I4,$I$27:$AG$46,2,0))","v":{"$error":"#N/A"}},"<tr><td class=\"r\">1</td><td>Beeckman Mark</td><td class=\"r\">1</td><td class=\"r\">1</td><td class=\"r\">0</td><td class=\"r\">0</td><td class=\"r\"><strong>3</strong></td><td class=\"r\">2</td><td class=\"r\">1</td><td class=\"r\">1</td></tr>"]
[null,null,null,null,null,null,null,{"$f":"IF(ISBLANK(I28),\"\",H28)","v":2},{"$error":"#N/A"},null,{"$error":"#N/A"},{"$error":"#N/A"},{"$error":"#N/A"},{"$error":"#N/A"},{"$error":"#N/A"},{"$error":"#N/A"},{"$error":"#N/A"},{"$error":"#N/A"},"<tr><td class=\"r\">2</td><td>Barbieur Olivier</td><td class=\"r\">1</td><td class=\"r\">0</td><td class=\"r\">0</td><td class=\"r\">1</td><td class=\"r\"><strong>1</strong></td><td class=\"r\">1</td><td class=\"r\">2</td><td class=\"r\">0</td></tr>"]
[null,null,null,null,null,null,null,3,{"$error":"#N/A"},null,{"$error":"#N/A"},{"$error":"#N/A"},{"$error":"#N/A"},{"$error":"#N/A"},{"$error":"#N/A"},{"$error":"#N/A"},{"$error":"#N/A"},{"$error":"#N/A"},"<tr><td class=\"r\">3</td><td>Bockxtale Patrick</td><td class=\"r\">0</td><td class=\"r\">0</td><td class=\"r\">0</td><td class=\"r\">0</td><td class=\"r\"><strong>0</strong></td><td class=\"r\">0</td><td class=\"r\">0</td><td class=\"r\">0</td></tr>"]
[null,null,null,null,null,null,null,4,{"$error":"#N/A"},null,{"$error":"#N/A"},{"$error":"#N/A"},{"$error":"#N/A"},{"$error":"#N/A"},{"$error":"#N/A"},{"$error":"#N/A"},{"$error":"#N/A"},{"$error":"#N/A"},"<tr><td class=\"r\">4</td><td>Claus Geert</td><td class=\"r\">0</td><td class=\"r\">0</td><td class=\"r\">0</td><td class=\"r\">0</td><td class=\"r\"><strong>0</strong></td><td class=\"r\">0</td><td class=\"r\">0</td><td class=\"r\">0</td></tr>"]
[null,null,null,null,null,null,null,5,{"$error":"#N/A"},null,{"$error":"#N/A"},{"$error":"#N/A"},{"$error":"#N/A"},{"$error":"#N/A"},{"$error":"#N/A"},{"$error":"#N/A"},{"$error":"#N/A"},{"$error":"#N/A"},"<tr><td class=\"r\">5</td><td>Claus Odilon</td><td class=\"r\">0</td><td class=\"r\">0</td><td class=\"r\">0</td><td class=\"r\">0</td><td class=\"r\"><strong>0</strong></td><td class=\"r\">0</td><td class=\"r\">0</td><td class=\"r\">0</td></tr>"]
[null,null,null,null,null,null,null,6,{"$error":"#N/A"},null,{"$error":"#N/A"},{"$error":"#N/A"},{"$error":"#N/A"},{"$error":"#N/A"},{"$error":"#N/A"},{"$error":"#N/A"},{"$error":"#N/A"},{"$error":"#N/A"},"<tr><td class=\"r\">6</td><td>Coppens Daniël</td><td class=\"r\">0</td><td class=\"r\">0</td><td class=\"r\">0</td><td class=\"r\">0</td><td class=\"r\"><strong>0</strong></td><td class=\"r\">0</td><td class=\"r\">0</td><td class=\"r\">0</td></tr>"]
[null,null,null,null,null,null,null,7,{"$error":"#N/A"},null,{"$error":"#N/A"},{"$error":"#N/A"},{"$error":"#N/A"},{"$error":"#N/A"},{"$error":"#N/A"},{"$error":"#N/A"},{"$error":"#N/A"},{"$error":"#N/A"},"<tr><td class=\"r\">7</td><td>De Smet Filip</td><td class=\"r\">0</td><td class=\"r\">0</td><td class=\"r\">0</td><td class=\"r\">0</td><td class=\"r\"><strong>0</strong></td><td class=\"r\">0</td><td class=\"r\">0</td><td class=\"r\">0</td></tr>"]
[null,null,null,null,null,null,null,8,{"$error":"#N/A"},null,{"$error":"#N/A"},{"$error":"#N/A"},{"$error":"#N/A"},{"$error":"#N/A"},{"$error":"#N/A"},{"$error":"#N/A"},{"$error":"#N/A"},{"$error":"#N/A"},"<tr><td class=\"r\">8</td><td>Keppens Jurgen</td><td class=\"r\">0</td><td class=\"r\">0</td><td class=\"r\">0</td><td class=\"r\">0</td><td class=\"r\"><strong>0</strong></td><td class=\"r\">0</td><td class=\"r\">0</td><td class=\"r\">0</td></tr>"]
[null,null,null,null,null,null,null,9,{"$error":"#N/A"},null,{"$error":"#N/A"},{"$error":"#N/A"},{"$error":"#N/A"},{"$error":"#N/A"},{"$error":"#N/A"},{"$error":"#N/A"},{"$error":"#N/A"},{"$error":"#N/A"},"<tr><td class=\"r\">9</td><td>Rosschaert Casper</td><td class=\"r\">0</td><td class=\"r\">0</td><td class=\"r\">0</td><td class=\"r\">0</td><td class=\"r\"><strong>0</strong></td><td class=\"r\">0</td><td class=\"r\">0</td><td class=\"r\">0</td></tr>",null,null,null,null,"           "]
[null,null,null,null,null,null,null,10,{"$error":"#N/A"},null,{"$error":"#N/A"},{"$error":"#N/A"},{"$error":"#N/A"},{"$error":"#N/A"},{"$error":"#N/A"},{"$error":"#N/A"},{"$error":"#N/A"},{"$error":"#N/A"},"<tr><td class=\"r\">10</td><td>Rosschaert Peter</td><td class=\"r\">0</td><td class=\"r\">0</td><td class=\"r\">0</td><td class=\"r\">0</td><td class=\"r\"><strong>0</strong></td><td class=\"r\">0</td><td class=\"r\">0</td><td class=\"r\">0</td></tr>"]
[null,null,null,null,null,null,null,11,{"$error":"#N/A"},null,{"$error":"#N/A"},{"$error":"#N/A"},{"$error":"#N/A"},{"$error":"#N/A"},{"$error":"#N/A"},{"$error":"#N/A"},{"$error":"#N/A"},{"$error":"#N/A"},"<tr><td class=\"r\">11</td><td>Vagenende Etienne</td><td class=\"r\">0</td><td class=\"r\">0</td><td class=\"r\">0</td><td class=\"r\">0</td><td class=\"r\"><strong>0</strong></td><td class=\"r\">0</td><td class=\"r\">0</td><td class=\"r\">0</td></tr>"]
[null,null,null,null,null,null,null,"","",null,"","","","","","","","","</table>"]
[null,null,null,null,null,null,"","","",null,"","","","","","","",""]
[null,null,null,null,null,null,"","","",null,"","","","","","","",""]
[null,null,null,null,null,null,"","","",null,"","","","","","","",""]
[null,null,null,null,null,null,"","","",null,"","","","","","","",""]
[null,null,null,null,null,null,"","","",null,"","","","","","","",""]
[null,null,null,null,null,null,"","","",null,"","","","","","","",""]
[null,null,null,null,null,null,"","","",null,"","","","","","","",""]
[null,null,null,null,null,null,"","","",null,"","","","","","","",""]
[]
[null,null,null,null,null,null,null,"Teamindeling",null,null,null,"Thuis",null,null,null,null,null,null,"Uit",null,null,null,null,null,null,"Totaal"]
[null,null,null,null,null,null,null,null,"Team",null,"extra punt niet-comp","gespeeld thuis","gewonnen thuis","gelijk thuis","verloren thuis","punten thuis","gewonnen takken thuis","verloren takken thuis","gespeeld uit","gewonnen uit","gelijk uit","verloren uit","punten uit","gewonnen takken uit","verloren takken uit","gespeeld totaal","gewonnen totaal","gelijk totaal","verloren totaal","punten totaal","gewonnen takken totaal","verloren takken totaal","takkensaldo totaal","volgorde punten","volgorde gespeeld","volgorde takkensaldo","volgorde takken voor","volgorde teamnaam","volgorde nummer","volgorde totaal","Team"]
[null,null,null,null,null,null,null,1,"Barbieur Olivier",null,null,{"$f":"SUMPRODUCT((thuis=$I27)*(gespeeld=1))","v":0},{"$f":"SUMPRODUCT((thuis=$I27)*(gespeeld=1)*(thuis_uitslag>uit_uitslag))","v":0},{"$f":"SUMPRODUCT((thuis=$I27)*(gespeeld=1)*(thuis_uitslag=uit_uitslag))","v":0},{"$f":"SUMPRODUCT((thuis=$I27)*(gespeeld=1)*(thuis_uitslag<uit_uitslag))","v":0},{"$f":"SUMIFS(uitslag_punten_thuis,gespeeld,1,thuis,$I27)","v":0},{"$f":"SUMIF(thuis,$I27,thuis_uitslag)","v":2},{"$f":"SUMIF(thuis,$I27,uit_uitslag)","v":1},{"$f":"SUMPRODUCT((uit=$I27)*(gespeeld=1))","v":0},{"$f":"SUMPRODUCT((uit=$I27)*(gespeeld=1)*(uit_uitslag>thuis_uitslag))","v":0},{"$f":"SUMPRODUCT((uit=$I27)*(gespeeld=1)*(uit_uitslag=thuis_uitslag))","v":0},{"$f":"SUMPRODUCT((uit=$I27)*(gespeeld=1)*(uit_uitslag<thuis_uitslag))","v":0},{"$f":"SUMIFS(uitslag_punten_uit,gespeeld,1,uit,$I27)","v":{"$error":"#NAME?"}},{"$f":"SUMIF(uit,$I27,uit_uitslag)","v":0},{"$f":"SUMIF(uit,$I27,thuis_uitslag)","v":0},{"$f":"$L27+$S27","v":0},{"$f":"$M27+$T27","v":0},{"$f":"$N27+$U27","v":0},{"$f":"$O27+$V27","v":0},{"$f":"$P27+$W27","v":{"$error":"#NAME?"}},{"$f":"$Q27+$X27","v":2},{"$f":"$R27+$Y27","v":1},{"$f":"$AE27-$AF27","v":1},{"$f":"RANK($AD27,$AD$27:$AD$46,1)","v":{"$error":"#NAME?"}},{"$f":"RANK($Z27,$Z$27:$Z$46)","v":1},{"$f":"RANK($AG27,$AG$27:$AG$46,1)","v":20},{"$f":"RANK($AE27,$AE$27:$AE$46,1)","v":20},{"$f":"20-SUMPRODUCT(--($I27>teams))","v":11},{"$f":"IF(ISBLANK($I27),0,$AH27*20^4+$AI27*20^3+$AJ27*20^2+$AK27*20^1+$AL27*20^0)","v":{"$error":"#NAME?"}},{"$f":"RANK($AM27,$AM$27:$AM$46)","v":{"$error":"#NAME?"}},{"$f":"IF(ISBLANK($I27),\"\",$I27)","v":"Barbieur Olivier"}]
[null,null,null,null,null,null,null,2,"Beeckman Mark",null,null,0,0,0,0,0,0,0,0,0,0,0,{"$error":"#NAME?"},1,2,0,0,0,0,{"$error":"#NAME?"},1,2,-1,{"$error":"#NAME?"},1,1,19,10,{"$error":"#NAME?"},{"$error":"#NAME?"},"Beeckman Mark"]
[null,null,null,null,null,null,null,3,"Bockxtale Patrick",null,null,0,0,0,0,0,0,0,0,0,0,0,{"$error":"#NAME?"},0,0,0,0,0,0,{"$error":"#NAME?"},0,0,0,{"$error":"#NAME?"},1,2,1,9,{"$error":"#NAME?"},{"$error":"#NAME?"},"Bockxtale Patrick"]
[null,null,null,null,null,null,null,4,"Claus Geert",null,null,0,0,0,0,0,0,0,0,0,0,0,{"$error":"#NAME?"},0,0,0,0,0,0,{"$error":"#NAME?"},0,0,0,{"$error":"#NAME?"},1,2,1,8,{"$error":"#NAME?"},{"$error":"#NAME?"},"Claus Geert"]
[null,null,null,null,null,null,null,5,"Claus Odilon",null,null,0,0,0,0,0,0,0,0,0,0,0,{"$error":"#NAME?"},0,0,0,0,0,0,{"$error":"#NAME?"},0,0,0,{"$error":"#NAME?"},1,2,1,7,{"$error":"#NAME?"},{"$error":"#NAME?"},"Claus Odilon"]
[null,null,null,null,null,null,null,6,"Coppens Daniël",null,null,0,0,0,0,0,0,0,0,0,0,0,{"$error":"#NAME?"},0,0,0,0,0,0,{"$error":"#NAME?"},0,0,0,{"$error":"#NAME?"},1,2,1,6,{"$error":"#NAME?"},{"$error":"#NAME?"},"Coppens Daniël"]
[null,null,null,null,null,null,null,7,"De Smet Filip",null,null,0,0,0,0,0,0,0,0,0,0,0,{"$error":"#NAME?"},0,0,0,0,0,0,{"$error":"#NAME?"},0,0,0,{"$error":"#NAME?"},1,2,1,5,{"$error":"#NAME?"},{"$error":"#NAME?"},"De Smet Filip"]
[null,null,null,null,null,null,null,8,"Keppens Jurgen",null,null,0,0,0,0,0,0,0,0,0,0,0,{"$error":"#NAME?"},0,0,0,0,0,0,{"$error":"#NAME?"},0,0,0,{"$error":"#NAME?"},1,2,1,4,{"$error":"#NAME?"},{"$error":"#NAME?"},"Keppens Jurgen"]
[null,null,null,null,null,null,null,9,"Rosschaert Casper",null,null,0,0,0,0,0,0,0,0,0,0,0,{"$error":"#NAME?"},0,0,0,0,0,0,{"$error":"#NAME?"},0,0,0,{"$error":"#NAME?"},1,2,1,3,{"$error":"#NAME?"},{"$error":"#NAME?"},"Rosschaert Casper"]
[null,null,null,null,null,null,null,10,"Rosschaert Peter",null,null,0,0,0,0,0,0,0,0,0,0,0,{"$error":"#NAME?"},0,0,0,0,0,0,{"$error":"#NAME?"},0,0,0,{"$error":"#NAME?"},1,2,1,2,{"$error":"#NAME?"},{"$error":"#NAME?"},"Rosschaert Peter"]
[null,null,null,null,null,null,null,11,"Vagenende Etienne",null,null,0,0,0,0,0,0,0,0,0,0,0,{"$error":"#NAME?"},0,0,0,0,0,0,{"$error":"#NAME?"},0,0,0,{"$error":"#NAME?"},1,2,1,1,{"$error":"#NAME?"},{"$error":"#NAME?"},"Vagenende Etienne"]
[null,null,null,null,null,null,null,12,null,null,null,0,0,0,0,0,0,0,0,0,0,0,{"$error":"#NAME?"},0,0,0,0,0,0,{"$error":"#NAME?"},0,0,0,{"$error":"#NAME?"},1,2,1,20,0,{"$error":"#NAME?"},""]
[null,null,null,null,null,null,null,13,null,null,null,0,0,0,0,0,0,0,0,0,0,0,{"$error":"#NAME?"},0,0,0,0,0,0,{"$error":"#NAME?"},0,0,0,{"$error":"#NAME?"},1,2,1,20,0,{"$error":"#NAME?"},""]
[null,null,null,null,null,null,null,14,null,null,null,0,0,0,0,0,0,0,0,0,0,0,{"$error":"#NAME?"},0,0,0,0,0,0,{"$error":"#NAME?"},0,0,0,{"$error":"#NAME?"},1,2,1,20,0,{"$error":"#NAME?"},""]
[null,null,null,null,null,null,null,15,null,null,null,0,0,0,0,0,0,0,0,0,0,0,{"$error":"#NAME?"},0,0,0,0,0,0,{"$error":"#NAME?"},0,0,0,{"$error":"#NAME?"},1,2,1,20,0,{"$error":"#NAME?"},""]
[null,null,null,null,null,null,null,16,null,null,null,0,0,0,0,0,0,0,0,0,0,0,{"$error":"#NAME?"},0,0,0,0,0,0,{"$error":"#NAME?"},0,0,0,{"$error":"#NAME?"},1,2,1,20,0,{"$error":"#NAME?"},""]
[null,null,null,null,null,null,null,17,null,null,null,0,0,0,0,0,0,0,0,0,0,0,{"$error":"#NAME?"},0,0,0,0,0,0,{"$error":"#NAME?"},0,0,0,{"$error":"#NAME?"},1,2,1,20,0,{"$error":"#NAME?"},""]
[null,null,null,null,null,null,null,18,null,null,null,0,0,0,0,0,0,0,0,0,0,0,{"$error":"#NAME?"},0,0,0,0,0,0,{"$error":"#NAME?"},0,0,0,{"$error":"#NAME?"},1,2,1,20,0,{"$error":"#NAME?"},""]
[null,null,null,null,null,null,null,19,null,null,null,0,0,0,0,0,0,0,0,0,0,0,{"$error":"#NAME?"},0,0,0,0,0,0,{"$error":"#NAME?"},0,0,0,{"$error":"#NAME?"},1,2,1,20,0,{"$error":"#NAME?"},""]
[null,null,null,null,null,null,null,20,null,null,null,0,0,0,0,0,0,0,0,0,0,0,{"$error":"#NAME?"},0,0,0,0,0,0,{"$error":"#NAME?"},0,0,0,{"$error":"#NAME?"},1,2,1,20,0,{"$error":"#NAME?"},""]
[]
[null,null,null,null,null,null,null,null,"Favoriet"]
[null,null,null,null,null,null,null,null,"spelersnaam"]
[]
[null,null,null,null,null,"Uitslagen",null,null,null,null,null,null,"<table summary=\"Uitslagen chronologisch\" class=\"rand\">"]
["a","b","c","d","e","datum","thuis",null,"uit",null,"uitslag",null,"<tr><th>Datum</th><th>Thuis</th><th>Uit</th><th>Uitslag</th></tr>","Punten thuis/uit",null,"N. comp. speler"]
[1,2,{"$f":"IF(OR(A53=B53,A53>COUNTA(teams),B53>COUNTA(teams)),0,1)","v":1},{"$f":"IF(C53=0,0,IF(NOT(OR(ISBLANK(F53),ISBLANK(G53),ISBLANK(I53))),2,1))","v":1},{"$f":"IF(AND(D53=2,ISNUMBER(K53),ISNUMBER(L53)),1,0)","v":0},null,{"$f":"IF(C53=0,\"\",VLOOKUP(A53,team_vlgnrs,2,FALSE))","v":"Barbieur Olivier"},"-",{"$f":"IF(C53=0,\"\",VLOOKUP(B53,team_vlgnrs,2,FALSE))","v":"Beeckman Mark"},{"$f":"G53&I53","v":"Barbieur OlivierBeeckman Mark"},2,1,"<tr><td>24-03-2019</td><td>Barbieur Olivier</td><td>Beeckman Mark</td><td class=\"c\">1-2</td></tr>",{"$f":"IF(AND(K53=2,L53=0),3,K53)+P53","v":2},{"$f":"IF(AND(L53=2,K53=0),3,L53)+Q53","v":1},{"$f":"IF(AND(VLOOKUP(G53,I$27:K$46,2,0)=1,VLOOKUP(I53,I$27:K$46,2,0)=1),0,IF(AND(VLOOKUP(G53,I$27:K$46,2,0)=0,VLOOKUP(I53,I$27:K$46,2,0)=0),0,VLOOKUP(G53,I$27:K$46,2,0)))","v":0},{"$f":"IF(AND(VLOOKUP(G53,I$27:K$46,2,0)=1,VLOOKUP(I53,I$27:K$46,2,0)=1),0,IF(AND(VLOOKUP(G53,I$27:K$46,2,0)=0,VLOOKUP(I53,I$27:K$46,2,0)=0),0,VLOOKUP(I53,I$27:K$46,2,0)))","v":0}]
[1,11,1,1,0,null,"Barbieur Olivier","-","Vagenende Etienne",null,null,null,"</table>",0,0,0,0]
[1,10,1,1,0,null,"Barbieur Olivier","-","Rosschaert Peter",null,null,null,null,0,0,0,0]
[1,5,1,1,0,null,"Barbieur Olivier","-","Claus Odilon",null,null,null,null,0,0,0,0]
[1,3,1,1,0,null,"Barbieur Olivier","-","Bockxtale Patrick",null,null,null,null,0,0,0,0]
[1,9,1,1,0,null,"Barbieur Olivier","-","Rosschaert Casper",null,null,null,null,0,0,0,0]
[1,8,1,1,0,null,"Barbieur Olivier","-","Keppens Jurgen",null,null,null,null,0,0,0,0]
[1,7,1,1,0,null,"Barbieur Olivier","-","De Smet Filip",null,null,null,null,0,0,0,0]
[1,6,1,1,0,null,"Barbieur Olivier","-","Coppens Daniël",null,null,null,null,0,0,0,0]
[1,4,1,1,0,null,"Barbieur Olivier","-","Claus Geert",null,null,null,null,0,0,0,0]
[2,1,1,1,0,null,"Beeckman Mark","-","Barbieur Olivier",null,null,null,null,0,0,0,0]
[2,10,1,1,0,null,"Beeckman Mark","-","Rosschaert Peter",null,null,null,null,0,0,0,0]
[2,11,1,1,0,null,"Beeckman Mark","-","Vagenende Etienne",null,null,null,null,0,0,0,0]
[2,5,1,1,0,null,"Beeckman Mark","-","Claus Odilon",null,null,null,null,0,0,0,0]
[2,7,1,1,0,null,"Beeckman Mark","-","De Smet Filip",null,null,null,null,0,0,0,0]
[2,8,1,1,0,null,"Beeckman Mark","-","Keppens Jurgen",null,null,null,null,0,0,0,0]
[2,3,1,1,0,null,"Beeckman Mark","-","Bockxtale Patrick",null,null,null,null,0,0,0,0]
[2,4,1,1,0,null,"Beeckman Mark","-","Claus Geert",null,null,null,null,0,0,0,0]
[2,9,1,1,0,null,"Beeckman Mark","-","Rosschaert Casper",null,null,null,null,0,0,0,0]
[2,6,1,1,0,null,"Beeckman Mark","-","Coppens Daniël",null,null,null,null,0,0,0,0]
[3,8,1,1,0,null,"Bockxtale Patrick","-","Keppens Jurgen",null,null,null,null,0,0,0,0]
[3,4,1,1,0,null,"Bockxtale Patrick","-","Claus Geert",null,null,null,null,0,0,0,0]
[3,2,1,1,0,null,"Bockxtale Patrick","-","Beeckman Mark",null,null,null,null,0,0,0,0]
[3,1,1,1,0,null,"Bockxtale Patrick","-","Barbieur Olivier",null,null,null,null,0,0,0,0]
[3,5,1,1,0,null,"Bockxtale Patrick","-","Claus Odilon",null,null,null,null,0,0,0,0]
[3,7,1,1,0,null,"Bockxtale Patrick","-","De Smet Filip",null,null,null,null,0,0,0,0]
[3,9,1,1,0,null,"Bockxtale Patrick","-","Rosschaert Casper",null,null,null,null,0,0,0,0]
[3,10,1,1,0,null,"Bockxtale Patrick","-","Rosschaert Peter",null,null,null,null,0,0,0,0]
[3,6,1,1,0,null,"Bockxtale Patrick","-","Coppens Daniël",null,null,null,null,0,0,0,0]
[3,11,1,1,0,null,"Bockxtale Patrick","-","Vagenende Etienne",null,null,null,null,0,0,0,0]
[4,1,1,1,0,null,"Claus Geert","-","Barbieur Olivier",null,null,null,null,0,0,0,0]
[4,5,1,1,0,null,"Claus Geert","-","Claus Odilon",null,null,null,null,0,0,0,0]
[4,9,1,1,0,null,"Claus Geert","-","Rosschaert Casper",null,null,null,null,{"$f":"IF(AND(K85=2,L85=0),3,K85)+P85","v":0},{"$f":"IF(AND(L85=2,K85=0),3,L85)+Q85","v":0},0,0]
[4,11,1,1,0,null,"Claus Geert","-","Vagenende Etienne",null,null,null,null,0,0,0,0]
[4,2,1,1,0,null,"Claus Geert","-","Beeckman Mark",null,null,null,null,0,0,0,0]
[4,7,1,1,0,null,"Claus Geert","-","De Smet Filip",null,null,null,null,0,0,0,0]
[4,10,1,1,0,null,"Claus Geert","-","Rosschaert Peter",null,null,null,null,0,0,0,0]
[4,6,1,1,0,null,"Claus Geert","-","Coppens Daniël",null,null,null,null,0,0,0,0]
[4,8,1,1,0,null,"Claus Geert","-","Keppens Jurgen",null,null,null,null,0,0,0,0]
[4,3,1,1,0,null,"Claus Geert","-","Bockxtale Patrick",null,null,null,null,0,0,0,0]
[5,8,1,1,0,null,"Claus Odilon","-","Keppens Jurgen",null,null,null,null,0,0,0,0]
[5,6,1,1,0,null,"Claus Odilon","-","Coppens Daniël",null,null,null,null,0,0,0,0]
[5,7,1,1,0,null,"Claus Odilon","-","De Smet Filip",null,null,null,null,0,0,0,0]
[5,10,1,1,0,null,"Claus Odilon","-","Rosschaert Peter",null,null,null,null,0,0,0,0]
[5,2,1,1,0,null,"Claus Odilon","-","Beeckman Mark",null,null,null,null,0,0,0,0]
[5,9,1,1,0,null,"Claus Odilon","-","Rosschaert Casper",null,null,null,null,0,0,0,0]
[5,1,1,1,0,null,"Claus Odilon","-","Barbieur Olivier",null,null,null,null,0,0,0,0]
[5,11,1,1,0,null,"Claus Odilon","-","Vagenende Etienne",null,null,null,null,0,0,0,0]
[5,4,1,1,0,null,"Claus Odilon","-","Claus Geert",null,null,null,null,0,0,0,0]
[5,3,1,1,0,null,"Claus Odilon","-","Bockxtale Patrick",null,null,null,null,0,0,0,0]
[6,1,1,1,0,null,"Coppens Daniël","-","Barbieur Olivier",null,null,null,null,0,0,0,0]
[6,2,1,1,0,null,"Coppens Daniël","-","Beeckman Mark",null,null,null,null,0,0,0,0]
[6,4,1,1,0,null,"Coppens Daniël","-","Claus Geert",null,null,null,null,0,0,0,0]
[6,11,1,1,0,null,"Coppens Daniël","-","Vagenende Etienne",null,null,null,null,0,0,0,0]
[6,3,1,1,0,null,"Coppens Daniël","-","Bockxtale Patrick",null,null,null,null,0,0,0,0]
[6,9,1,1,0,null,"Coppens Daniël","-","Rosschaert Casper",null,null,null,null,0,0,0,0]
[6,10,1,1,0,null,"Coppens Daniël","-","Rosschaert Peter",null,null,null,null,0,0,0,0]
[6,7,1,1,0,null,"Coppens Daniël","-","De Smet Filip",null,null,null,null,0,0,0,0]
[6,5,1,1,0,null,"Coppens Daniël","-","Claus Odilon",null,null,null,null,0,0,0,0]
[6,8,1,1,0,null,"Coppens Daniël","-","Keppens Jurgen",null,null,null,null,0,0,0,0]
[7,4,1,1,0,null,"De Smet Filip","-","Claus Geert",null,null,null,null,0,0,0,0]
[7,9,1,1,0,null,"De Smet Filip","-","Rosschaert Casper",null,null,null,null,0,0,0,0]
[7,1,1,1,0,null,"De Smet Filip","-","Barbieur Olivier",null,null,null,null,0,0,0,0]
[7,8,1,1,0,null,"De Smet Filip","-","Keppens Jurgen",null,null,null,null,0,0,0,0]
[7,6,{"$f":"IF(OR(A117=B117,A117>COUNTA(teams),B117>COUNTA(teams)),0,1)","v":1},{"$f":"IF(C117=0,0,IF(NOT(OR(ISBLANK(F117),ISBLANK(G117),ISBLANK(I117))),2,1))","v":1},{"$f":"IF(AND(D117=2,ISNUMBER(K117),ISNUMBER(L117)),1,0)","v":0},null,{"$f":"IF(C117=0,\"\",VLOOKUP(A117,team_vlgnrs,2,FALSE))","v":"De Smet Filip"},"-",{"$f":"IF(C117=0,\"\",VLOOKUP(B117,team_vlgnrs,2,FALSE))","v":"Coppens Daniël"},null,null,null,null,{"$f":"IF(AND(K117=2,L117=0),3,K117)+P117","v":0},{"$f":"IF(AND(L117=2,K117=0),3,L117)+Q117","v":0},{"$f":"IF(AND(VLOOKUP(G117,I$27:K$46,2,0)=1,VLOOKUP(I117,I$27:K$46,2,0)=1),0,IF(AND(VLOOKUP(G117,I$27:K$46,2,0)=0,VLOOKUP(I117,I$27:K$46,2,0)=0),0,VLOOKUP(G117,I$27:K$46,2,0)))","v":0},{"$f":"IF(AND(VLOOKUP(G117,I$27:K$46,2,0)=1,VLOOKUP(I117,I$27:K$46,2,0)=1),0,IF(AND(VLOOKUP(G117,I$27:K$46,2,0)=0,VLOOKUP(I117,I$27:K$46,2,0)=0),0,VLOOKUP(I117,I$27:K$46,2,0)))","v":0}]
[7,10,1,1,0,null,"De Smet Filip","-","Rosschaert Peter",null,null,null,null,0,0,0,0]
[7,11,1,1,0,null,"De Smet Filip","-","Vagenende Etienne",null,null,null,null,0,0,0,0]
[7,5,1,1,0,null,"De Smet Filip","-","Claus Odilon",null,null,null,null,0,0,0,0]
[7,3,1,1,0,null,"De Smet Filip","-","Bockxtale Patrick",null,null,null,null,0,0,0,0]
[7,2,1,1,0,null,"De Smet Filip","-","Beeckman Mark",null,null,null,null,0,0,0,0]
[8,2,1,1,0,null,"Keppens Jurgen","-","Beeckman Mark",null,null,null,null,0,0,0,0]
[8,10,1,1,0,null,"Keppens Jurgen","-","Rosschaert Peter",null,null,null,null,0,0,0,0]
[8,9,1,1,0,null,"Keppens Jurgen","-","Rosschaert Casper",null,null,null,null,0,0,0,0]
[8,6,1,1,0,null,"Keppens Jurgen","-","Coppens Daniël",null,null,null,null,0,0,0,0]
[8,4,1,1,0,null,"Keppens Jurgen","-","Claus Geert",null,null,null,null,0,0,0,0]
[8,3,1,1,0,null,"Keppens Jurgen","-","Bockxtale Patrick",null,null,null,null,0,0,0,0]
[8,7,1,1,0,null,"Keppens Jurgen","-","De Smet Filip",null,null,null,null,0,0,0,0]
[8,1,1,1,0,null,"Keppens Jurgen","-","Barbieur Olivier",null,null,null,null,0,0,0,0]
[8,11,1,1,0,null,"Keppens Jurgen","-","Vagenende Etienne",null,null,null,null,0,0,0,0]
[8,5,1,1,0,null,"Keppens Jurgen","-","Claus Odilon",null,null,null,null,0,0,0,0]
[9,6,1,1,0,null,"Rosschaert Casper","-","Coppens Daniël",null,null,null,null,0,0,0,0]
[9,5,1,1,0,null,"Rosschaert Casper","-","Claus Odilon",null,null,null,null,0,0,0,0]
[9,4,1,1,0,null,"Rosschaert Casper","-","Claus Geert",null,null,null,null,0,0,0,0]
[9,2,1,1,0,null,"Rosschaert Casper","-","Beeckman Mark",null,null,null,null,0,0,0,0]
[9,1,1,1,0,null,"Rosschaert Casper","-","Barbieur Olivier",null,null,null,null,0,0,0,0]
[9,3,1,1,0,null,"Rosschaert Casper","-","Bockxtale Patrick",null,null,null,null,0,0,0,0]
[9,11,1,1,0,null,"Rosschaert Casper","-","Vagenende Etienne",null,null,null,null,0,0,0,0]
[9,10,1,1,0,null,"Rosschaert Casper","-","Rosschaert Peter",null,null,null,null,0,0,0,0]
[9,8,1,1,0,null,"Rosschaert Casper","-","Keppens Jurgen",null,null,null,null,0,0,0,0]
[9,7,1,1,0,null,"Rosschaert Casper","-","De Smet Filip",null,null,null,null,0,0,0,0]
[10,2,1,1,0,null,"Rosschaert Peter","-","Beeckman Mark",null,null,null,null,0,0,0,0]
[10,1,1,1,0,null,"Rosschaert Peter","-","Barbieur Olivier",null,null,null,null,0,0,0,0]
[10,11,1,1,0,null,"Rosschaert Peter","-","Vagenende Etienne",null,null,null,null,0,0,0,0]
[10,7,1,1,0,null,"Rosschaert Peter","-","De Smet Filip",null,null,null,null,0,0,0,0]
[10,9,1,1,0,null,"Rosschaert Peter","-","Rosschaert Casper",null,null,null,null,0,0,0,0]
[10,4,1,1,0,null,"Rosschaert Peter","-","Claus Geert",null,null,null,null,0,0,0,0]
[10,6,1,1,0,null,"Rosschaert Peter","-","Coppens Daniël",null,null,null,null,{"$f":"IF(AND(K149=2,L149=0),3,K149)+P149","v":0},{"$f":"IF(AND(L149=2,K149=0),3,L149)+Q149","v":0},0,0]
[10,3,1,1,0,null,"Rosschaert Peter","-","Bockxtale Patrick",null,null,null,null,0,0,0,0]
[10,5,1,1,0,null,"Rosschaert Peter","-","Claus Odilon",null,null,null,null,0,0,0,0]
[10,8,1,1,0,null,"Rosschaert Peter","-","Keppens Jurgen",null,null,null,null,0,0,0,0]
[11,1,1,1,0,null,"Vagenende Etienne","-","Barbieur Olivier",null,null,null,null,0,0,0,0]
[11,10,1,1,0,null,"Vagenende Etienne","-","Rosschaert Peter",null,null,null,null,0,0,0,0]
[11,2,1,1,0,null,"Vagenende Etienne","-","Beeckman Mark",null,null,null,null,0,0,0,0]
[11,9,1,1,0,null,"Vagenende Etienne","-","Rosschaert Casper",null,null,null,null,0,0,0,0]
[11,3,1,1,0,null,"Vagenende Etienne","-","Bockxtale Patrick",null,null,null,null,0,0,0,0]
[11,7,1,1,0,null,"Vagenende Etienne","-","De Smet Filip",null,null,null,null,0,0,0,0]
[11,8,1,1,0,null,"Vagenende Etienne","-","Keppens Jurgen",null,null,null,null,0,0,0,0]
[11,5,1,1,0,null,"Vagenende Etienne","-","Claus Odilon",null,null,null,null,0,0,0,0]
[11,4,1,1,0,null,"Vagenende Etienne","-","Claus Geert",null,null,null,null,0,0,0,0]
[11,6,1,1,0,null,"Vagenende Etienne","-","Coppens Daniël",null,null,null,null,0,0,0,0]
[1,15,0,0,0,null,"","-","",null,null,null,null,{"$f":"IF(AND(K163=2,L163=0),3,K163)+P163","v":{"$error":"#N/A"}},{"$f":"IF(AND(L163=2,K163=0),3,L163)+Q163","v":{"$error":"#N/A"}},{"$error":"#N/A"},{"$error":"#N/A"}]
[1,16,0,0,0,null,"","-","",null,null,null,null,{"$error":"#N/A"},{"$error":"#N/A"},{"$error":"#N/A"},{"$error":"#N/A"}]
[1,17,0,0,0,null,"","-","",null,null,null,null,{"$error":"#N/A"},{"$error":"#N/A"},{"$error":"#N/A"},{"$error":"#N/A"}]
[1,18,0,0,0,null,"","-","",null,null,null,null,{"$error":"#N/A"},{"$error":"#N/A"},{"$error":"#N/A"},{"$error":"#N/A"}]
[1,19,0,0,0,null,"","-","",null,null,null,null,{"$error":"#N/A"},{"$error":"#N/A"},{"$error":"#N/A"},{"$error":"#N/A"}]
[1,20,0,0,0,null,"","-","",null,null,null,null,{"$error":"#N/A"},{"$error":"#N/A"},{"$error":"#N/A"},{"$error":"#N/A"}]
[1,12,0,0,0,null,"","-","",null,null,null,null,{"$error":"#N/A"},{"$error":"#N/A"},{"$error":"#N/A"},{"$error":"#N/A"}]
[1,13,0,0,0,null,"","-","",null,null,null,null,{"$error":"#N/A"},{"$error":"#N/A"},{"$error":"#N/A"},{"$error":"#N/A"}]
[1,14,0,0,0,null,"","-","",null,null,null,null,{"$error":"#N/A"},{"$error":"#N/A"},{"$error":"#N/A"},{"$error":"#N/A"}]
[2,15,0,0,0,null,"","-","",null,null,null,null,{"$error":"#N/A"},{"$error":"#N/A"},{"$error":"#N/A"},{"$error":"#N/A"}]
[2,16,0,0,0,null,"","-","",null,null,null,null,{"$error":"#N/A"},{"$error":"#N/A"},{"$error":"#N/A"},{"$error":"#N/A"}]
[2,17,0,0,0,null,"","-","",null,null,null,null,{"$error":"#N/A"},{"$error":"#N/A"},{"$error":"#N/A"},{"$error":"#N/A"}]
[2,18,0,0,0,null,"","-","",null,null,null,null,{"$error":"#N/A"},{"$error":"#N/A"},{"$error":"#N/A"},{"$error":"#N/A"}]
[2,19,0,0,0,null,"","-","",null,null,null,null,{"$error":"#N/A"},{"$error":"#N/A"},{"$error":"#N/A"},{"$error":"#N/A"}]
[2,20,0,0,0,null,"","-","",null,null,null,null,{"$error":"#N/A"},{"$error":"#N/A"},{"$error":"#N/A"},{"$error":"#N/A"}]
[2,12,0,0,0,null,"","-","",null,null,null,null,{"$error":"#N/A"},{"$error":"#N/A"},{"$error":"#N/A"},{"$error":"#N/A"}]
[2,13,0,0,0,null,"","-","",null,null,null,null,{"$error":"#N/A"},{"$error":"#N/A"},{"$error":"#N/A"},{"$error":"#N/A"}]
[2,14,0,0,0,null,"","-","",null,null,null,null,{"$error":"#N/A"},{"$error":"#N/A"},{"$error":"#N/A"},{"$error":"#N/A"}]
[3,15,{"$f":"IF(OR(A181=B181,A181>COUNTA(teams),B181>COUNTA(teams)),0,1)","v":0},{"$f":"IF(C181=0,0,IF(NOT(OR(ISBLANK(F181),ISBLANK(G181),ISBLANK(I181))),2,1))","v":0},{"$f":"IF(AND(D181=2,ISNUMBER(K181),ISNUMBER(L181)),1,0)","v":0},null,{"$f":"IF(C181=0,\"\",VLOOKUP(A181,team_vlgnrs,2,FALSE))","v":""},"-",{"$f":"IF(C181=0,\"\",VLOOKUP(B181,team_vlgnrs,2,FALSE))","v":""},null,null,null,null,{"$error":"#N/A"},{"$error":"#N/A"},{"$f":"IF(AND(VLOOKUP(G181,I$27:K$46,2,0)=1,VLOOKUP(I181,I$27:K$46,2,0)=1),0,IF(AND(VLOOKUP(G181,I$27:K$46,2,0)=0,VLOOKUP(I181,I$27:K$46,2,0)=0),0,VLOOKUP(G181,I$27:K$46,2,0)))","v":{"$error":"#N/A"}},{"$f":"IF(AND(VLOOKUP(G181,I$27:K$46,2,0)=1,VLOOKUP(I181,I$27:K$46,2,0)=1),0,IF(AND(VLOOKUP(G181,I$27:K$46,2,0)=0,VLOOKUP(I181,I$27:K$46,2,0)=0),0,VLOOKUP(I181,I$27:K$46,2,0)))","v":{"$error":"#N/A"}}]
[3,16,0,0,0,null,"","-","",null,null,null,null,{"$error":"#N/A"},{"$error":"#N/A"},{"$error":"#N/A"},{"$error":"#N/A"}]
[3,17,0,0,0,null,"","-","",null,null,null,null,{"$error":"#N/A"},{"$error":"#N/A"},{"$error":"#N/A"},{"$error":"#N/A"}]
[3,18,0,0,0,null,"","-","",null,null,null,null,{"$error":"#N/A"},{"$error":"#N/A"},{"$error":"#N/A"},{"$error":"#N/A"}]
[3,19,0,0,0,null,"","-","",null,null,null,null,{"$error":"#N/A"},{"$error":"#N/A"},{"$error":"#N/A"},{"$error":"#N/A"}]
[3,20,0,0,0,null,"","-","",null,null,null,null,{"$error":"#N/A"},{"$error":"#N/A"},{"$error":"#N/A"},{"$error":"#N/A"}]
[3,13,0,0,0,null,"","-","",null,null,null,null,{"$error":"#N/A"},{"$error":"#N/A"},{"$error":"#N/A"},{"$error":"#N/A"}]
[3,14,0,0,0,null,"","-","",null,null,null,null,{"$error":"#N/A"},{"$error":"#N/A"},{"$error":"#N/A"},{"$error":"#N/A"}]
[3,12,0,0,0,null,"","-","",null,null,null,null,{"$error":"#N/A"},{"$error":"#N/A"},{"$error":"#N/A"},{"$error":"#N/A"}]
[4,15,0,0,0,null,"","-","",null,null,null,null,{"$error":"#N/A"},{"$error":"#N/A"},{"$error":"#N/A"},{"$error":"#N/A"}]
[4,16,0,0,0,null,"","-","",null,null,null,null,{"$error":"#N/A"},{"$error":"#N/A"},{"$error":"#N/A"},{"$error":"#N/A"}]
[4,17,0,0,0,null,"","-","",null,null,null,null,{"$error":"#N/A"},{"$error":"#N/A"},{"$error":"#N/A"},{"$error":"#N/A"}]
[4,18,0,0,0,null,"","-","",null,null,null,null,{"$error":"#N/A"},{"$error":"#N/A"},{"$error":"#N/A"},{"$error":"#N/A"}]
[4,19,0,0,0,null,"","-","",null,null,null,null,{"$error":"#N/A"},{"$error":"#N/A"},{"$error":"#N/A"},{"$error":"#N/A"}]
[4,20,0,0,0,null,"","-","",null,null,null,null,{"$error":"#N/A"},{"$error":"#N/A"},{"$error":"#N/A"},{"$error":"#N/A"}]
[4,12,0,0,0,null,"","-","",null,null,null,null,{"$error":"#N/A"},{"$error":"#N/A"},{"$error":"#N/A"},{"$error":"#N/A"}]
[4,14,0,0,0,null,"","-","",null,null,null,null,{"$error":"#N/A"},{"$error":"#N/A"},{"$error":"#N/A"},{"$error":"#N/A"}]
[4,13,0,0,0,null,"","-","",null,null,null,null,{"$error":"#N/A"},{"$error":"#N/A"},{"$error":"#N/A"},{"$error":"#N/A"}]
[5,15,0,0,0,null,"","-","",null,null,null,null,{"$error":"#N/A"},{"$error":"#N/A"},{"$error":"#N/A"},{"$error":"#N/A"}]
[5,16,0,0,0,null,"","-","",null,null,null,null,{"$error":"#N/A"},{"$error":"#N/A"},{"$error":"#N/A"},{"$error":"#N/A"}]
[5,17,0,0,0,null,"","-","",null,null,null,null,{"$error":"#N/A"},{"$error":"#N/A"},{"$error":"#N/A"},{"$error":"#N/A"}]
[5,18,0,0,0,null,"","-","",null,null,null,null,{"$error":"#N/A"},{"$error":"#N/A"},{"$error":"#N/A"},{"$error":"#N/A"}]
[5,19,0,0,0,null,"","-","",null,null,null,null,{"$error":"#N/A"},{"$error":"#N/A"},{"$error":"#N/A"},{"$error":"#N/A"}]
[5,20,0,0,0,null,"","-","",null,null,null,null,{"$error":"#N/A"},{"$error":"#N/A"},{"$error":"#N/A"},{"$error":"#N/A"}]
[5,14,0,0,0,null,"","-","",null,null,null,null,{"$error":"#N/A"},{"$error":"#N/A"},{"$error":"#N/A"},{"$error":"#N/A"}]
[5,12,0,0,0,null,"","-","",null,null,null,null,{"$error":"#N/A"},{"$error":"#N/A"},{"$error":"#N/A"},{"$error":"#N/A"}]
[5,13,0,0,0,null,"","-","",null,null,null,null,{"$error":"#N/A"},{"$error":"#N/A"},{"$error":"#N/A"},{"$error":"#N/A"}]
[6,15,0,0,0,null,"","-","",null,null,null,null,{"$error":"#N/A"},{"$error":"#N/A"},{"$error":"#N/A"},{"$error":"#N/A"}]
[6,16,0,0,0,null,"","-","",null,null,null,null,{"$error":"#N/A"},{"$error":"#N/A"},{"$error":"#N/A"},{"$error":"#N/A"}]
[6,17,0,0,0,null,"","-","",null,null,null,null,{"$error":"#N/A"},{"$error":"#N/A"},{"$error":"#N/A"},{"$error":"#N/A"}]
[6,18,0,0,0,null,"","-","",null,null,null,null,{"$error":"#N/A"},{"$error":"#N/A"},{"$error":"#N/A"},{"$error":"#N/A"}]
[6,19,0,0,0,null,"","-","",null,null,null,null,{"$error":"#N/A"},{"$error":"#N/A"},{"$error":"#N/A"},{"$error":"#N/A"}]
[6,20,0,0,0,null,"","-","",null,null,null,null,{"$error":"#N/A"},{"$error":"#N/A"},{"$error":"#N/A"},{"$error":"#N/A"}]
[6,13,0,0,0,null,"","-","",null,null,null,null,{"$error":"#N/A"},{"$error":"#N/A"},{"$error":"#N/A"},{"$error":"#N/A"}]
[6,12,0,0,0,null,"","-","",null,null,null,null,{"$error":"#N/A"},{"$error":"#N/A"},{"$error":"#N/A"},{"$error":"#N/A"}]
[6,14,0,0,0,null,"","-","",null,null,null,null,{"$error":"#N/A"},{"$error":"#N/A"},{"$error":"#N/A"},{"$error":"#N/A"}]
[7,15,0,0,0,null,"","-","",null,null,null,null,{"$error":"#N/A"},{"$error":"#N/A"},{"$error":"#N/A"},{"$error":"#N/A"}]
[7,16,0,0,0,null,"","-","",null,null,null,null,{"$error":"#N/A"},{"$error":"#N/A"},{"$error":"#N/A"},{"$error":"#N/A"}]
[7,17,0,0,0,null,"","-","",null,null,null,null,{"$error":"#N/A"},{"$error":"#N/A"},{"$error":"#N/A"},{"$error":"#N/A"}]
[7,18,0,0,0,null,"","-","",null,null,null,null,{"$error":"#N/A"},{"$error":"#N/A"},{"$error":"#N/A"},{"$error":"#N/A"}]
[7,19,0,0,0,null,"","-","",null,null,null,null,{"$error":"#N/A"},{"$error":"#N/A"},{"$error":"#N/A"},{"$error":"#N/A"}]
[7,20,0,0,0,null,"","-","",null,null,null,null,{"$error":"#N/A"},{"$error":"#N/A"},{"$error":"#N/A"},{"$error":"#N/A"}]
[7,12,0,0,0,null,"","-","",null,null,null,null,{"$error":"#N/A"},{"$error":"#N/A"},{"$error":"#N/A"},{"$error":"#N/A"}]
[7,13,0,0,0,null,"","-","",null,null,null,null,{"$error":"#N/A"},{"$error":"#N/A"},{"$error":"#N/A"},{"$error":"#N/A"}]
[7,14,0,0,0,null,"","-","",null,null,null,null,{"$error":"#N/A"},{"$error":"#N/A"},{"$error":"#N/A"},{"$error":"#N/A"}]
[8,15,0,0,0,null,"","-","",null,null,null,null,{"$error":"#N/A"},{"$error":"#N/A"},{"$error":"#N/A"},{"$error":"#N/A"}]
[8,16,0,0,0,null,"","-","",null,null,null,null,{"$f":"IF(AND(K227=2,L227=0),3,K227)+P227","v":{"$error":"#N/A"}},{"$f":"IF(AND(L227=2,K227=0),3,L227)+Q227","v":{"$error":"#N/A"}},{"$error":"#N/A"},{"$error":"#N/A"}]
[8,17,0,0,0,null,"","-","",null,null,null,null,{"$error":"#N/A"},{"$error":"#N/A"},{"$error":"#N/A"},{"$error":"#N/A"}]
[8,18,0,0,0,null,"","-","",null,null,null,null,{"$error":"#N/A"},{"$error":"#N/A"},{"$error":"#N/A"},{"$error":"#N/A"}]
[8,19,0,0,0,null,"","-","",null,null,null,null,{"$error":"#N/A"},{"$error":"#N/A"},{"$error":"#N/A"},{"$error":"#N/A"}]
[8,20,0,0,0,null,"","-","",null,null,null,null,{"$error":"#N/A"},{"$error":"#N/A"},{"$error":"#N/A"},{"$error":"#N/A"}]
[8,14,0,0,0,null,"","-","",null,null,null,null,{"$error":"#N/A"},{"$error":"#N/A"},{"$error":"#N/A"},{"$error":"#N/A"}]
[8,13,0,0,0,null,"","-","",null,null,null,null,{"$error":"#N/A"},{"$error":"#N/A"},{"$error":"#N/A"},{"$error":"#N/A"}]
[8,12,0,0,0,null,"","-","",null,null,null,null,{"$error":"#N/A"},{"$error":"#N/A"},{"$error":"#N/A"},{"$error":"#N/A"}]
[9,15,0,0,0,null,"","-","",null,null,null,null,{"$error":"#N/A"},{"$error":"#N/A"},{"$error":"#N/A"},{"$error":"#N/A"}]
[9,16,0,0,0,null,"","-","",null,null,null,null,{"$error":"#N/A"},{"$error":"#N/A"},{"$error":"#N/A"},{"$error":"#N/A"}]
[9,17,0,0,0,null,"","-","",null,null,null,null,{"$error":"#N/A"},{"$error":"#N/A"},{"$error":"#N/A"},{"$error":"#N/A"}]
[9,18,0,0,0,null,"","-","",null,null,null,null,{"$error":"#N/A"},{"$error":"#N/A"},{"$error":"#N/A"},{"$error":"#N/A"}]
[9,19,0,0,0,null,"","-","",null,null,null,null,{"$error":"#N/A"},{"$error":"#N/A"},{"$error":"#N/A"},{"$error":"#N/A"}]
[9,20,0,0,0,null,"","-","",null,null,null,null,{"$error":"#N/A"},{"$error":"#N/A"},{"$error":"#N/A"},{"$error":"#N/A"}]
[9,14,0,0,0,null,"","-","",null,null,null,null,{"$error":"#N/A"},{"$error":"#N/A"},{"$error":"#N/A"},{"$error":"#N/A"}]
[9,13,0,0,0,null,"","-","",null,null,null,null,{"$error":"#N/A"},{"$error":"#N/A"},{"$error":"#N/A"},{"$error":"#N/A"}]
[9,12,0,0,0,null,"","-","",null,null,null,null,{"$error":"#N/A"},{"$error":"#N/A"},{"$error":"#N/A"},{"$error":"#N/A"}]
[10,15,0,0,0,null,"","-","",null,null,null,null,{"$error":"#N/A"},{"$error":"#N/A"},{"$error":"#N/A"},{"$error":"#N/A"}]
[10,16,{"$f":"IF(OR(A245=B245,A245>COUNTA(teams),B245>COUNTA(teams)),0,1)","v":0},{"$f":"IF(C245=0,0,IF(NOT(OR(ISBLANK(F245),ISBLANK(G245),ISBLANK(I245))),2,1))","v":0},{"$f":"IF(AND(D245=2,ISNUMBER(K245),ISNUMBER(L245)),1,0)","v":0},null,{"$f":"IF(C245=0,\"\",VLOOKUP(A245,team_vlgnrs,2,FALSE))","v":""},"-",{"$f":"IF(C245=0,\"\",VLOOKUP(B245,team_vlgnrs,2,FALSE))","v":""},null,null,null,null,{"$error":"#N/A"},{"$error":"#N/A"},{"$f":"IF(AND(VLOOKUP(G245,I$27:K$46,2,0)=1,VLOOKUP(I245,I$27:K$46,2,0)=1),0,IF(AND(VLOOKUP(G245,I$27:K$46,2,0)=0,VLOOKUP(I245,I$27:K$46,2,0)=0),0,VLOOKUP(G245,I$27:K$46,2,0)))","v":{"$error":"#N/A"}},{"$f":"IF(AND(VLOOKUP(G245,I$27:K$46,2,0)=1,VLOOKUP(I245,I$27:K$46,2,0)=1),0,IF(AND(VLOOKUP(G245,I$27:K$46,2,0)=0,VLOOKUP(I245,I$27:K$46,2,0)=0),0,VLOOKUP(I245,I$27:K$46,2,0)))","v":{"$error":"#N/A"}}]
[10,17,0,0,0,null,"","-","",null,null,null,null,{"$error":"#N/A"},{"$error":"#N/A"},{"$error":"#N/A"},{"$error":"#N/A"}]
[10,18,0,0,0,null,"","-","",null,null,null,null,{"$error":"#N/A"},{"$error":"#N/A"},{"$error":"#N/A"},{"$error":"#N/A"}]
[10,19,0,0,0,null,"","-","",null,null,null,null,{"$error":"#N/A"},{"$error":"#N/A"},{"$error":"#N/A"},{"$error":"#N/A"}]
[10,20,0,0,0,null,"","-","",null,null,null,null,{"$error":"#N/A"},{"$error":"#N/A"},{"$error":"#N/A"},{"$error":"#N/A"}]
[10,13,0,0,0,null,"","-","",null,null,null,null,{"$error":"#N/A"},{"$error":"#N/A"},{"$error":"#N/A"},{"$error":"#N/A"}]
[10,14,0,0,0,null,"","-","",null,null,null,null,{"$error":"#N/A"},{"$error":"#N/A"},{"$error":"#N/A"},{"$error":"#N/A"}]
[10,12,0,0,0,null,"","-","",null,null,null,null,{"$error":"#N/A"},{"$error":"#N/A"},{"$error":"#N/A"},{"$error":"#N/A"}]
[11,15,0,0,0,null,"","-","",null,null,null,null,{"$error":"#N/A"},{"$error":"#N/A"},{"$error":"#N/A"},{"$error":"#N/A"}]
[11,16,0,0,0,null,"","-","",null,null,null,null,{"$error":"#N/A"},{"$error":"#N/A"},{"$error":"#N/A"},{"$error":"#N/A"}]
[11,17,0,0,0,null,"","-","",null,null,null,null,{"$error":"#N/A"},{"$error":"#N/A"},{"$error":"#N/A"},{"$error":"#N/A"}]
[11,18,0,0,0,null,"","-","",null,null,null,null,{"$error":"#N/A"},{"$error":"#N/A"},{"$error":"#N/A"},{"$error":"#N/A"}]
[11,19,0,0,0,null,"","-","",null,null,null,null,{"$error":"#N/A"},{"$error":"#N/A"},{"$error":"#N/A"},{"$error":"#N/A"}]
[11,20,0,0,0,null,"","-","",null,null,null,null,{"$error":"#N/A"},{"$error":"#N/A"},{"$error":"#N/A"},{"$error":"#N/A"}]
[11,14,0,0,0,null,"","-","",null,null,null,null,{"$error":"#N/A"},{"$error":"#N/A"},{"$error":"#N/A"},{"$error":"#N/A"}]
[11,12,0,0,0,null,"","-","",null,null,null,null,{"$error":"#N/A"},{"$error":"#N/A"},{"$error":"#N/A"},{"$error":"#N/A"}]
[11,13,0,0,0,null,"","-","",null,null,null,null,{"$error":"#N/A"},{"$error":"#N/A"},{"$error":"#N/A"},{"$error":"#N/A"}]
[12,15,0,0,0,null,"","-","",null,2,0,null,{"$error":"#N/A"},{"$error":"#N/A"},{"$error":"#N/A"},{"$error":"#N/A"}]
[12,16,0,0,0,null,"","-","",null,null,null,null,{"$error":"#N/A"},{"$error":"#N/A"},{"$error":"#N/A"},{"$error":"#N/A"}]
[12,17,0,0,0,null,"","-","",null,null,null,null,{"$error":"#N/A"},{"$error":"#N/A"},{"$error":"#N/A"},{"$error":"#N/A"}]
[12,18,0,0,0,null,"","-","",null,null,null,null,{"$error":"#N/A"},{"$error":"#N/A"},{"$error":"#N/A"},{"$error":"#N/A"}]
[12,19,0,0,0,null,"","-","",null,null,null,null,{"$error":"#N/A"},{"$error":"#N/A"},{"$error":"#N/A"},{"$error":"#N/A"}]
[12,20,0,0,0,null,"","-","",null,null,null,null,{"$error":"#N/A"},{"$error":"#N/A"},{"$error":"#N/A"},{"$error":"#N/A"}]
[12,11,0,0,0,null,"","-","",null,null,null,null,{"$error":"#N/A"},{"$error":"#N/A"},{"$error":"#N/A"},{"$error":"#N/A"}]
[12,6,0,0,0,null,"","-","",null,null,null,null,{"$error":"#N/A"},{"$error":"#N/A"},{"$error":"#N/A"},{"$error":"#N/A"}]
[12,9,0,0,0,null,"","-","",null,null,null,null,{"$error":"#N/A"},{"$error":"#N/A"},{"$error":"#N/A"},{"$error":"#N/A"}]
[12,3,0,0,0,null,"","-","",null,null,null,null,{"$error":"#N/A"},{"$error":"#N/A"},{"$error":"#N/A"},{"$error":"#N/A"}]
[12,10,0,0,0,null,"","-","",null,null,null,null,{"$error":"#N/A"},{"$error":"#N/A"},{"$error":"#N/A"},{"$error":"#N/A"}]
[12,8,0,0,0,null,"","-","",null,null,null,null,{"$error":"#N/A"},{"$error":"#N/A"},{"$error":"#N/A"},{"$error":"#N/A"}]
[12,13,0,0,0,null,"","-","",null,null,null,null,{"$error":"#N/A"},{"$error":"#N/A"},{"$error":"#N/A"},{"$error":"#N/A"}]
[12,4,0,0,0,null,"","-","",null,null,null,null,{"$error":"#N/A"},{"$error":"#N/A"},{"$error":"#N/A"},{"$error":"#N/A"}]
[12,5,0,0,0,null,"","-","",null,null,null,null,{"$error":"#N/A"},{"$error":"#N/A"},{"$error":"#N/A"},{"$error":"#N/A"}]
[12,2,0,0,0,null,"","-","",null,null,null,null,{"$error":"#N/A"},{"$error":"#N/A"},{"$error":"#N/A"},{"$error":"#N/A"}]
[12,14,0,0,0,null,"","-","",null,null,null,null,{"$error":"#N/A"},{"$error":"#N/A"},{"$error":"#N/A"},{"$error":"#N/A"}]
[12,7,0,0,0,null,"","-","",null,null,null,null,{"$error":"#N/A"},{"$error":"#N/A"},{"$error":"#N/A"},{"$error":"#N/A"}]
[12,1,0,0,0,null,"","-","",null,null,null,null,{"$error":"#N/A"},{"$error":"#N/A"},{"$error":"#N/A"},{"$error":"#N/A"}]
[13,15,0,0,0,null,"","-","",null,null,null,null,{"$error":"#N/A"},{"$error":"#N/A"},{"$error":"#N/A"},{"$error":"#N/A"}]
[13,16,0,0,0,null,"","-","",null,null,null,null,{"$error":"#N/A"},{"$error":"#N/A"},{"$error":"#N/A"},{"$error":"#N/A"}]
[13,17,0,0,0,null,"","-","",null,null,null,null,{"$error":"#N/A"},{"$error":"#N/A"},{"$error":"#N/A"},{"$error":"#N/A"}]
[13,18,0,0,0,null,"","-","",null,null,null,null,{"$error":"#N/A"},{"$error":"#N/A"},{"$error":"#N/A"},{"$error":"#N/A"}]
[13,19,0,0,0,null,"","-","",null,null,null,null,{"$error":"#N/A"},{"$error":"#N/A"},{"$error":"#N/A"},{"$error":"#N/A"}]
[13,20,0,0,0,null,"","-","",null,null,null,null,{"$error":"#N/A"},{"$error":"#N/A"},{"$error":"#N/A"},{"$error":"#N/A"}]
[13,8,0,0,0,null,"","-","",null,null,null,null,{"$error":"#N/A"},{"$error":"#N/A"},{"$error":"#N/A"},{"$error":"#N/A"}]
[13,5,0,0,0,null,"","-","",null,null,null,null,{"$error":"#N/A"},{"$error":"#N/A"},{"$error":"#N/A"},{"$error":"#N/A"}]
[13,11,0,0,0,null,"","-","",null,null,null,null,{"$error":"#N/A"},{"$error":"#N/A"},{"$error":"#N/A"},{"$error":"#N/A"}]
[13,2,0,0,0,null,"","-","",null,null,null,null,{"$error":"#N/A"},{"$error":"#N/A"},{"$error":"#N/A"},{"$error":"#N/A"}]
[13,14,0,0,0,null,"","-","",null,null,null,null,{"$f":"IF(AND(K291=2,L291=0),3,K291)+P291","v":{"$error":"#N/A"}},{"$f":"IF(AND(L291=2,K291=0),3,L291)+Q291","v":{"$error":"#N/A"}},{"$error":"#N/A"},{"$error":"#N/A"}]
[13,4,0,0,0,null,"","-","",null,null,null,null,{"$error":"#N/A"},{"$error":"#N/A"},{"$error":"#N/A"},{"$error":"#N/A"}]
[13,9,0,0,0,null,"","-","",null,null,null,null,{"$error":"#N/A"},{"$error":"#N/A"},{"$error":"#N/A"},{"$error":"#N/A"}]
[13,3,0,0,0,null,"","-","",null,null,null,null,{"$error":"#N/A"},{"$error":"#N/A"},{"$error":"#N/A"},{"$error":"#N/A"}]
[13,6,0,0,0,null,"","-","",null,null,null,null,{"$error":"#N/A"},{"$error":"#N/A"},{"$error":"#N/A"},{"$error":"#N/A"}]
[13,7,0,0,0,null,"","-","",null,null,null,null,{"$error":"#N/A"},{"$error":"#N/A"},{"$error":"#N/A"},{"$error":"#N/A"}]
[13,12,0,0,0,null,"","-","",null,null,null,null,{"$error":"#N/A"},{"$error":"#N/A"},{"$error":"#N/A"},{"$error":"#N/A"}]
[13,1,0,0,0,null,"","-","",null,null,null,null,{"$error":"#N/A"},{"$error":"#N/A"},{"$error":"#N/A"},{"$error":"#N/A"}]
[13,10,0,0,0,null,"","-","",null,null,null,null,{"$error":"#N/A"},{"$error":"#N/A"},{"$error":"#N/A"},{"$error":"#N/A"}]
[14,15,0,0,0,null,"","-","",null,null,null,null,{"$error":"#N/A"},{"$error":"#N/A"},{"$error":"#N/A"},{"$error":"#N/A"}]
[14,16,0,0,0,null,"","-","",null,null,null,null,{"$error":"#N/A"},{"$error":"#N/A"},{"$error":"#N/A"},{"$error":"#N/A"}]
[14,17,0,0,0,null,"","-","",null,null,null,null,{"$error":"#N/A"},{"$error":"#N/A"},{"$error":"#N/A"},{"$error":"#N/A"}]
[14,18,0,0,0,null,"","-","",null,null,null,null,{"$error":"#N/A"},{"$error":"#N/A"},{"$error":"#N/A"},{"$error":"#N/A"}]
[14,19,0,0,0,null,"","-","",null,null,null,null,{"$error":"#N/A"},{"$error":"#N/A"},{"$error":"#N/A"},{"$error":"#N/A"}]
[14,20,0,0,0,null,"","-","",null,null,null,null,{"$error":"#N/A"},{"$error":"#N/A"},{"$error":"#N/A"},{"$error":"#N/A"}]
[14,3,0,0,0,null,"","-","",null,null,null,null,{"$error":"#N/A"},{"$error":"#N/A"},{"$error":"#N/A"},{"$error":"#N/A"}]
[14,11,0,0,0,null,"","-","",null,null,null,null,{"$error":"#N/A"},{"$error":"#N/A"},{"$error":"#N/A"},{"$error":"#N/A"}]
[14,1,0,0,0,null,"","-","",null,null,null,null,{"$error":"#N/A"},{"$error":"#N/A"},{"$error":"#N/A"},{"$error":"#N/A"}]
[14,6,{"$f":"IF(OR(A309=B309,A309>COUNTA(teams),B309>COUNTA(teams)),0,1)","v":0},{"$f":"IF(C309=0,0,IF(NOT(OR(ISBLANK(F309),ISBLANK(G309),ISBLANK(I309))),2,1))","v":0},{"$f":"IF(AND(D309=2,ISNUMBER(K309),ISNUMBER(L309)),1,0)","v":0},null,{"$f":"IF(C309=0,\"\",VLOOKUP(A309,team_vlgnrs,2,FALSE))","v":""},"-",{"$f":"IF(C309=0,\"\",VLOOKUP(B309,team_vlgnrs,2,FALSE))","v":""},null,null,null,null,{"$error":"#N/A"},{"$error":"#N/A"},{"$f":"IF(AND(VLOOKUP(G309,I$27:K$46,2,0)=1,VLOOKUP(I309,I$27:K$46,2,0)=1),0,IF(AND(VLOOKUP(G309,I$27:K$46,2,0)=0,VLOOKUP(I309,I$27:K$46,2,0)=0),0,VLOOKUP(G309,I$27:K$46,2,0)))","v":{"$error":"#N/A"}},{"$f":"IF(AND(VLOOKUP(G309,I$27:K$46,2,0)=1,VLOOKUP(I309,I$27:K$46,2,0)=1),0,IF(AND(VLOOKUP(G309,I$27:K$46,2,0)=0,VLOOKUP(I309,I$27:K$46,2,0)=0),0,VLOOKUP(I309,I$27:K$46,2,0)))","v":{"$error":"#N/A"}}]
[14,7,0,0,0,null,"","-","",null,null,null,null,{"$error":"#N/A"},{"$error":"#N/A"},{"$error":"#N/A"},{"$error":"#N/A"}]
[14,2,0,0,0,null,"","-","",null,null,null,null,{"$error":"#N/A"},{"$error":"#N/A"},{"$error":"#N/A"},{"$error":"#N/A"}]
[14,12,0,0,0,null,"","-","",null,null,null,null,{"$error":"#N/A"},{"$error":"#N/A"},{"$error":"#N/A"},{"$error":"#N/A"}]
[14,5,0,0,0,null,"","-","",null,null,null,null,{"$error":"#N/A"},{"$error":"#N/A"},{"$error":"#N/A"},{"$error":"#N/A"}]
[14,8,0,0,0,null,"","-","",null,null,null,null,{"$error":"#N/A"},{"$error":"#N/A"},{"$error":"#N/A"},{"$error":"#N/A"}]
[14,13,0,0,0,null,"","-","",null,null,null,null,{"$error":"#N/A"},{"$error":"#N/A"},{"$error":"#N/A"},{"$error":"#N/A"}]
[14,9,0,0,0,null,"","-","",null,null,null,null,{"$error":"#N/A"},{"$error":"#N/A"},{"$error":"#N/A"},{"$error":"#N/A"}]
[14,10,0,0,0,null,"","-","",null,null,null,null,{"$error":"#N/A"},{"$error":"#N/A"},{"$error":"#N/A"},{"$error":"#N/A"}]
[14,4,0,0,0,null,"","-","",null,null,null,null,{"$error":"#N/A"},{"$error":"#N/A"},{"$error":"#N/A"},{"$error":"#N/A"}]
[15,1,0,0,0,null,"","-","",null,null,null,null,{"$error":"#N/A"},{"$error":"#N/A"},{"$error":"#N/A"},{"$error":"#N/A"}]
[15,2,0,0,0,null,"","-","",null,null,null,null,{"$error":"#N/A"},{"$error":"#N/A"},{"$error":"#N/A"},{"$error":"#N/A"}]
[15,3,0,0,0,null,"","-","",null,null,null,null,{"$error":"#N/A"},{"$error":"#N/A"},{"$error":"#N/A"},{"$error":"#N/A"}]
[15,4,0,0,0,null,"","-","",null,null,null,null,{"$error":"#N/A"},{"$error":"#N/A"},{"$error":"#N/A"},{"$error":"#N/A"}]
[15,5,0,0,0,null,"","-","",null,null,null,null,{"$error":"#N/A"},{"$error":"#N/A"},{"$error":"#N/A"},{"$error":"#N/A"}]
[15,6,0,0,0,null,"","-","",null,null,null,null,{"$error":"#N/A"},{"$error":"#N/A"},{"$error":"#N/A"},{"$error":"#N/A"}]
[15,7,0,0,0,null,"","-","",null,null,null,null,{"$error":"#N/A"},{"$error":"#N/A"},{"$error":"#N/A"},{"$error":"#N/A"}]
[15,8,0,0,0,null,"","-","",null,null,null,null,{"$error":"#N/A"},{"$error":"#N/A"},{"$error":"#N/A"},{"$error":"#N/A"}]
[15,9,0,0,0,null,"","-","",null,null,null,null,{"$error":"#N/A"},{"$error":"#N/A"},{"$error":"#N/A"},{"$error":"#N/A"}]
[15,10,0,0,0,null,"","-","",null,null,null,null,{"$error":"#N/A"},{"$error":"#N/A"},{"$error":"#N/A"},{"$error":"#N/A"}]
[15,11,0,0,0,null,"","-","",null,null,null,null,{"$error":"#N/A"},{"$error":"#N/A"},{"$error":"#N/A"},{"$error":"#N/A"}]
[15,12,0,0,0,null,"","-","",null,null,null,null,{"$error":"#N/A"},{"$error":"#N/A"},{"$error":"#N/A"},{"$error":"#N/A"}]
[15,13,0,0,0,null,"","-","",null,null,null,null,{"$error":"#N/A"},{"$error":"#N/A"},{"$error":"#N/A"},{"$error":"#N/A"}]
[15,14,0,0,0,null,"","-","",null,null,null,null,{"$error":"#N/A"},{"$error":"#N/A"},{"$error":"#N/A"},{"$error":"#N/A"}]
[15,16,0,0,0,null,"","-","",null,null,null,null,{"$error":"#N/A"},{"$error":"#N/A"},{"$error":"#N/A"},{"$error":"#N/A"}]
[15,17,0,0,0,null,"","-","",null,null,null,null,{"$error":"#N/A"},{"$error":"#N/A"},{"$error":"#N/A"},{"$error":"#N/A"}]
[15,18,0,0,0,null,"","-","",null,null,null,null,{"$error":"#N/A"},{"$error":"#N/A"},{"$error":"#N/A"},{"$error":"#N/A"}]
[15,19,0,0,0,null,"","-","",null,null,null,null,{"$error":"#N/A"},{"$error":"#N/A"},{"$error":"#N/A"},{"$error":"#N/A"}]
[15,20,0,0,0,null,"","-","",null,null,null,null,{"$error":"#N/A"},{"$error":"#N/A"},{"$error":"#N/A"},{"$error":"#N/A"}]
[16,13,0,0,0,null,"","-","",null,null,null,null,{"$error":"#N/A"},{"$error":"#N/A"},{"$error":"#N/A"},{"$error":"#N/A"}]
[16,1,0,0,0,null,"","-","",null,null,null,null,{"$error":"#N/A"},{"$error":"#N/A"},{"$error":"#N/A"},{"$error":"#N/A"}]
[16,2,0,0,0,null,"","-","",null,null,null,null,{"$error":"#N/A"},{"$error":"#N/A"},{"$error":"#N/A"},{"$error":"#N/A"}]
[16,3,0,0,0,null,"","-","",null,null,null,null,{"$error":"#N/A"},{"$error":"#N/A"},{"$error":"#N/A"},{"$error":"#N/A"}]
[16,4,0,0,0,null,"","-","",null,null,null,null,{"$error":"#N/A"},{"$error":"#N/A"},{"$error":"#N/A"},{"$error":"#N/A"}]
[16,5,0,0,0,null,"","-","",null,null,null,null,{"$error":"#N/A"},{"$error":"#N/A"},{"$error":"#N/A"},{"$error":"#N/A"}]
[16,6,0,0,0,null,"","-","",null,null,null,null,{"$error":"#N/A"},{"$error":"#N/A"},{"$error":"#N/A"},{"$error":"#N/A"}]
[16,7,0,0,0,null,"","-","",null,null,null,null,{"$error":"#N/A"},{"$error":"#N/A"},{"$error":"#N/A"},{"$error":"#N/A"}]
[16,8,0,0,0,null,"","-","",null,null,null,null,{"$error":"#N/A"},{"$error":"#N/A"},{"$error":"#N/A"},{"$error":"#N/A"}]
[16,9,0,0,0,null,"","-","",null,null,null,null,{"$error":"#N/A"},{"$error":"#N/A"},{"$error":"#N/A"},{"$error":"#N/A"}]
[16,10,0,0,0,null,"","-","",null,null,null,null,{"$error":"#N/A"},{"$error":"#N/A"},{"$error":"#N/A"},{"$error":"#N/A"}]
[16,11,0,0,0,null,"","-","",null,null,null,null,{"$error":"#N/A"},{"$error":"#N/A"},{"$error":"#N/A"},{"$error":"#N/A"}]
[16,12,0,0,0,null,"","-","",null,null,null,null,{"$error":"#N/A"},{"$error":"#N/A"},{"$error":"#N/A"},{"$error":"#N/A"}]
[16,14,0,0,0,null,"","-","",null,null,null,null,{"$error":"#N/A"},{"$error":"#N/A"},{"$error":"#N/A"},{"$error":"#N/A"}]
[16,15,0,0,0,null,"","-","",null,null,null,null,{"$error":"#N/A"},{"$error":"#N/A"},{"$error":"#N/A"},{"$error":"#N/A"}]
[16,17,0,0,0,null,"","-","",null,null,null,null,{"$error":"#N/A"},{"$error":"#N/A"},{"$error":"#N/A"},{"$error":"#N/A"}]
[16,18,0,0,0,null,"","-","",null,null,null,null,{"$error":"#N/A"},{"$error":"#N/A"},{"$error":"#N/A"},{"$error":"#N/A"}]
[16,19,0,0,0,null,"","-","",null,null,null,null,{"$f":"IF(AND(K355=2,L355=0),3,K355)+P355","v":{"$error":"#N/A"}},{"$f":"IF(AND(L355=2,K355=0),3,L355)+Q355","v":{"$error":"#N/A"}},{"$error":"#N/A"},{"$error":"#N/A"}]
[16,20,0,0,0,null,"","-","",null,null,null,null,{"$error":"#N/A"},{"$error":"#N/A"},{"$error":"#N/A"},{"$error":"#N/A"}]
[17,1,0,0,0,null,"","-","",null,null,null,null,{"$error":"#N/A"},{"$error":"#N/A"},{"$error":"#N/A"},{"$error":"#N/A"}]
[17,2,0,0,0,null,"","-","",null,null,null,null,{"$error":"#N/A"},{"$error":"#N/A"},{"$error":"#N/A"},{"$error":"#N/A"}]
[17,3,0,0,0,null,"","-","",null,null,null,null,{"$error":"#N/A"},{"$error":"#N/A"},{"$error":"#N/A"},{"$error":"#N/A"}]
[17,4,0,0,0,null,"","-","",null,null,null,null,{"$error":"#N/A"},{"$error":"#N/A"},{"$error":"#N/A"},{"$error":"#N/A"}]
[17,5,0,0,0,null,"","-","",null,null,null,null,{"$error":"#N/A"},{"$error":"#N/A"},{"$error":"#N/A"},{"$error":"#N/A"}]
[17,6,0,0,0,null,"","-","",null,null,null,null,{"$error":"#N/A"},{"$error":"#N/A"},{"$error":"#N/A"},{"$error":"#N/A"}]
[17,7,0,0,0,null,"","-","",null,null,null,null,{"$error":"#N/A"},{"$error":"#N/A"},{"$error":"#N/A"},{"$error":"#N/A"}]
[17,8,0,0,0,null,"","-","",null,null,null,null,{"$error":"#N/A"},{"$error":"#N/A"},{"$error":"#N/A"},{"$error":"#N/A"}]
[17,9,0,0,0,null,"","-","",null,null,null,null,{"$error":"#N/A"},{"$error":"#N/A"},{"$error":"#N/A"},{"$error":"#N/A"}]
[17,10,0,0,0,null,"","-","",null,null,null,null,{"$error":"#N/A"},{"$error":"#N/A"},{"$error":"#N/A"},{"$error":"#N/A"}]
[17,11,0,0,0,null,"","-","",null,null,null,null,{"$error":"#N/A"},{"$error":"#N/A"},{"$error":"#N/A"},{"$error":"#N/A"}]
[17,12,0,0,0,null,"","-","",null,null,null,null,{"$error":"#N/A"},{"$error":"#N/A"},{"$error":"#N/A"},{"$error":"#N/A"}]
[17,13,0,0,0,null,"","-","",null,null,null,null,{"$error":"#N/A"},{"$error":"#N/A"},{"$error":"#N/A"},{"$error":"#N/A"}]
[17,14,0,0,0,null,"","-","",null,null,null,null,{"$error":"#N/A"},{"$error":"#N/A"},{"$error":"#N/A"},{"$error":"#N/A"}]
[17,15,0,0,0,null,"","-","",null,null,null,null,{"$error":"#N/A"},{"$error":"#N/A"},{"$error":"#N/A"},{"$error":"#N/A"}]
[17,16,0,0,0,null,"","-","",null,null,null,null,{"$error":"#N/A"},{"$error":"#N/A"},{"$error":"#N/A"},{"$error":"#N/A"}]
[17,18,{"$f":"IF(OR(A373=B373,A373>COUNTA(teams),B373>COUNTA(teams)),0,1)","v":0},{"$f":"IF(C373=0,0,IF(NOT(OR(ISBLANK(F373),ISBLANK(G373),ISBLANK(I373))),2,1))","v":0},{"$f":"IF(AND(D373=2,ISNUMBER(K373),ISNUMBER(L373)),1,0)","v":0},null,{"$f":"IF(C373=0,\"\",VLOOKUP(A373,team_vlgnrs,2,FALSE))","v":""},"-",{"$f":"IF(C373=0,\"\",VLOOKUP(B373,team_vlgnrs,2,FALSE))","v":""},null,null,null,null,{"$error":"#N/A"},{"$error":"#N/A"},{"$f":"IF(AND(VLOOKUP(G373,I$27:K$46,2,0)=1,VLOOKUP(I373,I$27:K$46,2,0)=1),0,IF(AND(VLOOKUP(G373,I$27:K$46,2,0)=0,VLOOKUP(I373,I$27:K$46,2,0)=0),0,VLOOKUP(G373,I$27:K$46,2,0)))","v":{"$error":"#N/A"}},{"$f":"IF(AND(VLOOKUP(G373,I$27:K$46,2,0)=1,VLOOKUP(I373,I$27:K$46,2,0)=1),0,IF(AND(VLOOKUP(G373,I$27:K$46,2,0)=0,VLOOKUP(I373,I$27:K$46,2,0)=0),0,VLOOKUP(I373,I$27:K$46,2,0)))","v":{"$error":"#N/A"}}]
[17,19,0,0,0,null,"","-","",null,null,null,null,{"$error":"#N/A"},{"$error":"#N/A"},{"$error":"#N/A"},{"$error":"#N/A"}]
[17,20,0,0,0,null,"","-","",null,null,null,null,{"$error":"#N/A"},{"$error":"#N/A"},{"$error":"#N/A"},{"$error":"#N/A"}]
[18,1,0,0,0,null,"","-","",null,null,null,null,{"$error":"#N/A"},{"$error":"#N/A"},{"$error":"#N/A"},{"$error":"#N/A"}]
[18,2,0,0,0,null,"","-","",null,null,null,null,{"$error":"#N/A"},{"$error":"#N/A"},{"$error":"#N/A"},{"$error":"#N/A"}]
[18,3,0,0,0,null,"","-","",null,null,null,null,{"$error":"#N/A"},{"$error":"#N/A"},{"$error":"#N/A"},{"$error":"#N/A"}]
[18,4,0,0,0,null,"","-","",null,null,null,null,{"$error":"#N/A"},{"$error":"#N/A"},{"$error":"#N/A"},{"$error":"#N/A"}]
[18,5,0,0,0,null,"","-","",null,null,null,null,{"$error":"#N/A"},{"$error":"#N/A"},{"$error":"#N/A"},{"$error":"#N/A"}]
[18,6,0,0,0,null,"","-","",null,null,null,null,{"$error":"#N/A"},{"$error":"#N/A"},{"$error":"#N/A"},{"$error":"#N/A"}]
[18,7,0,0,0,null,"","-","",null,null,null,null,{"$error":"#N/A"},{"$error":"#N/A"},{"$error":"#N/A"},{"$error":"#N/A"}]
[18,8,0,0,0,null,"","-","",null,null,null,null,{"$error":"#N/A"},{"$error":"#N/A"},{"$error":"#N/A"},{"$error":"#N/A"}]
[18,9,0,0,0,null,"","-","",null,null,null,null,{"$error":"#N/A"},{"$error":"#N/A"},{"$error":"#N/A"},{"$error":"#N/A"}]
[18,10,0,0,0,null,"","-","",null,null,null,null,{"$error":"#N/A"},{"$error":"#N/A"},{"$error":"#N/A"},{"$error":"#N/A"}]
[18,11,0,0,0,null,"","-","",null,null,null,null,{"$error":"#N/A"},{"$error":"#N/A"},{"$error":"#N/A"},{"$error":"#N/A"}]
[18,12,0,0,0,null,"","-","",null,null,null,null,{"$error":"#N/A"},{"$error":"#N/A"},{"$error":"#N/A"},{"$error":"#N/A"}]
[18,13,0,0,0,null,"","-","",null,null,null,null,{"$error":"#N/A"},{"$error":"#N/A"},{"$error":"#N/A"},{"$error":"#N/A"}]
[18,14,0,0,0,null,"","-","",null,null,null,null,{"$error":"#N/A"},{"$error":"#N/A"},{"$error":"#N/A"},{"$error":"#N/A"}]
[18,15,0,0,0,null,"","-","",null,null,null,null,{"$error":"#N/A"},{"$error":"#N/A"},{"$error":"#N/A"},{"$error":"#N/A"}]
[18,16,0,0,0,null,"","-","",null,null,null,null,{"$error":"#N/A"},{"$error":"#N/A"},{"$error":"#N/A"},{"$error":"#N/A"}]
[18,17,0,0,0,null,"","-","",null,null,null,null,{"$error":"#N/A"},{"$error":"#N/A"},{"$error":"#N/A"},{"$error":"#N/A"}]
[18,19,0,0,0,null,"","-","",null,null,null,null,{"$error":"#N/A"},{"$error":"#N/A"},{"$error":"#N/A"},{"$error":"#N/A"}]
[18,20,0,0,0,null,"","-","",null,null,null,null,{"$error":"#N/A"},{"$error":"#N/A"},{"$error":"#N/A"},{"$error":"#N/A"}]
[19,1,0,0,0,null,"","-","",null,null,null,null,{"$error":"#N/A"},{"$error":"#N/A"},{"$error":"#N/A"},{"$error":"#N/A"}]
[19,2,0,0,0,null,"","-","",null,null,null,null,{"$error":"#N/A"},{"$error":"#N/A"},{"$error":"#N/A"},{"$error":"#N/A"}]
[19,3,0,0,0,null,"","-","",null,null,null,null,{"$error":"#N/A"},{"$error":"#N/A"},{"$error":"#N/A"},{"$error":"#N/A"}]
[19,4,0,0,0,null,"","-","",null,null,null,null,{"$error":"#N/A"},{"$error":"#N/A"},{"$error":"#N/A"},{"$error":"#N/A"}]
[19,5,0,0,0,null,"","-","",null,null,null,null,{"$error":"#N/A"},{"$error":"#N/A"},{"$error":"#N/A"},{"$error":"#N/A"}]
[19,6,0,0,0,null,"","-","",null,null,null,null,{"$error":"#N/A"},{"$error":"#N/A"},{"$error":"#N/A"},{"$error":"#N/A"}]
[19,7,0,0,0,null,"","-","",null,null,null,null,{"$error":"#N/A"},{"$error":"#N/A"},{"$error":"#N/A"},{"$error":"#N/A"}]
[19,8,0,0,0,null,"","-","",null,null,null,null,{"$error":"#N/A"},{"$error":"#N/A"},{"$error":"#N/A"},{"$error":"#N/A"}]
[19,9,0,0,0,null,"","-","",null,null,null,null,{"$error":"#N/A"},{"$error":"#N/A"},{"$error":"#N/A"},{"$error":"#N/A"}]
[19,10,0,0,0,null,"","-","",null,null,null,null,{"$error":"#N/A"},{"$error":"#N/A"},{"$error":"#N/A"},{"$error":"#N/A"}]
[19,11,0,0,0,null,"","-","",null,null,null,null,{"$error":"#N/A"},{"$error":"#N/A"},{"$error":"#N/A"},{"$error":"#N/A"}]
[19,12,0,0,0,null,"","-","",null,null,null,null,{"$error":"#N/A"},{"$error":"#N/A"},{"$error":"#N/A"},{"$error":"#N/A"}]
[19,13,0,0,0,null,"","-","",null,null,null,null,{"$error":"#N/A"},{"$error":"#N/A"},{"$error":"#N/A"},{"$error":"#N/A"}]
[19,14,0,0,0,null,"","-","",null,null,null,null,{"$error":"#N/A"},{"$error":"#N/A"},{"$error":"#N/A"},{"$error":"#N/A"}]
[19,15,0,0,0,null,"","-","",null,null,null,null,{"$error":"#N/A"},{"$error":"#N/A"},{"$error":"#N/A"},{"$error":"#N/A"}]
[19,16,0,0,0,null,"","-","",null,null,null,null,{"$error":"#N/A"},{"$error":"#N/A"},{"$error":"#N/A"},{"$error":"#N/A"}]
[19,17,0,0,0,null,"","-","",null,null,null,null,{"$error":"#N/A"},{"$error":"#N/A"},{"$error":"#N/A"},{"$error":"#N/A"}]
[19,18,0,0,0,null,"","-","",null,null,null,null,{"$error":"#N/A"},{"$error":"#N/A"},{"$error":"#N/A"},{"$error":"#N/A"}]
[19,20,0,0,0,null,"","-","",null,null,null,null,{"$error":"#N/A"},{"$error":"#N/A"},{"$error":"#N/A"},{"$error":"#N/A"}]
[20,1,0,0,0,null,"","-","",null,null,null,null,{"$error":"#N/A"},{"$error":"#N/A"},{"$error":"#N/A"},{"$error":"#N/A"}]
[20,2,0,0,0,null,"","-","",null,null,null,null,{"$error":"#N/A"},{"$error":"#N/A"},{"$error":"#N/A"},{"$error":"#N/A"}]
[20,3,0,0,0,null,"","-","",null,null,null,null,{"$error":"#N/A"},{"$error":"#N/A"},{"$error":"#N/A"},{"$error":"#N/A"}]
[20,4,0,0,0,null,"","-","",null,null,null,null,{"$error":"#N/A"},{"$error":"#N/A"},{"$error":"#N/A"},{"$error":"#N/A"}]
[20,5,0,0,0,null,"","-","",null,null,null,null,{"$error":"#N/A"},{"$error":"#N/A"},{"$error":"#N/A"},{"$error":"#N/A"}]
[20,6,0,0,0,null,"","-","",null,null,null,null,{"$f":"IF(AND(K419=2,L419=0),3,K419)+P419","v":{"$error":"#N/A"}},{"$f":"IF(AND(L419=2,K419=0),3,L419)+Q419","v":{"$error":"#N/A"}},{"$error":"#N/A"},{"$error":"#N/A"}]
[20,7,0,0,0,null,"","-","",null,null,null,null,{"$error":"#N/A"},{"$error":"#N/A"},{"$error":"#N/A"},{"$error":"#N/A"}]
[20,8,0,0,0,null,"","-","",null,null,null,null,{"$error":"#N/A"},{"$error":"#N/A"},{"$error":"#N/A"},{"$error":"#N/A"}]
[20,9,0,0,0,null,"","-","",null,null,null,null,{"$error":"#N/A"},{"$error":"#N/A"},{"$error":"#N/A"},{"$error":"#N/A"}]
[20,10,0,0,0,null,"","-","",null,null,null,null,{"$error":"#N/A"},{"$error":"#N/A"},{"$error":"#N/A"},{"$error":"#N/A"}]
[20,11,0,0,0,null,"","-","",null,null,null,null,{"$error":"#N/A"},{"$error":"#N/A"},{"$error":"#N/A"},{"$error":"#N/A"}]
[20,12,0,0,0,null,"","-","",null,null,null,null,{"$error":"#N/A"},{"$error":"#N/A"},{"$error":"#N/A"},{"$error":"#N/A"}]
[20,13,0,0,0,null,"","-","",null,null,null,null,{"$error":"#N/A"},{"$error":"#N/A"},{"$error":"#N/A"},{"$error":"#N/A"}]
[20,14,0,0,0,null,"","-","",null,null,null,null,{"$error":"#N/A"},{"$error":"#N/A"},{"$error":"#N/A"},{"$error":"#N/A"}]
[20,15,0,0,0,null,"","-","",null,null,null,null,{"$error":"#N/A"},{"$error":"#N/A"},{"$error":"#N/A"},{"$error":"#N/A"}]
[20,16,0,0,0,null,"","-","",null,null,null,null,{"$error":"#N/A"},{"$error":"#N/A"},{"$error":"#N/A"},{"$error":"#N/A"}]
[20,17,0,0,0,null,"","-","",null,null,null,null,{"$error":"#N/A"},{"$error":"#N/A"},{"$error":"#N/A"},{"$error":"#N/A"}]
[20,18,0,0,0,null,"","-","",null,null,null,null,{"$error":"#N/A"},{"$error":"#N/A"},{"$error":"#N/A"},{"$error":"#N/A"}]
[20,19,0,0,0,null,"","-","",null,null,null,null,{"$error":"#N/A"},{"$error":"#N/A"},{"$error":"#N/A"},{"$error":"#N/A"}]
[1,1,0,0,0,null,"",null,"",null,null,null,null,{"$error":"#N/A"},{"$error":"#N/A"},{"$error":"#N/A"},{"$error":"#N/A"}]
[2,2,0,0,0,null,"",null,"",null,null,null,null,{"$error":"#N/A"},{"$error":"#N/A"},{"$error":"#N/A"},{"$error":"#N/A"}]
[3,3,0,0,0,null,"",null,"",null,null,null,null,{"$error":"#N/A"},{"$error":"#N/A"},{"$error":"#N/A"},{"$error":"#N/A"}]
[4,4,0,0,0,null,"",null,"",null,null,null,null,{"$error":"#N/A"},{"$error":"#N/A"},{"$error":"#N/A"},{"$error":"#N/A"}]
[5,5,{"$f":"IF(OR(A437=B437,A437>COUNTA(teams),B437>COUNTA(teams)),0,1)","v":0},{"$f":"IF(C437=0,0,IF(NOT(OR(ISBLANK(F437),ISBLANK(G437),ISBLANK(I437))),2,1))","v":0},{"$f":"IF(AND(D437=2,ISNUMBER(K437),ISNUMBER(L437)),1,0)","v":0},null,{"$f":"IF(C437=0,\"\",VLOOKUP(A437,team_vlgnrs,2,FALSE))","v":""},null,{"$f":"IF(C437=0,\"\",VLOOKUP(B437,team_vlgnrs,2,FALSE))","v":""},null,null,null,null,{"$error":"#N/A"},{"$error":"#N/A"},{"$f":"IF(AND(VLOOKUP(G437,I$27:K$46,2,0)=1,VLOOKUP(I437,I$27:K$46,2,0)=1),0,IF(AND(VLOOKUP(G437,I$27:K$46,2,0)=0,VLOOKUP(I437,I$27:K$46,2,0)=0),0,VLOOKUP(G437,I$27:K$46,2,0)))","v":{"$error":"#N/A"}},{"$f":"IF(AND(VLOOKUP(G437,I$27:K$46,2,0)=1,VLOOKUP(I437,I$27:K$46,2,0)=1),0,IF(AND(VLOOKUP(G437,I$27:K$46,2,0)=0,VLOOKUP(I437,I$27:K$46,2,0)=0),0,VLOOKUP(I437,I$27:K$46,2,0)))","v":{"$error":"#N/A"}}]
[6,6,0,0,0,null,"",null,"",null,null,null,null,{"$error":"#N/A"},{"$error":"#N/A"},{"$error":"#N/A"},{"$error":"#N/A"}]
[7,7,0,0,0,null,"",null,"",null,null,null,null,{"$error":"#N/A"},{"$error":"#N/A"},{"$error":"#N/A"},{"$error":"#N/A"}]
[8,8,0,0,0,null,"",null,"",null,null,null,null,{"$error":"#N/A"},{"$error":"#N/A"},{"$error":"#N/A"},{"$error":"#N/A"}]
[9,9,0,0,0,null,"",null,"",null,null,null,null,{"$error":"#N/A"},{"$error":"#N/A"},{"$error":"#N/A"},{"$error":"#N/A"}]
[10,10,0,0,0,null,"",null,"",null,null,null,null,{"$error":"#N/A"},{"$error":"#N/A"},{"$error":"#N/A"},{"$error":"#N/A"}]
[11,11,0,0,0,null,"",null,"",null,null,null,null,{"$error":"#N/A"},{"$error":"#N/A"},{"$error":"#N/A"},{"$error":"#N/A"}]
[12,12,0,0,0,null,"",null,"",null,null,null,null,{"$error":"#N/A"},{"$error":"#N/A"},{"$error":"#N/A"},{"$error":"#N/A"}]
[13,13,0,0,0,null,"",null,"",null,null,null,null,{"$error":"#N/A"},{"$error":"#N/A"},{"$error":"#N/A"},{"$error":"#N/A"}]
[14,14,0,0,0,null,"",null,"",null,null,null,null,{"$error":"#N/A"},{"$error":"#N/A"},{"$error":"#N/A"},{"$error":"#N/A"}]
[15,15,0,0,0,null,"",null,"",null,null,null,null,{"$error":"#N/A"},{"$error":"#N/A"},{"$error":"#N/A"},{"$error":"#N/A"}]
[16,16,0,0,0,null,"",null,"",null,null,null,null,{"$error":"#N/A"},{"$error":"#N/A"},{"$error":"#N/A"},{"$error":"#N/A"}]
[17,17,0,0,0,null,"",null,"",null,null,null,null,{"$error":"#N/A"},{"$error":"#N/A"},{"$error":"#N/A"},{"$error":"#N/A"}]
[18,18,0,0,0,null,"",null,"",null,null,null,null,{"$error":"#N/A"},{"$error":"#N/A"},{"$error":"#N/A"},{"$error":"#N/A"}]
[19,19,0,0,0,null,"",null,"",null,null,null,null,{"$error":"#N/A"},{"$error":"#N/A"},{"$error":"#N/A"},{"$error":"#N/A"}]
[20,20,0,0,0,null,"",null,"",null,null,null,null,{"$error":"#N/A"},{"$error":"#N/A"},{"$error":"#N/A"},{"$error":"#N/A"}]

{"sheet":"2e","index":1,"n_rows":452,"n_cols":40,"rows_kept":452,"cut":false,"hidden":false,"merged":[[24,17,24,23],[24,10,24,16],[24,24,24,31]]}
[null,null,null,null,null,null,null,"Enjoy Biljart"]
[null,null,null,null,null,null,null,"Stand",null,null,null,null,null,null,null,null,null,"<table class=\"rand\">"]
[null,null,null,null,null,null,null,"#","Team","G","W","GL","V","P","GT","VT","PM","<tr><th scope=\"col\">&nbsp;</th><th scope=\"col\">Team</th><th scope=\"col\">G</th><th scope=\"col\">W</th><th scope=\"col\">GL</th><th scope=\"col\">V</th><th scope=\"col\">P</th><th scope=\"col\">DPV</th><th scope=\"col\">DPT</th><th scope=\"col\">PM</th></tr>"]
[null,null,null,null,null,null,null,{"$f":"IF(ISBLANK(I27),\"\",H27)","v":""},{"$f":"IF(H4=\"\",\"\",VLOOKUP(H4,$AM$27:$AN$46,2,0))","v":""},{"$f":"IF(H4=\"\",\"\",VLOOKUP(I4,$I$27:$AF$46,17,0))","v":""},{"$f":"IF(H4=\"\",\"\",VLOOKUP(I4,$I$27:$AF$46,18,0))","v":""},{"$f":"IF(H4=\"\",\"\",VLOOKUP(I4,$I$27:$AF$46,19,0))","v":""},{"$f":"IF(H4=\"\",\"\",VLOOKUP(I4,$I$27:$AF$46,20,0))","v":""},{"$f":"IF(H4=\"\",\"\",VLOOKUP(I4,$I$27:$AF$46,21,0))","v":""},{"$f":"IF(H4=\"\",\"\",VLOOKUP(I4,$I$27:$AF$46,22,0))","v":""},{"$f":"IF(H4=\"\",\"\",VLOOKUP(I4,$I$27:$AF$46,23,0))","v":""},{"$f":"IF(H4=\"\",\"\",VLOOKUP(I4,$I$27:$AF$46,2,0))","v":""},"</table>"]
[null,null,null,null,null,null,null,{"$f":"IF(ISBLANK(I28),\"\",H28)","v":""},{"$f":"IF(H5=\"\",\"\",VLOOKUP(H5,$AM$27:$AN$46,2,0))","v":""},{"$f":"IF(H5=\"\",\"\",VLOOKUP(I5,$I$27:$AF$46,17,0))","v":""},{"$f":"IF(H5=\"\",\"\",VLOOKUP(I5,$I$27:$AF$46,18,0))","v":""},{"$f":"IF(H5=\"\",\"\",VLOOKUP(I5,$I$27:$AF$46,19,0))","v":""},{"$f":"IF(H5=\"\",\"\",VLOOKUP(I5,$I$27:$AF$46,20,0))","v":""},{"$f":"IF(H5=\"\",\"\",VLOOKUP(I5,$I$27:$AF$46,21,0))","v":""},{"$f":"IF(H5=\"\",\"\",VLOOKUP(I5,$I$27:$AF$46,22,0))","v":""},{"$f":"IF(H5=\"\",\"\",VLOOKUP(I5,$I$27:$AF$46,23,0))","v":""},{"$f":"IF(H5=\"\",\"\",VLOOKUP(I5,$I$27:$AF$46,2,0))","v":""}]
[null,null,null,null,null,null,null,"","","","","","","","","",""]
[null,null,null,null,null,null,null,"","","","","","","","","",""]
[null,null,null,null,null,null,null,{"$f":"IF(ISBLANK(I31),\"\",H31)","v":""},"","","","","","","","",""]
[null,null,null,null,null,null,null,"","","","","","","","","",""]
[null,null,null,null,null,null,null,"","","","","","","","","",""]
[null,null,null,null,null,null,null,"","","","","","","","","",""]
[null,null,null,null,null,null,null,"","","","","","","","","",""]
[null,null,null,null,null,null,null,"","","","","","","","","",""]
[null,null,null,null,null,null,null,"","","","","","","","","",""]
[null,null,null,null,null,null,null,"","","","","","","","","",""]
[null,null,null,null,null,null,"","","","","","","","","","",""]
[null,null,null,null,null,null,"","","","","","","","","","",""]
[null,null,null,null,null,null,"","","","","","","","","","",""]
[null,null,null,null,null,null,"","","","","","","","","","",""]
[null,null,null,null,null,null,"","","","","","","","","","",""]
[null,null,null,null,null,null,"","","","","","","","","","",""]
[null,null,null,null,null,null,"","","","","","","","","","",""]
[null,null,null,null,null,null,"","","","","","","","","","",""]
[]
[null,null,null,null,null,null,null,"Teamindeling",null,null,"Thuis",null,null,null,null,null,null,"Uit",null,null,null,null,null,null,"Totaal"]
[null,null,null,null,null,null,null,null,"Team","punten in mindering","gespeeld thuis","gewonnen thuis","gelijk thuis","verloren thuis","punten thuis","gewonnen takkan thuis","verloren takken thuis","gespeeld uit","gewonnen uit","gelijk uit","verloren uit","punten uit","gewonnen takken uit","verloren takken uit","gespeeld totaal","gewonnen totaal","gelijk totaal","verloren totaal","punten totaal","gewonnen takken totaal","verloren takken totaal","takkensaldo totaal","volgorde punten","volgorde gespeeld","volgorde doelsaldo","volgorde doelp. voor","volgorde teamnaam","volgorde nummer","volgorde totaal","Team"]
[null,null,null,null,null,null,null,1,null,0,{"$f":"SUMPRODUCT((thuis=I27)*(gespeeld=1))","v":{"$error":"#NAME?"}},{"$f":"SUMPRODUCT((thuis=I27)*(gespeeld=1)*(thuis_uitslag>uit_uitslag))","v":{"$error":"#NAME?"}},{"$f":"SUMPRODUCT((thuis=I27)*(gespeeld=1)*(thuis_uitslag=uit_uitslag))","v":{"$error":"#NAME?"}},{"$f":"SUMPRODUCT((thuis=I27)*(gespeeld=1)*(thuis_uitslag<uit_uitslag))","v":{"$error":"#NAME?"}},{"$f":"L27*3+M27*1+N27*0","v":{"$error":"#NAME?"}},{"$f":"SUMIF(thuis,I27,thuis_uitslag)","v":{"$error":"#NAME?"}},{"$f":"SUMIF(thuis,I27,uit_uitslag)","v":{"$error":"#NAME?"}},{"$f":"SUMPRODUCT((uit=I27)*(gespeeld=1))","v":{"$error":"#NAME?"}},{"$f":"SUMPRODUCT((uit=I27)*(gespeeld=1)*(uit_uitslag>thuis_uitslag))","v":{"$error":"#NAME?"}},{"$f":"SUMPRODUCT((uit=I27)*(gespeeld=1)*(uit_uitslag=thuis_uitslag))","v":{"$error":"#NAME?"}},{"$f":"SUMPRODUCT((uit=I27)*(gespeeld=1)*(uit_uitslag<thuis_uitslag))","v":{"$error":"#NAME?"}},{"$f":"S27*3+T27*1+U27*0","v":{"$error":"#NAME?"}},{"$f":"SUMIF(uit,I27,uit_uitslag)","v":{"$error":"#NAME?"}},{"$f":"SUMIF(uit,I27,thuis_uitslag)","v":{"$error":"#NAME?"}},{"$f":"K27+R27","v":{"$error":"#NAME?"}},{"$error":"#NAME?"},{"$error":"#NAME?"},{"$error":"#NAME?"},{"$f":"O27+V27-J27","v":{"$error":"#NAME?"}},{"$error":"#NAME?"},{"$error":"#NAME?"},{"$f":"AD27-AE27","v":{"$error":"#NAME?"}},{"$f":"RANK(AC27,$AC$27:$AC$46,1)","v":{"$error":"#NAME?"}},{"$f":"RANK(Y27,$Y$27:$Y$46)","v":{"$error":"#NAME?"}},{"$f":"RANK(AF27,$AF$27:$AF$46,1)","v":{"$error":"#NAME?"}},{"$f":"RANK(AD27,$AD$27:$AD$46,1)","v":{"$error":"#NAME?"}},{"$f":"20-SUMPRODUCT(--(I27>teams))","v":{"$error":"#NAME?"}},{"$f":"IF(ISBLANK(I27),0,AG27*20^4+AH27*20^3+AI27*20^2+AJ27*20^1+AK27*20^0)","v":0},{"$f":"RANK(AL27,$AL$27:$AL$46)","v":1},{"$f":"IF(ISBLANK(I27),\"\",I27)","v":""}]
[null,null,null,null,null,null,null,2,null,0,{"$error":"#NAME?"},{"$error":"#NAME?"},{"$error":"#NAME?"},{"$error":"#NAME?"},{"$f":"L28*3+M28*1+N28*0","v":{"$error":"#NAME?"}},{"$error":"#NAME?"},{"$error":"#NAME?"},{"$error":"#NAME?"},{"$error":"#NAME?"},{"$error":"#NAME?"},{"$error":"#NAME?"},{"$f":"S28*3+T28*1+U28*0","v":{"$error":"#NAME?"}},{"$error":"#NAME?"},{"$error":"#NAME?"},{"$error":"#NAME?"},{"$error":"#NAME?"},{"$error":"#NAME?"},{"$error":"#NAME?"},{"$f":"O28+V28-J28","v":{"$error":"#NAME?"}},{"$error":"#NAME?"},{"$error":"#NAME?"},{"$f":"AD28-AE28","v":{"$error":"#NAME?"}},{"$f":"RANK(AC28,$AC$27:$AC$46,1)","v":{"$error":"#NAME?"}},{"$f":"RANK(Y28,$Y$27:$Y$46)","v":{"$error":"#NAME?"}},{"$f":"RANK(AF28,$AF$27:$AF$46,1)","v":{"$error":"#NAME?"}},{"$f":"RANK(AD28,$AD$27:$AD$46,1)","v":{"$error":"#NAME?"}},{"$error":"#NAME?"},{"$f":"IF(ISBLANK(I28),0,AG28*20^4+AH28*20^3+AI28*20^2+AJ28*20^1+AK28*20^0)","v":0},{"$f":"RANK(AL28,$AL$27:$AL$46)","v":1},{"$f":"IF(ISBLANK(I28),\"\",I28)","v":""}]
[null,null,null,null,null,null,null,3,null,0,{"$error":"#NAME?"},{"$error":"#NAME?"},{"$error":"#NAME?"},{"$error":"#NAME?"},{"$error":"#NAME?"},{"$error":"#NAME?"},{"$error":"#NAME?"},{"$error":"#NAME?"},{"$error":"#NAME?"},{"$error":"#NAME?"},{"$error":"#NAME?"},{"$error":"#NAME?"},{"$error":"#NAME?"},{"$error":"#NAME?"},{"$error":"#NAME?"},{"$error":"#NAME?"},{"$error":"#NAME?"},{"$error":"#NAME?"},{"$error":"#NAME?"},{"$error":"#NAME?"},{"$error":"#NAME?"},{"$error":"#NAME?"},{"$error":"#NAME?"},{"$error":"#NAME?"},{"$error":"#NAME?"},{"$error":"#NAME?"},{"$error":"#NAME?"},0,1,""]
[null,null,null,null,null,null,null,4,null,0,{"$error":"#NAME?"},{"$error":"#NAME?"},{"$error":"#NAME?"},{"$error":"#NAME?"},{"$error":"#NAME?"},{"$error":"#NAME?"},{"$error":"#NAME?"},{"$error":"#NAME?"},{"$error":"#NAME?"},{"$error":"#NAME?"},{"$error":"#NAME?"},{"$error":"#NAME?"},{"$error":"#NAME?"},{"$error":"#NAME?"},{"$error":"#NAME?"},{"$error":"#NAME?"},{"$error":"#NAME?"},{"$error":"#NAME?"},{"$error":"#NAME?"},{"$error":"#NAME?"},{"$error":"#NAME?"},{"$error":"#NAME?"},{"$error":"#NAME?"},{"$error":"#NAME?"},{"$error":"#NAME?"},{"$error":"#NAME?"},{"$error":"#NAME?"},0,1,""]
[null,null,null,null,null,null,null,5,null,0,{"$f":"SUMPRODUCT((thuis=I31)*(gespeeld=1))","v":{"$error":"#NAME?"}},{"$f":"SUMPRODUCT((thuis=I31)*(gespeeld=1)*(thuis_uitslag>uit_uitslag))","v":{"$error":"#NAME?"}},{"$f":"SUMPRODUCT((thuis=I31)*(gespeeld=1)*(thuis_uitslag=uit_uitslag))","v":{"$error":"#NAME?"}},{"$f":"SUMPRODUCT((thuis=I31)*(gespeeld=1)*(thuis_uitslag<uit_uitslag))","v":{"$error":"#NAME?"}},{"$error":"#NAME?"},{"$f":"SUMIF(thuis,I31,thuis_uitslag)","v":{"$error":"#NAME?"}},{"$f":"SUMIF(thuis,I31,uit_uitslag)","v":{"$error":"#NAME?"}},{"$f":"SUMPRODUCT((uit=I31)*(gespeeld=1))","v":{"$error":"#NAME?"}},{"$f":"SUMPRODUCT((uit=I31)*(gespeeld=1)*(uit_uitslag>thuis_uitslag))","v":{"$error":"#NAME?"}},{"$f":"SUMPRODUCT((uit=I31)*(gespeeld=1)*(uit_uitslag=thuis_uitslag))","v":{"$error":"#NAME?"}},{"$f":"SUMPRODUCT((uit=I31)*(gespeeld=1)*(uit_uitslag<thuis_uitslag))","v":{"$error":"#NAME?"}},{"$error":"#NAME?"},{"$f":"SUMIF(uit,I31,uit_uitslag)","v":{"$error":"#NAME?"}},{"$f":"SUMIF(uit,I31,thuis_uitslag)","v":{"$error":"#NAME?"}},{"$error":"#NAME?"},{"$error":"#NAME?"},{"$error":"#NAME?"},{"$error":"#NAME?"},{"$error":"#NAME?"},{"$error":"#NAME?"},{"$error":"#NAME?"},{"$error":"#NAME?"},{"$error":"#NAME?"},{"$error":"#NAME?"},{"$error":"#NAME?"},{"$error":"#NAME?"},{"$f":"20-SUMPRODUCT(--(I31>teams))","v":{"$error":"#NAME?"}},{"$f":"IF(ISBLANK(I31),0,AG31*20^4+AH31*20^3+AI31*20^2+AJ31*20^1+AK31*20^0)","v":0},1,{"$f":"IF(ISBLANK(I31),\"\",I31)","v":""}]
[null,null,null,null,null,null,null,6,null,0,{"$error":"#NAME?"},{"$error":"#NAME?"},{"$error":"#NAME?"},{"$error":"#NAME?"},{"$error":"#NAME?"},{"$error":"#NAME?"},{"$error":"#NAME?"},{"$error":"#NAME?"},{"$error":"#NAME?"},{"$error":"#NAME?"},{"$error":"#NAME?"},{"$error":"#NAME?"},{"$error":"#NAME?"},{"$error":"#NAME?"},{"$error":"#NAME?"},{"$error":"#NAME?"},{"$error":"#NAME?"},{"$error":"#NAME?"},{"$error":"#NAME?"},{"$error":"#NAME?"},{"$error":"#NAME?"},{"$error":"#NAME?"},{"$error":"#NAME?"},{"$error":"#NAME?"},{"$error":"#NAME?"},{"$error":"#NAME?"},{"$error":"#NAME?"},0,1,""]
[null,null,null,null,null,null,null,7,null,0,{"$error":"#NAME?"},{"$error":"#NAME?"},{"$error":"#NAME?"},{"$error":"#NAME?"},{"$error":"#NAME?"},{"$error":"#NAME?"},{"$error":"#NAME?"},{"$error":"#NAME?"},{"$error":"#NAME?"},{"$error":"#NAME?"},{"$error":"#NAME?"},{"$error":"#NAME?"},{"$error":"#NAME?"},{"$error":"#NAME?"},{"$error":"#NAME?"},{"$error":"#NAME?"},{"$error":"#NAME?"},{"$error":"#NAME?"},{"$error":"#NAME?"},{"$error":"#NAME?"},{"$error":"#NAME?"},{"$error":"#NAME?"},{"$error":"#NAME?"},{"$error":"#NAME?"},{"$error":"#NAME?"},{"$error":"#NAME?"},{"$error":"#NAME?"},0,1,""]
[null,null,null,null,null,null,null,8,null,0,{"$error":"#NAME?"},{"$error":"#NAME?"},{"$error":"#NAME?"},{"$error":"#NAME?"},{"$error":"#NAME?"},{"$error":"#NAME?"},{"$error":"#NAME?"},{"$error":"#NAME?"},{"$error":"#NAME?"},{"$error":"#NAME?"},{"$error":"#NAME?"},{"$error":"#NAME?"},{"$error":"#NAME?"},{"$error":"#NAME?"},{"$error":"#NAME?"},{"$error":"#NAME?"},{"$error":"#NAME?"},{"$error":"#NAME?"},{"$error":"#NAME?"},{"$error":"#NAME?"},{"$error":"#NAME?"},{"$error":"#NAME?"},{"$error":"#NAME?"},{"$error":"#NAME?"},{"$error":"#NAME?"},{"$error":"#NAME?"},{"$error":"#NAME?"},0,1,""]
[null,null,null,null,null,null,null,9,null,0,{"$error":"#NAME?"},{"$error":"#NAME?"},{"$error":"#NAME?"},{"$error":"#NAME?"},{"$error":"#NAME?"},{"$error":"#NAME?"},{"$error":"#NAME?"},{"$error":"#NAME?"},{"$error":"#NAME?"},{"$error":"#NAME?"},{"$error":"#NAME?"},{"$error":"#NAME?"},{"$error":"#NAME?"},{"$error":"#NAME?"},{"$error":"#NAME?"},{"$error":"#NAME?"},{"$error":"#NAME?"},{"$error":"#NAME?"},{"$error":"#NAME?"},{"$error":"#NAME?"},{"$error":"#NAME?"},{"$error":"#NAME?"},{"$error":"#NAME?"},{"$error":"#NAME?"},{"$error":"#NAME?"},{"$error":"#NAME?"},{"$error":"#NAME?"},0,1,""]
[null,null,null,null,null,null,null,10,null,0,{"$error":"#NAME?"},{"$error":"#NAME?"},{"$error":"#NAME?"},{"$error":"#NAME?"},{"$error":"#NAME?"},{"$error":"#NAME?"},{"$error":"#NAME?"},{"$error":"#NAME?"},{"$error":"#NAME?"},{"$error":"#NAME?"},{"$error":"#NAME?"},{"$error":"#NAME?"},{"$error":"#NAME?"},{"$error":"#NAME?"},{"$error":"#NAME?"},{"$error":"#NAME?"},{"$error":"#NAME?"},{"$error":"#NAME?"},{"$error":"#NAME?"},{"$error":"#NAME?"},{"$error":"#NAME?"},{"$error":"#NAME?"},{"$error":"#NAME?"},{"$error":"#NAME?"},{"$error":"#NAME?"},{"$error":"#NAME?"},{"$error":"#NAME?"},0,1,""]
[null,null,null,null,null,null,null,11,null,0,{"$error":"#NAME?"},{"$error":"#NAME?"},{"$error":"#NAME?"},{"$error":"#NAME?"},{"$error":"#NAME?"},{"$error":"#NAME?"},{"$error":"#NAME?"},{"$error":"#NAME?"},{"$error":"#NAME?"},{"$error":"#NAME?"},{"$error":"#NAME?"},{"$error":"#NAME?"},{"$error":"#NAME?"},{"$error":"#NAME?"},{"$error":"#NAME?"},{"$error":"#NAME?"},{"$error":"#NAME?"},{"$error":"#NAME?"},{"$error":"#NAME?"},{"$error":"#NAME?"},{"$error":"#NAME?"},{"$error":"#NAME?"},{"$error":"#NAME?"},{"$error":"#NAME?"},{"$error":"#NAME?"},{"$error":"#NAME?"},{"$error":"#NAME?"},0,1,""]
[null,null,null,null,null,null,null,12,null,0,{"$error":"#NAME?"},{"$error":"#NAME?"},{"$error":"#NAME?"},{"$error":"#NAME?"},{"$error":"#NAME?"},{"$error":"#NAME?"},{"$error":"#NAME?"},{"$error":"#NAME?"},{"$error":"#NAME?"},{"$error":"#NAME?"},{"$error":"#NAME?"},{"$error":"#NAME?"},{"$error":"#NAME?"},{"$error":"#NAME?"},{"$error":"#NAME?"},{"$error":"#NAME?"},{"$error":"#NAME?"},{"$error":"#NAME?"},{"$f":"O38+V38-J38","v":{"$error":"#NAME?"}},{"$error":"#NAME?"},{"$error":"#NAME?"},{"$error":"#NAME?"},{"$error":"#NAME?"},{"$error":"#NAME?"},{"$error":"#NAME?"},{"$error":"#NAME?"},{"$error":"#NAME?"},0,1,""]
[null,null,null,null,null,null,null,13,null,0,{"$error":"#NAME?"},{"$error":"#NAME?"},{"$error":"#NAME?"},{"$error":"#NAME?"},{"$error":"#NAME?"},{"$error":"#NAME?"},{"$error":"#NAME?"},{"$error":"#NAME?"},{"$error":"#NAME?"},{"$error":"#NAME?"},{"$error":"#NAME?"},{"$error":"#NAME?"},{"$error":"#NAME?"},{"$error":"#NAME?"},{"$error":"#NAME?"},{"$error":"#NAME?"},{"$error":"#NAME?"},{"$error":"#NAME?"},{"$error":"#NAME?"},{"$error":"#NAME?"},{"$error":"#NAME?"},{"$error":"#NAME?"},{"$error":"#NAME?"},{"$error":"#NAME?"},{"$error":"#NAME?"},{"$error":"#NAME?"},{"$error":"#NAME?"},0,1,""]
[null,null,null,null,null,null,null,14,null,0,{"$error":"#NAME?"},{"$error":"#NAME?"},{"$error":"#NAME?"},{"$error":"#NAME?"},{"$error":"#NAME?"},{"$error":"#NAME?"},{"$error":"#NAME?"},{"$error":"#NAME?"},{"$error":"#NAME?"},{"$error":"#NAME?"},{"$error":"#NAME?"},{"$error":"#NAME?"},{"$error":"#NAME?"},{"$error":"#NAME?"},{"$error":"#NAME?"},{"$error":"#NAME?"},{"$error":"#NAME?"},{"$error":"#NAME?"},{"$error":"#NAME?"},{"$error":"#NAME?"},{"$error":"#NAME?"},{"$error":"#NAME?"},{"$error":"#NAME?"},{"$error":"#NAME?"},{"$error":"#NAME?"},{"$error":"#NAME?"},{"$error":"#NAME?"},0,1,""]
[null,null,null,null,null,null,null,15,null,0,{"$error":"#NAME?"},{"$error":"#NAME?"},{"$error":"#NAME?"},{"$error":"#NAME?"},{"$error":"#NAME?"},{"$error":"#NAME?"},{"$error":"#NAME?"},{"$error":"#NAME?"},{"$error":"#NAME?"},{"$error":"#NAME?"},{"$error":"#NAME?"},{"$error":"#NAME?"},{"$error":"#NAME?"},{"$error":"#NAME?"},{"$error":"#NAME?"},{"$error":"#NAME?"},{"$error":"#NAME?"},{"$error":"#NAME?"},{"$error":"#NAME?"},{"$error":"#NAME?"},{"$error":"#NAME?"},{"$error":"#NAME?"},{"$error":"#NAME?"},{"$error":"#NAME?"},{"$error":"#NAME?"},{"$error":"#NAME?"},{"$error":"#NAME?"},0,1,""]
[null,null,null,null,null,null,null,16,null,0,{"$error":"#NAME?"},{"$error":"#NAME?"},{"$error":"#NAME?"},{"$error":"#NAME?"},{"$error":"#NAME?"},{"$error":"#NAME?"},{"$error":"#NAME?"},{"$error":"#NAME?"},{"$error":"#NAME?"},{"$error":"#NAME?"},{"$error":"#NAME?"},{"$error":"#NAME?"},{"$error":"#NAME?"},{"$error":"#NAME?"},{"$error":"#NAME?"},{"$error":"#NAME?"},{"$error":"#NAME?"},{"$error":"#NAME?"},{"$error":"#NAME?"},{"$error":"#NAME?"},{"$error":"#NAME?"},{"$error":"#NAME?"},{"$error":"#NAME?"},{"$error":"#NAME?"},{"$error":"#NAME?"},{"$error":"#NAME?"},{"$error":"#NAME?"},0,1,""]
[null,null,null,null,null,null,null,17,null,0,{"$error":"#NAME?"},{"$error":"#NAME?"},{"$error":"#NAME?"},{"$error":"#NAME?"},{"$error":"#NAME?"},{"$error":"#NAME?"},{"$error":"#NAME?"},{"$error":"#NAME?"},{"$error":"#NAME?"},{"$error":"#NAME?"},{"$error":"#NAME?"},{"$error":"#NAME?"},{"$error":"#NAME?"},{"$error":"#NAME?"},{"$f":"K43+R43","v":{"$error":"#NAME?"}},{"$error":"#NAME?"},{"$error":"#NAME?"},{"$error":"#NAME?"},{"$error":"#NAME?"},{"$f":"P43+W43","v":{"$error":"#NAME?"}},{"$error":"#NAME?"},{"$error":"#NAME?"},{"$error":"#NAME?"},{"$error":"#NAME?"},{"$error":"#NAME?"},{"$error":"#NAME?"},{"$error":"#NAME?"},0,1,""]
[null,null,null,null,null,null,null,18,null,0,{"$error":"#NAME?"},{"$error":"#NAME?"},{"$error":"#NAME?"},{"$error":"#NAME?"},{"$error":"#NAME?"},{"$error":"#NAME?"},{"$error":"#NAME?"},{"$error":"#NAME?"},{"$error":"#NAME?"},{"$error":"#NAME?"},{"$error":"#NAME?"},{"$error":"#NAME?"},{"$error":"#NAME?"},{"$error":"#NAME?"},{"$error":"#NAME?"},{"$error":"#NAME?"},{"$error":"#NAME?"},{"$error":"#NAME?"},{"$error":"#NAME?"},{"$error":"#NAME?"},{"$error":"#NAME?"},{"$error":"#NAME?"},{"$error":"#NAME?"},{"$error":"#NAME?"},{"$error":"#NAME?"},{"$error":"#NAME?"},{"$error":"#NAME?"},0,1,""]
[null,null,null,null,null,null,null,19,null,0,{"$error":"#NAME?"},{"$error":"#NAME?"},{"$error":"#NAME?"},{"$error":"#NAME?"},{"$error":"#NAME?"},{"$error":"#NAME?"},{"$error":"#NAME?"},{"$error":"#NAME?"},{"$error":"#NAME?"},{"$error":"#NAME?"},{"$error":"#NAME?"},{"$error":"#NAME?"},{"$error":"#NAME?"},{"$error":"#NAME?"},{"$error":"#NAME?"},{"$error":"#NAME?"},{"$error":"#NAME?"},{"$error":"#NAME?"},{"$error":"#NAME?"},{"$error":"#NAME?"},{"$error":"#NAME?"},{"$error":"#NAME?"},{"$error":"#NAME?"},{"$error":"#NAME?"},{"$error":"#NAME?"},{"$error":"#NAME?"},{"$error":"#NAME?"},0,1,""]
[null,null,null,null,null,null,null,20,null,0,{"$error":"#NAME?"},{"$error":"#NAME?"},{"$error":"#NAME?"},{"$error":"#NAME?"},{"$error":"#NAME?"},{"$error":"#NAME?"},{"$error":"#NAME?"},{"$error":"#NAME?"},{"$error":"#NAME?"},{"$error":"#NAME?"},{"$error":"#NAME?"},{"$error":"#NAME?"},{"$error":"#NAME?"},{"$error":"#NAME?"},{"$error":"#NAME?"},{"$error":"#NAME?"},{"$error":"#NAME?"},{"$error":"#NAME?"},{"$error":"#NAME?"},{"$error":"#NAME?"},{"$error":"#NAME?"},{"$error":"#NAME?"},{"$error":"#NAME?"},{"$error":"#NAME?"},{"$error":"#NAME?"},{"$error":"#NAME?"},{"$error":"#NAME?"},0,1,""]
[]
[null,null,null,null,null,null,null,null,"Favoriet"]
[null,null,null,null,null,null,null,null,"Spelersnaam"]
[]
[null,null,null,null,null,"Uitslagen",null,null,null,null,null,"<table summary=\"Uitslagen chronologisch\" class=\"rand\">"]
["a","b","c","d","e","datum","thuis",null,"uit","uitslag",null,"<tr><th>Datum</th><th>Thuis</th><th>Uit</th><th>Uitslag</th></tr>"]
[1,8,{"$f":"IF(OR(A53=B53,A53>COUNTA(teams),B53>COUNTA(teams)),0,1)","v":0},{"$f":"IF(C53=0,0,IF(NOT(OR(ISBLANK(F53),ISBLANK(G53),ISBLANK(I53))),2,1))","v":0},{"$f":"IF(AND(D53=2,ISNUMBER(J53),ISNUMBER(K53)),1,0)","v":0},null,{"$f":"IF(C53=0,\"\",VLOOKUP(A53,team_vlgnrs,2,FALSE))","v":""},"-",{"$f":"IF(C53=0,\"\",VLOOKUP(B53,team_vlgnrs,2,FALSE))","v":""},null,null,"</table>"]
[2,11,0,0,0,null,"","-",""]
[4,5,0,0,0,null,"","-",""]
[6,7,0,0,0,null,"","-",""]
[9,3,0,0,0,null,"","-",""]
[12,10,0,0,0,null,"","-",""]
[2,7,0,0,0,null,"","-",""]
[4,10,0,0,0,null,"","-",""]
[5,3,0,0,0,null,"","-",""]
[6,8,0,0,0,null,"","-",""]
[9,11,0,0,0,null,"","-",""]
[12,1,0,0,0,null,"","-",""]
[1,9,0,0,0,null,"","-",""]
[3,12,0,0,0,null,"","-",""]
[7,5,0,0,0,null,"","-",""]
[8,4,0,0,0,null,"","-",""]
[10,2,0,0,0,null,"","-",""]
[11,6,0,0,0,null,"","-",""]
[8,2,0,0,0,null,"","-",""]
[2,8,0,0,0,null,"","-",""]
[4,1,0,0,0,null,"","-",""]
[5,11,0,0,0,null,"","-",""]
[7,3,0,0,0,null,"","-",""]
[12,9,0,0,0,null,"","-",""]
[6,10,0,0,0,null,"","-",""]
[1,6,0,0,0,null,"","-",""]
[3,2,0,0,0,null,"","-",""]
[8,12,0,0,0,null,"","-",""]
[9,4,0,0,0,null,"","-",""]
[10,5,0,0,0,null,"","-",""]
[11,7,0,0,0,null,"","-",""]
[2,6,0,0,0,null,"","-",""]
[11,3,0,0,0,null,"","-",""]
[2,12,0,0,0,null,"","-",""]
[7,9,0,0,0,null,"","-",""]
[2,1,0,0,0,null,"","-",""]
[5,8,0,0,0,null,"","-",""]
[6,9,0,0,0,null,"","-",""]
[7,10,0,0,0,null,"","-",""]
[12,4,0,0,0,null,"","-",""]
[1,5,0,0,0,null,"","-",""]
[4,6,0,0,0,null,"","-",""]
[8,3,0,0,0,null,"","-",""]
[9,2,0,0,0,null,"","-",""]
[10,11,0,0,0,null,"","-",""]
[12,7,0,0,0,null,"","-",""]
[1,10,0,0,0,null,"","-",""]
[4,3,0,0,0,null,"","-",""]
[7,2,0,0,0,null,"","-",""]
[11,12,0,0,0,null,"","-",""]
[2,4,0,0,0,null,"","-",""]
[3,10,0,0,0,null,"","-",""]
[5,9,0,0,0,null,"","-",""]
[6,12,0,0,0,null,"","-",""]
[7,1,0,0,0,null,"","-",""]
[11,8,0,0,0,null,"","-",""]
[1,11,0,0,0,null,"","-",""]
[6,2,0,0,0,null,"","-",""]
[8,7,0,0,0,null,"","-",""]
[9,10,0,0,0,null,"","-",""]
[12,5,0,0,0,null,"","-",""]
[3,1,0,0,0,null,"","-",""]
[5,6,0,0,0,null,"","-",""]
[10,8,0,0,0,null,"","-",""]
[11,4,{"$f":"IF(OR(A117=B117,A117>COUNTA(teams),B117>COUNTA(teams)),0,1)","v":0},{"$f":"IF(C117=0,0,IF(NOT(OR(ISBLANK(F117),ISBLANK(G117),ISBLANK(I117))),2,1))","v":0},{"$f":"IF(AND(D117=2,ISNUMBER(J117),ISNUMBER(K117)),1,0)","v":0},null,{"$f":"IF(C117=0,\"\",VLOOKUP(A117,team_vlgnrs,2,FALSE))","v":""},"-",{"$f":"IF(C117=0,\"\",VLOOKUP(B117,team_vlgnrs,2,FALSE))","v":""}]
[2,10,0,0,0,null,"","-",""]
[4,8,0,0,0,null,"","-",""]
[5,7,0,0,0,null,"","-",""]
[6,11,0,0,0,null,"","-",""]
[9,1,0,0,0,null,"","-",""]
[12,3,0,0,0,null,"","-",""]
[3,6,0,0,0,null,"","-",""]
[5,2,0,0,0,null,"","-",""]
[7,4,0,0,0,null,"","-",""]
[8,9,0,0,0,null,"","-",""]
[10,1,0,0,0,null,"","-",""]
[1,4,0,0,0,null,"","-",""]
[3,7,0,0,0,null,"","-",""]
[9,12,0,0,0,null,"","-",""]
[10,6,0,0,0,null,"","-",""]
[11,5,0,0,0,null,"","-",""]
[2,3,0,0,0,null,"","-",""]
[4,9,0,0,0,null,"","-",""]
[5,10,0,0,0,null,"","-",""]
[6,1,0,0,0,null,"","-",""]
[7,11,0,0,0,null,"","-",""]
[12,8,0,0,0,null,"","-",""]
[9,8,0,0,0,null,"","-",""]
[1,2,0,0,0,null,"","-",""]
[3,11,0,0,0,null,"","-",""]
[4,12,0,0,0,null,"","-",""]
[8,5,0,0,0,null,"","-",""]
[9,6,0,0,0,null,"","-",""]
[10,7,0,0,0,null,"","-",""]
[2,9,0,0,0,null,"","-",""]
[3,8,0,0,0,null,"","-",""]
[5,1,0,0,0,null,"","-",""]
[6,4,0,0,0,null,"","-",""]
[7,12,0,0,0,null,"","-",""]
[11,10,0,0,0,null,"","-",""]
[1,7,0,0,0,null,"","-",""]
[4,2,0,0,0,null,"","-",""]
[8,11,0,0,0,null,"","-",""]
[9,5,0,0,0,null,"","-",""]
[10,3,0,0,0,null,"","-",""]
[12,6,0,0,0,null,"","-",""]
[10,9,0,0,0,null,"","-",""]
[11,2,0,0,0,null,"","-",""]
[3,4,0,0,0,null,"","-",""]
[5,12,0,0,0,null,"","-",""]
[7,8,0,0,0,null,"","-",""]
[11,1,0,0,0,null,"","-",""]
[1,3,0,0,0,null,"","-",""]
[4,11,0,0,0,null,"","-",""]
[6,5,0,0,0,null,"","-",""]
[8,10,0,0,0,null,"","-",""]
[9,7,0,0,0,null,"","-",""]
[12,2,0,0,0,null,"","-",""]
[3,9,0,0,0,null,"","-",""]
[5,4,0,0,0,null,"","-",""]
[7,6,0,0,0,null,"","-",""]
[8,1,0,0,0,null,"","-",""]
[10,12,0,0,0,null,"","-",""]
[2,5,0,0,0,null,"","-",""]
[4,7,0,0,0,null,"","-",""]
[6,3,0,0,0,null,"","-",""]
[12,11,0,0,0,null,"","-",""]
[1,12,0,0,0,null,"","-",""]
[3,5,{"$f":"IF(OR(A181=B181,A181>COUNTA(teams),B181>COUNTA(teams)),0,1)","v":0},{"$f":"IF(C181=0,0,IF(NOT(OR(ISBLANK(F181),ISBLANK(G181),ISBLANK(I181))),2,1))","v":0},{"$f":"IF(AND(D181=2,ISNUMBER(J181),ISNUMBER(K181)),1,0)","v":0},null,{"$f":"IF(C181=0,\"\",VLOOKUP(A181,team_vlgnrs,2,FALSE))","v":""},"-",{"$f":"IF(C181=0,\"\",VLOOKUP(B181,team_vlgnrs,2,FALSE))","v":""}]
[8,6,0,0,0,null,"","-",""]
[10,4,0,0,0,null,"","-",""]
[11,9,0,0,0,null,"","-",""]
[1,1,0,0,0,null,"","-",""]
[1,13,0,0,0,null,"","-",""]
[1,14,0,0,0,null,"","-",""]
[1,15,0,0,0,null,"","-",""]
[1,16,0,0,0,null,"","-",""]
[1,17,0,0,0,null,"","-",""]
[1,18,0,0,0,null,"","-",""]
[1,19,0,0,0,null,"","-",""]
[1,20,0,0,0,null,"","-",""]
[2,2,0,0,0,null,"","-",""]
[2,13,0,0,0,null,"","-",""]
[2,14,0,0,0,null,"","-",""]
[2,15,0,0,0,null,"","-",""]
[2,16,0,0,0,null,"","-",""]
[2,17,0,0,0,null,"","-",""]
[2,18,0,0,0,null,"","-",""]
[2,19,0,0,0,null,"","-",""]
[2,20,0,0,0,null,"","-",""]
[3,3,0,0,0,null,"","-",""]
[3,13,0,0,0,null,"","-",""]
[3,14,0,0,0,null,"","-",""]
[3,15,0,0,0,null,"","-",""]
[3,16,0,0,0,null,"","-",""]
[3,17,0,0,0,null,"","-",""]
[3,18,0,0,0,null,"","-",""]
[3,19,0,0,0,null,"","-",""]
[3,20,0,0,0,null,"","-",""]
[4,4,0,0,0,null,"","-",""]
[4,13,0,0,0,null,"","-",""]
[4,14,0,0,0,null,"","-",""]
[4,15,0,0,0,null,"","-",""]
[4,16,0,0,0,null,"","-",""]
[4,17,0,0,0,null,"","-",""]
[4,18,0,0,0,null,"","-",""]
[4,19,0,0,0,null,"","-",""]
[4,20,0,0,0,null,"","-",""]
[5,5,0,0,0,null,"","-",""]
[5,13,0,0,0,null,"","-",""]
[5,14,0,0,0,null,"","-",""]
[5,15,0,0,0,null,"","-",""]
[5,16,0,0,0,null,"","-",""]
[5,17,0,0,0,null,"","-",""]
[5,18,0,0,0,null,"","-",""]
[5,19,0,0,0,null,"","-",""]
[5,20,0,0,0,null,"","-",""]
[6,6,0,0,0,null,"",null,""]
[6,13,0,0,0,null,"","-",""]
[6,14,0,0,0,null,"","-",""]
[6,15,0,0,0,null,"","-",""]
[6,16,0,0,0,null,"","-",""]
[6,17,0,0,0,null,"","-",""]
[6,18,0,0,0,null,"","-",""]
[6,19,0,0,0,null,"","-",""]
[6,20,0,0,0,null,"","-",""]
[7,7,0,0,0,null,"","-",""]
[7,13,0,0,0,null,"","-",""]
[7,14,0,0,0,null,"","-",""]
[7,15,0,0,0,null,"","-",""]
[7,16,0,0,0,null,"","-",""]
[7,17,0,0,0,null,"","-",""]
[7,18,{"$f":"IF(OR(A245=B245,A245>COUNTA(teams),B245>COUNTA(teams)),0,1)","v":0},{"$f":"IF(C245=0,0,IF(NOT(OR(ISBLANK(F245),ISBLANK(G245),ISBLANK(I245))),2,1))","v":0},{"$f":"IF(AND(D245=2,ISNUMBER(J245),ISNUMBER(K245)),1,0)","v":0},null,{"$f":"IF(C245=0,\"\",VLOOKUP(A245,team_vlgnrs,2,FALSE))","v":""},"-",{"$f":"IF(C245=0,\"\",VLOOKUP(B245,team_vlgnrs,2,FALSE))","v":""}]
[7,19,0,0,0,null,"","-",""]
[7,20,0,0,0,null,"","-",""]
[8,8,0,0,0,null,"","-",""]
[8,13,0,0,0,null,"","-",""]
[8,14,0,0,0,null,"","-",""]
[8,15,0,0,0,null,"","-",""]
[8,16,0,0,0,null,"","-",""]
[8,17,0,0,0,null,"","-",""]
[8,18,0,0,0,null,"","-",""]
[8,19,0,0,0,null,"","-",""]
[8,20,0,0,0,null,"","-",""]
[9,9,0,0,0,null,"","-",""]
[9,13,0,0,0,null,"","-",""]
[9,14,0,0,0,null,"","-",""]
[9,15,0,0,0,null,"","-",""]
[9,16,0,0,0,null,"","-",""]
[9,17,0,0,0,null,"","-",""]
[9,18,0,0,0,null,"","-",""]
[9,19,0,0,0,null,"","-",""]
[9,20,0,0,0,null,"","-",""]
[10,10,0,0,0,null,"","-",""]
[10,13,0,0,0,null,"","-",""]
[10,14,0,0,0,null,"","-",""]
[10,15,0,0,0,null,"","-",""]
[10,16,0,0,0,null,"","-",""]
[10,17,0,0,0,null,"","-",""]
[10,18,0,0,0,null,"","-",""]
[10,19,0,0,0,null,"","-",""]
[10,20,0,0,0,null,"","-",""]
[11,11,0,0,0,null,"","-",""]
[11,13,0,0,0,null,"","-",""]
[11,14,0,0,0,null,"","-",""]
[11,15,0,0,0,null,"","-",""]
[11,16,0,0,0,null,"","-",""]
[11,17,0,0,0,null,"","-",""]
[11,18,0,0,0,null,"","-",""]
[11,19,0,0,0,null,"","-",""]
[11,20,0,0,0,null,"","-",""]
[12,12,0,0,0,null,"","-",""]
[12,13,0,0,0,null,"","-",""]
[12,14,0,0,0,null,"","-",""]
[12,15,0,0,0,null,"","-",""]
[12,16,0,0,0,null,"","-",""]
[12,17,0,0,0,null,"","-",""]
[12,18,0,0,0,null,"","-",""]
[12,19,0,0,0,null,"","-",""]
[12,20,0,0,0,null,"","-",""]
[13,1,0,0,0,null,"","-",""]
[13,2,0,0,0,null,"","-",""]
[13,3,0,0,0,null,"","-",""]
[13,4,0,0,0,null,"","-",""]
[13,5,0,0,0,null,"","-",""]
[13,6,0,0,0,null,"","-",""]
[13,7,0,0,0,null,"","-",""]
[13,8,0,0,0,null,"","-",""]
[13,9,0,0,0,null,"","-",""]
[13,10,0,0,0,null,"","-",""]
[13,11,0,0,0,null,"","-",""]
[13,12,0,0,0,null,"","-",""]
[13,13,0,0,0,null,"","-",""]
[13,14,0,0,0,null,"","-",""]
[13,15,0,0,0,null,"","-",""]
[13,16,0,0,0,null,"","-",""]
[13,17,{"$f":"IF(OR(A309=B309,A309>COUNTA(teams),B309>COUNTA(teams)),0,1)","v":0},{"$f":"IF(C309=0,0,IF(NOT(OR(ISBLANK(F309),ISBLANK(G309),ISBLANK(I309))),2,1))","v":0},{"$f":"IF(AND(D309=2,ISNUMBER(J309),ISNUMBER(K309)),1,0)","v":0},null,{"$f":"IF(C309=0,\"\",VLOOKUP(A309,team_vlgnrs,2,FALSE))","v":""},"-",{"$f":"IF(C309=0,\"\",VLOOKUP(B309,team_vlgnrs,2,FALSE))","v":""}]
[13,18,0,0,0,null,"","-",""]
[13,19,0,0,0,null,"","-",""]
[13,20,0,0,0,null,"","-",""]
[14,1,0,0,0,null,"","-",""]
[14,2,0,0,0,null,"","-",""]
[14,3,0,0,0,null,"","-",""]
[14,4,0,0,0,null,"","-",""]
[14,5,0,0,0,null,"","-",""]
[14,6,0,0,0,null,"","-",""]
[14,7,0,0,0,null,"","-",""]
[14,8,0,0,0,null,"","-",""]
[14,9,0,0,0,null,"","-",""]
[14,10,0,0,0,null,"","-",""]
[14,11,0,0,0,null,"","-",""]
[14,12,0,0,0,null,"","-",""]
[14,13,0,0,0,null,"","-",""]
[14,14,0,0,0,null,"","-",""]
[14,15,0,0,0,null,"","-",""]
[14,16,0,0,0,null,"","-",""]
[14,17,0,0,0,null,"","-",""]
[14,18,0,0,0,null,"","-",""]
[14,19,0,0,0,null,"","-",""]
[14,20,0,0,0,null,"","-",""]
[15,1,0,0,0,null,"","-",""]
[15,2,0,0,0,null,"","-",""]
[15,3,0,0,0,null,"","-",""]
[15,4,0,0,0,null,"","-",""]
[15,5,0,0,0,null,"","-",""]
[15,6,0,0,0,null,"","-",""]
[15,7,0,0,0,null,"","-",""]
[15,8,0,0,0,null,"","-",""]
[15,9,0,0,0,null,"","-",""]
[15,10,0,0,0,null,"","-",""]
[15,11,0,0,0,null,"","-",""]
[15,12,0,0,0,null,"","-",""]
[15,13,0,0,0,null,"","-",""]
[15,14,0,0,0,null,"","-",""]
[15,15,0,0,0,null,"","-",""]
[15,16,0,0,0,null,"","-",""]
[15,17,0,0,0,null,"","-",""]
[15,18,0,0,0,null,"","-",""]
[15,19,0,0,0,null,"","-",""]
[15,20,0,0,0,null,"","-",""]
[16,1,0,0,0,null,"","-",""]
[16,2,0,0,0,null,"","-",""]
[16,3,0,0,0,null,"","-",""]
[16,4,0,0,0,null,"","-",""]
[16,5,0,0,0,null,"","-",""]
[16,6,0,0,0,null,"","-",""]
[16,7,0,0,0,null,"","-",""]
[16,8,0,0,0,null,"","-",""]
[16,9,0,0,0,null,"","-",""]
[16,10,0,0,0,null,"","-",""]
[16,11,0,0,0,null,"","-",""]
[16,12,0,0,0,null,"","-",""]
[16,13,0,0,0,null,"","-",""]
[16,14,0,0,0,null,"","-",""]
[16,15,0,0,0,null,"","-",""]
[16,16,0,0,0,null,"","-",""]
[16,17,0,0,0,null,"","-",""]
[16,18,0,0,0,null,"","-",""]
[16,19,0,0,0,null,"","-",""]
[16,20,0,0,0,null,"","-",""]
[17,1,{"$f":"IF(OR(A373=B373,A373>COUNTA(teams),B373>COUNTA(teams)),0,1)","v":0},{"$f":"IF(C373=0,0,IF(NOT(OR(ISBLANK(F373),ISBLANK(G373),ISBLANK(I373))),2,1))","v":0},{"$f":"IF(AND(D373=2,ISNUMBER(J373),ISNUMBER(K373)),1,0)","v":0},null,{"$f":"IF(C373=0,\"\",VLOOKUP(A373,team_vlgnrs,2,FALSE))","v":""},"-",{"$f":"IF(C373=0,\"\",VLOOKUP(B373,team_vlgnrs,2,FALSE))","v":""}]
[17,2,0,0,0,null,"","-",""]
[17,3,0,0,0,null,"","-",""]
[17,4,0,0,0,null,"","-",""]
[17,5,0,0,0,null,"","-",""]
[17,6,0,0,0,null,"","-",""]
[17,7,0,0,0,null,"","-",""]
[17,8,0,0,0,null,"","-",""]
[17,9,0,0,0,null,"","-",""]
[17,10,0,0,0,null,"","-",""]
[17,11,0,0,0,null,"","-",""]
[17,12,0,0,0,null,"","-",""]
[17,13,0,0,0,null,"","-",""]
[17,14,0,0,0,null,"","-",""]
[17,15,0,0,0,null,"","-",""]
[17,16,0,0,0,null,"","-",""]
[17,17,0,0,0,null,"","-",""]
[17,18,0,0,0,null,"","-",""]
[17,19,0,0,0,null,"","-",""]
[17,20,0,0,0,null,"","-",""]
[18,1,0,0,0,null,"","-",""]
[18,2,0,0,0,null,"","-",""]
[18,3,0,0,0,null,"","-",""]
[18,4,0,0,0,null,"","-",""]
[18,5,0,0,0,null,"","-",""]
[18,6,0,0,0,null,"","-",""]
[18,7,0,0,0,null,"","-",""]
[18,8,0,0,0,null,"","-",""]
[18,9,0,0,0,null,"","-",""]
[18,10,0,0,0,null,"","-",""]
[18,11,0,0,0,null,"","-",""]
[18,12,0,0,0,null,"","-",""]
[18,13,0,0,0,null,"","-",""]
[18,14,0,0,0,null,"","-",""]
[18,15,0,0,0,null,"","-",""]
[18,16,0,0,0,null,"","-",""]
[18,17,0,0,0,null,"","-",""]
[18,18,0,0,0,null,"","-",""]
[18,19,0,0,0,null,"","-",""]
[18,20,0,0,0,null,"","-",""]
[19,1,0,0,0,null,"","-",""]
[19,2,0,0,0,null,"","-",""]
[19,3,0,0,0,null,"","-",""]
[19,4,0,0,0,null,"","-",""]
[19,5,0,0,0,null,"","-",""]
[19,6,0,0,0,null,"","-",""]
[19,7,0,0,0,null,"","-",""]
[19,8,0,0,0,null,"","-",""]
[19,9,0,0,0,null,"","-",""]
[19,10,0,0,0,null,"","-",""]
[19,11,0,0,0,null,"","-",""]
[19,12,0,0,0,null,"","-",""]
[19,13,0,0,0,null,"","-",""]
[19,14,0,0,0,null,"","-",""]
[19,15,0,0,0,null,"","-",""]
[19,16,0,0,0,null,"","-",""]
[19,17,0,0,0,null,"","-",""]
[19,18,0,0,0,null,"","-",""]
[19,19,0,0,0,null,"","-",""]
[19,20,0,0,0,null,"","-",""]
[20,1,0,0,0,null,"","-",""]
[20,2,0,0,0,null,"","-",""]
[20,3,0,0,0,null,"","-",""]
[20,4,0,0,0,null,"","-",""]
[20,5,{"$f":"IF(OR(A437=B437,A437>COUNTA(teams),B437>COUNTA(teams)),0,1)","v":0},{"$f":"IF(C437=0,0,IF(NOT(OR(ISBLANK(F437),ISBLANK(G437),ISBLANK(I437))),2,1))","v":0},{"$f":"IF(AND(D437=2,ISNUMBER(J437),ISNUMBER(K437)),1,0)","v":0},null,{"$f":"IF(C437=0,\"\",VLOOKUP(A437,team_vlgnrs,2,FALSE))","v":""},"-",{"$f":"IF(C437=0,\"\",VLOOKUP(B437,team_vlgnrs,2,FALSE))","v":""}]
[20,6,0,0,0,null,"","-",""]
[20,7,0,0,0,null,"","-",""]
[20,8,0,0,0,null,"","-",""]
[20,9,0,0,0,null,"","-",""]
[20,10,0,0,0,null,"","-",""]
[20,11,0,0,0,null,"","-",""]
[20,12,0,0,0,null,"","-",""]
[20,13,0,0,0,null,"","-",""]
[20,14,0,0,0,null,"","-",""]
[20,15,0,0,0,null,"","-",""]
[20,16,0,0,0,null,"","-",""]
[20,17,0,0,0,null,"","-",""]
[20,18,0,0,0,null,"","-",""]
[20,19,0,0,0,null,"","-",""]
[20,20,0,0,0,null,"","-",""]

{"sheet":"Blad3","index":2,"n_rows":22,"n_cols":61,"rows_kept":22,"cut":false,"hidden":false,"merged":[[6,14,6,16],[5,11,5,13],[4,8,4,10],[3,5,3,7],[21,59,21,61],[20,56,20,58],[19,53,19,55],[18,50,18,52],[17,47,17,49],[16,44,16,46],[15,41,15,43],[14,38,14,40],[13,35,13,37],[12,32,12,34],[11,29,11,31],[10,26,10,28],[9,23,9,25],[8,20,8,22],[7,17,7,19],[0,29,1,31],[0,26,1,28],[0,23,1,25],[0,20,1,22],[2,2,2,4],[0,44,1,46],[0,41,1,43],[0,38,1,40],[0,35,1,37],[0,32,1,34],[0,17,1,19],[0,14,1,16],[0,11,1,13],[0,8,1,10],[0,5,1,7],[0,2,1,4],[0,0,1,0],[0,59,1,61],[0,56,1,58],[0,53,1,55],[0,50,1,52],[0,47,1,49]]}
["#","Uit",{"$f":"IF($A3=\"\",\"\",'1e'!$I27)","v":"Barbieur Olivier"},null,null,{"$f":"IF($A4=\"\",\"\",'1e'!$I28)","v":"Beeckman Mark"},null,null,{"$f":"IF($A5=\"\",\"\",'1e'!$I29)","v":"Bockxtale Patrick"},null,null,{"$f":"IF($A6=\"\",\"\",'1e'!$I30)","v":"Claus Geert"},null,null,{"$f":"IF($A7=\"\",\"\",'1e'!$I31)","v":"Claus Odilon"},null,null,{"$f":"IF($A8=\"\",\"\",'1e'!$I32)","v":"Coppens Daniël"},null,null,{"$f":"IF($A9=\"\",\"\",'1e'!$I33)","v":"De Smet Filip"},null,null,{"$f":"IF($A10=\"\",\"\",'1e'!$I34)","v":"Keppens Jurgen"},null,null,{"$f":"IF($A11=\"\",\"\",'1e'!$I35)","v":"Rosschaert Casper"},null,null,{"$f":"IF($A12=\"\",\"\",'1e'!$I36)","v":"Rosschaert Peter"},null,null,{"$f":"IF($A13=\"\",\"\",'1e'!$I37)","v":"Vagenende Etienne"},null,null,{"$f":"IF($A14=\"\",\"\",'1e'!$I38)","v":""},null,null,{"$f":"IF($A15=\"\",\"\",'1e'!$I39)","v":""},null,null,{"$f":"IF($A16=\"\",\"\",'1e'!$I40)","v":""},null,null,{"$f":"IF($A17=\"\",\"\",'1e'!$I41)","v":""},null,null,{"$f":"IF($A18=\"\",\"\",'1e'!$I42)","v":""},null,null,{"$f":"IF($A19=\"\",\"\",'1e'!$I43)","v":""},null,null,{"$f":"IF($A20=\"\",\"\",'1e'!$I44)","v":""},null,null,{"$f":"IF($A21=\"\",\"\",'1e'!$I45)","v":""},null,null,{"$f":"IF($A21=\"\",\"\",'1e'!$I46)","v":""}]
[null,"Thuis"]
[{"$f":"IF(ISBLANK('1e'!$I27),\"\",'1e'!$H27)","v":1},{"$f":"IF($A3=\"\",\"\",'1e'!$I27)","v":"Barbieur Olivier"},null,null,null,{"$f":"VLOOKUP(B3&B4,namen,2,0)","v":2},"-",{"$f":"VLOOKUP(B3&B4,namen,3,0)","v":1},null,"-",null,null,"-",null,null,"-",null,null,"-",null,null,"-",null,null,"-",null,null,"-",null,null,"-",null,null,"-",null,null,"-",null,null,"-",null,null,"-",null,null,"-",null,null,"-",null,null,"-",null,null,"-",null,null,"-",null,null,"-"]
[{"$f":"IF(ISBLANK('1e'!$I28),\"\",'1e'!$H28)","v":2},{"$f":"IF($A4=\"\",\"\",'1e'!$I28)","v":"Beeckman Mark"},null,"-",null,null,null,null,null,"-",null,null,"-",null,null,"-",null,null,"-",null,null,"-",null,null,"-",null,null,"-",null,null,"-",null,null,"-",null,null,"-",null,null,"-",null,null,"-",null,null,"-",null,null,"-",null,null,"-",null,null,"-",null,null,"-",null,null,"-"]
[{"$f":"IF(ISBLANK('1e'!$I29),\"\",'1e'!$H29)","v":3},{"$f":"IF($A5=\"\",\"\",'1e'!$I29)","v":"Bockxtale Patrick"},null,"-",null,null,"-",null,null,null,null,null,"-",null,null,"-",null,null,"-",null,null,"-",null,null,"-",null,null,"-",null,null,"-",null,null,"-",null,null,"-",null,null,"-",null,null,"-",null,null,"-",null,null,"-",null,null,"-",null,null,"-",null,null,"-",null,null,"-"]
[{"$f":"IF(ISBLANK('1e'!$I30),\"\",'1e'!$H30)","v":4},{"$f":"IF($A6=\"\",\"\",'1e'!$I30)","v":"Claus Geert"},null,"-",null,null,"-",null,null,"-",null,null,null,null,null,"-",null,null,"-",null,null,"-",null,null,"-",null,null,"-",null,null,"-",null,null,"-",null,null,"-",null,null,"-",null,null,"-",null,null,"-",null,null,"-",null,null,"-",null,null,"-",null,null,"-",null,null,"-"]
[{"$f":"IF(ISBLANK('1e'!$I31),\"\",'1e'!$H31)","v":5},{"$f":"IF($A7=\"\",\"\",'1e'!$I31)","v":"Claus Odilon"},null,"-",null,null,"-",null,null,"-",null,null,"-",null,null,null,null,null,"-",null,null,"-",null,null,"-",null,null,"-",null,null,"-",null,null,"-",null,null,"-",null,null,"-",null,null,"-",null,null,"-",null,null,"-",null,null,"-",null,null,"-",null,null,"-",null,null,"-"]
[{"$f":"IF(ISBLANK('1e'!$I32),\"\",'1e'!$H32)","v":6},{"$f":"IF($A8=\"\",\"\",'1e'!$I32)","v":"Coppens Daniël"},null,"-",null,null,"-",null,null,"-",null,null,"-",null,null,"-",null,null,null,null,null,"-",null,null,"-",null,null,"-",null,null,"-",null,null,"-",null,null,"-",null,null,"-",null,null,"-",null,null,"-",null,null,"-",null,null,"-",null,null,"-",null,null,"-",null,null,"-"]
[{"$f":"IF(ISBLANK('1e'!$I33),\"\",'1e'!$H33)","v":7},{"$f":"IF($A9=\"\",\"\",'1e'!$I33)","v":"De Smet Filip"},null,"-",null,null,"-",null,null,"-",null,null,"-",null,null,"-",null,null,"-",null,null,null,null,null,"-",null,null,"-",null,null,"-",null,null,"-",null,null,"-",null,null,"-",null,null,"-",null,null,"-",null,null,"-",null,null,"-",null,null,"-",null,null,"-",null,null,"-"]
[{"$f":"IF(ISBLANK('1e'!$I34),\"\",'1e'!$H34)","v":8},{"$f":"IF($A10=\"\",\"\",'1e'!$I34)","v":"Keppens Jurgen"},null,"-",null,null,"-",null,null,"-",null,null,"-",null,null,"-",null,null,"-",null,null,"-",null,null,null,null,null,"-",null,null,"-",null,null,"-",null,null,"-",null,null,"-",null,null,"-",null,null,"-",null,null,"-",null,null,"-",null,null,"-",null,null,"-",null,null,"-"]
[{"$f":"IF(ISBLANK('1e'!$I35),\"\",'1e'!$H35)","v":9},{"$f":"IF($A11=\"\",\"\",'1e'!$I35)","v":"Rosschaert Casper"},null,"-",null,null,"-",null,null,"-",null,null,"-",null,null,"-",null,null,"-",null,null,"-",null,null,"-",null,null,null,null,null,"-",null,null,"-",null,null,"-",null,null,"-",null,null,"-",null,null,"-",null,null,"-",null,null,"-",null,null,"-",null,null,"-",null,null,"-"]
[{"$f":"IF(ISBLANK('1e'!$I36),\"\",'1e'!$H36)","v":10},{"$f":"IF($A12=\"\",\"\",'1e'!$I36)","v":"Rosschaert Peter"},null,"-",null,null,"-",null,null,"-",null,null,"-",null,null,"-",null,null,"-",null,null,"-",null,null,"-",null,null,"-",null,null,null,null,null,"-",null,null,"-",null,null,"-",null,null,"-",null,null,"-",null,null,"-",null,null,"-",null,null,"-",null,null,"-",null,null,"-"]
[{"$f":"IF(ISBLANK('1e'!$I37),\"\",'1e'!$H37)","v":11},{"$f":"IF($A13=\"\",\"\",'1e'!$I37)","v":"Vagenende Etienne"},null,"-",null,null,"-",null,null,"-",null,null,"-",null,null,"-",null,null,"-",null,null,"-",null,null,"-",null,null,"-",null,null,"-",null,null,null,null,null,"-",null,null,"-",null,null,"-",null,null,"-",null,null,"-",null,null,"-",null,null,"-",null,null,"-",null,null,"-"]
[{"$f":"IF(ISBLANK('1e'!$I38),\"\",'1e'!$H38)","v":""},{"$f":"IF($A14=\"\",\"\",'1e'!$I38)","v":""},null,"-",null,null,"-",null,null,"-",null,null,"-",null,null,"-",null,null,"-",null,null,"-",null,null,"-",null,null,"-",null,null,"-",null,null,"-",null,null,null,null,null,"-",null,null,"-",null,null,"-",null,null,"-",null,null,"-",null,null,"-",null,null,"-",null,null,"-"]
[{"$f":"IF(ISBLANK('1e'!$I39),\"\",'1e'!$H39)","v":""},{"$f":"IF($A15=\"\",\"\",'1e'!$I39)","v":""},null,"-",null,null,"-",null,null,"-",null,null,"-",null,null,"-",null,null,"-",null,null,"-",null,null,"-",null,null,"-",null,null,"-",null,null,"-",null,null,"-",null,null,null,null,null,"-",null,null,"-",null,null,"-",null,null,"-",null,null,"-",null,null,"-",null,null,"-"]
[{"$f":"IF(ISBLANK('1e'!$I40),\"\",'1e'!$H40)","v":""},{"$f":"IF($A16=\"\",\"\",'1e'!$I40)","v":""},null,"-",null,null,"-",null,null,"-",null,null,"-",null,null,"-",null,null,"-",null,null,"-",null,null,"-",null,null,"-",null,null,"-",null,null,"-",null,null,"-",null,null,"-",null,null,null,null,null,"-",null,null,"-",null,null,"-",null,null,"-",null,null,"-",null,null,"-"]
[{"$f":"IF(ISBLANK('1e'!$I41),\"\",'1e'!$H41)","v":""},{"$f":"IF($A17=\"\",\"\",'1e'!$I41)","v":""},null,"-",null,null,"-",null,null,"-",null,null,"-",null,null,"-",null,null,"-",null,null,"-",null,null,"-",null,null,"-",null,null,"-",null,null,"-",null,null,"-",null,null,"-",null,null,"-",null,null,null,null,null,"-",null,null,"-",null,null,"-",null,null,"-",null,null,"-"]
[{"$f":"IF(ISBLANK('1e'!$I42),\"\",'1e'!$H42)","v":""},{"$f":"IF($A18=\"\",\"\",'1e'!$I42)","v":""},null,"-",null,null,"-",null,null,"-",null,null,"-",null,null,"-",null,null,"-",null,null,"-",null,null,"-",null,null,"-",null,null,"-",null,null,"-",null,null,"-",null,null,"-",null,null,"-",null,null,"-",null,null,null,null,null,"-",null,null,"-",null,null,"-",null,null,"-"]
[{"$f":"IF(ISBLANK('1e'!$I43),\"\",'1e'!$H43)","v":""},{"$f":"IF($A19=\"\",\"\",'1e'!$I43)","v":""},null,"-",null,null,"-",null,null,"-",null,null,"-",null,null,"-",null,null,"-",null,null,"-",null,null,"-",null,null,"-",null,null,"-",null,null,"-",null,null,"-",null,null,"-",null,null,"-",null,null,"-",null,null,"-",null,null,null,null,null,"-",null,null,"-",null,null,"-"]
[{"$f":"IF(ISBLANK('1e'!$I44),\"\",'1e'!$H44)","v":""},{"$f":"IF($A20=\"\",\"\",'1e'!$I44)","v":""},null,"-",null,null,"-",null,null,"-",null,null,"-",null,null,"-",null,null,"-",null,null,"-",null,null,"-",null,null,"-",null,null,"-",null,null,"-",null,null,"-",null,null,"-",null,null,"-",null,null,"-",null,null,"-",null,null,"-",null,null,null,null,null,"-",null,null,"-"]
[{"$f":"IF(ISBLANK('1e'!$I45),\"\",'1e'!$H45)","v":""},{"$f":"IF($A21=\"\",\"\",'1e'!$I45)","v":""},null,"-",null,null,"-",null,null,"-",null,null,"-",null,null,"-",null,null,"-",null,null,"-",null,null,"-",null,null,"-",null,null,"-",null,null,"-",null,null,"-",null,null,"-",null,null,"-",null,null,"-",null,null,"-",null,null,"-",null,null,"-",null,null,null,null,null,"-"]
[{"$f":"IF(ISBLANK('1e'!$I46),\"\",'1e'!$H46)","v":""},{"$f":"IF($A22=\"\",\"\",'1e'!$I46)","v":""},null,"-",null,null,"-",null,null,"-",null,null,"-",null,null,"-",null,null,"-",null,null,"-",null,null,"-",null,null,"-",null,null,"-",null,null,"-",null,null,"-",null,null,"-",null,null,"-",null,null,"-",null,null,"-",null,null,"-",null,null,"-",null,null,"-"]