{"text_format":"1","workbook":"xlsx","n_sheets":3,"sheets":["WEEKPLANNING","Overzicht UITZENDBURO","Validatie"],"not_rendered":{"charts":0,"images":0,"macros":1,"external_links":0,"defined_names":5,"comments":0,"pivot_tables":0},"unopened":[],"bounds":{"document_bytes":16777216,"sheet_cells":100000,"rows_first":2000,"rows_last":500,"rows_between":2000,"halvings":0,"cell_chars":16384,"cell_head_chars":4096},"cells_cut":0,"cells_raw":0,"read":"whole","date_system":"1900"}

{"sheet":"WEEKPLANNING","index":0,"n_rows":35,"n_cols":24,"rows_kept":35,"cut":false,"hidden":false,"merged":[[2,21,2,23],[2,3,2,5],[2,6,2,8],[2,9,2,11],[2,12,2,14],[2,15,2,17],[2,18,2,20]]}
[null,null,null,null,null,"Planning"]
["Jaar","WEEK",null,{"$f":"D3","v":43829},{"$f":"D2","v":43829},{"$f":"D2","v":43829},{"$f":"G3","v":43830},{"$f":"G2","v":43830},{"$f":"G2","v":43830},{"$f":"J3","v":43831},{"$f":"J2","v":43831},{"$f":"J2","v":43831},{"$f":"M3","v":43832},{"$f":"M2","v":43832},{"$f":"M2","v":43832},{"$f":"P3","v":43833},{"$f":"P2","v":43833},{"$f":"P2","v":43833},{"$f":"S3","v":43834},{"$f":"S2","v":43834},{"$f":"S2","v":43834},{"$f":"V3","v":43835},{"$f":"V2","v":43835},{"$f":"V2","v":43835}]
[2020,1,null,{"$f":"DATE($A$3,1,4)-WEEKDAY(DATE($A$3,1,4),2)+1+(($B$3-1)*7)","v":"2019-12-30"},null,null,{"$f":"D3+1","v":"2019-12-31"},null,null,{"$f":"G3+1","v":"2020-01-01"},null,null,{"$f":"J3+1","v":"2020-01-02"},null,null,{"$f":"M3+1","v":"2020-01-03"},null,null,{"$f":"P3+1","v":"2020-01-04"},null,null,{"$f":"S3+1","v":"2020-01-05"}]
["Afdeling","Verlof","FTE","Vroeg","Laat","Nacht","Vroeg","Laat","Nacht","Vroeg","Laat","Nacht","Vroeg","Laat","Nacht","Vroeg","Laat","Nacht","Vroeg","Laat","Nacht","Vroeg","Laat","Nacht"]
["AF","Flore",1,{"$f":"IFERROR(INDEX('Overzicht UITZENDBURO'!$Q$6:$Q$150,SMALL(IF('Overzicht UITZENDBURO'!$P$6:$P$150=$A5,IF('Overzicht UITZENDBURO'!$L$6:$L$150=D$2,IF('Overzicht UITZENDBURO'!$O$6:$O$150=D$4,IF('Overzicht UITZENDBURO'!$R$6:$R$150=\"\",ROW('Overzicht UITZENDBURO'!$R$6:$R$150)-ROW($R$6)+1)))),$C5)),\"\")","v":"Klaas"},{"$f":"IFERROR(INDEX('Overzicht UITZENDBURO'!$Q$6:$Q$150,SMALL(IF('Overzicht UITZENDBURO'!$P$6:$P$150=$A5,IF('Overzicht UITZENDBURO'!$L$6:$L$150=E$2,IF('Overzicht UITZENDBURO'!$O$6:$O$150=E$4,IF('Overzicht UITZENDBURO'!$R$6:$R$150=\"\",ROW('Overzicht UITZENDBURO'!$R$6:$R$150)-ROW($R$6)+1)))),$C5)),\"\")","v":"Klaas"},{"$f":"IFERROR(INDEX('Overzicht UITZENDBURO'!$Q$6:$Q$150,SMALL(IF('Overzicht UITZENDBURO'!$P$6:$P$150=$A5,IF('Overzicht UITZENDBURO'!$L$6:$L$150=F$2,IF('Overzicht UITZENDBURO'!$O$6:$O$150=F$4,IF('Overzicht UITZENDBURO'!$R$6:$R$150=\"\",ROW('Overzicht UITZENDBURO'!$R$6:$R$150)-ROW($R$6)+1)))),$C5)),\"\")","v":""},{"$f":"IFERROR(INDEX('Overzicht UITZENDBURO'!$Q$6:$Q$150,SMALL(IF('Overzicht UITZENDBURO'!$P$6:$P$150=$A5,IF('Overzicht UITZENDBURO'!$L$6:$L$150=G$2,IF('Overzicht UITZENDBURO'!$O$6:$O$150=G$4,IF('Overzicht UITZENDBURO'!$R$6:$R$150=\"\",ROW('Overzicht UITZENDBURO'!$R$6:$R$150)-ROW($R$6)+1)))),$C5)),\"\")","v":"Peter"},{"$f":"IFERROR(INDEX('Overzicht UITZENDBURO'!$Q$6:$Q$150,SMALL(IF('Overzicht UITZENDBURO'!$P$6:$P$150=$A5,IF('Overzicht UITZENDBURO'!$L$6:$L$150=H$2,IF('Overzicht UITZENDBURO'!$O$6:$O$150=H$4,IF('Overzicht UITZENDBURO'!$R$6:$R$150=\"\",ROW('Overzicht UITZENDBURO'!$R$6:$R$150)-ROW($R$6)+1)))),$C5)),\"\")","v":""},{"$f":"IFERROR(INDEX('Overzicht UITZENDBURO'!$Q$6:$Q$150,SMALL(IF('Overzicht UITZENDBURO'!$P$6:$P$150=$A5,IF('Overzicht UITZENDBURO'!$L$6:$L$150=I$2,IF('Overzicht UITZENDBURO'!$O$6:$O$150=I$4,IF('Overzicht UITZENDBURO'!$R$6:$R$150=\"\",ROW('Overzicht UITZENDBURO'!$R$6:$R$150)-ROW($R$6)+1)))),$C5)),\"\")","v":""},{"$f":"IFERROR(INDEX('Overzicht UITZENDBURO'!$Q$6:$Q$150,SMALL(IF('Overzicht UITZENDBURO'!$P$6:$P$150=$A5,IF('Overzicht UITZENDBURO'!$L$6:$L$150=J$2,IF('Overzicht UITZENDBURO'!$O$6:$O$150=J$4,IF('Overzicht UITZENDBURO'!$R$6:$R$150=\"\",ROW('Overzicht UITZENDBURO'!$R$6:$R$150)-ROW($R$6)+1)))),$C5)),\"\")","v":"Jos"},{"$f":"IFERROR(INDEX('Overzicht UITZENDBURO'!$Q$6:$Q$150,SMALL(IF('Overzicht UITZENDBURO'!$P$6:$P$150=$A5,IF('Overzicht UITZENDBURO'!$L$6:$L$150=K$2,IF('Overzicht UITZENDBURO'!$O$6:$O$150=K$4,IF('Overzicht UITZENDBURO'!$R$6:$R$150=\"\",ROW('Overzicht UITZENDBURO'!$R$6:$R$150)-ROW($R$6)+1)))),$C5)),\"\")","v":""},{"$f":"IFERROR(INDEX('Overzicht UITZENDBURO'!$Q$6:$Q$150,SMALL(IF('Overzicht UITZENDBURO'!$P$6:$P$150=$A5,IF('Overzicht UITZENDBURO'!$L$6:$L$150=L$2,IF('Overzicht UITZENDBURO'!$O$6:$O$150=L$4,IF('Overzicht UITZENDBURO'!$R$6:$R$150=\"\",ROW('Overzicht UITZENDBURO'!$R$6:$R$150)-ROW($R$6)+1)))),$C5)),\"\")","v":""},{"$f":"IFERROR(INDEX('Overzicht UITZENDBURO'!$Q$6:$Q$150,SMALL(IF('Overzicht UITZENDBURO'!$P$6:$P$150=$A5,IF('Overzicht UITZENDBURO'!$L$6:$L$150=M$2,IF('Overzicht UITZENDBURO'!$O$6:$O$150=M$4,IF('Overzicht UITZENDBURO'!$R$6:$R$150=\"\",ROW('Overzicht UITZENDBURO'!$R$6:$R$150)-ROW($R$6)+1)))),$C5)),\"\")","v":"Ida"},{"$f":"IFERROR(INDEX('Overzicht UITZENDBURO'!$Q$6:$Q$150,SMALL(IF('Overzicht UITZENDBURO'!$P$6:$P$150=$A5,IF('Overzicht UITZENDBURO'!$L$6:$L$150=N$2,IF('Overzicht UITZENDBURO'!$O$6:$O$150=N$4,IF('Overzicht UITZENDBURO'!$R$6:$R$150=\"\",ROW('Overzicht UITZENDBURO'!$R$6:$R$150)-ROW($R$6)+1)))),$C5)),\"\")","v":""},{"$f":"IFERROR(INDEX('Overzicht UITZENDBURO'!$Q$6:$Q$150,SMALL(IF('Overzicht UITZENDBURO'!$P$6:$P$150=$A5,IF('Overzicht UITZENDBURO'!$L$6:$L$150=O$2,IF('Overzicht UITZENDBURO'!$O$6:$O$150=O$4,IF('Overzicht UITZENDBURO'!$R$6:$R$150=\"\",ROW('Overzicht UITZENDBURO'!$R$6:$R$150)-ROW($R$6)+1)))),$C5)),\"\")","v":""},{"$f":"IFERROR(INDEX('Overzicht UITZENDBURO'!$Q$6:$Q$150,SMALL(IF('Overzicht UITZENDBURO'!$P$6:$P$150=$A5,IF('Overzicht UITZENDBURO'!$L$6:$L$150=P$2,IF('Overzicht UITZENDBURO'!$O$6:$O$150=P$4,IF('Overzicht UITZENDBURO'!$R$6:$R$150=\"\",ROW('Overzicht UITZENDBURO'!$R$6:$R$150)-ROW($R$6)+1)))),$C5)),\"\")","v":""},{"$f":"IFERROR(INDEX('Overzicht UITZENDBURO'!$Q$6:$Q$150,SMALL(IF('Overzicht UITZENDBURO'!$P$6:$P$150=$A5,IF('Overzicht UITZENDBURO'!$L$6:$L$150=Q$2,IF('Overzicht UITZENDBURO'!$O$6:$O$150=Q$4,IF('Overzicht UITZENDBURO'!$R$6:$R$150=\"\",ROW('Overzicht UITZENDBURO'!$R$6:$R$150)-ROW($R$6)+1)))),$C5)),\"\")","v":""},{"$f":"IFERROR(INDEX('Overzicht UITZENDBURO'!$Q$6:$Q$150,SMALL(IF('Overzicht UITZENDBURO'!$P$6:$P$150=$A5,IF('Overzicht UITZENDBURO'!$L$6:$L$150=R$2,IF('Overzicht UITZENDBURO'!$O$6:$O$150=R$4,IF('Overzicht UITZENDBURO'!$R$6:$R$150=\"\",ROW('Overzicht UITZENDBURO'!$R$6:$R$150)-ROW($R$6)+1)))),$C5)),\"\")","v":""},{"$f":"IFERROR(INDEX('Overzicht UITZENDBURO'!$Q$6:$Q$150,SMALL(IF('Overzicht UITZENDBURO'!$P$6:$P$150=$A5,IF('Overzicht UITZENDBURO'!$L$6:$L$150=S$2,IF('Overzicht UITZENDBURO'!$O$6:$O$150=S$4,IF('Overzicht UITZENDBURO'!$R$6:$R$150=\"\",ROW('Overzicht UITZENDBURO'!$R$6:$R$150)-ROW($R$6)+1)))),$C5)),\"\")","v":""},{"$f":"IFERROR(INDEX('Overzicht UITZENDBURO'!$Q$6:$Q$150,SMALL(IF('Overzicht UITZENDBURO'!$P$6:$P$150=$A5,IF('Overzicht UITZENDBURO'!$L$6:$L$150=T$2,IF('Overzicht UITZENDBURO'!$O$6:$O$150=T$4,IF('Overzicht UITZENDBURO'!$R$6:$R$150=\"\",ROW('Overzicht UITZENDBURO'!$R$6:$R$150)-ROW($R$6)+1)))),$C5)),\"\")","v":""},{"$f":"IFERROR(INDEX('Overzicht UITZENDBURO'!$Q$6:$Q$150,SMALL(IF('Overzicht UITZENDBURO'!$P$6:$P$150=$A5,IF('Overzicht UITZENDBURO'!$L$6:$L$150=U$2,IF('Overzicht UITZENDBURO'!$O$6:$O$150=U$4,IF('Overzicht UITZENDBURO'!$R$6:$R$150=\"\",ROW('Overzicht UITZENDBURO'!$R$6:$R$150)-ROW($R$6)+1)))),$C5)),\"\")","v":""},{"$f":"IFERROR(INDEX('Overzicht UITZENDBURO'!$Q$6:$Q$150,SMALL(IF('Overzicht UITZENDBURO'!$P$6:$P$150=$A5,IF('Overzicht UITZENDBURO'!$L$6:$L$150=V$2,IF('Overzicht UITZENDBURO'!$O$6:$O$150=V$4,IF('Overzicht UITZENDBURO'!$R$6:$R$150=\"\",ROW('Overzicht UITZENDBURO'!$R$6:$R$150)-ROW($R$6)+1)))),$C5)),\"\")","v":""},{"$f":"IFERROR(INDEX('Overzicht UITZENDBURO'!$Q$6:$Q$150,SMALL(IF('Overzicht UITZENDBURO'!$P$6:$P$150=$A5,IF('Overzicht UITZENDBURO'!$L$6:$L$150=W$2,IF('Overzicht UITZENDBURO'!$O$6:$O$150=W$4,IF('Overzicht UITZENDBURO'!$R$6:$R$150=\"\",ROW('Overzicht UITZENDBURO'!$R$6:$R$150)-ROW($R$6)+1)))),$C5)),\"\")","v":""},{"$f":"IFERROR(INDEX('Overzicht UITZENDBURO'!$Q$6:$Q$150,SMALL(IF('Overzicht UITZENDBURO'!$P$6:$P$150=$A5,IF('Overzicht UITZENDBURO'!$L$6:$L$150=X$2,IF('Overzicht UITZENDBURO'!$O$6:$O$150=X$4,IF('Overzicht UITZENDBURO'!$R$6:$R$150=\"\",ROW('Overzicht UITZENDBURO'!$R$6:$R$150)-ROW($R$6)+1)))),$C5)),\"\")","v":""}]
["AF",null,2,{"$f":"IFERROR(INDEX('Overzicht UITZENDBURO'!$Q$6:$Q$150,SMALL(IF('Overzicht UITZENDBURO'!$P$6:$P$150=$A6,IF('Overzicht UITZENDBURO'!$L$6:$L$150=D$2,IF('Overzicht UITZENDBURO'!$O$6:$O$150=D$4,IF('Overzicht UITZENDBURO'!$R$6:$R$150=\"\",ROW('Overzicht UITZENDBURO'!$R$6:$R$150)-ROW($R$6)+1)))),$C6)),\"\")","v":""},{"$f":"IFERROR(INDEX('Overzicht UITZENDBURO'!$Q$6:$Q$150,SMALL(IF('Overzicht UITZENDBURO'!$P$6:$P$150=$A6,IF('Overzicht UITZENDBURO'!$L$6:$L$150=E$2,IF('Overzicht UITZENDBURO'!$O$6:$O$150=E$4,IF('Overzicht UITZENDBURO'!$R$6:$R$150=\"\",ROW('Overzicht UITZENDBURO'!$R$6:$R$150)-ROW($R$6)+1)))),$C6)),\"\")","v":""},{"$f":"IFERROR(INDEX('Overzicht UITZENDBURO'!$Q$6:$Q$150,SMALL(IF('Overzicht UITZENDBURO'!$P$6:$P$150=$A6,IF('Overzicht UITZENDBURO'!$L$6:$L$150=F$2,IF('Overzicht UITZENDBURO'!$O$6:$O$150=F$4,IF('Overzicht UITZENDBURO'!$R$6:$R$150=\"\",ROW('Overzicht UITZENDBURO'!$R$6:$R$150)-ROW($R$6)+1)))),$C6)),\"\")","v":""},{"$f":"IFERROR(INDEX('Overzicht UITZENDBURO'!$Q$6:$Q$150,SMALL(IF('Overzicht UITZENDBURO'!$P$6:$P$150=$A6,IF('Overzicht UITZENDBURO'!$L$6:$L$150=G$2,IF('Overzicht UITZENDBURO'!$O$6:$O$150=G$4,IF('Overzicht UITZENDBURO'!$R$6:$R$150=\"\",ROW('Overzicht UITZENDBURO'!$R$6:$R$150)-ROW($R$6)+1)))),$C6)),\"\")","v":""},{"$f":"IFERROR(INDEX('Overzicht UITZENDBURO'!$Q$6:$Q$150,SMALL(IF('Overzicht UITZENDBURO'!$P$6:$P$150=$A6,IF('Overzicht UITZENDBURO'!$L$6:$L$150=H$2,IF('Overzicht UITZENDBURO'!$O$6:$O$150=H$4,IF('Overzicht UITZENDBURO'!$R$6:$R$150=\"\",ROW('Overzicht UITZENDBURO'!$R$6:$R$150)-ROW($R$6)+1)))),$C6)),\"\")","v":""},{"$f":"IFERROR(INDEX('Overzicht UITZENDBURO'!$Q$6:$Q$150,SMALL(IF('Overzicht UITZENDBURO'!$P$6:$P$150=$A6,IF('Overzicht UITZENDBURO'!$L$6:$L$150=I$2,IF('Overzicht UITZENDBURO'!$O$6:$O$150=I$4,IF('Overzicht UITZENDBURO'!$R$6:$R$150=\"\",ROW('Overzicht UITZENDBURO'!$R$6:$R$150)-ROW($R$6)+1)))),$C6)),\"\")","v":""},{"$f":"IFERROR(INDEX('Overzicht UITZENDBURO'!$Q$6:$Q$150,SMALL(IF('Overzicht UITZENDBURO'!$P$6:$P$150=$A6,IF('Overzicht UITZENDBURO'!$L$6:$L$150=J$2,IF('Overzicht UITZENDBURO'!$O$6:$O$150=J$4,IF('Overzicht UITZENDBURO'!$R$6:$R$150=\"\",ROW('Overzicht UITZENDBURO'!$R$6:$R$150)-ROW($R$6)+1)))),$C6)),\"\")","v":""},{"$f":"IFERROR(INDEX('Overzicht UITZENDBURO'!$Q$6:$Q$150,SMALL(IF('Overzicht UITZENDBURO'!$P$6:$P$150=$A6,IF('Overzicht UITZENDBURO'!$L$6:$L$150=K$2,IF('Overzicht UITZENDBURO'!$O$6:$O$150=K$4,IF('Overzicht UITZENDBURO'!$R$6:$R$150=\"\",ROW('Overzicht UITZENDBURO'!$R$6:$R$150)-ROW($R$6)+1)))),$C6)),\"\")","v":""},{"$f":"IFERROR(INDEX('Overzicht UITZENDBURO'!$Q$6:$Q$150,SMALL(IF('Overzicht UITZENDBURO'!$P$6:$P$150=$A6,IF('Overzicht UITZENDBURO'!$L$6:$L$150=L$2,IF('Overzicht UITZENDBURO'!$O$6:$O$150=L$4,IF('Overzicht UITZENDBURO'!$R$6:$R$150=\"\",ROW('Overzicht UITZENDBURO'!$R$6:$R$150)-ROW($R$6)+1)))),$C6)),\"\")","v":""},{"$f":"IFERROR(INDEX('Overzicht UITZENDBURO'!$Q$6:$Q$150,SMALL(IF('Overzicht UITZENDBURO'!$P$6:$P$150=$A6,IF('Overzicht UITZENDBURO'!$L$6:$L$150=M$2,IF('Overzicht UITZENDBURO'!$O$6:$O$150=M$4,IF('Overzicht UITZENDBURO'!$R$6:$R$150=\"\",ROW('Overzicht UITZENDBURO'!$R$6:$R$150)-ROW($R$6)+1)))),$C6)),\"\")","v":"Fons"},{"$f":"IFERROR(INDEX('Overzicht UITZENDBURO'!$Q$6:$Q$150,SMALL(IF('Overzicht UITZENDBURO'!$P$6:$P$150=$A6,IF('Overzicht UITZENDBURO'!$L$6:$L$150=N$2,IF('Overzicht UITZENDBURO'!$O$6:$O$150=N$4,IF('Overzicht UITZENDBURO'!$R$6:$R$150=\"\",ROW('Overzicht UITZENDBURO'!$R$6:$R$150)-ROW($R$6)+1)))),$C6)),\"\")","v":""},{"$f":"IFERROR(INDEX('Overzicht UITZENDBURO'!$Q$6:$Q$150,SMALL(IF('Overzicht UITZENDBURO'!$P$6:$P$150=$A6,IF('Overzicht UITZENDBURO'!$L$6:$L$150=O$2,IF('Overzicht UITZENDBURO'!$O$6:$O$150=O$4,IF('Overzicht UITZENDBURO'!$R$6:$R$150=\"\",ROW('Overzicht UITZENDBURO'!$R$6:$R$150)-ROW($R$6)+1)))),$C6)),\"\")","v":""},{"$f":"IFERROR(INDEX('Overzicht UITZENDBURO'!$Q$6:$Q$150,SMALL(IF('Overzicht UITZENDBURO'!$P$6:$P$150=$A6,IF('Overzicht UITZENDBURO'!$L$6:$L$150=P$2,IF('Overzicht UITZENDBURO'!$O$6:$O$150=P$4,IF('Overzicht UITZENDBURO'!$R$6:$R$150=\"\",ROW('Overzicht UITZENDBURO'!$R$6:$R$150)-ROW($R$6)+1)))),$C6)),\"\")","v":""},{"$f":"IFERROR(INDEX('Overzicht UITZENDBURO'!$Q$6:$Q$150,SMALL(IF('Overzicht UITZENDBURO'!$P$6:$P$150=$A6,IF('Overzicht UITZENDBURO'!$L$6:$L$150=Q$2,IF('Overzicht UITZENDBURO'!$O$6:$O$150=Q$4,IF('Overzicht UITZENDBURO'!$R$6:$R$150=\"\",ROW('Overzicht UITZENDBURO'!$R$6:$R$150)-ROW($R$6)+1)))),$C6)),\"\")","v":""},{"$f":"IFERROR(INDEX('Overzicht UITZENDBURO'!$Q$6:$Q$150,SMALL(IF('Overzicht UITZENDBURO'!$P$6:$P$150=$A6,IF('Overzicht UITZENDBURO'!$L$6:$L$150=R$2,IF('Overzicht UITZENDBURO'!$O$6:$O$150=R$4,IF('Overzicht UITZENDBURO'!$R$6:$R$150=\"\",ROW('Overzicht UITZENDBURO'!$R$6:$R$150)-ROW($R$6)+1)))),$C6)),\"\")","v":""},{"$f":"IFERROR(INDEX('Overzicht UITZENDBURO'!$Q$6:$Q$150,SMALL(IF('Overzicht UITZENDBURO'!$P$6:$P$150=$A6,IF('Overzicht UITZENDBURO'!$L$6:$L$150=S$2,IF('Overzicht UITZENDBURO'!$O$6:$O$150=S$4,IF('Overzicht UITZENDBURO'!$R$6:$R$150=\"\",ROW('Overzicht UITZENDBURO'!$R$6:$R$150)-ROW($R$6)+1)))),$C6)),\"\")","v":""},{"$f":"IFERROR(INDEX('Overzicht UITZENDBURO'!$Q$6:$Q$150,SMALL(IF('Overzicht UITZENDBURO'!$P$6:$P$150=$A6,IF('Overzicht UITZENDBURO'!$L$6:$L$150=T$2,IF('Overzicht UITZENDBURO'!$O$6:$O$150=T$4,IF('Overzicht UITZENDBURO'!$R$6:$R$150=\"\",ROW('Overzicht UITZENDBURO'!$R$6:$R$150)-ROW($R$6)+1)))),$C6)),\"\")","v":""},{"$f":"IFERROR(INDEX('Overzicht UITZENDBURO'!$Q$6:$Q$150,SMALL(IF('Overzicht UITZENDBURO'!$P$6:$P$150=$A6,IF('Overzicht UITZENDBURO'!$L$6:$L$150=U$2,IF('Overzicht UITZENDBURO'!$O$6:$O$150=U$4,IF('Overzicht UITZENDBURO'!$R$6:$R$150=\"\",ROW('Overzicht UITZENDBURO'!$R$6:$R$150)-ROW($R$6)+1)))),$C6)),\"\")","v":""},{"$f":"IFERROR(INDEX('Overzicht UITZENDBURO'!$Q$6:$Q$150,SMALL(IF('Overzicht UITZENDBURO'!$P$6:$P$150=$A6,IF('Overzicht UITZENDBURO'!$L$6:$L$150=V$2,IF('Overzicht UITZENDBURO'!$O$6:$O$150=V$4,IF('Overzicht UITZENDBURO'!$R$6:$R$150=\"\",ROW('Overzicht UITZENDBURO'!$R$6:$R$150)-ROW($R$6)+1)))),$C6)),\"\")","v":""},{"$f":"IFERROR(INDEX('Overzicht UITZENDBURO'!$Q$6:$Q$150,SMALL(IF('Overzicht UITZENDBURO'!$P$6:$P$150=$A6,IF('Overzicht UITZENDBURO'!$L$6:$L$150=W$2,IF('Overzicht UITZENDBURO'!$O$6:$O$150=W$4,IF('Overzicht UITZENDBURO'!$R$6:$R$150=\"\",ROW('Overzicht UITZENDBURO'!$R$6:$R$150)-ROW($R$6)+1)))),$C6)),\"\")","v":""},{"$f":"IFERROR(INDEX('Overzicht UITZENDBURO'!$Q$6:$Q$150,SMALL(IF('Overzicht UITZENDBURO'!$P$6:$P$150=$A6,IF('Overzicht UITZENDBURO'!$L$6:$L$150=X$2,IF('Overzicht UITZENDBURO'!$O$6:$O$150=X$4,IF('Overzicht UITZENDBURO'!$R$6:$R$150=\"\",ROW('Overzicht UITZENDBURO'!$R$6:$R$150)-ROW($R$6)+1)))),$C6)),\"\")","v":""}]
{"$rows_left_out":30}
{"sheet":"Overzicht UITZENDBURO","index":1,"n_rows":150,"n_cols":18,"rows_kept":150,"cut":false,"hidden":false,"merged":[]}
[null,null,null,null,null,null,null,null,null,null,"Datum","Datum","Start","Einde","Post","Afdeling","Afdeling","Naam"]
[null,null,null,null,null,null,null,null,null,null,">43828","<43836",null,null,null,"<>HEFT","<>EMB"]
[null,"Data van uitzendburo bijvoegen"]
[null,null,null,null,null,null,null,"Enkele afdelingen b.v. EMB en HEFT   haal ik er uit door een filter. Dit is van een andere afdeling"]
[null,"Datum","Start","Einde","Post","Afdeling","Naam",null,null,null,null,"Datum","Start","Einde","Post","Afdeling","Naam","Verlof"]
[null,"2019-12-30","06:00:00","14:00:00","Vroeg","AF","Klaas",null,null,null,null,"2019-12-30","06:00:00","14:00:00","Vroeg","AF","Klaas",{"$f":"IFERROR(IF(MATCH(WEEKNUM(L6)&P6&Q6,WEEKPLANNING!$B$3&WEEKPLANNING!$A$5:$A$36&WEEKPLANNING!$B$5:$B$36,0)>0,\"V\",0),\"\")","v":""}]
{"$rows_left_out":145}
{"sheet":"Validatie","index":2,"n_rows":53,"n_cols":5,"rows_kept":53,"cut":false,"hidden":false,"merged":[]}
[1,null,2018,null,"evron"]
[2,null,2019,null,"Fien"]
[3,null,2020,null,"Flore"]
[4,null,2021,null,"Fons"]
[5,null,2022,null,"Ida"]
[6,null,2023,null,"Jan"]
{"$rows_left_out":47}