{"text_format":"1","workbook":"xlsx","n_sheets":5,"sheets":["Verlof","InfoUitzendburo","WEEKPLANNING","PlanningsFilter","Validatie"],"not_rendered":{"charts":0,"images":0,"macros":1,"external_links":0,"defined_names":10,"comments":0,"pivot_tables":0},"unopened":[],"bounds":{"document_bytes":16777216,"sheet_cells":100000,"rows_first":2000,"rows_last":500,"rows_between":2000,"halvings":0,"cell_chars":16384,"cell_head_chars":4096},"cells_cut":0,"cells_raw":0,"read":"whole","date_system":"1900"}

{"sheet":"Verlof","index":0,"n_rows":7,"n_cols":4,"rows_kept":7,"cut":false,"hidden":false,"merged":[]}
[]
[null,"Vul hier de afwezige dagen (periode) in"]
[null,"Afwezig ","van","tot en met"]
[null,"Peter","2019-12-28","2020-01-02"]
[null,"Pieter","2019-12-27","2020-01-01"]
[null,"Klaas","2019-12-30","2019-12-30"]
[null,"Mohamed","2020-01-09","2020-01-09"]

{"sheet":"InfoUitzendburo","index":1,"n_rows":939,"n_cols":15,"rows_kept":939,"cut":false,"hidden":false,"merged":[]}
[null,null,null,null,null,null,null,null,null,null,"Mijn afdelingen","Planning afdeling ",null,"NIET mijn afdelingen"]
["Info","Functie","Starttijd","Eindtijd","Voornaam","Achternaam",null,null,null,null,"ABB weekenddienst","ABB",null,"PALL HAS"]
["2019-12-01","ABB middag",43800.604166666664,43800.875,"Baki","Bos",null,null,null,null,"ABB middag","ABB",null,"PALL MEP"]
["2019-12-01","SCHM",43800.999305555553,43801.364583333336,"Rolinka","van den Bosch",null,null,null,null,"ABB ochtend ","ABB",null,"PALL Rweg"]
["2019-12-01","SCHM",43800.999305555553,43801.364583333336,"Erik","de Haan",null,null,null,null,null,null,null,"Reserve ochtend"]
["2019-12-02","ABB ochtend ",43801.25,43801.614583333336,"Flavi","van der Heyden",null,null,null,null,"AFV MEP","MEP",null,"Reserve middag"]
["2019-12-02","AFV HAS",43801.25,43801.40625,"Norbert","de Lange"]
["2019-12-02","AFV MEP",43801.25,43801.614583333336,"Houcin","Huisman",null,null,null,null,"SCHM AFV","AFV"]
["2019-12-02","LCR ochtend",43801.25,43801.614583333336,"Wolter","De bolder"]
["2019-12-02","PALL HAS",43801.25,43801.614583333336,"Henk","Koster",null,null,null,null,"SCHM","SCHM",null,"In de planning "]
["2019-12-02","PALL MEP",43801.25,43801.614583333336,"Latie","van Wijk",null,null,null,null,null,null,null,"06:00/14:45","14:45/23:30"]
["2019-12-02","PALL MEP",43801.25,43801.614583333336,"Michael","Gerritsen",null,null,null,null,"AFV HAS","HAS",null,"Voornaam + achternaam","Voornaam + achternaam"]
["2019-12-02","PALL MEP",43801.25,43801.614583333336,"Abdurahman Ibrahim","de Vries",null,null,null,null,"SCHM HAS","HAS"]
["2019-12-02","PALL MEP",43801.25,43801.614583333336,"Hans","van de Ven "]
["2019-12-02","PALL MEP",43801.25,43801.614583333336,"Jeroen","Post",null,null,null,null,"LCR middag","LCR"]
["2019-12-02","PALL Rweg",43801.25,43801.614583333336,"Akela","van Dijk",null,null,null,null,"LCR ochtend","LCR"]
["2019-12-02","PALL Rweg",43801.25,43801.614583333336,"Karrar","Kuiper"]
["2019-12-02","PALL Rweg",43801.25,43801.614583333336,"Sebastian","Kuijpers"]
["2019-12-02","PALL Rweg",43801.25,43801.614583333336,"Abdul","Jansen"]
["2019-12-02","PALL Rweg",43801.25,43801.614583333336,"Apollonia","Meijer"]
["2019-12-02","PALL Rweg",43801.25,43801.614583333336,"Naoufel","van de Velde "]
["2019-12-02","PALL Rweg",43801.25,43801.614583333336,"Jelte","van Veen"]
["2019-12-02","PALL Rweg",43801.25,43801.614583333336,"Agathe","van de Berg "]
["2019-12-02","PALL Rweg",43801.25,43801.614583333336,"Heruy","van de Wal "]
["2019-12-02","PALL Rweg",43801.25,43801.614583333336,"Hassan","Verhoeven"]
["2019-12-02","PALL Rweg",43801.25,43801.614583333336,"Sied"," van der Pol"]
["2019-12-02","PALL Rweg",43801.25,43801.614583333336,"Jarek","Kuipers"]
["2019-12-02","PALL Rweg",43801.25,43801.614583333336,"Martijn","de Ruiter"]
["2019-12-02","PALL Rweg",43801.25,43801.614583333336,"Mark","Vink"]
["2019-12-02","PALL Rweg",43801.25,43801.614583333336,"Laszlo","Scholten"]
["2019-12-02","PALL Rweg",43801.25,43801.614583333336,"Abdiqadir","de Jong"]
["2019-12-02","PALL Rweg",43801.25,43801.614583333336,"Atobhran","de Groot"]
["2019-12-02","PALL Rweg",43801.25,43801.614583333336,"Barend","Vos"]
["2019-12-02","PALL Rweg",43801.25,43801.614583333336,"Nexhmedi","Willemsen"]
["2019-12-02","SCHM",43801.25,43801.614583333336,"Rachid","van der Laan"]
["2019-12-02","SCHM",43801.25,43801.614583333336,"Evans","Vermeulen"]
["2019-12-02","SCHM",43801.25,43801.614583333336,"Kevin","Veenstra"]
["2019-12-02","SCHM AFV",43801.25,43801.614583333336,"Baki","Bos"]
["2019-12-02","SCHM AFV",43801.25,43801.614583333336,"Ilker","Peeters"]
["2019-12-02","SCHM AFV",43801.25,43801.614583333336,"Miquel","van Loon"]
["2019-12-02","SCHM AFV",43801.25,43801.614583333336,"Klaas","Kramer"]
["2019-12-02","SCHM AFV",43801.25,43801.614583333336,"Sebastiaan","Mol"]
["2019-12-02","TRSP",43801.25,43801.614583333336,"Emsud","Kok"]
["2019-12-02","TRSP",43801.25,43801.614583333336,"Reinder","Koning"]
["2019-12-02","AFV MEP",43801.291666666664,43801.65625,"Rudolf","Hofman"]
["2019-12-02","PALL Rweg",43801.3125,43801.677083333336,"Hilko","Prins"]
["2019-12-02","TRSP",43801.333333333336,43801.697916666664,"Harrie","Hoekstra"]
["2019-12-02","SCHM HAS",43801.40625,43801.614583333336,"Norbert","de Lange"]
["2019-12-02","ABB middag",43801.572916666664,43801.9375,"Trienko","Spooren"]
["2019-12-02","AFV HAS",43801.572916666664,43801.697916666664,"Paul","van Dongen"]
["2019-12-02","AFV MEP",43801.572916666664,43801.9375,"Rijk","van Doorn"]
["2019-12-02","LCR middag",43801.572916666664,43801.9375,"Christiaan","de Wit"]
["2019-12-02","PALL MEP",43801.614583333336,43801.979166666664,"Wenaron","Kurkema"]
["2019-12-02","PALL MEP",43801.614583333336,43801.979166666664,"Engin","Jacobs"]
["2019-12-02","PALL MEP",43801.614583333336,43801.979166666664,"Salahadin","Wolters"]
["2019-12-02","PALL MEP",43801.614583333336,43801.979166666664,"Dikkie","van der Meer"]
["2019-12-02","PALL MEP",43801.614583333336,43801.979166666664,"Rene","van der Velden"]
["2019-12-02","PALL MEP",43801.614583333336,43801.979166666664,"Richard","Driessen"]
["2019-12-02","PALL Rweg",43801.614583333336,43801.979166666664,"Felicia","van den Broek"]
["2019-12-02","PALL Rweg",43801.614583333336,43801.979166666664,"Gerrit","van Beek"]
["2019-12-02","PALL Rweg",43801.614583333336,43801.979166666664,"Shawn","Molenaar"]
["2019-12-02","PALL Rweg",43801.614583333336,43801.979166666664,"Elroy","van der Linden"]
["2019-12-02","PALL Rweg",43801.614583333336,43801.979166666664,"Everon","van den Heuvel"]
["2019-12-02","PALL Rweg",43801.614583333336,43801.979166666664,"Davood","Smits"]
["2019-12-02","PALL Rweg",43801.614583333336,43801.979166666664,"Arsenio","Mulder"]
["2019-12-02","PALL Rweg",43801.614583333336,43801.979166666664,"Viorel","Triest"]
["2019-12-02","PALL Rweg",43801.614583333336,43801.979166666664,"Saidou","Bosman"]
["2019-12-02","PALL Rweg",43801.614583333336,43801.979166666664,"Wim","Vogel"]
["2019-12-02","PALL Rweg",43801.614583333336,43801.979166666664,"Sebastiaan","Mol"]
["2019-12-02","PALL Rweg",43801.614583333336,43801.979166666664,"Amadou","Bakker"]
["2019-12-02","PALL Rweg",43801.614583333336,43801.979166666664,"Wout","Van Goud"]
["2019-12-02","PALL Rweg",43801.614583333336,43801.979166666664,"Fars","van de Veen"]
["2019-12-02","PALL Rweg",43801.614583333336,43801.979166666664,"Charles","Dekker"]
["2019-12-02","PALL Rweg",43801.614583333336,43801.979166666664,"Henk","Koster"]
["2019-12-02","PALL Rweg",43801.614583333336,43801.979166666664,"Ko","van de Brink"]
["2019-12-02","PALL Rweg",43801.614583333336,43801.979166666664,"Robin","Evers"]
["2019-12-02","SCHM",43801.614583333336,43801.979166666664,"Marjolein","Martens"]
["2019-12-02","SCHM",43801.614583333336,43801.979166666664,"Roy","van der Meulen"]
["2019-12-02","SCHM",43801.614583333336,43801.979166666664,"Piet","Schipper"]
["2019-12-02","SCHM AFV",43801.614583333336,43801.979166666664,"Jan","de Jonge"]
["2019-12-02","SCHM AFV",43801.614583333336,43801.979166666664,"Boyan","van Leeuwen"]
["2019-12-02","SCHM AFV",43801.614583333336,43801.979166666664,"Sami","van der Horst"]
["2019-12-02","SCHM AFV",43801.614583333336,43801.979166666664,"Henri","van Dam"]
["2019-12-02","SCHM AFV",43801.614583333336,43801.979166666664,"Michel","Jonker"]
["2019-12-02","TRSP",43801.614583333336,43801.979166666664,"Henk","Koster"]
["2019-12-02","PALL Rweg",43801.645833333336,43801.979166666664,"Amanuel","Janssen"]
["2019-12-02","SCHM HAS",43801.697916666664,43801.9375,"Paul","van Dongen"]
["2019-12-02","PALL Rweg",43801.708333333336,43801.979166666664,"Merhawi","Groen"]
["2019-12-02","SCHM",43801.916666666664,43802.28125,"Patrick","Bosch"]
["2019-12-02","SCHM",43801.916666666664,43802.28125,"Rolinka","van den Bosch"]
["2019-12-02","SCHM",43801.916666666664,43802.28125,"Erik","de Haan"]
["2019-12-03","ABB ochtend ",43802.25,43802.614583333336,"Flavi","van der Heyden"]
["2019-12-03","AFV HAS",43802.25,43802.40625,"Norbert","de Lange"]
["2019-12-03","AFV MEP",43802.25,43802.614583333336,"Houcin","Huisman"]
["2019-12-03","LCR ochtend",43802.25,43802.614583333336,"Wolter","De bolder"]
["2019-12-03","PALL HAS",43802.25,43802.614583333336,"Henk","Koster"]
["2019-12-03","PALL MEP",43802.25,43802.614583333336,"Latie","van Wijk"]
["2019-12-03","PALL MEP",43802.25,43802.614583333336,"Michael","Gerritsen"]
["2019-12-03","PALL MEP",43802.25,43802.614583333336,"Abdurahman Ibrahim","de Vries"]
["2019-12-03","PALL MEP",43802.25,43802.614583333336,"Hans","van de Ven "]
["2019-12-03","PALL MEP",43802.25,43802.614583333336,"Jeroen","Post"]
["2019-12-03","PALL Rweg",43802.25,43802.614583333336,"Akela","van Dijk"]
["2019-12-03","PALL Rweg",43802.25,43802.614583333336,"Karrar","Kuiper"]
["2019-12-03","PALL Rweg",43802.25,43802.614583333336,"Harry","Maas"]
["2019-12-03","PALL Rweg",43802.25,43802.614583333336,"Apollonia","Meijer"]
["2019-12-03","PALL Rweg",43802.25,43802.614583333336,"Naoufel","van de Velde "]
["2019-12-03","PALL Rweg",43802.25,43802.614583333336,"Dennis","de Graaf"]
["2019-12-03","PALL Rweg",43802.25,43802.614583333336,"Agathe","van de Berg "]
["2019-12-03","PALL Rweg",43802.25,43802.614583333336,"Heruy","van de Wal "]
["2019-12-03","PALL Rweg",43802.25,43802.614583333336,"Hassan","Verhoeven"]
["2019-12-03","PALL Rweg",43802.25,43802.614583333336,"Samantha","Sanders"]
["2019-12-03","PALL Rweg",43802.25,43802.614583333336,"Jarek","Kuipers"]
["2019-12-03","PALL Rweg",43802.25,43802.614583333336,"Martijn","de Ruiter"]
["2019-12-03","PALL Rweg",43802.25,43802.614583333336,"Mark","Vink"]
["2019-12-03","PALL Rweg",43802.25,43802.614583333336,"Laszlo","Scholten"]
["2019-12-03","PALL Rweg",43802.25,43802.614583333336,"Abdiqadir","de Jong"]
["2019-12-03","PALL Rweg",43802.25,43802.614583333336,"Atobhran","de Groot"]
["2019-12-03","PALL Rweg",43802.25,43802.614583333336,"Nexhmedi","Willemsen"]
["2019-12-03","PALL Rweg",43802.25,43802.614583333336,"Chevindio","Brouwer"]
["2019-12-03","PALL Rweg",43802.25,43802.614583333336,"Sied"," van der Pol"]
["2019-12-03","SCHM",43802.25,43802.614583333336,"Rachid","van der Laan"]
["2019-12-03","SCHM",43802.25,43802.614583333336,"Evans","Vermeulen"]
["2019-12-03","SCHM",43802.25,43802.614583333336,"Kevin","Veenstra"]
["2019-12-03","SCHM AFV",43802.25,43802.614583333336,"Baki","Bos"]
["2019-12-03","SCHM AFV",43802.25,43802.614583333336,"Ilker","Peeters"]
["2019-12-03","SCHM AFV",43802.25,43802.614583333336,"Miquel","van Loon"]
["2019-12-03","SCHM AFV",43802.25,43802.614583333336,"Klaas","Kramer"]
["2019-12-03","SCHM AFV",43802.25,43802.614583333336,"Sebastiaan","Mol"]
["2019-12-03","TRSP",43802.25,43802.614583333336,"Emsud","Kok"]
["2019-12-03","TRSP",43802.25,43802.614583333336,"Reinder","Koning"]
["2019-12-03","AFV MEP",43802.291666666664,43802.65625,"Rudolf","Hofman"]
["2019-12-03","PALL Rweg",43802.3125,43802.677083333336,"Hilko","Prins"]
["2019-12-03","TRSP",43802.333333333336,43802.697916666664,"Harrie","Hoekstra"]
["2019-12-03","SCHM HAS",43802.40625,43802.614583333336,"Norbert","de Lange"]
["2019-12-03","ABB middag",43802.572916666664,43802.9375,"Trienko","Spooren"]
["2019-12-03","AFV HAS",43802.572916666664,43802.697916666664,"Paul","van Dongen"]
["2019-12-03","AFV MEP",43802.572916666664,43802.9375,"Rijk","van Doorn"]
["2019-12-03","LCR middag",43802.572916666664,43802.9375,"Christiaan","de Wit"]
["2019-12-03","PALL MEP",43802.614583333336,43802.979166666664,"Wenaron","Kurkema"]
["2019-12-03","PALL MEP",43802.614583333336,43802.979166666664,"Engin","Jacobs"]
["2019-12-03","PALL MEP",43802.614583333336,43802.979166666664,"Salahadin","Wolters"]
["2019-12-03","PALL MEP",43802.614583333336,43802.979166666664,"Dikkie","van der Meer"]
["2019-12-03","PALL MEP",43802.614583333336,43802.979166666664,"Rene","van der Velden"]
["2019-12-03","PALL MEP",43802.614583333336,43802.979166666664,"Richard","Driessen"]
["2019-12-03","PALL Rweg",43802.614583333336,43802.979166666664,"Merhawi","Groen"]
["2019-12-03","PALL Rweg",43802.614583333336,43802.979166666664,"Gerrit","van Beek"]
["2019-12-03","PALL Rweg",43802.614583333336,43802.979166666664,"Shawn","Molenaar"]
["2019-12-03","PALL Rweg",43802.614583333336,43802.979166666664,"Elroy","van der Linden"]
["2019-12-03","PALL Rweg",43802.614583333336,43802.979166666664,"Everon","van den Heuvel"]
["2019-12-03","PALL Rweg",43802.614583333336,43802.979166666664,"Davood","Smits"]
["2019-12-03","PALL Rweg",43802.614583333336,43802.979166666664,"Arsenio","Mulder"]
["2019-12-03","PALL Rweg",43802.614583333336,43802.979166666664,"Viorel","Triest"]
["2019-12-03","PALL Rweg",43802.614583333336,43802.979166666664,"Saidou","Bosman"]
["2019-12-03","PALL Rweg",43802.614583333336,43802.979166666664,"Wim","Vogel"]
["2019-12-03","PALL Rweg",43802.614583333336,43802.979166666664,"Sebastiaan","Mol"]
["2019-12-03","PALL Rweg",43802.614583333336,43802.979166666664,"Amadou","Bakker"]
["2019-12-03","PALL Rweg",43802.614583333336,43802.979166666664,"Quincy","de Koning"]
["2019-12-03","PALL Rweg",43802.614583333336,43802.979166666664,"Wout","Van Goud"]
["2019-12-03","PALL Rweg",43802.614583333336,43802.979166666664,"Fetehawi","de Bruyn"]
["2019-12-03","PALL Rweg",43802.614583333336,43802.979166666664,"Charles","Dekker"]
["2019-12-03","PALL Rweg",43802.614583333336,43802.979166666664,"Henk","Koster"]
["2019-12-03","PALL Rweg",43802.614583333336,43802.979166666664,"Ko","van de Brink"]
["2019-12-03","PALL Rweg",43802.614583333336,43802.979166666664,"Robin","Evers"]
["2019-12-03","PALL Rweg",43802.614583333336,43802.979166666664,"Olcay","de Vos"]
["2019-12-03","SCHM",43802.614583333336,43802.979166666664,"Marjolein","Martens"]
["2019-12-03","SCHM",43802.614583333336,43802.979166666664,"Roy","van der Meulen"]
["2019-12-03","SCHM",43802.614583333336,43802.979166666664,"Piet","Schipper"]
["2019-12-03","SCHM AFV",43802.614583333336,43802.979166666664,"Jan","de Jonge"]
["2019-12-03","SCHM AFV",43802.614583333336,43802.979166666664,"Boyan","van Leeuwen"]
["2019-12-03","SCHM AFV",43802.614583333336,43802.979166666664,"Sami","van der Horst"]
["2019-12-03","SCHM AFV",43802.614583333336,43802.979166666664,"Henri","van Dam"]
["2019-12-03","SCHM AFV",43802.614583333336,43802.979166666664,"Michel","Jonker"]
["2019-12-03","TRSP",43802.614583333336,43802.979166666664,"Henk","Koster"]
["2019-12-03","TRSP",43802.614583333336,43802.979166666664,"Anton","Smit"]
["2019-12-03","PALL Rweg",43802.645833333336,43802.979166666664,"Amanuel","Janssen"]
["2019-12-03","PALL Rweg",43802.645833333336,43802.979166666664,"Yemane","Masout"]
["2019-12-03","PALL Rweg",43802.666666666664,43802.979166666664,"Hishelu","Blom"]
["2019-12-03","SCHM HAS",43802.697916666664,43802.9375,"Paul","van Dongen"]
["2019-12-03","SCHM",43802.916666666664,43803.28125,"Patrick","Bosch"]
["2019-12-03","SCHM",43802.916666666664,43803.28125,"Rolinka","van den Bosch"]
["2019-12-03","SCHM",43802.916666666664,43803.28125,"Erik","de Haan"]
["2019-12-04","ABB ochtend ",43803.25,43803.614583333336,"Flavi","van der Heyden"]
["2019-12-04","AFV HAS",43803.25,43803.40625,"Norbert","de Lange"]
["2019-12-04","AFV MEP",43803.25,43803.614583333336,"Houcin","Huisman"]
["2019-12-04","LCR ochtend",43803.25,43803.614583333336,"Wolter","De bolder"]
["2019-12-04","PALL HAS",43803.25,43803.614583333336,"Henk","Koster"]
["2019-12-04","PALL MEP",43803.25,43803.614583333336,"Latie","van Wijk"]
["2019-12-04","PALL MEP",43803.25,43803.614583333336,"Michael","Gerritsen"]
["2019-12-04","PALL MEP",43803.25,43803.614583333336,"Abdurahman Ibrahim","de Vries"]
["2019-12-04","PALL MEP",43803.25,43803.614583333336,"Hans","van de Ven "]
["2019-12-04","PALL MEP",43803.25,43803.614583333336,"Jeroen","Post"]
["2019-12-04","PALL Rweg",43803.25,43803.614583333336,"Akela","van Dijk"]
["2019-12-04","PALL Rweg",43803.25,43803.614583333336,"Karrar","Kuiper"]
["2019-12-04","PALL Rweg",43803.25,43803.614583333336,"Sebastian","Kuijpers"]
["2019-12-04","PALL Rweg",43803.25,43803.614583333336,"Abdul","Jansen"]
["2019-12-04","PALL Rweg",43803.25,43803.614583333336,"Harry","Maas"]
["2019-12-04","PALL Rweg",43803.25,43803.614583333336,"Naoufel","van de Velde "]
["2019-12-04","PALL Rweg",43803.25,43803.614583333336,"Dennis","de Graaf"]
["2019-12-04","PALL Rweg",43803.25,43803.614583333336,"Jelte","van Veen"]
["2019-12-04","PALL Rweg",43803.25,43803.614583333336,"Agathe","van de Berg "]
["2019-12-04","PALL Rweg",43803.25,43803.614583333336,"Heruy","van de Wal "]
["2019-12-04","PALL Rweg",43803.25,43803.614583333336,"Hassan","Verhoeven"]
["2019-12-04","PALL Rweg",43803.25,43803.614583333336,"Samantha","Sanders"]
["2019-12-04","PALL Rweg",43803.25,43803.614583333336,"Sied"," van der Pol"]
["2019-12-04","PALL Rweg",43803.25,43803.614583333336,"Jarek","Kuipers"]
["2019-12-04","PALL Rweg",43803.25,43803.614583333336,"Martijn","de Ruiter"]
["2019-12-04","PALL Rweg",43803.25,43803.614583333336,"Mark","Vink"]
["2019-12-04","PALL Rweg",43803.25,43803.614583333336,"Abdiqadir","de Jong"]
["2019-12-04","PALL Rweg",43803.25,43803.614583333336,"Mebrathu","Timmermans"]
["2019-12-04","PALL Rweg",43803.25,43803.614583333336,"Nexhmedi","Willemsen"]
["2019-12-04","SCHM",43803.25,43803.614583333336,"Rachid","van der Laan"]
["2019-12-04","SCHM",43803.25,43803.614583333336,"Evans","Vermeulen"]
["2019-12-04","SCHM",43803.25,43803.614583333336,"Kevin","Veenstra"]
["2019-12-04","SCHM AFV",43803.25,43803.614583333336,"Baki","Bos"]
["2019-12-04","SCHM AFV",43803.25,43803.614583333336,"Ilker","Peeters"]
["2019-12-04","SCHM AFV",43803.25,43803.614583333336,"Miquel","van Loon"]
["2019-12-04","SCHM AFV",43803.25,43803.614583333336,"Klaas","Kramer"]
["2019-12-04","SCHM AFV",43803.25,43803.614583333336,"Sebastiaan","Mol"]
["2019-12-04","TRSP",43803.25,43803.614583333336,"Emsud","Kok"]
["2019-12-04","TRSP",43803.25,43803.614583333336,"Reinder","Koning"]
["2019-12-04","AFV MEP",43803.291666666664,43803.65625,"Rudolf","Hofman"]
["2019-12-04","PALL Rweg",43803.3125,43803.677083333336,"Hilko","Prins"]
["2019-12-04","TRSP",43803.333333333336,43803.697916666664,"Harrie","Hoekstra"]
["2019-12-04","SCHM HAS",43803.40625,43803.614583333336,"Norbert","de Lange"]
["2019-12-04","ABB middag",43803.572916666664,43803.9375,"Trienko","Spooren"]
["2019-12-04","AFV HAS",43803.572916666664,43803.697916666664,"Paul","van Dongen"]
["2019-12-04","AFV MEP",43803.572916666664,43803.9375,"Rijk","van Doorn"]
["2019-12-04","LCR middag",43803.572916666664,43803.9375,"Christiaan","de Wit"]
["2019-12-04","PALL MEP",43803.614583333336,43803.979166666664,"Wenaron","Kurkema"]
["2019-12-04","PALL MEP",43803.614583333336,43803.979166666664,"Engin","Jacobs"]
["2019-12-04","PALL MEP",43803.614583333336,43803.979166666664,"Salahadin","Wolters"]
["2019-12-04","PALL MEP",43803.614583333336,43803.979166666664,"Dikkie","van der Meer"]
["2019-12-04","PALL MEP",43803.614583333336,43803.979166666664,"Rene","van der Velden"]
["2019-12-04","PALL MEP",43803.614583333336,43803.979166666664,"Richard","Driessen"]
["2019-12-04","PALL Rweg",43803.614583333336,43803.979166666664,"Felicia","van den Broek"]
["2019-12-04","PALL Rweg",43803.614583333336,43803.979166666664,"Merhawi","Groen"]
["2019-12-04","PALL Rweg",43803.614583333336,43803.979166666664,"Gerrit","van Beek"]
["2019-12-04","PALL Rweg",43803.614583333336,43803.979166666664,"Shawn","Molenaar"]
["2019-12-04","PALL Rweg",43803.614583333336,43803.979166666664,"Elroy","van der Linden"]
["2019-12-04","PALL Rweg",43803.614583333336,43803.979166666664,"Everon","van den Heuvel"]
["2019-12-04","PALL Rweg",43803.614583333336,43803.979166666664,"Davood","Smits"]
["2019-12-04","PALL Rweg",43803.614583333336,43803.979166666664,"Arsenio","Mulder"]
["2019-12-04","PALL Rweg",43803.614583333336,43803.979166666664,"Viorel","Triest"]
["2019-12-04","PALL Rweg",43803.614583333336,43803.979166666664,"Saidou","Bosman"]
["2019-12-04","PALL Rweg",43803.614583333336,43803.979166666664,"Wim","Vogel"]
["2019-12-04","PALL Rweg",43803.614583333336,43803.979166666664,"Sebastiaan","Mol"]
["2019-12-04","PALL Rweg",43803.614583333336,43803.979166666664,"Amadou","Bakker"]
["2019-12-04","PALL Rweg",43803.614583333336,43803.979166666664,"Wout","Van Goud"]
["2019-12-04","PALL Rweg",43803.614583333336,43803.979166666664,"Fars","van de Veen"]
["2019-12-04","PALL Rweg",43803.614583333336,43803.979166666664,"Fetehawi","de Bruyn"]
["2019-12-04","PALL Rweg",43803.614583333336,43803.979166666664,"Charles","Dekker"]
["2019-12-04","PALL Rweg",43803.614583333336,43803.979166666664,"Henk","Koster"]
["2019-12-04","PALL Rweg",43803.614583333336,43803.979166666664,"Ko","van de Brink"]
["2019-12-04","PALL Rweg",43803.614583333336,43803.979166666664,"Haben","Willems"]
["2019-12-04","PALL Rweg",43803.614583333336,43803.979166666664,"Robel","Hermans"]
["2019-12-04","PALL Rweg",43803.614583333336,43803.979166666664,"Quincy","de Koning"]
["2019-12-04","PALL Rweg",43803.614583333336,43803.979166666664,"Robin","Evers"]
["2019-12-04","SCHM",43803.614583333336,43803.979166666664,"Marjolein","Martens"]
["2019-12-04","SCHM",43803.614583333336,43803.979166666664,"Roy","van der Meulen"]
["2019-12-04","SCHM",43803.614583333336,43803.979166666664,"Piet","Schipper"]
["2019-12-04","SCHM AFV",43803.614583333336,43803.979166666664,"Jan","de Jonge"]
["2019-12-04","SCHM AFV",43803.614583333336,43803.979166666664,"Boyan","van Leeuwen"]
["2019-12-04","SCHM AFV",43803.614583333336,43803.979166666664,"Sami","van der Horst"]
["2019-12-04","SCHM AFV",43803.614583333336,43803.979166666664,"Henri","van Dam"]
["2019-12-04","SCHM AFV",43803.614583333336,43803.979166666664,"Michel","Jonker"]
["2019-12-04","TRSP",43803.614583333336,43803.979166666664,"Henk","Koster"]
["2019-12-04","TRSP",43803.614583333336,43803.979166666664,"Anton","Smit"]
["2019-12-04","PALL Rweg",43803.677083333336,43803.979166666664,"Gebrehiwet","Schouten"]
["2019-12-04","SCHM HAS",43803.697916666664,43803.9375,"Paul","van Dongen"]
["2019-12-04","SCHM",43803.916666666664,43804.28125,"Patrick","Bosch"]
["2019-12-04","SCHM",43803.916666666664,43804.28125,"Rolinka","van den Bosch"]
["2019-12-04","SCHM",43803.916666666664,43804.28125,"Erik","de Haan"]
["2019-12-05","ABB ochtend ",43804.25,43804.614583333336,"Flavi","van der Heyden"]
["2019-12-05","AFV HAS",43804.25,43804.40625,"Norbert","de Lange"]
["2019-12-05","AFV MEP",43804.25,43804.614583333336,"Houcin","Huisman"]
["2019-12-05","LCR ochtend",43804.25,43804.614583333336,"Wolter","De bolder"]
["2019-12-05","PALL HAS",43804.25,43804.614583333336,"Henk","Koster"]
["2019-12-05","PALL MEP",43804.25,43804.614583333336,"Latie","van Wijk"]
["2019-12-05","PALL MEP",43804.25,43804.614583333336,"Michael","Gerritsen"]
["2019-12-05","PALL MEP",43804.25,43804.614583333336,"Abdurahman Ibrahim","de Vries"]
["2019-12-05","PALL MEP",43804.25,43804.614583333336,"Hans","van de Ven "]
["2019-12-05","PALL MEP",43804.25,43804.614583333336,"Jeroen","Post"]
["2019-12-05","PALL Rweg",43804.25,43804.614583333336,"Akela","van Dijk"]
["2019-12-05","PALL Rweg",43804.25,43804.614583333336,"Karrar","Kuiper"]
["2019-12-05","PALL Rweg",43804.25,43804.614583333336,"Sebastian","Kuijpers"]
["2019-12-05","PALL Rweg",43804.25,43804.614583333336,"Harry","Maas"]
["2019-12-05","PALL Rweg",43804.25,43804.614583333336,"Apollonia","Meijer"]
["2019-12-05","PALL Rweg",43804.25,43804.614583333336,"Naoufel","van de Velde "]
["2019-12-05","PALL Rweg",43804.25,43804.614583333336,"Dennis","de Graaf"]
["2019-12-05","PALL Rweg",43804.25,43804.614583333336,"Agathe","van de Berg "]
["2019-12-05","PALL Rweg",43804.25,43804.614583333336,"Heruy","van de Wal "]
["2019-12-05","PALL Rweg",43804.25,43804.614583333336,"Hassan","Verhoeven"]
["2019-12-05","PALL Rweg",43804.25,43804.614583333336,"Samantha","Sanders"]
["2019-12-05","PALL Rweg",43804.25,43804.614583333336,"Sied"," van der Pol"]
["2019-12-05","PALL Rweg",43804.25,43804.614583333336,"Filimon","de Bruin"]
["2019-12-05","PALL Rweg",43804.25,43804.614583333336,"Jarek","Kuipers"]
["2019-12-05","PALL Rweg",43804.25,43804.614583333336,"Mark","Vink"]
["2019-12-05","PALL Rweg",43804.25,43804.614583333336,"Laszlo","Scholten"]
["2019-12-05","PALL Rweg",43804.25,43804.614583333336,"Abdiqadir","de Jong"]
["2019-12-05","PALL Rweg",43804.25,43804.614583333336,"Atobhran","de Groot"]
["2019-12-05","PALL Rweg",43804.25,43804.614583333336,"Nexhmedi","Willemsen"]
["2019-12-05","PALL Rweg",43804.25,43804.291666666664,"Chevindio","Brouwer"]
["2019-12-05","PALL Rweg",43804.25,43804.614583333336,"Martijn","de Ruiter"]
["2019-12-05","SCHM",43804.25,43804.614583333336,"Rachid","van der Laan"]
["2019-12-05","SCHM",43804.25,43804.614583333336,"Evans","Vermeulen"]
["2019-12-05","SCHM",43804.25,43804.614583333336,"Kevin","Veenstra"]
["2019-12-05","SCHM AFV",43804.25,43804.614583333336,"Baki","Bos"]
["2019-12-05","SCHM AFV",43804.25,43804.614583333336,"Ilker","Peeters"]
["2019-12-05","SCHM AFV",43804.25,43804.614583333336,"Miquel","van Loon"]
["2019-12-05","SCHM AFV",43804.25,43804.614583333336,"Klaas","Kramer"]
["2019-12-05","SCHM AFV",43804.25,43804.614583333336,"Sebastiaan","Mol"]
["2019-12-05","TRSP",43804.25,43804.614583333336,"Emsud","Kok"]
["2019-12-05","TRSP",43804.25,43804.614583333336,"Reinder","Koning"]
["2019-12-05","AFV MEP",43804.291666666664,43804.65625,"Rudolf","Hofman"]
["2019-12-05","PALL Rweg",43804.3125,43804.677083333336,"Hilko","Prins"]
["2019-12-05","TRSP",43804.333333333336,43804.697916666664,"Harrie","Hoekstra"]
["2019-12-05","SCHM HAS",43804.40625,43804.614583333336,"Norbert","de Lange"]
["2019-12-05","ABB middag",43804.572916666664,43804.9375,"Trienko","Spooren"]
["2019-12-05","AFV HAS",43804.572916666664,43804.697916666664,"Paul","van Dongen"]
["2019-12-05","AFV MEP",43804.572916666664,43804.9375,"Rijk","van Doorn"]
["2019-12-05","LCR middag",43804.572916666664,43804.9375,"Christiaan","de Wit"]
["2019-12-05","PALL MEP",43804.614583333336,43804.979166666664,"Wenaron","Kurkema"]
["2019-12-05","PALL MEP",43804.614583333336,43804.979166666664,"Engin","Jacobs"]
["2019-12-05","PALL MEP",43804.614583333336,43804.979166666664,"Salahadin","Wolters"]
["2019-12-05","PALL MEP",43804.614583333336,43804.979166666664,"Dikkie","van der Meer"]
["2019-12-05","PALL MEP",43804.614583333336,43804.979166666664,"Rene","van der Velden"]
["2019-12-05","PALL MEP",43804.614583333336,43804.979166666664,"Richard","Driessen"]
["2019-12-05","PALL Rweg",43804.614583333336,43804.979166666664,"Merhawi","Groen"]
["2019-12-05","PALL Rweg",43804.614583333336,43804.979166666664,"Gerrit","van Beek"]
["2019-12-05","PALL Rweg",43804.614583333336,43804.979166666664,"Shawn","Molenaar"]
["2019-12-05","PALL Rweg",43804.614583333336,43804.979166666664,"Elroy","van der Linden"]
["2019-12-05","PALL Rweg",43804.614583333336,43804.979166666664,"Tomas","Koolen"]
["2019-12-05","PALL Rweg",43804.614583333336,43804.979166666664,"Everon","van den Heuvel"]
["2019-12-05","PALL Rweg",43804.614583333336,43804.979166666664,"Hagos","van Vliet"]
["2019-12-05","PALL Rweg",43804.614583333336,43804.979166666664,"Davood","Smits"]
["2019-12-05","PALL Rweg",43804.614583333336,43804.979166666664,"Arsenio","Mulder"]
["2019-12-05","PALL Rweg",43804.614583333336,43804.979166666664,"Saidou","Bosman"]
["2019-12-05","PALL Rweg",43804.614583333336,43804.979166666664,"Olcay","de Vos"]
["2019-12-05","PALL Rweg",43804.614583333336,43804.979166666664,"Wim","Vogel"]
["2019-12-05","PALL Rweg",43804.614583333336,43804.979166666664,"Sebastiaan","Mol"]
["2019-12-05","PALL Rweg",43804.614583333336,43804.979166666664,"Amadou","Bakker"]
["2019-12-05","PALL Rweg",43804.614583333336,43804.979166666664,"Bereket","Peters"]
["2019-12-05","PALL Rweg",43804.614583333336,43804.979166666664,"Quincy","de Koning"]
["2019-12-05","PALL Rweg",43804.614583333336,43804.979166666664,"Wout","Van Goud"]
["2019-12-05","PALL Rweg",43804.614583333336,43804.791666666664,"Fars","van de Veen"]
["2019-12-05","PALL Rweg",43804.614583333336,43804.979166666664,"Charles","Dekker"]
["2019-12-05","PALL Rweg",43804.614583333336,43804.979166666664,"Henk","Koster"]
["2019-12-05","PALL Rweg",43804.614583333336,43804.979166666664,"Ko","van de Brink"]
["2019-12-05","PALL Rweg",43804.614583333336,43804.979166666664,"Haben","Willems"]
["2019-12-05","PALL Rweg",43804.614583333336,43804.979166666664,"Moussa","Boer"]
["2019-12-05","PALL Rweg",43804.614583333336,43804.979166666664,"Viorel","Triest"]
["2019-12-05","PALL Rweg",43804.614583333336,43804.979166666664,"Robin","Evers"]
["2019-12-05","SCHM",43804.614583333336,43804.979166666664,"Roy","van der Meulen"]
["2019-12-05","SCHM AFV",43804.614583333336,43804.979166666664,"Jan","de Jonge"]
["2019-12-05","SCHM AFV",43804.614583333336,43804.979166666664,"Boyan","van Leeuwen"]
["2019-12-05","SCHM AFV",43804.614583333336,43804.979166666664,"Sami","van der Horst"]
["2019-12-05","SCHM AFV",43804.614583333336,43804.979166666664,"Henri","van Dam"]
["2019-12-05","SCHM AFV",43804.614583333336,43804.979166666664,"Michel","Jonker"]
["2019-12-05","TRSP",43804.614583333336,43804.979166666664,"Henk","Koster"]
["2019-12-05","TRSP",43804.614583333336,43804.979166666664,"Anton","Smit"]
["2019-12-05","PALL Rweg",43804.645833333336,43804.979166666664,"Yemane","Masout"]
["2019-12-05","SCHM HAS",43804.697916666664,43804.9375,"Paul","van Dongen"]
["2019-12-05","SCHM",43804.916666666664,43805.28125,"Patrick","Bosch"]
["2019-12-05","SCHM",43804.916666666664,43805.28125,"Rolinka","van den Bosch"]
["2019-12-05","SCHM",43804.916666666664,43805.28125,"Erik","de Haan"]
["2019-12-06","ABB ochtend ",43805.25,43805.614583333336,"Flavi","van der Heyden"]
["2019-12-06","AFV HAS",43805.25,43805.40625,"Norbert","de Lange"]
["2019-12-06","AFV MEP",43805.25,43805.614583333336,"Houcin","Huisman"]
["2019-12-06","LCR ochtend",43805.25,43805.614583333336,"Wolter","De bolder"]
["2019-12-06","PALL HAS",43805.25,43805.614583333336,"Henk","Koster"]
["2019-12-06","PALL MEP",43805.25,43805.614583333336,"Latie","van Wijk"]
["2019-12-06","PALL MEP",43805.25,43805.614583333336,"Michael","Gerritsen"]
["2019-12-06","PALL MEP",43805.25,43805.614583333336,"Abdurahman Ibrahim","de Vries"]
["2019-12-06","PALL MEP",43805.25,43805.614583333336,"Hans","van de Ven "]
["2019-12-06","PALL MEP",43805.25,43805.614583333336,"Jeroen","Post"]
["2019-12-06","PALL Rweg",43805.25,43805.614583333336,"Akela","van Dijk"]
["2019-12-06","PALL Rweg",43805.25,43805.614583333336,"Karrar","Kuiper"]
["2019-12-06","PALL Rweg",43805.25,43805.614583333336,"Sebastian","Kuijpers"]
["2019-12-06","PALL Rweg",43805.25,43805.614583333336,"Abdul","Jansen"]
["2019-12-06","PALL Rweg",43805.25,43805.614583333336,"Apollonia","Meijer"]
["2019-12-06","PALL Rweg",43805.25,43805.614583333336,"Naoufel","van de Velde "]
["2019-12-06","PALL Rweg",43805.25,43805.614583333336,"Dennis","de Graaf"]
["2019-12-06","PALL Rweg",43805.25,43805.614583333336,"Jelte","van Veen"]
["2019-12-06","PALL Rweg",43805.25,43805.614583333336,"Agathe","van de Berg "]
["2019-12-06","PALL Rweg",43805.25,43805.614583333336,"Heruy","van de Wal "]
["2019-12-06","PALL Rweg",43805.25,43805.614583333336,"Hassan","Verhoeven"]
["2019-12-06","PALL Rweg",43805.25,43805.614583333336,"Samantha","Sanders"]
["2019-12-06","PALL Rweg",43805.25,43805.614583333336,"Sied"," van der Pol"]
["2019-12-06","PALL Rweg",43805.25,43805.614583333336,"Jarek","Kuipers"]
["2019-12-06","PALL Rweg",43805.25,43805.614583333336,"Fars","van de Veen"]
["2019-12-06","PALL Rweg",43805.25,43805.614583333336,"Mark","Vink"]
["2019-12-06","PALL Rweg",43805.25,43805.614583333336,"Laszlo","Scholten"]
["2019-12-06","PALL Rweg",43805.25,43805.614583333336,"Abdiqadir","de Jong"]
["2019-12-06","PALL Rweg",43805.25,43805.614583333336,"Atobhran","de Groot"]
["2019-12-06","PALL Rweg",43805.25,43805.614583333336,"Mebrathu","Timmermans"]
["2019-12-06","PALL Rweg",43805.25,43805.614583333336,"Nexhmedi","Willemsen"]
["2019-12-06","PALL Rweg",43805.25,43805.614583333336,"Swen","de Leeuw"]
["2019-12-06","PALL Rweg",43805.25,43805.614583333336,"Martijn","de Ruiter"]
["2019-12-06","SCHM",43805.25,43805.614583333336,"Rachid","van der Laan"]
["2019-12-06","SCHM",43805.25,43805.614583333336,"Evans","Vermeulen"]
["2019-12-06","SCHM",43805.25,43805.614583333336,"Kevin","Veenstra"]
["2019-12-06","SCHM AFV",43805.25,43805.614583333336,"Baki","Bos"]
["2019-12-06","SCHM AFV",43805.25,43805.614583333336,"Ilker","Peeters"]
["2019-12-06","SCHM AFV",43805.25,43805.614583333336,"Miquel","van Loon"]
["2019-12-06","SCHM AFV",43805.25,43805.614583333336,"Klaas","Kramer"]
["2019-12-06","SCHM AFV",43805.25,43805.614583333336,"Sebastiaan","Mol"]
["2019-12-06","TRSP",43805.25,43805.614583333336,"Emsud","Kok"]
["2019-12-06","TRSP",43805.25,43805.614583333336,"Reinder","Koning"]
["2019-12-06","AFV MEP",43805.291666666664,43805.65625,"Rudolf","Hofman"]
["2019-12-06","PALL Rweg",43805.3125,43805.677083333336,"Hilko","Prins"]
["2019-12-06","TRSP",43805.333333333336,43805.697916666664,"Harrie","Hoekstra"]
["2019-12-06","SCHM HAS",43805.40625,43805.614583333336,"Norbert","de Lange"]
["2019-12-06","ABB middag",43805.572916666664,43805.9375,"Trienko","Spooren"]
["2019-12-06","AFV HAS",43805.572916666664,43805.697916666664,"Paul","van Dongen"]
["2019-12-06","AFV MEP",43805.572916666664,43805.9375,"Rijk","van Doorn"]
["2019-12-06","LCR middag",43805.572916666664,43805.9375,"Christiaan","de Wit"]
["2019-12-06","PALL MEP",43805.614583333336,43805.979166666664,"Wenaron","Kurkema"]
["2019-12-06","PALL MEP",43805.614583333336,43805.979166666664,"Engin","Jacobs"]
["2019-12-06","PALL MEP",43805.614583333336,43805.979166666664,"Salahadin","Wolters"]
["2019-12-06","PALL MEP",43805.614583333336,43805.979166666664,"Dikkie","van der Meer"]
["2019-12-06","PALL MEP",43805.614583333336,43805.979166666664,"Rene","van der Velden"]
["2019-12-06","PALL MEP",43805.614583333336,43805.979166666664,"Richard","Driessen"]
["2019-12-06","PALL Rweg",43805.614583333336,43805.979166666664,"Felicia","van den Broek"]
["2019-12-06","PALL Rweg",43805.614583333336,43805.979166666664,"Gerrit","van Beek"]
["2019-12-06","PALL Rweg",43805.614583333336,43805.979166666664,"Shawn","Molenaar"]
["2019-12-06","PALL Rweg",43805.614583333336,43805.979166666664,"Elroy","van der Linden"]
["2019-12-06","PALL Rweg",43805.614583333336,43805.979166666664,"Everon","van den Heuvel"]
["2019-12-06","PALL Rweg",43805.614583333336,43805.979166666664,"Hagos","van Vliet"]
["2019-12-06","PALL Rweg",43805.614583333336,43805.979166666664,"Davood","Smits"]
["2019-12-06","PALL Rweg",43805.614583333336,43805.979166666664,"Arsenio","Mulder"]
["2019-12-06","PALL Rweg",43805.614583333336,43805.979166666664,"Viorel","Triest"]
["2019-12-06","PALL Rweg",43805.614583333336,43805.979166666664,"Saidou","Bosman"]
["2019-12-06","PALL Rweg",43805.614583333336,43805.979166666664,"Olcay","de Vos"]
["2019-12-06","PALL Rweg",43805.614583333336,43805.979166666664,"Wim","Vogel"]
["2019-12-06","PALL Rweg",43805.614583333336,43805.979166666664,"Sebastiaan","Mol"]
["2019-12-06","PALL Rweg",43805.614583333336,43805.979166666664,"Amadou","Bakker"]
["2019-12-06","PALL Rweg",43805.614583333336,43805.979166666664,"Bereket","Peters"]
["2019-12-06","PALL Rweg",43805.614583333336,43805.979166666664,"Quincy","de Koning"]
["2019-12-06","PALL Rweg",43805.614583333336,43805.979166666664,"Wout","Van Goud"]
["2019-12-06","PALL Rweg",43805.614583333336,43805.979166666664,"Fetehawi","de Bruyn"]
["2019-12-06","PALL Rweg",43805.614583333336,43805.979166666664,"Charles","Dekker"]
["2019-12-06","PALL Rweg",43805.614583333336,43805.979166666664,"Henk","Koster"]
["2019-12-06","PALL Rweg",43805.614583333336,43805.979166666664,"Ko","van de Brink"]
["2019-12-06","PALL Rweg",43805.614583333336,43805.979166666664,"Robin","Evers"]
["2019-12-06","SCHM",43805.614583333336,43805.979166666664,"Roy","van der Meulen"]
["2019-12-06","SCHM",43805.614583333336,43805.979166666664,"Piet","Schipper"]
["2019-12-06","SCHM AFV",43805.614583333336,43805.979166666664,"Jan","de Jonge"]
["2019-12-06","SCHM AFV",43805.614583333336,43805.979166666664,"Boyan","van Leeuwen"]
["2019-12-06","SCHM AFV",43805.614583333336,43805.979166666664,"Sami","van der Horst"]
["2019-12-06","SCHM AFV",43805.614583333336,43805.979166666664,"Henri","van Dam"]
["2019-12-06","SCHM AFV",43805.614583333336,43805.979166666664,"Michel","Jonker"]
["2019-12-06","TRSP",43805.614583333336,43805.979166666664,"Henk","Koster"]
["2019-12-06","TRSP",43805.614583333336,43805.979166666664,"Anton","Smit"]
["2019-12-06","PALL Rweg",43805.666666666664,43805.979166666664,"Robel","Hermans"]
["2019-12-06","SCHM HAS",43805.697916666664,43805.9375,"Paul","van Dongen"]
["2019-12-07","ABB weekenddienst",43806.333333333336,43806.875,"Arkan","de Boer"]
["2019-12-08","ABB weekenddienst",43807.333333333336,43807.614583333336,"Baki","Bos"]
["2019-12-08","ABB middag",43807.572916666664,43807.9375,"Flavi","van der Heyden"]
["2019-12-08","SCHM",43807.999305555553,43808.364583333336,"Rachid","van der Laan"]
["2019-12-08","SCHM",43807.999305555553,43808.364583333336,"Evans","Vermeulen"]
["2019-12-08","SCHM",43807.999305555553,43808.364583333336,"Kevin","Veenstra"]
["2019-12-09","ABB ochtend ",43808.25,43808.614583333336,"Trienko","Spooren"]
["2019-12-09","AFV HAS",43808.25,43808.40625,"Paul","van Dongen"]
["2019-12-09","AFV MEP",43808.25,43808.614583333336,"Rudolf","Hofman"]
["2019-12-09","LCR ochtend",43808.25,43808.614583333336,"Sami","van der Horst"]
["2019-12-09","LCR ochtend",43808.25,43808.614583333336,"Wolter","De bolder"]
["2019-12-09","PALL HAS",43808.25,43808.614583333336,"Henk","Koster"]
["2019-12-09","PALL MEP",43808.25,43808.614583333336,"Wenaron","Kurkema"]
["2019-12-09","PALL MEP",43808.25,43808.614583333336,"Salahadin","Wolters"]
["2019-12-09","PALL MEP",43808.25,43808.614583333336,"Dikkie","van der Meer"]
["2019-12-09","PALL MEP",43808.25,43808.614583333336,"Rene","van der Velden"]
["2019-12-09","PALL MEP",43808.25,43808.614583333336,"Richard","Driessen"]
["2019-12-09","PALL Rweg",43808.25,43808.614583333336,"Felicia","van den Broek"]
["2019-12-09","PALL Rweg",43808.25,43808.614583333336,"Shawn","Molenaar"]
["2019-12-09","PALL Rweg",43808.25,43808.614583333336,"Elroy","van der Linden"]
["2019-12-09","PALL Rweg",43808.25,43808.614583333336,"Swen","de Leeuw"]
["2019-12-09","PALL Rweg",43808.25,43808.614583333336,"Arsenio","Mulder"]
["2019-12-09","PALL Rweg",43808.25,43808.614583333336,"Viorel","Triest"]
["2019-12-09","PALL Rweg",43808.25,43808.614583333336,"Olcay","de Vos"]
["2019-12-09","PALL Rweg",43808.25,43808.614583333336,"Sebastiaan","Mol"]
["2019-12-09","PALL Rweg",43808.25,43808.614583333336,"Amadou","Bakker"]
["2019-12-09","PALL Rweg",43808.25,43808.614583333336,"Wout","Van Goud"]
["2019-12-09","PALL Rweg",43808.25,43808.614583333336,"Fars","van de Veen"]
["2019-12-09","PALL Rweg",43808.25,43808.614583333336,"Magdalena","Postma"]
["2019-12-09","PALL Rweg",43808.25,43808.614583333336,"Charles","Dekker"]
["2019-12-09","PALL Rweg",43808.25,43808.614583333336,"Ko","van de Brink"]
["2019-12-09","PALL Rweg",43808.25,43808.614583333336,"Gerrit","van Beek"]
["2019-12-09","PALL Rweg",43808.25,43808.614583333336,"Everon","van den Heuvel"]
["2019-12-09","PALL Rweg",43808.25,43808.614583333336,"Davood","Smits"]
["2019-12-09","PALL Rweg",43808.25,43808.614583333336,"Saidou","Bosman"]
["2019-12-09","PALL Rweg",43808.25,43808.614583333336,"Wim","Vogel"]
["2019-12-09","PALL Rweg",43808.25,43808.614583333336,"Quincy","de Koning"]
["2019-12-09","PALL Rweg",43808.25,43808.614583333336,"Henk","Koster"]
["2019-12-09","Reserve ochtend",43808.25,43808.614583333336,"Robin","Evers"]
["2019-12-09","SCHM",43808.25,43808.614583333336,"Marjolein","Martens"]
["2019-12-09","SCHM",43808.25,43808.614583333336,"Piet","Schipper"]
["2019-12-09","SCHM",43808.25,43808.614583333336,"Roy","van der Meulen"]
["2019-12-09","SCHM AFV",43808.25,43808.614583333336,"Christiaan","de Wit"]
["2019-12-09","SCHM AFV",43808.25,43808.614583333336,"Henri","van Dam"]
["2019-12-09","SCHM AFV",43808.25,43808.614583333336,"Jan","de Jonge"]
["2019-12-09","SCHM AFV",43808.25,43808.614583333336,"Boyan","van Leeuwen"]
["2019-12-09","SCHM AFV",43808.25,43808.614583333336,"Michel","Jonker"]
["2019-12-09","TRSP",43808.25,43808.614583333336,"Anton","Smit"]
["2019-12-09","TRSP",43808.25,43808.614583333336,"Henk","Koster"]
["2019-12-09","AFV MEP",43808.291666666664,43808.65625,"Rijk","van Doorn"]
["2019-12-09","Teamleider PALL",43808.3125,43808.677083333336,"Hilko","Prins"]
["2019-12-09","TRSP",43808.333333333336,43808.697916666664,"Harrie","Hoekstra"]
["2019-12-09","SCHM HAS",43808.40625,43808.614583333336,"Paul","van Dongen"]
["2019-12-09","ABB middag",43808.572916666664,43808.9375,"Bile","Hendriks"]
["2019-12-09","ABB middag",43808.572916666664,43808.9375,"Flavi","van der Heyden"]
["2019-12-09","AFV HAS",43808.572916666664,43808.697916666664,"Norbert","de Lange"]
["2019-12-09","AFV MEP",43808.572916666664,43808.9375,"Houcin","Huisman"]
["2019-12-09","LCR middag",43808.572916666664,43808.9375,"Klaas","Kramer"]
["2019-12-09","PALL MEP",43808.614583333336,43808.979166666664,"Latie","van Wijk"]
["2019-12-09","PALL MEP",43808.614583333336,43808.979166666664,"Abdurahman Ibrahim","de Vries"]
["2019-12-09","PALL MEP",43808.614583333336,43808.979166666664,"Michael","Gerritsen"]
["2019-12-09","PALL MEP",43808.614583333336,43808.979166666664,"Hans","van de Ven "]
["2019-12-09","PALL MEP",43808.614583333336,43808.979166666664,"Jeroen","Post"]
["2019-12-09","PALL Rweg",43808.614583333336,43808.979166666664,"Akela","van Dijk"]
["2019-12-09","PALL Rweg",43808.614583333336,43808.979166666664,"Karrar","Kuiper"]
["2019-12-09","PALL Rweg",43808.614583333336,43808.979166666664,"Sebastian","Kuijpers"]
["2019-12-09","PALL Rweg",43808.614583333336,43808.979166666664,"Harry","Maas"]
["2019-12-09","PALL Rweg",43808.614583333336,43808.979166666664,"Apollonia","Meijer"]
["2019-12-09","PALL Rweg",43808.614583333336,43808.979166666664,"Agathe","van de Berg "]
["2019-12-09","PALL Rweg",43808.614583333336,43808.979166666664,"Heruy","van de Wal "]
["2019-12-09","PALL Rweg",43808.614583333336,43808.979166666664,"Hassan","Verhoeven"]
["2019-12-09","PALL Rweg",43808.614583333336,43808.979166666664,"Samantha","Sanders"]
["2019-12-09","PALL Rweg",43808.614583333336,43808.979166666664,"Sied"," van der Pol"]
["2019-12-09","PALL Rweg",43808.614583333336,43808.979166666664,"Laszlo","Scholten"]
["2019-12-09","PALL Rweg",43808.614583333336,43808.979166666664,"Atobhran","de Groot"]
["2019-12-09","PALL Rweg",43808.614583333336,43808.979166666664,"Abdul","Jansen"]
["2019-12-09","PALL Rweg",43808.614583333336,43808.979166666664,"Naoufel","van de Velde "]
["2019-12-09","PALL Rweg",43808.614583333336,43808.979166666664,"Niek","Smeets"]
["2019-12-09","PALL Rweg",43808.614583333336,43808.979166666664,"Jarek","Kuipers"]
["2019-12-09","PALL Rweg",43808.614583333336,43808.979166666664,"Martijn","de Ruiter"]
["2019-12-09","PALL Rweg",43808.614583333336,43808.979166666664,"Mark","Vink"]
["2019-12-09","PALL Rweg",43808.614583333336,43808.979166666664,"Abdiqadir","de Jong"]
["2019-12-09","PALL Rweg",43808.614583333336,43808.979166666664,"Nexhmedi","Willemsen"]
["2019-12-09","SCHM",43808.614583333336,43808.979166666664,"Erik","de Haan"]
["2019-12-09","SCHM",43808.614583333336,43808.979166666664,"Patrick","Bosch"]
["2019-12-09","SCHM",43808.614583333336,43808.979166666664,"Rolinka","van den Bosch"]
["2019-12-09","SCHM AFV",43808.614583333336,43808.979166666664,"Miquel","van Loon"]
["2019-12-09","SCHM AFV",43808.614583333336,43808.979166666664,"Paul","van Dongen"]
["2019-12-09","SCHM AFV",43808.614583333336,43808.979166666664,"Sebastiaan","Mol"]
["2019-12-09","SCHM AFV",43808.614583333336,43808.979166666664,"Baki","Bos"]
["2019-12-09","SCHM AFV",43808.614583333336,43808.979166666664,"Ilker","Peeters"]
["2019-12-09","TRSP",43808.614583333336,43808.979166666664,"Emsud","Kok"]
["2019-12-09","TRSP",43808.614583333336,43808.979166666664,"Reinder","Koning"]
["2019-12-09","PALL Rweg",43808.645833333336,43808.979166666664,"Amanuel","Janssen"]
["2019-12-09","PALL Rweg",43808.666666666664,43808.979166666664,"Gebrehiwet","Schouten"]
["2019-12-09","Reserve middag",43808.666666666664,43808.979166666664,"Bereket","Peters"]
["2019-12-09","SCHM HAS",43808.697916666664,43808.9375,"Norbert","de Lange"]
["2019-12-09","SCHM",43808.916666666664,43809.28125,"Rachid","van der Laan"]
["2019-12-09","SCHM",43808.916666666664,43809.28125,"Evans","Vermeulen"]
["2019-12-09","SCHM",43808.916666666664,43809.28125,"Kevin","Veenstra"]
["2019-12-10","ABB ochtend ",43809.25,43809.614583333336,"Trienko","Spooren"]
["2019-12-10","AFV HAS",43809.25,43809.40625,"Paul","van Dongen"]
["2019-12-10","AFV MEP",43809.25,43809.614583333336,"Rudolf","Hofman"]
["2019-12-10","LCR ochtend",43809.25,43809.614583333336,"Sami","van der Horst"]
["2019-12-10","LCR ochtend",43809.25,43809.614583333336,"Wolter","De bolder"]
["2019-12-10","PALL HAS",43809.25,43809.614583333336,"Henk","Koster"]
["2019-12-10","PALL MEP",43809.25,43809.614583333336,"Wenaron","Kurkema"]
["2019-12-10","PALL MEP",43809.25,43809.614583333336,"Salahadin","Wolters"]
["2019-12-10","PALL MEP",43809.25,43809.614583333336,"Dikkie","van der Meer"]
["2019-12-10","PALL MEP",43809.25,43809.614583333336,"Rene","van der Velden"]
["2019-12-10","PALL MEP",43809.25,43809.614583333336,"Richard","Driessen"]
["2019-12-10","PALL Rweg",43809.25,43809.614583333336,"Shawn","Molenaar"]
["2019-12-10","PALL Rweg",43809.25,43809.614583333336,"Elroy","van der Linden"]
["2019-12-10","PALL Rweg",43809.25,43809.614583333336,"Arsenio","Mulder"]
["2019-12-10","PALL Rweg",43809.25,43809.614583333336,"Viorel","Triest"]
["2019-12-10","PALL Rweg",43809.25,43809.614583333336,"Olcay","de Vos"]
["2019-12-10","PALL Rweg",43809.25,43809.614583333336,"Amadou","Bakker"]
["2019-12-10","PALL Rweg",43809.25,43809.614583333336,"Wout","Van Goud"]
["2019-12-10","PALL Rweg",43809.25,43809.614583333336,"Magdalena","Postma"]
["2019-12-10","PALL Rweg",43809.25,43809.614583333336,"Charles","Dekker"]
["2019-12-10","PALL Rweg",43809.25,43809.614583333336,"Ko","van de Brink"]
["2019-12-10","PALL Rweg",43809.25,43809.614583333336,"Robin","Evers"]
["2019-12-10","PALL Rweg",43809.25,43809.614583333336,"Gerrit","van Beek"]
["2019-12-10","PALL Rweg",43809.25,43809.614583333336,"Everon","van den Heuvel"]
["2019-12-10","PALL Rweg",43809.25,43809.614583333336,"Davood","Smits"]
["2019-12-10","PALL Rweg",43809.25,43809.614583333336,"Swen","de Leeuw"]
["2019-12-10","PALL Rweg",43809.25,43809.614583333336,"Saidou","Bosman"]
["2019-12-10","PALL Rweg",43809.25,43809.614583333336,"Wim","Vogel"]
["2019-12-10","PALL Rweg",43809.25,43809.614583333336,"Quincy","de Koning"]
["2019-12-10","PALL Rweg",43809.25,43809.614583333336,"Henk","Koster"]
["2019-12-10","SCHM",43809.25,43809.614583333336,"Marjolein","Martens"]
["2019-12-10","SCHM",43809.25,43809.614583333336,"Piet","Schipper"]
["2019-12-10","SCHM",43809.25,43809.614583333336,"Roy","van der Meulen"]
["2019-12-10","SCHM AFV",43809.25,43809.614583333336,"Christiaan","de Wit"]
["2019-12-10","SCHM AFV",43809.25,43809.614583333336,"Henri","van Dam"]
["2019-12-10","SCHM AFV",43809.25,43809.614583333336,"Jan","de Jonge"]
["2019-12-10","SCHM AFV",43809.25,43809.614583333336,"Boyan","van Leeuwen"]
["2019-12-10","SCHM AFV",43809.25,43809.614583333336,"Michel","Jonker"]
["2019-12-10","TRSP",43809.25,43809.614583333336,"Anton","Smit"]
["2019-12-10","TRSP",43809.25,43809.614583333336,"Henk","Koster"]
["2019-12-10","AFV MEP",43809.291666666664,43809.65625,"Rijk","van Doorn"]
["2019-12-10","Teamleider PALL",43809.3125,43809.677083333336,"Hilko","Prins"]
["2019-12-10","TRSP",43809.333333333336,43809.697916666664,"Harrie","Hoekstra"]
["2019-12-10","SCHM HAS",43809.40625,43809.614583333336,"Paul","van Dongen"]
["2019-12-10","Reserve ochtend",43809.458333333336,43809.614583333336,"Fars","van de Veen"]
["2019-12-10","ABB middag",43809.572916666664,43809.9375,"Bile","Hendriks"]
["2019-12-10","ABB middag",43809.572916666664,43809.9375,"Flavi","van der Heyden"]
["2019-12-10","AFV HAS",43809.572916666664,43809.697916666664,"Norbert","de Lange"]
["2019-12-10","AFV MEP",43809.572916666664,43809.9375,"Houcin","Huisman"]
["2019-12-10","LCR middag",43809.572916666664,43809.9375,"Klaas","Kramer"]
["2019-12-10","PALL MEP",43809.614583333336,43809.979166666664,"Latie","van Wijk"]
["2019-12-10","PALL MEP",43809.614583333336,43809.979166666664,"Abdurahman Ibrahim","de Vries"]
["2019-12-10","PALL MEP",43809.614583333336,43809.979166666664,"Michael","Gerritsen"]
["2019-12-10","PALL MEP",43809.614583333336,43809.979166666664,"Hans","van de Ven "]
["2019-12-10","PALL MEP",43809.614583333336,43809.979166666664,"Jeroen","Post"]
["2019-12-10","PALL Rweg",43809.614583333336,43809.979166666664,"Akela","van Dijk"]
["2019-12-10","PALL Rweg",43809.614583333336,43809.979166666664,"Karrar","Kuiper"]
["2019-12-10","PALL Rweg",43809.614583333336,43809.979166666664,"Sebastian","Kuijpers"]
["2019-12-10","PALL Rweg",43809.614583333336,43809.979166666664,"Chevindio","Brouwer"]
["2019-12-10","PALL Rweg",43809.614583333336,43809.979166666664,"Harry","Maas"]
["2019-12-10","PALL Rweg",43809.614583333336,43809.979166666664,"Apollonia","Meijer"]
["2019-12-10","PALL Rweg",43809.614583333336,43809.979166666664,"Dennis","de Graaf"]
["2019-12-10","PALL Rweg",43809.614583333336,43809.979166666664,"Agathe","van de Berg "]
["2019-12-10","PALL Rweg",43809.614583333336,43809.979166666664,"Heruy","van de Wal "]
["2019-12-10","PALL Rweg",43809.614583333336,43809.979166666664,"Hassan","Verhoeven"]
["2019-12-10","PALL Rweg",43809.614583333336,43809.979166666664,"Samantha","Sanders"]
["2019-12-10","PALL Rweg",43809.614583333336,43809.979166666664,"Sied"," van der Pol"]
["2019-12-10","PALL Rweg",43809.614583333336,43809.979166666664,"Atobhran","de Groot"]
["2019-12-10","PALL Rweg",43809.614583333336,43809.979166666664,"Abdul","Jansen"]
["2019-12-10","PALL Rweg",43809.614583333336,43809.979166666664,"Naoufel","van de Velde "]
["2019-12-10","PALL Rweg",43809.614583333336,43809.979166666664,"Niek","Smeets"]
["2019-12-10","PALL Rweg",43809.614583333336,43809.979166666664,"Jarek","Kuipers"]
["2019-12-10","PALL Rweg",43809.614583333336,43809.979166666664,"Martijn","de Ruiter"]
["2019-12-10","PALL Rweg",43809.614583333336,43809.979166666664,"Mark","Vink"]
["2019-12-10","PALL Rweg",43809.614583333336,43809.979166666664,"Abdiqadir","de Jong"]
["2019-12-10","PALL Rweg",43809.614583333336,43809.979166666664,"Nexhmedi","Willemsen"]
["2019-12-10","SCHM",43809.614583333336,43809.979166666664,"Erik","de Haan"]
["2019-12-10","SCHM",43809.614583333336,43809.979166666664,"Patrick","Bosch"]
["2019-12-10","SCHM",43809.614583333336,43809.979166666664,"Rolinka","van den Bosch"]
["2019-12-10","SCHM AFV",43809.614583333336,43809.979166666664,"Miquel","van Loon"]
["2019-12-10","SCHM AFV",43809.614583333336,43809.979166666664,"Paul","van Dongen"]
["2019-12-10","SCHM AFV",43809.614583333336,43809.979166666664,"Sebastiaan","Mol"]
["2019-12-10","SCHM AFV",43809.614583333336,43809.979166666664,"Baki","Bos"]
["2019-12-10","SCHM AFV",43809.614583333336,43809.979166666664,"Ilker","Peeters"]
["2019-12-10","TRSP",43809.614583333336,43809.979166666664,"Emsud","Kok"]
["2019-12-10","TRSP",43809.614583333336,43809.979166666664,"Reinder","Koning"]
["2019-12-10","PALL Rweg",43809.645833333336,43809.979166666664,"Amanuel","Janssen"]
["2019-12-10","Reserve middag",43809.666666666664,43809.979166666664,"Haben","Willems"]
["2019-12-10","Reserve middag",43809.666666666664,43809.979166666664,"Bereket","Peters"]
["2019-12-10","Reserve middag",43809.666666666664,43809.979166666664,"Gebrehiwet","Schouten"]
["2019-12-10","Reserve middag",43809.666666666664,43809.979166666664,"Robel","Hermans"]
["2019-12-10","SCHM HAS",43809.697916666664,43809.9375,"Norbert","de Lange"]
["2019-12-10","SCHM",43809.916666666664,43810.28125,"Rachid","van der Laan"]
["2019-12-10","SCHM",43809.916666666664,43810.28125,"Evans","Vermeulen"]
["2019-12-10","SCHM",43809.916666666664,43810.28125,"Kevin","Veenstra"]
["2019-12-11","ABB ochtend ",43810.25,43810.614583333336,"Trienko","Spooren"]
["2019-12-11","AFV HAS",43810.25,43810.40625,"Paul","van Dongen"]
["2019-12-11","AFV MEP",43810.25,43810.614583333336,"Rudolf","Hofman"]
["2019-12-11","LCR ochtend",43810.25,43810.614583333336,"Sami","van der Horst"]
["2019-12-11","LCR ochtend",43810.25,43810.614583333336,"Wolter","De bolder"]
["2019-12-11","PALL HAS",43810.25,43810.614583333336,"Henk","Koster"]
["2019-12-11","PALL MEP",43810.25,43810.614583333336,"Wenaron","Kurkema"]
["2019-12-11","PALL MEP",43810.25,43810.614583333336,"Salahadin","Wolters"]
["2019-12-11","PALL MEP",43810.25,43810.614583333336,"Dikkie","van der Meer"]
["2019-12-11","PALL MEP",43810.25,43810.614583333336,"Rene","van der Velden"]
["2019-12-11","PALL MEP",43810.25,43810.614583333336,"Richard","Driessen"]
["2019-12-11","PALL Rweg",43810.25,43810.614583333336,"Felicia","van den Broek"]
["2019-12-11","PALL Rweg",43810.25,43810.614583333336,"Elroy","van der Linden"]
["2019-12-11","PALL Rweg",43810.25,43810.614583333336,"Arsenio","Mulder"]
["2019-12-11","PALL Rweg",43810.25,43810.614583333336,"Viorel","Triest"]
["2019-12-11","PALL Rweg",43810.25,43810.614583333336,"Olcay","de Vos"]
["2019-12-11","PALL Rweg",43810.25,43810.614583333336,"Sebastiaan","Mol"]
["2019-12-11","PALL Rweg",43810.25,43810.614583333336,"Amadou","Bakker"]
["2019-12-11","PALL Rweg",43810.25,43810.614583333336,"Wout","Van Goud"]
["2019-12-11","PALL Rweg",43810.25,43810.614583333336,"Magdalena","Postma"]
["2019-12-11","PALL Rweg",43810.25,43810.614583333336,"Charles","Dekker"]
["2019-12-11","PALL Rweg",43810.25,43810.614583333336,"Ko","van de Brink"]
["2019-12-11","PALL Rweg",43810.25,43810.614583333336,"Robin","Evers"]
["2019-12-11","PALL Rweg",43810.25,43810.614583333336,"Gerrit","van Beek"]
["2019-12-11","PALL Rweg",43810.25,43810.614583333336,"Everon","van den Heuvel"]
["2019-12-11","PALL Rweg",43810.25,43810.614583333336,"Davood","Smits"]
["2019-12-11","PALL Rweg",43810.25,43810.614583333336,"Swen","de Leeuw"]
["2019-12-11","PALL Rweg",43810.25,43810.614583333336,"Saidou","Bosman"]
["2019-12-11","PALL Rweg",43810.25,43810.614583333336,"Wim","Vogel"]
["2019-12-11","PALL Rweg",43810.25,43810.614583333336,"Quincy","de Koning"]
["2019-12-11","PALL Rweg",43810.25,43810.614583333336,"Daniel","Dijkstra"]
["2019-12-11","PALL Rweg",43810.25,43810.614583333336,"Henk","Koster"]
["2019-12-11","Reserve ochtend",43810.25,43810.614583333336,"Shawn","Molenaar"]
["2019-12-11","Reserve ochtend",43810.25,43810.614583333336,"Fars","van de Veen"]
["2019-12-11","Reserve ochtend",43810.25,43810.614583333336,"Mebrathu","Timmermans"]
["2019-12-11","SCHM",43810.25,43810.614583333336,"Marjolein","Martens"]
["2019-12-11","SCHM",43810.25,43810.614583333336,"Piet","Schipper"]
["2019-12-11","SCHM",43810.25,43810.614583333336,"Roy","van der Meulen"]
["2019-12-11","SCHM AFV",43810.25,43810.614583333336,"Christiaan","de Wit"]
["2019-12-11","SCHM AFV",43810.25,43810.614583333336,"Henri","van Dam"]
["2019-12-11","SCHM AFV",43810.25,43810.614583333336,"Jan","de Jonge"]
["2019-12-11","SCHM AFV",43810.25,43810.614583333336,"Boyan","van Leeuwen"]
["2019-12-11","SCHM AFV",43810.25,43810.614583333336,"Michel","Jonker"]
["2019-12-11","TRSP",43810.25,43810.614583333336,"Anton","Smit"]
["2019-12-11","TRSP",43810.25,43810.614583333336,"Henk","Koster"]
["2019-12-11","AFV MEP",43810.291666666664,43810.65625,"Rijk","van Doorn"]
["2019-12-11","Teamleider PALL",43810.3125,43810.677083333336,"Hilko","Prins"]
["2019-12-11","TRSP",43810.333333333336,43810.697916666664,"Harrie","Hoekstra"]
["2019-12-11","SCHM HAS",43810.40625,43810.614583333336,"Paul","van Dongen"]
["2019-12-11","ABB middag",43810.572916666664,43810.9375,"Bile","Hendriks"]
["2019-12-11","AFV HAS",43810.572916666664,43810.697916666664,"Norbert","de Lange"]
["2019-12-11","AFV MEP",43810.572916666664,43810.9375,"Houcin","Huisman"]
["2019-12-11","LCR middag",43810.572916666664,43810.9375,"Sebastiaan","Mol"]
["2019-12-11","PALL MEP",43810.614583333336,43810.979166666664,"Latie","van Wijk"]
["2019-12-11","PALL MEP",43810.614583333336,43810.979166666664,"Abdurahman Ibrahim","de Vries"]
["2019-12-11","PALL MEP",43810.614583333336,43810.979166666664,"Michael","Gerritsen"]
["2019-12-11","PALL MEP",43810.614583333336,43810.979166666664,"Hans","van de Ven "]
["2019-12-11","PALL MEP",43810.614583333336,43810.979166666664,"Jeroen","Post"]
["2019-12-11","PALL Rweg",43810.614583333336,43810.979166666664,"Akela","van Dijk"]
["2019-12-11","PALL Rweg",43810.614583333336,43810.979166666664,"Karrar","Kuiper"]
["2019-12-11","PALL Rweg",43810.614583333336,43810.979166666664,"Sebastian","Kuijpers"]
["2019-12-11","PALL Rweg",43810.614583333336,43810.979166666664,"Chevindio","Brouwer"]
["2019-12-11","PALL Rweg",43810.614583333336,43810.979166666664,"Harry","Maas"]
["2019-12-11","PALL Rweg",43810.614583333336,43810.979166666664,"Dennis","de Graaf"]
["2019-12-11","PALL Rweg",43810.614583333336,43810.979166666664,"Jelte","van Veen"]
["2019-12-11","PALL Rweg",43810.614583333336,43810.979166666664,"Agathe","van de Berg "]
["2019-12-11","PALL Rweg",43810.614583333336,43810.979166666664,"Amanuel","Janssen"]
["2019-12-11","PALL Rweg",43810.614583333336,43810.979166666664,"Hassan","Verhoeven"]
["2019-12-11","PALL Rweg",43810.614583333336,43810.979166666664,"Samantha","Sanders"]
["2019-12-11","PALL Rweg",43810.614583333336,43810.979166666664,"Sied"," van der Pol"]
["2019-12-11","PALL Rweg",43810.614583333336,43810.979166666664,"Ambroise","Visser"]
["2019-12-11","PALL Rweg",43810.614583333336,43810.979166666664,"Atobhran","de Groot"]
["2019-12-11","PALL Rweg",43810.614583333336,43810.979166666664,"Abdul","Jansen"]
["2019-12-11","PALL Rweg",43810.614583333336,43810.979166666664,"Naoufel","van de Velde "]
["2019-12-11","PALL Rweg",43810.614583333336,43810.979166666664,"Niek","Smeets"]
["2019-12-11","PALL Rweg",43810.614583333336,43810.979166666664,"Jarek","Kuipers"]
["2019-12-11","PALL Rweg",43810.614583333336,43810.979166666664,"Martijn","de Ruiter"]
["2019-12-11","PALL Rweg",43810.614583333336,43810.979166666664,"Mark","Vink"]
["2019-12-11","PALL Rweg",43810.614583333336,43810.979166666664,"Abdiqadir","de Jong"]
["2019-12-11","PALL Rweg",43810.614583333336,43810.979166666664,"Nexhmedi","Willemsen"]
["2019-12-11","Reserve middag",43810.614583333336,43810.979166666664,"Tomas","Koolen"]
["2019-12-11","Reserve middag",43810.614583333336,43810.979166666664,"Heruy","van de Wal "]
["2019-12-11","Reserve middag",43810.614583333336,43810.979166666664,"Tesfaldet","Verbeek"]
["2019-12-11","Reserve middag",43810.614583333336,43810.979166666664,"Laszlo","Scholten"]
["2019-12-11","Reserve middag",43810.614583333336,43810.979166666664,"Gebrehiwet","Schouten"]
["2019-12-11","SCHM",43810.614583333336,43810.979166666664,"Erik","de Haan"]
["2019-12-11","SCHM",43810.614583333336,43810.979166666664,"Patrick","Bosch"]
["2019-12-11","SCHM",43810.614583333336,43810.979166666664,"Rolinka","van den Bosch"]
["2019-12-11","SCHM AFV",43810.614583333336,43810.979166666664,"Paul","van Dongen"]
["2019-12-11","SCHM AFV",43810.614583333336,43810.979166666664,"Baki","Bos"]
["2019-12-11","SCHM AFV",43810.614583333336,43810.979166666664,"Ilker","Peeters"]
["2019-12-11","SCHM AFV",43810.614583333336,43810.979166666664,"Flavi","van der Heyden"]
["2019-12-11","TRSP",43810.614583333336,43810.979166666664,"Emsud","Kok"]
["2019-12-11","TRSP",43810.614583333336,43810.979166666664,"Reinder","Koning"]
["2019-12-11","SCHM HAS",43810.697916666664,43810.9375,"Norbert","de Lange"]
["2019-12-11","SCHM",43810.916666666664,43811.28125,"Rachid","van der Laan"]
["2019-12-11","SCHM",43810.916666666664,43811.28125,"Evans","Vermeulen"]
["2019-12-11","SCHM",43810.916666666664,43811.28125,"Kevin","Veenstra"]
["2019-12-12","ABB ochtend ",43811.25,43811.614583333336,"Trienko","Spooren"]
["2019-12-12","AFV HAS",43811.25,43811.40625,"Paul","van Dongen"]
["2019-12-12","AFV MEP",43811.25,43811.614583333336,"Rudolf","Hofman"]
["2019-12-12","LCR ochtend",43811.25,43811.614583333336,"Sami","van der Horst"]
["2019-12-12","PALL HAS",43811.25,43811.614583333336,"Henk","Koster"]
["2019-12-12","PALL MEP",43811.25,43811.614583333336,"Wenaron","Kurkema"]
["2019-12-12","PALL MEP",43811.25,43811.614583333336,"Salahadin","Wolters"]
["2019-12-12","PALL MEP",43811.25,43811.614583333336,"Dikkie","van der Meer"]
["2019-12-12","PALL MEP",43811.25,43811.614583333336,"Rene","van der Velden"]
["2019-12-12","PALL MEP",43811.25,43811.614583333336,"Richard","Driessen"]
["2019-12-12","PALL Rweg",43811.25,43811.614583333336,"Elroy","van der Linden"]
["2019-12-12","PALL Rweg",43811.25,43811.614583333336,"Arsenio","Mulder"]
["2019-12-12","PALL Rweg",43811.25,43811.614583333336,"Viorel","Triest"]
["2019-12-12","PALL Rweg",43811.25,43811.614583333336,"Olcay","de Vos"]
["2019-12-12","PALL Rweg",43811.25,43811.614583333336,"Sebastiaan","Mol"]
["2019-12-12","PALL Rweg",43811.25,43811.614583333336,"Amadou","Bakker"]
["2019-12-12","PALL Rweg",43811.25,43811.614583333336,"Wout","Van Goud"]
["2019-12-12","PALL Rweg",43811.25,43811.614583333336,"Fars","van de Veen"]
["2019-12-12","PALL Rweg",43811.25,43811.614583333336,"Magdalena","Postma"]
["2019-12-12","PALL Rweg",43811.25,43811.614583333336,"Charles","Dekker"]
["2019-12-12","PALL Rweg",43811.25,43811.614583333336,"Ko","van de Brink"]
["2019-12-12","PALL Rweg",43811.25,43811.614583333336,"Robin","Evers"]
["2019-12-12","PALL Rweg",43811.25,43811.614583333336,"Gerrit","van Beek"]
["2019-12-12","PALL Rweg",43811.25,43811.614583333336,"Everon","van den Heuvel"]
["2019-12-12","PALL Rweg",43811.25,43811.614583333336,"Davood","Smits"]
["2019-12-12","PALL Rweg",43811.25,43811.614583333336,"Swen","de Leeuw"]
["2019-12-12","PALL Rweg",43811.25,43811.614583333336,"Saidou","Bosman"]
["2019-12-12","PALL Rweg",43811.25,43811.614583333336,"Wim","Vogel"]
["2019-12-12","PALL Rweg",43811.25,43811.614583333336,"Quincy","de Koning"]
["2019-12-12","PALL Rweg",43811.25,43811.614583333336,"Daniel","Dijkstra"]
["2019-12-12","PALL Rweg",43811.25,43811.614583333336,"Henk","Koster"]
["2019-12-12","SCHM",43811.25,43811.614583333336,"Marjolein","Martens"]
["2019-12-12","SCHM",43811.25,43811.614583333336,"Piet","Schipper"]
["2019-12-12","SCHM",43811.25,43811.614583333336,"Roy","van der Meulen"]
["2019-12-12","SCHM AFV",43811.25,43811.614583333336,"Christiaan","de Wit"]
["2019-12-12","SCHM AFV",43811.25,43811.614583333336,"Henri","van Dam"]
["2019-12-12","SCHM AFV",43811.25,43811.614583333336,"Jan","de Jonge"]
["2019-12-12","SCHM AFV",43811.25,43811.614583333336,"Boyan","van Leeuwen"]
["2019-12-12","SCHM AFV",43811.25,43811.614583333336,"Michel","Jonker"]
["2019-12-12","TRSP",43811.25,43811.614583333336,"Anton","Smit"]
["2019-12-12","TRSP",43811.25,43811.614583333336,"Henk","Koster"]
["2019-12-12","AFV MEP",43811.291666666664,43811.65625,"Rijk","van Doorn"]
["2019-12-12","Teamleider PALL",43811.3125,43811.677083333336,"Hilko","Prins"]
["2019-12-12","TRSP",43811.333333333336,43811.697916666664,"Harrie","Hoekstra"]
["2019-12-12","SCHM HAS",43811.40625,43811.614583333336,"Paul","van Dongen"]
["2019-12-12","ABB middag",43811.572916666664,43811.9375,"Bile","Hendriks"]
["2019-12-12","AFV HAS",43811.572916666664,43811.697916666664,"Norbert","de Lange"]
["2019-12-12","AFV MEP",43811.572916666664,43811.9375,"Houcin","Huisman"]
["2019-12-12","LCR middag",43811.572916666664,43811.9375,"Klaas","Kramer"]
["2019-12-12","PALL MEP",43811.614583333336,43811.979166666664,"Latie","van Wijk"]
["2019-12-12","PALL MEP",43811.614583333336,43811.979166666664,"Abdurahman Ibrahim","de Vries"]
["2019-12-12","PALL MEP",43811.614583333336,43811.979166666664,"Michael","Gerritsen"]
["2019-12-12","PALL MEP",43811.614583333336,43811.979166666664,"Hans","van de Ven "]
["2019-12-12","PALL MEP",43811.614583333336,43811.979166666664,"Jeroen","Post"]
["2019-12-12","PALL Rweg",43811.614583333336,43811.979166666664,"Akela","van Dijk"]
["2019-12-12","PALL Rweg",43811.614583333336,43811.979166666664,"Karrar","Kuiper"]
["2019-12-12","PALL Rweg",43811.614583333336,43811.979166666664,"Chevindio","Brouwer"]
["2019-12-12","PALL Rweg",43811.614583333336,43811.979166666664,"Haben","Willems"]
["2019-12-12","PALL Rweg",43811.614583333336,43811.979166666664,"Harry","Maas"]
["2019-12-12","PALL Rweg",43811.614583333336,43811.979166666664,"Apollonia","Meijer"]
["2019-12-12","PALL Rweg",43811.614583333336,43811.979166666664,"Dennis","de Graaf"]
["2019-12-12","PALL Rweg",43811.614583333336,43811.979166666664,"Agathe","van de Berg "]
["2019-12-12","PALL Rweg",43811.614583333336,43811.979166666664,"Tomas","Koolen"]
["2019-12-12","PALL Rweg",43811.614583333336,43811.979166666664,"Heruy","van de Wal "]
["2019-12-12","PALL Rweg",43811.614583333336,43811.979166666664,"Hassan","Verhoeven"]
["2019-12-12","PALL Rweg",43811.614583333336,43811.979166666664,"Samantha","Sanders"]
["2019-12-12","PALL Rweg",43811.614583333336,43811.979166666664,"Sied"," van der Pol"]
["2019-12-12","PALL Rweg",43811.614583333336,43811.979166666664,"Laszlo","Scholten"]
["2019-12-12","PALL Rweg",43811.614583333336,43811.979166666664,"Atobhran","de Groot"]
["2019-12-12","PALL Rweg",43811.614583333336,43811.979166666664,"Abdul","Jansen"]
["2019-12-12","PALL Rweg",43811.614583333336,43811.979166666664,"Naoufel","van de Velde "]
["2019-12-12","PALL Rweg",43811.614583333336,43811.979166666664,"Jarek","Kuipers"]
["2019-12-12","PALL Rweg",43811.614583333336,43811.979166666664,"Martijn","de Ruiter"]
["2019-12-12","PALL Rweg",43811.614583333336,43811.979166666664,"Mark","Vink"]
["2019-12-12","PALL Rweg",43811.614583333336,43811.979166666664,"Abdiqadir","de Jong"]
["2019-12-12","PALL Rweg",43811.614583333336,43811.979166666664,"Nexhmedi","Willemsen"]
["2019-12-12","Reserve middag",43811.614583333336,43811.979166666664,"Sebastian","Kuijpers"]
["2019-12-12","Reserve middag",43811.614583333336,43811.979166666664,"Amanuel","Janssen"]
["2019-12-12","SCHM",43811.614583333336,43811.979166666664,"Erik","de Haan"]
["2019-12-12","SCHM",43811.614583333336,43811.979166666664,"Patrick","Bosch"]
["2019-12-12","SCHM",43811.614583333336,43811.979166666664,"Rolinka","van den Bosch"]
["2019-12-12","SCHM AFV",43811.614583333336,43811.979166666664,"Miquel","van Loon"]
["2019-12-12","SCHM AFV",43811.614583333336,43811.979166666664,"Paul","van Dongen"]
["2019-12-12","SCHM AFV",43811.614583333336,43811.979166666664,"Sebastiaan","Mol"]
["2019-12-12","SCHM AFV",43811.614583333336,43811.979166666664,"Baki","Bos"]
["2019-12-12","SCHM AFV",43811.614583333336,43811.979166666664,"Ilker","Peeters"]
["2019-12-12","SCHM AFV",43811.614583333336,43811.979166666664,"Flavi","van der Heyden"]
["2019-12-12","TRSP",43811.614583333336,43811.979166666664,"Emsud","Kok"]
["2019-12-12","TRSP",43811.614583333336,43811.979166666664,"Reinder","Koning"]
["2019-12-12","SCHM HAS",43811.697916666664,43811.9375,"Norbert","de Lange"]
["2019-12-12","SCHM",43811.916666666664,43812.28125,"Rachid","van der Laan"]
["2019-12-12","SCHM",43811.916666666664,43812.28125,"Evans","Vermeulen"]
["2019-12-12","SCHM",43811.916666666664,43812.28125,"Kevin","Veenstra"]
["2019-12-13","ABB ochtend ",43812.25,43812.614583333336,"Trienko","Spooren"]
["2019-12-13","AFV HAS",43812.25,43812.40625,"Paul","van Dongen"]
["2019-12-13","AFV MEP",43812.25,43812.614583333336,"Rudolf","Hofman"]
["2019-12-13","LCR ochtend",43812.25,43812.614583333336,"Sami","van der Horst"]
["2019-12-13","LCR ochtend",43812.25,43812.614583333336,"Wolter","De bolder"]
["2019-12-13","PALL HAS",43812.25,43812.614583333336,"Henk","Koster"]
["2019-12-13","PALL MEP",43812.25,43812.614583333336,"Wenaron","Kurkema"]
["2019-12-13","PALL MEP",43812.25,43812.614583333336,"Salahadin","Wolters"]
["2019-12-13","PALL MEP",43812.25,43812.614583333336,"Dikkie","van der Meer"]
["2019-12-13","PALL MEP",43812.25,43812.614583333336,"Rene","van der Velden"]
["2019-12-13","PALL MEP",43812.25,43812.614583333336,"Richard","Driessen"]
["2019-12-13","PALL Rweg",43812.25,43812.614583333336,"Felicia","van den Broek"]
["2019-12-13","PALL Rweg",43812.25,43812.614583333336,"Jelte","van Veen"]
["2019-12-13","PALL Rweg",43812.25,43812.614583333336,"Shawn","Molenaar"]
["2019-12-13","PALL Rweg",43812.25,43812.614583333336,"Elroy","van der Linden"]
["2019-12-13","PALL Rweg",43812.25,43812.614583333336,"Arsenio","Mulder"]
["2019-12-13","PALL Rweg",43812.25,43812.614583333336,"Viorel","Triest"]
["2019-12-13","PALL Rweg",43812.25,43812.614583333336,"Sebastiaan","Mol"]
["2019-12-13","PALL Rweg",43812.25,43812.614583333336,"Amadou","Bakker"]
["2019-12-13","PALL Rweg",43812.25,43812.614583333336,"Wout","Van Goud"]
["2019-12-13","PALL Rweg",43812.25,43812.614583333336,"Fars","van de Veen"]
["2019-12-13","PALL Rweg",43812.25,43812.614583333336,"Magdalena","Postma"]
["2019-12-13","PALL Rweg",43812.25,43812.614583333336,"Charles","Dekker"]
["2019-12-13","PALL Rweg",43812.25,43812.614583333336,"Ko","van de Brink"]
["2019-12-13","PALL Rweg",43812.25,43812.614583333336,"Robin","Evers"]
["2019-12-13","PALL Rweg",43812.25,43812.614583333336,"Gerrit","van Beek"]
["2019-12-13","PALL Rweg",43812.25,43812.614583333336,"Everon","van den Heuvel"]
["2019-12-13","PALL Rweg",43812.25,43812.614583333336,"Davood","Smits"]
["2019-12-13","PALL Rweg",43812.25,43812.614583333336,"Swen","de Leeuw"]
["2019-12-13","PALL Rweg",43812.25,43812.614583333336,"Saidou","Bosman"]
["2019-12-13","PALL Rweg",43812.25,43812.614583333336,"Wim","Vogel"]
["2019-12-13","PALL Rweg",43812.25,43812.614583333336,"Quincy","de Koning"]
["2019-12-13","PALL Rweg",43812.25,43812.614583333336,"Henk","Koster"]
["2019-12-13","Reserve ochtend",43812.25,43812.614583333336,"Olcay","de Vos"]
["2019-12-13","Reserve ochtend",43812.25,43812.614583333336,"Mebrathu","Timmermans"]
["2019-12-13","Reserve ochtend",43812.25,43812.614583333336,"Daniel","Dijkstra"]
["2019-12-13","SCHM",43812.25,43812.614583333336,"Marjolein","Martens"]
["2019-12-13","SCHM",43812.25,43812.614583333336,"Piet","Schipper"]
["2019-12-13","SCHM",43812.25,43812.614583333336,"Roy","van der Meulen"]
["2019-12-13","SCHM AFV",43812.25,43812.614583333336,"Christiaan","de Wit"]
["2019-12-13","SCHM AFV",43812.25,43812.614583333336,"Henri","van Dam"]
["2019-12-13","SCHM AFV",43812.25,43812.614583333336,"Jan","de Jonge"]
["2019-12-13","SCHM AFV",43812.25,43812.614583333336,"Boyan","van Leeuwen"]
["2019-12-13","SCHM AFV",43812.25,43812.614583333336,"Michel","Jonker"]
["2019-12-13","TRSP",43812.25,43812.614583333336,"Anton","Smit"]
["2019-12-13","TRSP",43812.25,43812.614583333336,"Henk","Koster"]
["2019-12-13","AFV MEP",43812.291666666664,43812.65625,"Rijk","van Doorn"]
["2019-12-13","Teamleider PALL",43812.3125,43812.677083333336,"Hilko","Prins"]
["2019-12-13","TRSP",43812.333333333336,43812.697916666664,"Harrie","Hoekstra"]
["2019-12-13","SCHM HAS",43812.40625,43812.614583333336,"Paul","van Dongen"]
["2019-12-13","ABB middag",43812.572916666664,43812.9375,"Bile","Hendriks"]
["2019-12-13","AFV HAS",43812.572916666664,43812.697916666664,"Norbert","de Lange"]
["2019-12-13","AFV MEP",43812.572916666664,43812.9375,"Houcin","Huisman"]
["2019-12-13","LCR middag",43812.572916666664,43812.9375,"Klaas","Kramer"]
["2019-12-13","PALL MEP",43812.614583333336,43812.979166666664,"Latie","van Wijk"]
["2019-12-13","PALL MEP",43812.614583333336,43812.979166666664,"Abdurahman Ibrahim","de Vries"]
["2019-12-13","PALL MEP",43812.614583333336,43812.979166666664,"Michael","Gerritsen"]
["2019-12-13","PALL MEP",43812.614583333336,43812.979166666664,"Hans","van de Ven "]
["2019-12-13","PALL MEP",43812.614583333336,43812.979166666664,"Jeroen","Post"]
["2019-12-13","PALL Rweg",43812.614583333336,43812.979166666664,"Akela","van Dijk"]
["2019-12-13","PALL Rweg",43812.614583333336,43812.979166666664,"Karrar","Kuiper"]
["2019-12-13","PALL Rweg",43812.614583333336,43812.979166666664,"Sebastian","Kuijpers"]
["2019-12-13","PALL Rweg",43812.614583333336,43812.979166666664,"Harry","Maas"]
["2019-12-13","PALL Rweg",43812.614583333336,43812.979166666664,"Apollonia","Meijer"]
["2019-12-13","PALL Rweg",43812.614583333336,43812.979166666664,"Dennis","de Graaf"]
["2019-12-13","PALL Rweg",43812.614583333336,43812.979166666664,"Agathe","van de Berg "]
["2019-12-13","PALL Rweg",43812.614583333336,43812.979166666664,"Hagos","van Vliet"]
["2019-12-13","PALL Rweg",43812.614583333336,43812.979166666664,"Heruy","van de Wal "]
["2019-12-13","PALL Rweg",43812.614583333336,43812.979166666664,"Hassan","Verhoeven"]
["2019-12-13","PALL Rweg",43812.614583333336,43812.979166666664,"Samantha","Sanders"]
["2019-12-13","PALL Rweg",43812.614583333336,43812.979166666664,"Sied"," van der Pol"]
["2019-12-13","PALL Rweg",43812.614583333336,43812.979166666664,"Laszlo","Scholten"]
["2019-12-13","PALL Rweg",43812.614583333336,43812.979166666664,"Atobhran","de Groot"]
["2019-12-13","PALL Rweg",43812.614583333336,43812.979166666664,"Abdul","Jansen"]
["2019-12-13","PALL Rweg",43812.614583333336,43812.979166666664,"Naoufel","van de Velde "]
["2019-12-13","PALL Rweg",43812.614583333336,43812.979166666664,"Jarek","Kuipers"]
["2019-12-13","PALL Rweg",43812.614583333336,43812.979166666664,"Martijn","de Ruiter"]
["2019-12-13","PALL Rweg",43812.614583333336,43812.979166666664,"Mark","Vink"]
["2019-12-13","PALL Rweg",43812.614583333336,43812.979166666664,"Abdiqadir","de Jong"]
["2019-12-13","PALL Rweg",43812.614583333336,43812.979166666664,"Nexhmedi","Willemsen"]
["2019-12-13","SCHM",43812.614583333336,43812.979166666664,"Erik","de Haan"]
["2019-12-13","SCHM",43812.614583333336,43812.979166666664,"Patrick","Bosch"]
["2019-12-13","SCHM",43812.614583333336,43812.979166666664,"Rolinka","van den Bosch"]
["2019-12-13","SCHM AFV",43812.614583333336,43812.979166666664,"Miquel","van Loon"]
["2019-12-13","SCHM AFV",43812.614583333336,43812.979166666664,"Paul","van Dongen"]
["2019-12-13","SCHM AFV",43812.614583333336,43812.979166666664,"Sebastiaan","Mol"]
["2019-12-13","SCHM AFV",43812.614583333336,43812.979166666664,"Baki","Bos"]
["2019-12-13","SCHM AFV",43812.614583333336,43812.979166666664,"Ilker","Peeters"]
["2019-12-13","SCHM AFV",43812.614583333336,43812.979166666664,"Flavi","van der Heyden"]
["2019-12-13","TRSP",43812.614583333336,43812.979166666664,"Emsud","Kok"]
["2019-12-13","TRSP",43812.614583333336,43812.979166666664,"Reinder","Koning"]
["2019-12-13","PALL Rweg",43812.645833333336,43812.979166666664,"Amanuel","Janssen"]
["2019-12-13","Reserve middag",43812.666666666664,43812.979166666664,"Bereket","Peters"]
["2019-12-13","Reserve middag",43812.666666666664,43812.979166666664,"Gebrehiwet","Schouten"]
["2019-12-13","Reserve middag",43812.666666666664,43812.979166666664,"Robel","Hermans"]
["2019-12-13","SCHM HAS",43812.697916666664,43812.9375,"Norbert","de Lange"]
["2019-12-14","ABB weekenddienst",43813.333333333336,43813.875,"Niek","Smeets"]
["2019-12-01","ABB weekenddienst",43800.333333333336,43800.614583333336,"Flavi","van der Heyden"]

{"sheet":"WEEKPLANNING","index":2,"n_rows":38,"n_cols":24,"rows_kept":38,"cut":false,"hidden":false,"merged":[[2,21,2,23],[2,3,2,5],[2,6,2,8],[2,9,2,11],[2,12,2,14],[2,15,2,17],[2,18,2,20]]}
[null,null,null,null,null,"Planning"]
["Jaar","WEEK",null,{"$f":"D3","v":"2019-12-02"},{"$f":"D2","v":43801},{"$f":"D2","v":43801},{"$f":"G3","v":43802},{"$f":"G2","v":43802},{"$f":"G2","v":43802},{"$f":"J3","v":43803},{"$f":"J2","v":43803},{"$f":"J2","v":43803},{"$f":"M3","v":43804},{"$f":"M2","v":43804},{"$f":"M2","v":43804},{"$f":"P3","v":43805},{"$f":"P2","v":43805},{"$f":"P2","v":43805},{"$f":"S3","v":43806},{"$f":"S2","v":43806},{"$f":"S2","v":43806},{"$f":"V3","v":43807},{"$f":"V2","v":43807},{"$f":"V2","v":43807}]
[2019,49,null,{"$f":"DATE($A$3,1,4)-WEEKDAY(DATE($A$3,1,4),2)+1+(($B$3-1)*7)","v":"2019-12-02"},null,null,{"$f":"D3+1","v":"2019-12-03"},null,null,{"$f":"G3+1","v":"2019-12-04"},null,null,{"$f":"J3+1","v":"2019-12-05"},null,null,{"$f":"M3+1","v":"2019-12-06"},null,null,{"$f":"P3+1","v":"2019-12-07"},null,null,{"$f":"S3+1","v":"2019-12-08"}]
["Afdeling",null,"FTE","Vroeg","Laat","Nacht","Vroeg","Laat","Nacht","Vroeg","Laat","Nacht","Vroeg","Laat","Nacht","Vroeg","Laat","Nacht","Vroeg","Laat","Nacht","Vroeg","Laat","Nacht"]
["WERKTIJDEN",null,null,"06:00/14:45","14:45/23:30",null,"06:00/14:45","14:45/23:30",null,"06:00/14:45","14:45/23:30",null,"06:00/14:45","14:45/23:30",null,"06:00/14:45","14:45/23:30",null,"06:00/14:45","14:45/23:30",null,"06:00/14:45","14:45/23:30"]
["AFV",null,1,{"$f":"IFERROR(INDEX(PlanningsFilter!$L$6:$L$1000,SMALL(IF(PlanningsFilter!$K$6:$K$1000=$A6,IF(PlanningsFilter!$C$6:$C$1000=D$2,IF(PlanningsFilter!$J$6:$J$1000=D$4,IF(PlanningsFilter!$I$6:$I$1000=\"\",ROW(PlanningsFilter!$I$6:$I$1000)-ROW($I$6)+1)))),$C6)),\"\")","v":"Baki Bos"},{"$f":"IFERROR(INDEX(PlanningsFilter!$L$6:$L$1000,SMALL(IF(PlanningsFilter!$K$6:$K$1000=$A6,IF(PlanningsFilter!$C$6:$C$1000=E$2,IF(PlanningsFilter!$J$6:$J$1000=E$4,IF(PlanningsFilter!$I$6:$I$1000=\"\",ROW(PlanningsFilter!$I$6:$I$1000)-ROW($I$6)+1)))),$C6)),\"\")","v":"Jan de Jonge"},{"$f":"IFERROR(INDEX(PlanningsFilter!$L$6:$L$1000,SMALL(IF(PlanningsFilter!$K$6:$K$1000=$A6,IF(PlanningsFilter!$C$6:$C$1000=F$2,IF(PlanningsFilter!$J$6:$J$1000=F$4,IF(PlanningsFilter!$I$6:$I$1000=\"\",ROW(PlanningsFilter!$I$6:$I$1000)-ROW($I$6)+1)))),$C6)),\"\")","v":""},{"$f":"IFERROR(INDEX(PlanningsFilter!$L$6:$L$1000,SMALL(IF(PlanningsFilter!$K$6:$K$1000=$A6,IF(PlanningsFilter!$C$6:$C$1000=G$2,IF(PlanningsFilter!$J$6:$J$1000=G$4,IF(PlanningsFilter!$I$6:$I$1000=\"\",ROW(PlanningsFilter!$I$6:$I$1000)-ROW($I$6)+1)))),$C6)),\"\")","v":"Baki Bos"},{"$f":"IFERROR(INDEX(PlanningsFilter!$L$6:$L$1000,SMALL(IF(PlanningsFilter!$K$6:$K$1000=$A6,IF(PlanningsFilter!$C$6:$C$1000=H$2,IF(PlanningsFilter!$J$6:$J$1000=H$4,IF(PlanningsFilter!$I$6:$I$1000=\"\",ROW(PlanningsFilter!$I$6:$I$1000)-ROW($I$6)+1)))),$C6)),\"\")","v":"Jan de Jonge"},{"$f":"IFERROR(INDEX(PlanningsFilter!$L$6:$L$1000,SMALL(IF(PlanningsFilter!$K$6:$K$1000=$A6,IF(PlanningsFilter!$C$6:$C$1000=I$2,IF(PlanningsFilter!$J$6:$J$1000=I$4,IF(PlanningsFilter!$I$6:$I$1000=\"\",ROW(PlanningsFilter!$I$6:$I$1000)-ROW($I$6)+1)))),$C6)),\"\")","v":""},{"$f":"IFERROR(INDEX(PlanningsFilter!$L$6:$L$1000,SMALL(IF(PlanningsFilter!$K$6:$K$1000=$A6,IF(PlanningsFilter!$C$6:$C$1000=J$2,IF(PlanningsFilter!$J$6:$J$1000=J$4,IF(PlanningsFilter!$I$6:$I$1000=\"\",ROW(PlanningsFilter!$I$6:$I$1000)-ROW($I$6)+1)))),$C6)),\"\")","v":"Baki Bos"},{"$f":"IFERROR(INDEX(PlanningsFilter!$L$6:$L$1000,SMALL(IF(PlanningsFilter!$K$6:$K$1000=$A6,IF(PlanningsFilter!$C$6:$C$1000=K$2,IF(PlanningsFilter!$J$6:$J$1000=K$4,IF(PlanningsFilter!$I$6:$I$1000=\"\",ROW(PlanningsFilter!$I$6:$I$1000)-ROW($I$6)+1)))),$C6)),\"\")","v":"Jan de Jonge"},{"$f":"IFERROR(INDEX(PlanningsFilter!$L$6:$L$1000,SMALL(IF(PlanningsFilter!$K$6:$K$1000=$A6,IF(PlanningsFilter!$C$6:$C$1000=L$2,IF(PlanningsFilter!$J$6:$J$1000=L$4,IF(PlanningsFilter!$I$6:$I$1000=\"\",ROW(PlanningsFilter!$I$6:$I$1000)-ROW($I$6)+1)))),$C6)),\"\")","v":""},{"$f":"IFERROR(INDEX(PlanningsFilter!$L$6:$L$1000,SMALL(IF(PlanningsFilter!$K$6:$K$1000=$A6,IF(PlanningsFilter!$C$6:$C$1000=M$2,IF(PlanningsFilter!$J$6:$J$1000=M$4,IF(PlanningsFilter!$I$6:$I$1000=\"\",ROW(PlanningsFilter!$I$6:$I$1000)-ROW($I$6)+1)))),$C6)),\"\")","v":"Baki Bos"},{"$f":"IFERROR(INDEX(PlanningsFilter!$L$6:$L$1000,SMALL(IF(PlanningsFilter!$K$6:$K$1000=$A6,IF(PlanningsFilter!$C$6:$C$1000=N$2,IF(PlanningsFilter!$J$6:$J$1000=N$4,IF(PlanningsFilter!$I$6:$I$1000=\"\",ROW(PlanningsFilter!$I$6:$I$1000)-ROW($I$6)+1)))),$C6)),\"\")","v":"Jan de Jonge"},{"$f":"IFERROR(INDEX(PlanningsFilter!$L$6:$L$1000,SMALL(IF(PlanningsFilter!$K$6:$K$1000=$A6,IF(PlanningsFilter!$C$6:$C$1000=O$2,IF(PlanningsFilter!$J$6:$J$1000=O$4,IF(PlanningsFilter!$I$6:$I$1000=\"\",ROW(PlanningsFilter!$I$6:$I$1000)-ROW($I$6)+1)))),$C6)),\"\")","v":""},{"$f":"IFERROR(INDEX(PlanningsFilter!$L$6:$L$1000,SMALL(IF(PlanningsFilter!$K$6:$K$1000=$A6,IF(PlanningsFilter!$C$6:$C$1000=P$2,IF(PlanningsFilter!$J$6:$J$1000=P$4,IF(PlanningsFilter!$I$6:$I$1000=\"\",ROW(PlanningsFilter!$I$6:$I$1000)-ROW($I$6)+1)))),$C6)),\"\")","v":"Baki Bos"},{"$f":"IFERROR(INDEX(PlanningsFilter!$L$6:$L$1000,SMALL(IF(PlanningsFilter!$K$6:$K$1000=$A6,IF(PlanningsFilter!$C$6:$C$1000=Q$2,IF(PlanningsFilter!$J$6:$J$1000=Q$4,IF(PlanningsFilter!$I$6:$I$1000=\"\",ROW(PlanningsFilter!$I$6:$I$1000)-ROW($I$6)+1)))),$C6)),\"\")","v":"Jan de Jonge"},{"$f":"IFERROR(INDEX(PlanningsFilter!$L$6:$L$1000,SMALL(IF(PlanningsFilter!$K$6:$K$1000=$A6,IF(PlanningsFilter!$C$6:$C$1000=R$2,IF(PlanningsFilter!$J$6:$J$1000=R$4,IF(PlanningsFilter!$I$6:$I$1000=\"\",ROW(PlanningsFilter!$I$6:$I$1000)-ROW($I$6)+1)))),$C6)),\"\")","v":""},{"$f":"IFERROR(INDEX(PlanningsFilter!$L$6:$L$1000,SMALL(IF(PlanningsFilter!$K$6:$K$1000=$A6,IF(PlanningsFilter!$C$6:$C$1000=S$2,IF(PlanningsFilter!$J$6:$J$1000=S$4,IF(PlanningsFilter!$I$6:$I$1000=\"\",ROW(PlanningsFilter!$I$6:$I$1000)-ROW($I$6)+1)))),$C6)),\"\")","v":""},{"$f":"IFERROR(INDEX(PlanningsFilter!$L$6:$L$1000,SMALL(IF(PlanningsFilter!$K$6:$K$1000=$A6,IF(PlanningsFilter!$C$6:$C$1000=T$2,IF(PlanningsFilter!$J$6:$J$1000=T$4,IF(PlanningsFilter!$I$6:$I$1000=\"\",ROW(PlanningsFilter!$I$6:$I$1000)-ROW($I$6)+1)))),$C6)),\"\")","v":""},{"$f":"IFERROR(INDEX(PlanningsFilter!$L$6:$L$1000,SMALL(IF(PlanningsFilter!$K$6:$K$1000=$A6,IF(PlanningsFilter!$C$6:$C$1000=U$2,IF(PlanningsFilter!$J$6:$J$1000=U$4,IF(PlanningsFilter!$I$6:$I$1000=\"\",ROW(PlanningsFilter!$I$6:$I$1000)-ROW($I$6)+1)))),$C6)),\"\")","v":""},{"$f":"IFERROR(INDEX(PlanningsFilter!$L$6:$L$1000,SMALL(IF(PlanningsFilter!$K$6:$K$1000=$A6,IF(PlanningsFilter!$C$6:$C$1000=V$2,IF(PlanningsFilter!$J$6:$J$1000=V$4,IF(PlanningsFilter!$I$6:$I$1000=\"\",ROW(PlanningsFilter!$I$6:$I$1000)-ROW($I$6)+1)))),$C6)),\"\")","v":""},{"$f":"IFERROR(INDEX(PlanningsFilter!$L$6:$L$1000,SMALL(IF(PlanningsFilter!$K$6:$K$1000=$A6,IF(PlanningsFilter!$C$6:$C$1000=W$2,IF(PlanningsFilter!$J$6:$J$1000=W$4,IF(PlanningsFilter!$I$6:$I$1000=\"\",ROW(PlanningsFilter!$I$6:$I$1000)-ROW($I$6)+1)))),$C6)),\"\")","v":""},{"$f":"IFERROR(INDEX(PlanningsFilter!$L$6:$L$1000,SMALL(IF(PlanningsFilter!$K$6:$K$1000=$A6,IF(PlanningsFilter!$C$6:$C$1000=X$2,IF(PlanningsFilter!$J$6:$J$1000=X$4,IF(PlanningsFilter!$I$6:$I$1000=\"\",ROW(PlanningsFilter!$I$6:$I$1000)-ROW($I$6)+1)))),$C6)),\"\")","v":""}]
["AFV",null,2,{"$f":"IFERROR(INDEX(PlanningsFilter!$L$6:$L$1000,SMALL(IF(PlanningsFilter!$K$6:$K$1000=$A7,IF(PlanningsFilter!$C$6:$C$1000=D$2,IF(PlanningsFilter!$J$6:$J$1000=D$4,IF(PlanningsFilter!$I$6:$I$1000=\"\",ROW(PlanningsFilter!$I$6:$I$1000)-ROW($I$6)+1)))),$C7)),\"\")","v":"Ilker Peeters"},{"$f":"IFERROR(INDEX(PlanningsFilter!$L$6:$L$1000,SMALL(IF(PlanningsFilter!$K$6:$K$1000=$A7,IF(PlanningsFilter!$C$6:$C$1000=E$2,IF(PlanningsFilter!$J$6:$J$1000=E$4,IF(PlanningsFilter!$I$6:$I$1000=\"\",ROW(PlanningsFilter!$I$6:$I$1000)-ROW($I$6)+1)))),$C7)),\"\")","v":"Boyan van Leeuwen"},{"$f":"IFERROR(INDEX(PlanningsFilter!$L$6:$L$1000,SMALL(IF(PlanningsFilter!$K$6:$K$1000=$A7,IF(PlanningsFilter!$C$6:$C$1000=F$2,IF(PlanningsFilter!$J$6:$J$1000=F$4,IF(PlanningsFilter!$I$6:$I$1000=\"\",ROW(PlanningsFilter!$I$6:$I$1000)-ROW($I$6)+1)))),$C7)),\"\")","v":""},{"$f":"IFERROR(INDEX(PlanningsFilter!$L$6:$L$1000,SMALL(IF(PlanningsFilter!$K$6:$K$1000=$A7,IF(PlanningsFilter!$C$6:$C$1000=G$2,IF(PlanningsFilter!$J$6:$J$1000=G$4,IF(PlanningsFilter!$I$6:$I$1000=\"\",ROW(PlanningsFilter!$I$6:$I$1000)-ROW($I$6)+1)))),$C7)),\"\")","v":"Ilker Peeters"},{"$f":"IFERROR(INDEX(PlanningsFilter!$L$6:$L$1000,SMALL(IF(PlanningsFilter!$K$6:$K$1000=$A7,IF(PlanningsFilter!$C$6:$C$1000=H$2,IF(PlanningsFilter!$J$6:$J$1000=H$4,IF(PlanningsFilter!$I$6:$I$1000=\"\",ROW(PlanningsFilter!$I$6:$I$1000)-ROW($I$6)+1)))),$C7)),\"\")","v":"Boyan van Leeuwen"},{"$f":"IFERROR(INDEX(PlanningsFilter!$L$6:$L$1000,SMALL(IF(PlanningsFilter!$K$6:$K$1000=$A7,IF(PlanningsFilter!$C$6:$C$1000=I$2,IF(PlanningsFilter!$J$6:$J$1000=I$4,IF(PlanningsFilter!$I$6:$I$1000=\"\",ROW(PlanningsFilter!$I$6:$I$1000)-ROW($I$6)+1)))),$C7)),\"\")","v":""},{"$f":"IFERROR(INDEX(PlanningsFilter!$L$6:$L$1000,SMALL(IF(PlanningsFilter!$K$6:$K$1000=$A7,IF(PlanningsFilter!$C$6:$C$1000=J$2,IF(PlanningsFilter!$J$6:$J$1000=J$4,IF(PlanningsFilter!$I$6:$I$1000=\"\",ROW(PlanningsFilter!$I$6:$I$1000)-ROW($I$6)+1)))),$C7)),\"\")","v":"Ilker Peeters"},{"$f":"IFERROR(INDEX(PlanningsFilter!$L$6:$L$1000,SMALL(IF(PlanningsFilter!$K$6:$K$1000=$A7,IF(PlanningsFilter!$C$6:$C$1000=K$2,IF(PlanningsFilter!$J$6:$J$1000=K$4,IF(PlanningsFilter!$I$6:$I$1000=\"\",ROW(PlanningsFilter!$I$6:$I$1000)-ROW($I$6)+1)))),$C7)),\"\")","v":"Boyan van Leeuwen"},{"$f":"IFERROR(INDEX(PlanningsFilter!$L$6:$L$1000,SMALL(IF(PlanningsFilter!$K$6:$K$1000=$A7,IF(PlanningsFilter!$C$6:$C$1000=L$2,IF(PlanningsFilter!$J$6:$J$1000=L$4,IF(PlanningsFilter!$I$6:$I$1000=\"\",ROW(PlanningsFilter!$I$6:$I$1000)-ROW($I$6)+1)))),$C7)),\"\")","v":""},{"$f":"IFERROR(INDEX(PlanningsFilter!$L$6:$L$1000,SMALL(IF(PlanningsFilter!$K$6:$K$1000=$A7,IF(PlanningsFilter!$C$6:$C$1000=M$2,IF(PlanningsFilter!$J$6:$J$1000=M$4,IF(PlanningsFilter!$I$6:$I$1000=\"\",ROW(PlanningsFilter!$I$6:$I$1000)-ROW($I$6)+1)))),$C7)),\"\")","v":"Ilker Peeters"},{"$f":"IFERROR(INDEX(PlanningsFilter!$L$6:$L$1000,SMALL(IF(PlanningsFilter!$K$6:$K$1000=$A7,IF(PlanningsFilter!$C$6:$C$1000=N$2,IF(PlanningsFilter!$J$6:$J$1000=N$4,IF(PlanningsFilter!$I$6:$I$1000=\"\",ROW(PlanningsFilter!$I$6:$I$1000)-ROW($I$6)+1)))),$C7)),\"\")","v":"Boyan van Leeuwen"},{"$f":"IFERROR(INDEX(PlanningsFilter!$L$6:$L$1000,SMALL(IF(PlanningsFilter!$K$6:$K$1000=$A7,IF(PlanningsFilter!$C$6:$C$1000=O$2,IF(PlanningsFilter!$J$6:$J$1000=O$4,IF(PlanningsFilter!$I$6:$I$1000=\"\",ROW(PlanningsFilter!$I$6:$I$1000)-ROW($I$6)+1)))),$C7)),\"\")","v":""},{"$f":"IFERROR(INDEX(PlanningsFilter!$L$6:$L$1000,SMALL(IF(PlanningsFilter!$K$6:$K$1000=$A7,IF(PlanningsFilter!$C$6:$C$1000=P$2,IF(PlanningsFilter!$J$6:$J$1000=P$4,IF(PlanningsFilter!$I$6:$I$1000=\"\",ROW(PlanningsFilter!$I$6:$I$1000)-ROW($I$6)+1)))),$C7)),\"\")","v":"Ilker Peeters"},{"$f":"IFERROR(INDEX(PlanningsFilter!$L$6:$L$1000,SMALL(IF(PlanningsFilter!$K$6:$K$1000=$A7,IF(PlanningsFilter!$C$6:$C$1000=Q$2,IF(PlanningsFilter!$J$6:$J$1000=Q$4,IF(PlanningsFilter!$I$6:$I$1000=\"\",ROW(PlanningsFilter!$I$6:$I$1000)-ROW($I$6)+1)))),$C7)),\"\")","v":"Boyan van Leeuwen"},{"$f":"IFERROR(INDEX(PlanningsFilter!$L$6:$L$1000,SMALL(IF(PlanningsFilter!$K$6:$K$1000=$A7,IF(PlanningsFilter!$C$6:$C$1000=R$2,IF(PlanningsFilter!$J$6:$J$1000=R$4,IF(PlanningsFilter!$I$6:$I$1000=\"\",ROW(PlanningsFilter!$I$6:$I$1000)-ROW($I$6)+1)))),$C7)),\"\")","v":""},{"$f":"IFERROR(INDEX(PlanningsFilter!$L$6:$L$1000,SMALL(IF(PlanningsFilter!$K$6:$K$1000=$A7,IF(PlanningsFilter!$C$6:$C$1000=S$2,IF(PlanningsFilter!$J$6:$J$1000=S$4,IF(PlanningsFilter!$I$6:$I$1000=\"\",ROW(PlanningsFilter!$I$6:$I$1000)-ROW($I$6)+1)))),$C7)),\"\")","v":""},{"$f":"IFERROR(INDEX(PlanningsFilter!$L$6:$L$1000,SMALL(IF(PlanningsFilter!$K$6:$K$1000=$A7,IF(PlanningsFilter!$C$6:$C$1000=T$2,IF(PlanningsFilter!$J$6:$J$1000=T$4,IF(PlanningsFilter!$I$6:$I$1000=\"\",ROW(PlanningsFilter!$I$6:$I$1000)-ROW($I$6)+1)))),$C7)),\"\")","v":""},{"$f":"IFERROR(INDEX(PlanningsFilter!$L$6:$L$1000,SMALL(IF(PlanningsFilter!$K$6:$K$1000=$A7,IF(PlanningsFilter!$C$6:$C$1000=U$2,IF(PlanningsFilter!$J$6:$J$1000=U$4,IF(PlanningsFilter!$I$6:$I$1000=\"\",ROW(PlanningsFilter!$I$6:$I$1000)-ROW($I$6)+1)))),$C7)),\"\")","v":""},{"$f":"IFERROR(INDEX(PlanningsFilter!$L$6:$L$1000,SMALL(IF(PlanningsFilter!$K$6:$K$1000=$A7,IF(PlanningsFilter!$C$6:$C$1000=V$2,IF(PlanningsFilter!$J$6:$J$1000=V$4,IF(PlanningsFilter!$I$6:$I$1000=\"\",ROW(PlanningsFilter!$I$6:$I$1000)-ROW($I$6)+1)))),$C7)),\"\")","v":""},{"$f":"IFERROR(INDEX(PlanningsFilter!$L$6:$L$1000,SMALL(IF(PlanningsFilter!$K$6:$K$1000=$A7,IF(PlanningsFilter!$C$6:$C$1000=W$2,IF(PlanningsFilter!$J$6:$J$1000=W$4,IF(PlanningsFilter!$I$6:$I$1000=\"\",ROW(PlanningsFilter!$I$6:$I$1000)-ROW($I$6)+1)))),$C7)),\"\")","v":""},{"$f":"IFERROR(INDEX(PlanningsFilter!$L$6:$L$1000,SMALL(IF(PlanningsFilter!$K$6:$K$1000=$A7,IF(PlanningsFilter!$C$6:$C$1000=X$2,IF(PlanningsFilter!$J$6:$J$1000=X$4,IF(PlanningsFilter!$I$6:$I$1000=\"\",ROW(PlanningsFilter!$I$6:$I$1000)-ROW($I$6)+1)))),$C7)),\"\")","v":""}]
["AFV",null,3,{"$f":"IFERROR(INDEX(PlanningsFilter!$L$6:$L$1000,SMALL(IF(PlanningsFilter!$K$6:$K$1000=$A8,IF(PlanningsFilter!$C$6:$C$1000=D$2,IF(PlanningsFilter!$J$6:$J$1000=D$4,IF(PlanningsFilter!$I$6:$I$1000=\"\",ROW(PlanningsFilter!$I$6:$I$1000)-ROW($I$6)+1)))),$C8)),\"\")","v":"Miquel van Loon"},{"$f":"IFERROR(INDEX(PlanningsFilter!$L$6:$L$1000,SMALL(IF(PlanningsFilter!$K$6:$K$1000=$A8,IF(PlanningsFilter!$C$6:$C$1000=E$2,IF(PlanningsFilter!$J$6:$J$1000=E$4,IF(PlanningsFilter!$I$6:$I$1000=\"\",ROW(PlanningsFilter!$I$6:$I$1000)-ROW($I$6)+1)))),$C8)),\"\")","v":"Sami van der Horst"},{"$f":"IFERROR(INDEX(PlanningsFilter!$L$6:$L$1000,SMALL(IF(PlanningsFilter!$K$6:$K$1000=$A8,IF(PlanningsFilter!$C$6:$C$1000=F$2,IF(PlanningsFilter!$J$6:$J$1000=F$4,IF(PlanningsFilter!$I$6:$I$1000=\"\",ROW(PlanningsFilter!$I$6:$I$1000)-ROW($I$6)+1)))),$C8)),\"\")","v":""},{"$f":"IFERROR(INDEX(PlanningsFilter!$L$6:$L$1000,SMALL(IF(PlanningsFilter!$K$6:$K$1000=$A8,IF(PlanningsFilter!$C$6:$C$1000=G$2,IF(PlanningsFilter!$J$6:$J$1000=G$4,IF(PlanningsFilter!$I$6:$I$1000=\"\",ROW(PlanningsFilter!$I$6:$I$1000)-ROW($I$6)+1)))),$C8)),\"\")","v":"Miquel van Loon"},{"$f":"IFERROR(INDEX(PlanningsFilter!$L$6:$L$1000,SMALL(IF(PlanningsFilter!$K$6:$K$1000=$A8,IF(PlanningsFilter!$C$6:$C$1000=H$2,IF(PlanningsFilter!$J$6:$J$1000=H$4,IF(PlanningsFilter!$I$6:$I$1000=\"\",ROW(PlanningsFilter!$I$6:$I$1000)-ROW($I$6)+1)))),$C8)),\"\")","v":"Sami van der Horst"},{"$f":"IFERROR(INDEX(PlanningsFilter!$L$6:$L$1000,SMALL(IF(PlanningsFilter!$K$6:$K$1000=$A8,IF(PlanningsFilter!$C$6:$C$1000=I$2,IF(PlanningsFilter!$J$6:$J$1000=I$4,IF(PlanningsFilter!$I$6:$I$1000=\"\",ROW(PlanningsFilter!$I$6:$I$1000)-ROW($I$6)+1)))),$C8)),\"\")","v":""},{"$f":"IFERROR(INDEX(PlanningsFilter!$L$6:$L$1000,SMALL(IF(PlanningsFilter!$K$6:$K$1000=$A8,IF(PlanningsFilter!$C$6:$C$1000=J$2,IF(PlanningsFilter!$J$6:$J$1000=J$4,IF(PlanningsFilter!$I$6:$I$1000=\"\",ROW(PlanningsFilter!$I$6:$I$1000)-ROW($I$6)+1)))),$C8)),\"\")","v":"Miquel van Loon"},{"$f":"IFERROR(INDEX(PlanningsFilter!$L$6:$L$1000,SMALL(IF(PlanningsFilter!$K$6:$K$1000=$A8,IF(PlanningsFilter!$C$6:$C$1000=K$2,IF(PlanningsFilter!$J$6:$J$1000=K$4,IF(PlanningsFilter!$I$6:$I$1000=\"\",ROW(PlanningsFilter!$I$6:$I$1000)-ROW($I$6)+1)))),$C8)),\"\")","v":"Sami van der Horst"},{"$f":"IFERROR(INDEX(PlanningsFilter!$L$6:$L$1000,SMALL(IF(PlanningsFilter!$K$6:$K$1000=$A8,IF(PlanningsFilter!$C$6:$C$1000=L$2,IF(PlanningsFilter!$J$6:$J$1000=L$4,IF(PlanningsFilter!$I$6:$I$1000=\"\",ROW(PlanningsFilter!$I$6:$I$1000)-ROW($I$6)+1)))),$C8)),\"\")","v":""},{"$f":"IFERROR(INDEX(PlanningsFilter!$L$6:$L$1000,SMALL(IF(PlanningsFilter!$K$6:$K$1000=$A8,IF(PlanningsFilter!$C$6:$C$1000=M$2,IF(PlanningsFilter!$J$6:$J$1000=M$4,IF(PlanningsFilter!$I$6:$I$1000=\"\",ROW(PlanningsFilter!$I$6:$I$1000)-ROW($I$6)+1)))),$C8)),\"\")","v":"Miquel van Loon"},{"$f":"IFERROR(INDEX(PlanningsFilter!$L$6:$L$1000,SMALL(IF(PlanningsFilter!$K$6:$K$1000=$A8,IF(PlanningsFilter!$C$6:$C$1000=N$2,IF(PlanningsFilter!$J$6:$J$1000=N$4,IF(PlanningsFilter!$I$6:$I$1000=\"\",ROW(PlanningsFilter!$I$6:$I$1000)-ROW($I$6)+1)))),$C8)),\"\")","v":"Sami van der Horst"},{"$f":"IFERROR(INDEX(PlanningsFilter!$L$6:$L$1000,SMALL(IF(PlanningsFilter!$K$6:$K$1000=$A8,IF(PlanningsFilter!$C$6:$C$1000=O$2,IF(PlanningsFilter!$J$6:$J$1000=O$4,IF(PlanningsFilter!$I$6:$I$1000=\"\",ROW(PlanningsFilter!$I$6:$I$1000)-ROW($I$6)+1)))),$C8)),\"\")","v":""},{"$f":"IFERROR(INDEX(PlanningsFilter!$L$6:$L$1000,SMALL(IF(PlanningsFilter!$K$6:$K$1000=$A8,IF(PlanningsFilter!$C$6:$C$1000=P$2,IF(PlanningsFilter!$J$6:$J$1000=P$4,IF(PlanningsFilter!$I$6:$I$1000=\"\",ROW(PlanningsFilter!$I$6:$I$1000)-ROW($I$6)+1)))),$C8)),\"\")","v":"Miquel van Loon"},{"$f":"IFERROR(INDEX(PlanningsFilter!$L$6:$L$1000,SMALL(IF(PlanningsFilter!$K$6:$K$1000=$A8,IF(PlanningsFilter!$C$6:$C$1000=Q$2,IF(PlanningsFilter!$J$6:$J$1000=Q$4,IF(PlanningsFilter!$I$6:$I$1000=\"\",ROW(PlanningsFilter!$I$6:$I$1000)-ROW($I$6)+1)))),$C8)),\"\")","v":"Sami van der Horst"},{"$f":"IFERROR(INDEX(PlanningsFilter!$L$6:$L$1000,SMALL(IF(PlanningsFilter!$K$6:$K$1000=$A8,IF(PlanningsFilter!$C$6:$C$1000=R$2,IF(PlanningsFilter!$J$6:$J$1000=R$4,IF(PlanningsFilter!$I$6:$I$1000=\"\",ROW(PlanningsFilter!$I$6:$I$1000)-ROW($I$6)+1)))),$C8)),\"\")","v":""},{"$f":"IFERROR(INDEX(PlanningsFilter!$L$6:$L$1000,SMALL(IF(PlanningsFilter!$K$6:$K$1000=$A8,IF(PlanningsFilter!$C$6:$C$1000=S$2,IF(PlanningsFilter!$J$6:$J$1000=S$4,IF(PlanningsFilter!$I$6:$I$1000=\"\",ROW(PlanningsFilter!$I$6:$I$1000)-ROW($I$6)+1)))),$C8)),\"\")","v":""},{"$f":"IFERROR(INDEX(PlanningsFilter!$L$6:$L$1000,SMALL(IF(PlanningsFilter!$K$6:$K$1000=$A8,IF(PlanningsFilter!$C$6:$C$1000=T$2,IF(PlanningsFilter!$J$6:$J$1000=T$4,IF(PlanningsFilter!$I$6:$I$1000=\"\",ROW(PlanningsFilter!$I$6:$I$1000)-ROW($I$6)+1)))),$C8)),\"\")","v":""},{"$f":"IFERROR(INDEX(PlanningsFilter!$L$6:$L$1000,SMALL(IF(PlanningsFilter!$K$6:$K$1000=$A8,IF(PlanningsFilter!$C$6:$C$1000=U$2,IF(PlanningsFilter!$J$6:$J$1000=U$4,IF(PlanningsFilter!$I$6:$I$1000=\"\",ROW(PlanningsFilter!$I$6:$I$1000)-ROW($I$6)+1)))),$C8)),\"\")","v":""},{"$f":"IFERROR(INDEX(PlanningsFilter!$L$6:$L$1000,SMALL(IF(PlanningsFilter!$K$6:$K$1000=$A8,IF(PlanningsFilter!$C$6:$C$1000=V$2,IF(PlanningsFilter!$J$6:$J$1000=V$4,IF(PlanningsFilter!$I$6:$I$1000=\"\",ROW(PlanningsFilter!$I$6:$I$1000)-ROW($I$6)+1)))),$C8)),\"\")","v":""},{"$f":"IFERROR(INDEX(PlanningsFilter!$L$6:$L$1000,SMALL(IF(PlanningsFilter!$K$6:$K$1000=$A8,IF(PlanningsFilter!$C$6:$C$1000=W$2,IF(PlanningsFilter!$J$6:$J$1000=W$4,IF(PlanningsFilter!$I$6:$I$1000=\"\",ROW(PlanningsFilter!$I$6:$I$1000)-ROW($I$6)+1)))),$C8)),\"\")","v":""},{"$f":"IFERROR(INDEX(PlanningsFilter!$L$6:$L$1000,SMALL(IF(PlanningsFilter!$K$6:$K$1000=$A8,IF(PlanningsFilter!$C$6:$C$1000=X$2,IF(PlanningsFilter!$J$6:$J$1000=X$4,IF(PlanningsFilter!$I$6:$I$1000=\"\",ROW(PlanningsFilter!$I$6:$I$1000)-ROW($I$6)+1)))),$C8)),\"\")","v":""}]
["AFV",null,4,{"$f":"IFERROR(INDEX(PlanningsFilter!$L$6:$L$1000,SMALL(IF(PlanningsFilter!$K$6:$K$1000=$A9,IF(PlanningsFilter!$C$6:$C$1000=D$2,IF(PlanningsFilter!$J$6:$J$1000=D$4,IF(PlanningsFilter!$I$6:$I$1000=\"\",ROW(PlanningsFilter!$I$6:$I$1000)-ROW($I$6)+1)))),$C9)),\"\")","v":"Klaas Kramer"},{"$f":"IFERROR(INDEX(PlanningsFilter!$L$6:$L$1000,SMALL(IF(PlanningsFilter!$K$6:$K$1000=$A9,IF(PlanningsFilter!$C$6:$C$1000=E$2,IF(PlanningsFilter!$J$6:$J$1000=E$4,IF(PlanningsFilter!$I$6:$I$1000=\"\",ROW(PlanningsFilter!$I$6:$I$1000)-ROW($I$6)+1)))),$C9)),\"\")","v":"Henri van Dam"},{"$f":"IFERROR(INDEX(PlanningsFilter!$L$6:$L$1000,SMALL(IF(PlanningsFilter!$K$6:$K$1000=$A9,IF(PlanningsFilter!$C$6:$C$1000=F$2,IF(PlanningsFilter!$J$6:$J$1000=F$4,IF(PlanningsFilter!$I$6:$I$1000=\"\",ROW(PlanningsFilter!$I$6:$I$1000)-ROW($I$6)+1)))),$C9)),\"\")","v":""},{"$f":"IFERROR(INDEX(PlanningsFilter!$L$6:$L$1000,SMALL(IF(PlanningsFilter!$K$6:$K$1000=$A9,IF(PlanningsFilter!$C$6:$C$1000=G$2,IF(PlanningsFilter!$J$6:$J$1000=G$4,IF(PlanningsFilter!$I$6:$I$1000=\"\",ROW(PlanningsFilter!$I$6:$I$1000)-ROW($I$6)+1)))),$C9)),\"\")","v":"Klaas Kramer"},{"$f":"IFERROR(INDEX(PlanningsFilter!$L$6:$L$1000,SMALL(IF(PlanningsFilter!$K$6:$K$1000=$A9,IF(PlanningsFilter!$C$6:$C$1000=H$2,IF(PlanningsFilter!$J$6:$J$1000=H$4,IF(PlanningsFilter!$I$6:$I$1000=\"\",ROW(PlanningsFilter!$I$6:$I$1000)-ROW($I$6)+1)))),$C9)),\"\")","v":"Henri van Dam"},{"$f":"IFERROR(INDEX(PlanningsFilter!$L$6:$L$1000,SMALL(IF(PlanningsFilter!$K$6:$K$1000=$A9,IF(PlanningsFilter!$C$6:$C$1000=I$2,IF(PlanningsFilter!$J$6:$J$1000=I$4,IF(PlanningsFilter!$I$6:$I$1000=\"\",ROW(PlanningsFilter!$I$6:$I$1000)-ROW($I$6)+1)))),$C9)),\"\")","v":""},{"$f":"IFERROR(INDEX(PlanningsFilter!$L$6:$L$1000,SMALL(IF(PlanningsFilter!$K$6:$K$1000=$A9,IF(PlanningsFilter!$C$6:$C$1000=J$2,IF(PlanningsFilter!$J$6:$J$1000=J$4,IF(PlanningsFilter!$I$6:$I$1000=\"\",ROW(PlanningsFilter!$I$6:$I$1000)-ROW($I$6)+1)))),$C9)),\"\")","v":"Klaas Kramer"},{"$f":"IFERROR(INDEX(PlanningsFilter!$L$6:$L$1000,SMALL(IF(PlanningsFilter!$K$6:$K$1000=$A9,IF(PlanningsFilter!$C$6:$C$1000=K$2,IF(PlanningsFilter!$J$6:$J$1000=K$4,IF(PlanningsFilter!$I$6:$I$1000=\"\",ROW(PlanningsFilter!$I$6:$I$1000)-ROW($I$6)+1)))),$C9)),\"\")","v":"Henri van Dam"},{"$f":"IFERROR(INDEX(PlanningsFilter!$L$6:$L$1000,SMALL(IF(PlanningsFilter!$K$6:$K$1000=$A9,IF(PlanningsFilter!$C$6:$C$1000=L$2,IF(PlanningsFilter!$J$6:$J$1000=L$4,IF(PlanningsFilter!$I$6:$I$1000=\"\",ROW(PlanningsFilter!$I$6:$I$1000)-ROW($I$6)+1)))),$C9)),\"\")","v":""},{"$f":"IFERROR(INDEX(PlanningsFilter!$L$6:$L$1000,SMALL(IF(PlanningsFilter!$K$6:$K$1000=$A9,IF(PlanningsFilter!$C$6:$C$1000=M$2,IF(PlanningsFilter!$J$6:$J$1000=M$4,IF(PlanningsFilter!$I$6:$I$1000=\"\",ROW(PlanningsFilter!$I$6:$I$1000)-ROW($I$6)+1)))),$C9)),\"\")","v":"Klaas Kramer"},{"$f":"IFERROR(INDEX(PlanningsFilter!$L$6:$L$1000,SMALL(IF(PlanningsFilter!$K$6:$K$1000=$A9,IF(PlanningsFilter!$C$6:$C$1000=N$2,IF(PlanningsFilter!$J$6:$J$1000=N$4,IF(PlanningsFilter!$I$6:$I$1000=\"\",ROW(PlanningsFilter!$I$6:$I$1000)-ROW($I$6)+1)))),$C9)),\"\")","v":"Henri van Dam"},{"$f":"IFERROR(INDEX(PlanningsFilter!$L$6:$L$1000,SMALL(IF(PlanningsFilter!$K$6:$K$1000=$A9,IF(PlanningsFilter!$C$6:$C$1000=O$2,IF(PlanningsFilter!$J$6:$J$1000=O$4,IF(PlanningsFilter!$I$6:$I$1000=\"\",ROW(PlanningsFilter!$I$6:$I$1000)-ROW($I$6)+1)))),$C9)),\"\")","v":""},{"$f":"IFERROR(INDEX(PlanningsFilter!$L$6:$L$1000,SMALL(IF(PlanningsFilter!$K$6:$K$1000=$A9,IF(PlanningsFilter!$C$6:$C$1000=P$2,IF(PlanningsFilter!$J$6:$J$1000=P$4,IF(PlanningsFilter!$I$6:$I$1000=\"\",ROW(PlanningsFilter!$I$6:$I$1000)-ROW($I$6)+1)))),$C9)),\"\")","v":"Klaas Kramer"},{"$f":"IFERROR(INDEX(PlanningsFilter!$L$6:$L$1000,SMALL(IF(PlanningsFilter!$K$6:$K$1000=$A9,IF(PlanningsFilter!$C$6:$C$1000=Q$2,IF(PlanningsFilter!$J$6:$J$1000=Q$4,IF(PlanningsFilter!$I$6:$I$1000=\"\",ROW(PlanningsFilter!$I$6:$I$1000)-ROW($I$6)+1)))),$C9)),\"\")","v":"Henri van Dam"},{"$f":"IFERROR(INDEX(PlanningsFilter!$L$6:$L$1000,SMALL(IF(PlanningsFilter!$K$6:$K$1000=$A9,IF(PlanningsFilter!$C$6:$C$1000=R$2,IF(PlanningsFilter!$J$6:$J$1000=R$4,IF(PlanningsFilter!$I$6:$I$1000=\"\",ROW(PlanningsFilter!$I$6:$I$1000)-ROW($I$6)+1)))),$C9)),\"\")","v":""},{"$f":"IFERROR(INDEX(PlanningsFilter!$L$6:$L$1000,SMALL(IF(PlanningsFilter!$K$6:$K$1000=$A9,IF(PlanningsFilter!$C$6:$C$1000=S$2,IF(PlanningsFilter!$J$6:$J$1000=S$4,IF(PlanningsFilter!$I$6:$I$1000=\"\",ROW(PlanningsFilter!$I$6:$I$1000)-ROW($I$6)+1)))),$C9)),\"\")","v":""},{"$f":"IFERROR(INDEX(PlanningsFilter!$L$6:$L$1000,SMALL(IF(PlanningsFilter!$K$6:$K$1000=$A9,IF(PlanningsFilter!$C$6:$C$1000=T$2,IF(PlanningsFilter!$J$6:$J$1000=T$4,IF(PlanningsFilter!$I$6:$I$1000=\"\",ROW(PlanningsFilter!$I$6:$I$1000)-ROW($I$6)+1)))),$C9)),\"\")","v":""},{"$f":"IFERROR(INDEX(PlanningsFilter!$L$6:$L$1000,SMALL(IF(PlanningsFilter!$K$6:$K$1000=$A9,IF(PlanningsFilter!$C$6:$C$1000=U$2,IF(PlanningsFilter!$J$6:$J$1000=U$4,IF(PlanningsFilter!$I$6:$I$1000=\"\",ROW(PlanningsFilter!$I$6:$I$1000)-ROW($I$6)+1)))),$C9)),\"\")","v":""},{"$f":"IFERROR(INDEX(PlanningsFilter!$L$6:$L$1000,SMALL(IF(PlanningsFilter!$K$6:$K$1000=$A9,IF(PlanningsFilter!$C$6:$C$1000=V$2,IF(PlanningsFilter!$J$6:$J$1000=V$4,IF(PlanningsFilter!$I$6:$I$1000=\"\",ROW(PlanningsFilter!$I$6:$I$1000)-ROW($I$6)+1)))),$C9)),\"\")","v":""},{"$f":"IFERROR(INDEX(PlanningsFilter!$L$6:$L$1000,SMALL(IF(PlanningsFilter!$K$6:$K$1000=$A9,IF(PlanningsFilter!$C$6:$C$1000=W$2,IF(PlanningsFilter!$J$6:$J$1000=W$4,IF(PlanningsFilter!$I$6:$I$1000=\"\",ROW(PlanningsFilter!$I$6:$I$1000)-ROW($I$6)+1)))),$C9)),\"\")","v":""},{"$f":"IFERROR(INDEX(PlanningsFilter!$L$6:$L$1000,SMALL(IF(PlanningsFilter!$K$6:$K$1000=$A9,IF(PlanningsFilter!$C$6:$C$1000=X$2,IF(PlanningsFilter!$J$6:$J$1000=X$4,IF(PlanningsFilter!$I$6:$I$1000=\"\",ROW(PlanningsFilter!$I$6:$I$1000)-ROW($I$6)+1)))),$C9)),\"\")","v":""}]
["AFV",null,5,{"$f":"IFERROR(INDEX(PlanningsFilter!$L$6:$L$1000,SMALL(IF(PlanningsFilter!$K$6:$K$1000=$A10,IF(PlanningsFilter!$C$6:$C$1000=D$2,IF(PlanningsFilter!$J$6:$J$1000=D$4,IF(PlanningsFilter!$I$6:$I$1000=\"\",ROW(PlanningsFilter!$I$6:$I$1000)-ROW($I$6)+1)))),$C10)),\"\")","v":"Sebastiaan Mol"},{"$f":"IFERROR(INDEX(PlanningsFilter!$L$6:$L$1000,SMALL(IF(PlanningsFilter!$K$6:$K$1000=$A10,IF(PlanningsFilter!$C$6:$C$1000=E$2,IF(PlanningsFilter!$J$6:$J$1000=E$4,IF(PlanningsFilter!$I$6:$I$1000=\"\",ROW(PlanningsFilter!$I$6:$I$1000)-ROW($I$6)+1)))),$C10)),\"\")","v":"Michel Jonker"},{"$f":"IFERROR(INDEX(PlanningsFilter!$L$6:$L$1000,SMALL(IF(PlanningsFilter!$K$6:$K$1000=$A10,IF(PlanningsFilter!$C$6:$C$1000=F$2,IF(PlanningsFilter!$J$6:$J$1000=F$4,IF(PlanningsFilter!$I$6:$I$1000=\"\",ROW(PlanningsFilter!$I$6:$I$1000)-ROW($I$6)+1)))),$C10)),\"\")","v":""},{"$f":"IFERROR(INDEX(PlanningsFilter!$L$6:$L$1000,SMALL(IF(PlanningsFilter!$K$6:$K$1000=$A10,IF(PlanningsFilter!$C$6:$C$1000=G$2,IF(PlanningsFilter!$J$6:$J$1000=G$4,IF(PlanningsFilter!$I$6:$I$1000=\"\",ROW(PlanningsFilter!$I$6:$I$1000)-ROW($I$6)+1)))),$C10)),\"\")","v":"Sebastiaan Mol"},{"$f":"IFERROR(INDEX(PlanningsFilter!$L$6:$L$1000,SMALL(IF(PlanningsFilter!$K$6:$K$1000=$A10,IF(PlanningsFilter!$C$6:$C$1000=H$2,IF(PlanningsFilter!$J$6:$J$1000=H$4,IF(PlanningsFilter!$I$6:$I$1000=\"\",ROW(PlanningsFilter!$I$6:$I$1000)-ROW($I$6)+1)))),$C10)),\"\")","v":"Michel Jonker"},{"$f":"IFERROR(INDEX(PlanningsFilter!$L$6:$L$1000,SMALL(IF(PlanningsFilter!$K$6:$K$1000=$A10,IF(PlanningsFilter!$C$6:$C$1000=I$2,IF(PlanningsFilter!$J$6:$J$1000=I$4,IF(PlanningsFilter!$I$6:$I$1000=\"\",ROW(PlanningsFilter!$I$6:$I$1000)-ROW($I$6)+1)))),$C10)),\"\")","v":""},{"$f":"IFERROR(INDEX(PlanningsFilter!$L$6:$L$1000,SMALL(IF(PlanningsFilter!$K$6:$K$1000=$A10,IF(PlanningsFilter!$C$6:$C$1000=J$2,IF(PlanningsFilter!$J$6:$J$1000=J$4,IF(PlanningsFilter!$I$6:$I$1000=\"\",ROW(PlanningsFilter!$I$6:$I$1000)-ROW($I$6)+1)))),$C10)),\"\")","v":"Sebastiaan Mol"},{"$f":"IFERROR(INDEX(PlanningsFilter!$L$6:$L$1000,SMALL(IF(PlanningsFilter!$K$6:$K$1000=$A10,IF(PlanningsFilter!$C$6:$C$1000=K$2,IF(PlanningsFilter!$J$6:$J$1000=K$4,IF(PlanningsFilter!$I$6:$I$1000=\"\",ROW(PlanningsFilter!$I$6:$I$1000)-ROW($I$6)+1)))),$C10)),\"\")","v":"Michel Jonker"},{"$f":"IFERROR(INDEX(PlanningsFilter!$L$6:$L$1000,SMALL(IF(PlanningsFilter!$K$6:$K$1000=$A10,IF(PlanningsFilter!$C$6:$C$1000=L$2,IF(PlanningsFilter!$J$6:$J$1000=L$4,IF(PlanningsFilter!$I$6:$I$1000=\"\",ROW(PlanningsFilter!$I$6:$I$1000)-ROW($I$6)+1)))),$C10)),\"\")","v":""},{"$f":"IFERROR(INDEX(PlanningsFilter!$L$6:$L$1000,SMALL(IF(PlanningsFilter!$K$6:$K$1000=$A10,IF(PlanningsFilter!$C$6:$C$1000=M$2,IF(PlanningsFilter!$J$6:$J$1000=M$4,IF(PlanningsFilter!$I$6:$I$1000=\"\",ROW(PlanningsFilter!$I$6:$I$1000)-ROW($I$6)+1)))),$C10)),\"\")","v":"Sebastiaan Mol"},{"$f":"IFERROR(INDEX(PlanningsFilter!$L$6:$L$1000,SMALL(IF(PlanningsFilter!$K$6:$K$1000=$A10,IF(PlanningsFilter!$C$6:$C$1000=N$2,IF(PlanningsFilter!$J$6:$J$1000=N$4,IF(PlanningsFilter!$I$6:$I$1000=\"\",ROW(PlanningsFilter!$I$6:$I$1000)-ROW($I$6)+1)))),$C10)),\"\")","v":"Michel Jonker"},{"$f":"IFERROR(INDEX(PlanningsFilter!$L$6:$L$1000,SMALL(IF(PlanningsFilter!$K$6:$K$1000=$A10,IF(PlanningsFilter!$C$6:$C$1000=O$2,IF(PlanningsFilter!$J$6:$J$1000=O$4,IF(PlanningsFilter!$I$6:$I$1000=\"\",ROW(PlanningsFilter!$I$6:$I$1000)-ROW($I$6)+1)))),$C10)),\"\")","v":""},{"$f":"IFERROR(INDEX(PlanningsFilter!$L$6:$L$1000,SMALL(IF(PlanningsFilter!$K$6:$K$1000=$A10,IF(PlanningsFilter!$C$6:$C$1000=P$2,IF(PlanningsFilter!$J$6:$J$1000=P$4,IF(PlanningsFilter!$I$6:$I$1000=\"\",ROW(PlanningsFilter!$I$6:$I$1000)-ROW($I$6)+1)))),$C10)),\"\")","v":"Sebastiaan Mol"},{"$f":"IFERROR(INDEX(PlanningsFilter!$L$6:$L$1000,SMALL(IF(PlanningsFilter!$K$6:$K$1000=$A10,IF(PlanningsFilter!$C$6:$C$1000=Q$2,IF(PlanningsFilter!$J$6:$J$1000=Q$4,IF(PlanningsFilter!$I$6:$I$1000=\"\",ROW(PlanningsFilter!$I$6:$I$1000)-ROW($I$6)+1)))),$C10)),\"\")","v":"Michel Jonker"},{"$f":"IFERROR(INDEX(PlanningsFilter!$L$6:$L$1000,SMALL(IF(PlanningsFilter!$K$6:$K$1000=$A10,IF(PlanningsFilter!$C$6:$C$1000=R$2,IF(PlanningsFilter!$J$6:$J$1000=R$4,IF(PlanningsFilter!$I$6:$I$1000=\"\",ROW(PlanningsFilter!$I$6:$I$1000)-ROW($I$6)+1)))),$C10)),\"\")","v":""},{"$f":"IFERROR(INDEX(PlanningsFilter!$L$6:$L$1000,SMALL(IF(PlanningsFilter!$K$6:$K$1000=$A10,IF(PlanningsFilter!$C$6:$C$1000=S$2,IF(PlanningsFilter!$J$6:$J$1000=S$4,IF(PlanningsFilter!$I$6:$I$1000=\"\",ROW(PlanningsFilter!$I$6:$I$1000)-ROW($I$6)+1)))),$C10)),\"\")","v":""},{"$f":"IFERROR(INDEX(PlanningsFilter!$L$6:$L$1000,SMALL(IF(PlanningsFilter!$K$6:$K$1000=$A10,IF(PlanningsFilter!$C$6:$C$1000=T$2,IF(PlanningsFilter!$J$6:$J$1000=T$4,IF(PlanningsFilter!$I$6:$I$1000=\"\",ROW(PlanningsFilter!$I$6:$I$1000)-ROW($I$6)+1)))),$C10)),\"\")","v":""},{"$f":"IFERROR(INDEX(PlanningsFilter!$L$6:$L$1000,SMALL(IF(PlanningsFilter!$K$6:$K$1000=$A10,IF(PlanningsFilter!$C$6:$C$1000=U$2,IF(PlanningsFilter!$J$6:$J$1000=U$4,IF(PlanningsFilter!$I$6:$I$1000=\"\",ROW(PlanningsFilter!$I$6:$I$1000)-ROW($I$6)+1)))),$C10)),\"\")","v":""},{"$f":"IFERROR(INDEX(PlanningsFilter!$L$6:$L$1000,SMALL(IF(PlanningsFilter!$K$6:$K$1000=$A10,IF(PlanningsFilter!$C$6:$C$1000=V$2,IF(PlanningsFilter!$J$6:$J$1000=V$4,IF(PlanningsFilter!$I$6:$I$1000=\"\",ROW(PlanningsFilter!$I$6:$I$1000)-ROW($I$6)+1)))),$C10)),\"\")","v":""},{"$f":"IFERROR(INDEX(PlanningsFilter!$L$6:$L$1000,SMALL(IF(PlanningsFilter!$K$6:$K$1000=$A10,IF(PlanningsFilter!$C$6:$C$1000=W$2,IF(PlanningsFilter!$J$6:$J$1000=W$4,IF(PlanningsFilter!$I$6:$I$1000=\"\",ROW(PlanningsFilter!$I$6:$I$1000)-ROW($I$6)+1)))),$C10)),\"\")","v":""},{"$f":"IFERROR(INDEX(PlanningsFilter!$L$6:$L$1000,SMALL(IF(PlanningsFilter!$K$6:$K$1000=$A10,IF(PlanningsFilter!$C$6:$C$1000=X$2,IF(PlanningsFilter!$J$6:$J$1000=X$4,IF(PlanningsFilter!$I$6:$I$1000=\"\",ROW(PlanningsFilter!$I$6:$I$1000)-ROW($I$6)+1)))),$C10)),\"\")","v":""}]
["AFV",null,6,{"$f":"IFERROR(INDEX(PlanningsFilter!$L$6:$L$1000,SMALL(IF(PlanningsFilter!$K$6:$K$1000=$A11,IF(PlanningsFilter!$C$6:$C$1000=D$2,IF(PlanningsFilter!$J$6:$J$1000=D$4,IF(PlanningsFilter!$I$6:$I$1000=\"\",ROW(PlanningsFilter!$I$6:$I$1000)-ROW($I$6)+1)))),$C11)),\"\")","v":""},{"$f":"IFERROR(INDEX(PlanningsFilter!$L$6:$L$1000,SMALL(IF(PlanningsFilter!$K$6:$K$1000=$A11,IF(PlanningsFilter!$C$6:$C$1000=E$2,IF(PlanningsFilter!$J$6:$J$1000=E$4,IF(PlanningsFilter!$I$6:$I$1000=\"\",ROW(PlanningsFilter!$I$6:$I$1000)-ROW($I$6)+1)))),$C11)),\"\")","v":""},{"$f":"IFERROR(INDEX(PlanningsFilter!$L$6:$L$1000,SMALL(IF(PlanningsFilter!$K$6:$K$1000=$A11,IF(PlanningsFilter!$C$6:$C$1000=F$2,IF(PlanningsFilter!$J$6:$J$1000=F$4,IF(PlanningsFilter!$I$6:$I$1000=\"\",ROW(PlanningsFilter!$I$6:$I$1000)-ROW($I$6)+1)))),$C11)),\"\")","v":""},{"$f":"IFERROR(INDEX(PlanningsFilter!$L$6:$L$1000,SMALL(IF(PlanningsFilter!$K$6:$K$1000=$A11,IF(PlanningsFilter!$C$6:$C$1000=G$2,IF(PlanningsFilter!$J$6:$J$1000=G$4,IF(PlanningsFilter!$I$6:$I$1000=\"\",ROW(PlanningsFilter!$I$6:$I$1000)-ROW($I$6)+1)))),$C11)),\"\")","v":""},{"$f":"IFERROR(INDEX(PlanningsFilter!$L$6:$L$1000,SMALL(IF(PlanningsFilter!$K$6:$K$1000=$A11,IF(PlanningsFilter!$C$6:$C$1000=H$2,IF(PlanningsFilter!$J$6:$J$1000=H$4,IF(PlanningsFilter!$I$6:$I$1000=\"\",ROW(PlanningsFilter!$I$6:$I$1000)-ROW($I$6)+1)))),$C11)),\"\")","v":""},{"$f":"IFERROR(INDEX(PlanningsFilter!$L$6:$L$1000,SMALL(IF(PlanningsFilter!$K$6:$K$1000=$A11,IF(PlanningsFilter!$C$6:$C$1000=I$2,IF(PlanningsFilter!$J$6:$J$1000=I$4,IF(PlanningsFilter!$I$6:$I$1000=\"\",ROW(PlanningsFilter!$I$6:$I$1000)-ROW($I$6)+1)))),$C11)),\"\")","v":""},{"$f":"IFERROR(INDEX(PlanningsFilter!$L$6:$L$1000,SMALL(IF(PlanningsFilter!$K$6:$K$1000=$A11,IF(PlanningsFilter!$C$6:$C$1000=J$2,IF(PlanningsFilter!$J$6:$J$1000=J$4,IF(PlanningsFilter!$I$6:$I$1000=\"\",ROW(PlanningsFilter!$I$6:$I$1000)-ROW($I$6)+1)))),$C11)),\"\")","v":""},{"$f":"IFERROR(INDEX(PlanningsFilter!$L$6:$L$1000,SMALL(IF(PlanningsFilter!$K$6:$K$1000=$A11,IF(PlanningsFilter!$C$6:$C$1000=K$2,IF(PlanningsFilter!$J$6:$J$1000=K$4,IF(PlanningsFilter!$I$6:$I$1000=\"\",ROW(PlanningsFilter!$I$6:$I$1000)-ROW($I$6)+1)))),$C11)),\"\")","v":""},{"$f":"IFERROR(INDEX(PlanningsFilter!$L$6:$L$1000,SMALL(IF(PlanningsFilter!$K$6:$K$1000=$A11,IF(PlanningsFilter!$C$6:$C$1000=L$2,IF(PlanningsFilter!$J$6:$J$1000=L$4,IF(PlanningsFilter!$I$6:$I$1000=\"\",ROW(PlanningsFilter!$I$6:$I$1000)-ROW($I$6)+1)))),$C11)),\"\")","v":""},{"$f":"IFERROR(INDEX(PlanningsFilter!$L$6:$L$1000,SMALL(IF(PlanningsFilter!$K$6:$K$1000=$A11,IF(PlanningsFilter!$C$6:$C$1000=M$2,IF(PlanningsFilter!$J$6:$J$1000=M$4,IF(PlanningsFilter!$I$6:$I$1000=\"\",ROW(PlanningsFilter!$I$6:$I$1000)-ROW($I$6)+1)))),$C11)),\"\")","v":""},{"$f":"IFERROR(INDEX(PlanningsFilter!$L$6:$L$1000,SMALL(IF(PlanningsFilter!$K$6:$K$1000=$A11,IF(PlanningsFilter!$C$6:$C$1000=N$2,IF(PlanningsFilter!$J$6:$J$1000=N$4,IF(PlanningsFilter!$I$6:$I$1000=\"\",ROW(PlanningsFilter!$I$6:$I$1000)-ROW($I$6)+1)))),$C11)),\"\")","v":""},{"$f":"IFERROR(INDEX(PlanningsFilter!$L$6:$L$1000,SMALL(IF(PlanningsFilter!$K$6:$K$1000=$A11,IF(PlanningsFilter!$C$6:$C$1000=O$2,IF(PlanningsFilter!$J$6:$J$1000=O$4,IF(PlanningsFilter!$I$6:$I$1000=\"\",ROW(PlanningsFilter!$I$6:$I$1000)-ROW($I$6)+1)))),$C11)),\"\")","v":""},{"$f":"IFERROR(INDEX(PlanningsFilter!$L$6:$L$1000,SMALL(IF(PlanningsFilter!$K$6:$K$1000=$A11,IF(PlanningsFilter!$C$6:$C$1000=P$2,IF(PlanningsFilter!$J$6:$J$1000=P$4,IF(PlanningsFilter!$I$6:$I$1000=\"\",ROW(PlanningsFilter!$I$6:$I$1000)-ROW($I$6)+1)))),$C11)),\"\")","v":""},{"$f":"IFERROR(INDEX(PlanningsFilter!$L$6:$L$1000,SMALL(IF(PlanningsFilter!$K$6:$K$1000=$A11,IF(PlanningsFilter!$C$6:$C$1000=Q$2,IF(PlanningsFilter!$J$6:$J$1000=Q$4,IF(PlanningsFilter!$I$6:$I$1000=\"\",ROW(PlanningsFilter!$I$6:$I$1000)-ROW($I$6)+1)))),$C11)),\"\")","v":""},{"$f":"IFERROR(INDEX(PlanningsFilter!$L$6:$L$1000,SMALL(IF(PlanningsFilter!$K$6:$K$1000=$A11,IF(PlanningsFilter!$C$6:$C$1000=R$2,IF(PlanningsFilter!$J$6:$J$1000=R$4,IF(PlanningsFilter!$I$6:$I$1000=\"\",ROW(PlanningsFilter!$I$6:$I$1000)-ROW($I$6)+1)))),$C11)),\"\")","v":""},{"$f":"IFERROR(INDEX(PlanningsFilter!$L$6:$L$1000,SMALL(IF(PlanningsFilter!$K$6:$K$1000=$A11,IF(PlanningsFilter!$C$6:$C$1000=S$2,IF(PlanningsFilter!$J$6:$J$1000=S$4,IF(PlanningsFilter!$I$6:$I$1000=\"\",ROW(PlanningsFilter!$I$6:$I$1000)-ROW($I$6)+1)))),$C11)),\"\")","v":""},{"$f":"IFERROR(INDEX(PlanningsFilter!$L$6:$L$1000,SMALL(IF(PlanningsFilter!$K$6:$K$1000=$A11,IF(PlanningsFilter!$C$6:$C$1000=T$2,IF(PlanningsFilter!$J$6:$J$1000=T$4,IF(PlanningsFilter!$I$6:$I$1000=\"\",ROW(PlanningsFilter!$I$6:$I$1000)-ROW($I$6)+1)))),$C11)),\"\")","v":""},{"$f":"IFERROR(INDEX(PlanningsFilter!$L$6:$L$1000,SMALL(IF(PlanningsFilter!$K$6:$K$1000=$A11,IF(PlanningsFilter!$C$6:$C$1000=U$2,IF(PlanningsFilter!$J$6:$J$1000=U$4,IF(PlanningsFilter!$I$6:$I$1000=\"\",ROW(PlanningsFilter!$I$6:$I$1000)-ROW($I$6)+1)))),$C11)),\"\")","v":""},{"$f":"IFERROR(INDEX(PlanningsFilter!$L$6:$L$1000,SMALL(IF(PlanningsFilter!$K$6:$K$1000=$A11,IF(PlanningsFilter!$C$6:$C$1000=V$2,IF(PlanningsFilter!$J$6:$J$1000=V$4,IF(PlanningsFilter!$I$6:$I$1000=\"\",ROW(PlanningsFilter!$I$6:$I$1000)-ROW($I$6)+1)))),$C11)),\"\")","v":""},{"$f":"IFERROR(INDEX(PlanningsFilter!$L$6:$L$1000,SMALL(IF(PlanningsFilter!$K$6:$K$1000=$A11,IF(PlanningsFilter!$C$6:$C$1000=W$2,IF(PlanningsFilter!$J$6:$J$1000=W$4,IF(PlanningsFilter!$I$6:$I$1000=\"\",ROW(PlanningsFilter!$I$6:$I$1000)-ROW($I$6)+1)))),$C11)),\"\")","v":""},{"$f":"IFERROR(INDEX(PlanningsFilter!$L$6:$L$1000,SMALL(IF(PlanningsFilter!$K$6:$K$1000=$A11,IF(PlanningsFilter!$C$6:$C$1000=X$2,IF(PlanningsFilter!$J$6:$J$1000=X$4,IF(PlanningsFilter!$I$6:$I$1000=\"\",ROW(PlanningsFilter!$I$6:$I$1000)-ROW($I$6)+1)))),$C11)),\"\")","v":""}]
["AFV",null,7,{"$f":"IFERROR(INDEX(PlanningsFilter!$L$6:$L$1000,SMALL(IF(PlanningsFilter!$K$6:$K$1000=$A12,IF(PlanningsFilter!$C$6:$C$1000=D$2,IF(PlanningsFilter!$J$6:$J$1000=D$4,IF(PlanningsFilter!$I$6:$I$1000=\"\",ROW(PlanningsFilter!$I$6:$I$1000)-ROW($I$6)+1)))),$C12)),\"\")","v":""},{"$f":"IFERROR(INDEX(PlanningsFilter!$L$6:$L$1000,SMALL(IF(PlanningsFilter!$K$6:$K$1000=$A12,IF(PlanningsFilter!$C$6:$C$1000=E$2,IF(PlanningsFilter!$J$6:$J$1000=E$4,IF(PlanningsFilter!$I$6:$I$1000=\"\",ROW(PlanningsFilter!$I$6:$I$1000)-ROW($I$6)+1)))),$C12)),\"\")","v":""},{"$f":"IFERROR(INDEX(PlanningsFilter!$L$6:$L$1000,SMALL(IF(PlanningsFilter!$K$6:$K$1000=$A12,IF(PlanningsFilter!$C$6:$C$1000=F$2,IF(PlanningsFilter!$J$6:$J$1000=F$4,IF(PlanningsFilter!$I$6:$I$1000=\"\",ROW(PlanningsFilter!$I$6:$I$1000)-ROW($I$6)+1)))),$C12)),\"\")","v":""},{"$f":"IFERROR(INDEX(PlanningsFilter!$L$6:$L$1000,SMALL(IF(PlanningsFilter!$K$6:$K$1000=$A12,IF(PlanningsFilter!$C$6:$C$1000=G$2,IF(PlanningsFilter!$J$6:$J$1000=G$4,IF(PlanningsFilter!$I$6:$I$1000=\"\",ROW(PlanningsFilter!$I$6:$I$1000)-ROW($I$6)+1)))),$C12)),\"\")","v":""},{"$f":"IFERROR(INDEX(PlanningsFilter!$L$6:$L$1000,SMALL(IF(PlanningsFilter!$K$6:$K$1000=$A12,IF(PlanningsFilter!$C$6:$C$1000=H$2,IF(PlanningsFilter!$J$6:$J$1000=H$4,IF(PlanningsFilter!$I$6:$I$1000=\"\",ROW(PlanningsFilter!$I$6:$I$1000)-ROW($I$6)+1)))),$C12)),\"\")","v":""},{"$f":"IFERROR(INDEX(PlanningsFilter!$L$6:$L$1000,SMALL(IF(PlanningsFilter!$K$6:$K$1000=$A12,IF(PlanningsFilter!$C$6:$C$1000=I$2,IF(PlanningsFilter!$J$6:$J$1000=I$4,IF(PlanningsFilter!$I$6:$I$1000=\"\",ROW(PlanningsFilter!$I$6:$I$1000)-ROW($I$6)+1)))),$C12)),\"\")","v":""},{"$f":"IFERROR(INDEX(PlanningsFilter!$L$6:$L$1000,SMALL(IF(PlanningsFilter!$K$6:$K$1000=$A12,IF(PlanningsFilter!$C$6:$C$1000=J$2,IF(PlanningsFilter!$J$6:$J$1000=J$4,IF(PlanningsFilter!$I$6:$I$1000=\"\",ROW(PlanningsFilter!$I$6:$I$1000)-ROW($I$6)+1)))),$C12)),\"\")","v":""},{"$f":"IFERROR(INDEX(PlanningsFilter!$L$6:$L$1000,SMALL(IF(PlanningsFilter!$K$6:$K$1000=$A12,IF(PlanningsFilter!$C$6:$C$1000=K$2,IF(PlanningsFilter!$J$6:$J$1000=K$4,IF(PlanningsFilter!$I$6:$I$1000=\"\",ROW(PlanningsFilter!$I$6:$I$1000)-ROW($I$6)+1)))),$C12)),\"\")","v":""},{"$f":"IFERROR(INDEX(PlanningsFilter!$L$6:$L$1000,SMALL(IF(PlanningsFilter!$K$6:$K$1000=$A12,IF(PlanningsFilter!$C$6:$C$1000=L$2,IF(PlanningsFilter!$J$6:$J$1000=L$4,IF(PlanningsFilter!$I$6:$I$1000=\"\",ROW(PlanningsFilter!$I$6:$I$1000)-ROW($I$6)+1)))),$C12)),\"\")","v":""},{"$f":"IFERROR(INDEX(PlanningsFilter!$L$6:$L$1000,SMALL(IF(PlanningsFilter!$K$6:$K$1000=$A12,IF(PlanningsFilter!$C$6:$C$1000=M$2,IF(PlanningsFilter!$J$6:$J$1000=M$4,IF(PlanningsFilter!$I$6:$I$1000=\"\",ROW(PlanningsFilter!$I$6:$I$1000)-ROW($I$6)+1)))),$C12)),\"\")","v":""},{"$f":"IFERROR(INDEX(PlanningsFilter!$L$6:$L$1000,SMALL(IF(PlanningsFilter!$K$6:$K$1000=$A12,IF(PlanningsFilter!$C$6:$C$1000=N$2,IF(PlanningsFilter!$J$6:$J$1000=N$4,IF(PlanningsFilter!$I$6:$I$1000=\"\",ROW(PlanningsFilter!$I$6:$I$1000)-ROW($I$6)+1)))),$C12)),\"\")","v":""},{"$f":"IFERROR(INDEX(PlanningsFilter!$L$6:$L$1000,SMALL(IF(PlanningsFilter!$K$6:$K$1000=$A12,IF(PlanningsFilter!$C$6:$C$1000=O$2,IF(PlanningsFilter!$J$6:$J$1000=O$4,IF(PlanningsFilter!$I$6:$I$1000=\"\",ROW(PlanningsFilter!$I$6:$I$1000)-ROW($I$6)+1)))),$C12)),\"\")","v":""},{"$f":"IFERROR(INDEX(PlanningsFilter!$L$6:$L$1000,SMALL(IF(PlanningsFilter!$K$6:$K$1000=$A12,IF(PlanningsFilter!$C$6:$C$1000=P$2,IF(PlanningsFilter!$J$6:$J$1000=P$4,IF(PlanningsFilter!$I$6:$I$1000=\"\",ROW(PlanningsFilter!$I$6:$I$1000)-ROW($I$6)+1)))),$C12)),\"\")","v":""},{"$f":"IFERROR(INDEX(PlanningsFilter!$L$6:$L$1000,SMALL(IF(PlanningsFilter!$K$6:$K$1000=$A12,IF(PlanningsFilter!$C$6:$C$1000=Q$2,IF(PlanningsFilter!$J$6:$J$1000=Q$4,IF(PlanningsFilter!$I$6:$I$1000=\"\",ROW(PlanningsFilter!$I$6:$I$1000)-ROW($I$6)+1)))),$C12)),\"\")","v":""},{"$f":"IFERROR(INDEX(PlanningsFilter!$L$6:$L$1000,SMALL(IF(PlanningsFilter!$K$6:$K$1000=$A12,IF(PlanningsFilter!$C$6:$C$1000=R$2,IF(PlanningsFilter!$J$6:$J$1000=R$4,IF(PlanningsFilter!$I$6:$I$1000=\"\",ROW(PlanningsFilter!$I$6:$I$1000)-ROW($I$6)+1)))),$C12)),\"\")","v":""},{"$f":"IFERROR(INDEX(PlanningsFilter!$L$6:$L$1000,SMALL(IF(PlanningsFilter!$K$6:$K$1000=$A12,IF(PlanningsFilter!$C$6:$C$1000=S$2,IF(PlanningsFilter!$J$6:$J$1000=S$4,IF(PlanningsFilter!$I$6:$I$1000=\"\",ROW(PlanningsFilter!$I$6:$I$1000)-ROW($I$6)+1)))),$C12)),\"\")","v":""},{"$f":"IFERROR(INDEX(PlanningsFilter!$L$6:$L$1000,SMALL(IF(PlanningsFilter!$K$6:$K$1000=$A12,IF(PlanningsFilter!$C$6:$C$1000=T$2,IF(PlanningsFilter!$J$6:$J$1000=T$4,IF(PlanningsFilter!$I$6:$I$1000=\"\",ROW(PlanningsFilter!$I$6:$I$1000)-ROW($I$6)+1)))),$C12)),\"\")","v":""},{"$f":"IFERROR(INDEX(PlanningsFilter!$L$6:$L$1000,SMALL(IF(PlanningsFilter!$K$6:$K$1000=$A12,IF(PlanningsFilter!$C$6:$C$1000=U$2,IF(PlanningsFilter!$J$6:$J$1000=U$4,IF(PlanningsFilter!$I$6:$I$1000=\"\",ROW(PlanningsFilter!$I$6:$I$1000)-ROW($I$6)+1)))),$C12)),\"\")","v":""},{"$f":"IFERROR(INDEX(PlanningsFilter!$L$6:$L$1000,SMALL(IF(PlanningsFilter!$K$6:$K$1000=$A12,IF(PlanningsFilter!$C$6:$C$1000=V$2,IF(PlanningsFilter!$J$6:$J$1000=V$4,IF(PlanningsFilter!$I$6:$I$1000=\"\",ROW(PlanningsFilter!$I$6:$I$1000)-ROW($I$6)+1)))),$C12)),\"\")","v":""},{"$f":"IFERROR(INDEX(PlanningsFilter!$L$6:$L$1000,SMALL(IF(PlanningsFilter!$K$6:$K$1000=$A12,IF(PlanningsFilter!$C$6:$C$1000=W$2,IF(PlanningsFilter!$J$6:$J$1000=W$4,IF(PlanningsFilter!$I$6:$I$1000=\"\",ROW(PlanningsFilter!$I$6:$I$1000)-ROW($I$6)+1)))),$C12)),\"\")","v":""},{"$f":"IFERROR(INDEX(PlanningsFilter!$L$6:$L$1000,SMALL(IF(PlanningsFilter!$K$6:$K$1000=$A12,IF(PlanningsFilter!$C$6:$C$1000=X$2,IF(PlanningsFilter!$J$6:$J$1000=X$4,IF(PlanningsFilter!$I$6:$I$1000=\"\",ROW(PlanningsFilter!$I$6:$I$1000)-ROW($I$6)+1)))),$C12)),\"\")","v":""}]
["AFV",null,8,{"$f":"IFERROR(INDEX(PlanningsFilter!$L$6:$L$1000,SMALL(IF(PlanningsFilter!$K$6:$K$1000=$A13,IF(PlanningsFilter!$C$6:$C$1000=D$2,IF(PlanningsFilter!$J$6:$J$1000=D$4,IF(PlanningsFilter!$I$6:$I$1000=\"\",ROW(PlanningsFilter!$I$6:$I$1000)-ROW($I$6)+1)))),$C13)),\"\")","v":""},{"$f":"IFERROR(INDEX(PlanningsFilter!$L$6:$L$1000,SMALL(IF(PlanningsFilter!$K$6:$K$1000=$A13,IF(PlanningsFilter!$C$6:$C$1000=E$2,IF(PlanningsFilter!$J$6:$J$1000=E$4,IF(PlanningsFilter!$I$6:$I$1000=\"\",ROW(PlanningsFilter!$I$6:$I$1000)-ROW($I$6)+1)))),$C13)),\"\")","v":""},{"$f":"IFERROR(INDEX(PlanningsFilter!$L$6:$L$1000,SMALL(IF(PlanningsFilter!$K$6:$K$1000=$A13,IF(PlanningsFilter!$C$6:$C$1000=F$2,IF(PlanningsFilter!$J$6:$J$1000=F$4,IF(PlanningsFilter!$I$6:$I$1000=\"\",ROW(PlanningsFilter!$I$6:$I$1000)-ROW($I$6)+1)))),$C13)),\"\")","v":""},{"$f":"IFERROR(INDEX(PlanningsFilter!$L$6:$L$1000,SMALL(IF(PlanningsFilter!$K$6:$K$1000=$A13,IF(PlanningsFilter!$C$6:$C$1000=G$2,IF(PlanningsFilter!$J$6:$J$1000=G$4,IF(PlanningsFilter!$I$6:$I$1000=\"\",ROW(PlanningsFilter!$I$6:$I$1000)-ROW($I$6)+1)))),$C13)),\"\")","v":""},{"$f":"IFERROR(INDEX(PlanningsFilter!$L$6:$L$1000,SMALL(IF(PlanningsFilter!$K$6:$K$1000=$A13,IF(PlanningsFilter!$C$6:$C$1000=H$2,IF(PlanningsFilter!$J$6:$J$1000=H$4,IF(PlanningsFilter!$I$6:$I$1000=\"\",ROW(PlanningsFilter!$I$6:$I$1000)-ROW($I$6)+1)))),$C13)),\"\")","v":""},{"$f":"IFERROR(INDEX(PlanningsFilter!$L$6:$L$1000,SMALL(IF(PlanningsFilter!$K$6:$K$1000=$A13,IF(PlanningsFilter!$C$6:$C$1000=I$2,IF(PlanningsFilter!$J$6:$J$1000=I$4,IF(PlanningsFilter!$I$6:$I$1000=\"\",ROW(PlanningsFilter!$I$6:$I$1000)-ROW($I$6)+1)))),$C13)),\"\")","v":""},{"$f":"IFERROR(INDEX(PlanningsFilter!$L$6:$L$1000,SMALL(IF(PlanningsFilter!$K$6:$K$1000=$A13,IF(PlanningsFilter!$C$6:$C$1000=J$2,IF(PlanningsFilter!$J$6:$J$1000=J$4,IF(PlanningsFilter!$I$6:$I$1000=\"\",ROW(PlanningsFilter!$I$6:$I$1000)-ROW($I$6)+1)))),$C13)),\"\")","v":""},{"$f":"IFERROR(INDEX(PlanningsFilter!$L$6:$L$1000,SMALL(IF(PlanningsFilter!$K$6:$K$1000=$A13,IF(PlanningsFilter!$C$6:$C$1000=K$2,IF(PlanningsFilter!$J$6:$J$1000=K$4,IF(PlanningsFilter!$I$6:$I$1000=\"\",ROW(PlanningsFilter!$I$6:$I$1000)-ROW($I$6)+1)))),$C13)),\"\")","v":""},{"$f":"IFERROR(INDEX(PlanningsFilter!$L$6:$L$1000,SMALL(IF(PlanningsFilter!$K$6:$K$1000=$A13,IF(PlanningsFilter!$C$6:$C$1000=L$2,IF(PlanningsFilter!$J$6:$J$1000=L$4,IF(PlanningsFilter!$I$6:$I$1000=\"\",ROW(PlanningsFilter!$I$6:$I$1000)-ROW($I$6)+1)))),$C13)),\"\")","v":""},{"$f":"IFERROR(INDEX(PlanningsFilter!$L$6:$L$1000,SMALL(IF(PlanningsFilter!$K$6:$K$1000=$A13,IF(PlanningsFilter!$C$6:$C$1000=M$2,IF(PlanningsFilter!$J$6:$J$1000=M$4,IF(PlanningsFilter!$I$6:$I$1000=\"\",ROW(PlanningsFilter!$I$6:$I$1000)-ROW($I$6)+1)))),$C13)),\"\")","v":""},{"$f":"IFERROR(INDEX(PlanningsFilter!$L$6:$L$1000,SMALL(IF(PlanningsFilter!$K$6:$K$1000=$A13,IF(PlanningsFilter!$C$6:$C$1000=N$2,IF(PlanningsFilter!$J$6:$J$1000=N$4,IF(PlanningsFilter!$I$6:$I$1000=\"\",ROW(PlanningsFilter!$I$6:$I$1000)-ROW($I$6)+1)))),$C13)),\"\")","v":""},{"$f":"IFERROR(INDEX(PlanningsFilter!$L$6:$L$1000,SMALL(IF(PlanningsFilter!$K$6:$K$1000=$A13,IF(PlanningsFilter!$C$6:$C$1000=O$2,IF(PlanningsFilter!$J$6:$J$1000=O$4,IF(PlanningsFilter!$I$6:$I$1000=\"\",ROW(PlanningsFilter!$I$6:$I$1000)-ROW($I$6)+1)))),$C13)),\"\")","v":""},{"$f":"IFERROR(INDEX(PlanningsFilter!$L$6:$L$1000,SMALL(IF(PlanningsFilter!$K$6:$K$1000=$A13,IF(PlanningsFilter!$C$6:$C$1000=P$2,IF(PlanningsFilter!$J$6:$J$1000=P$4,IF(PlanningsFilter!$I$6:$I$1000=\"\",ROW(PlanningsFilter!$I$6:$I$1000)-ROW($I$6)+1)))),$C13)),\"\")","v":""},{"$f":"IFERROR(INDEX(PlanningsFilter!$L$6:$L$1000,SMALL(IF(PlanningsFilter!$K$6:$K$1000=$A13,IF(PlanningsFilter!$C$6:$C$1000=Q$2,IF(PlanningsFilter!$J$6:$J$1000=Q$4,IF(PlanningsFilter!$I$6:$I$1000=\"\",ROW(PlanningsFilter!$I$6:$I$1000)-ROW($I$6)+1)))),$C13)),\"\")","v":""},{"$f":"IFERROR(INDEX(PlanningsFilter!$L$6:$L$1000,SMALL(IF(PlanningsFilter!$K$6:$K$1000=$A13,IF(PlanningsFilter!$C$6:$C$1000=R$2,IF(PlanningsFilter!$J$6:$J$1000=R$4,IF(PlanningsFilter!$I$6:$I$1000=\"\",ROW(PlanningsFilter!$I$6:$I$1000)-ROW($I$6)+1)))),$C13)),\"\")","v":""},{"$f":"IFERROR(INDEX(PlanningsFilter!$L$6:$L$1000,SMALL(IF(PlanningsFilter!$K$6:$K$1000=$A13,IF(PlanningsFilter!$C$6:$C$1000=S$2,IF(PlanningsFilter!$J$6:$J$1000=S$4,IF(PlanningsFilter!$I$6:$I$1000=\"\",ROW(PlanningsFilter!$I$6:$I$1000)-ROW($I$6)+1)))),$C13)),\"\")","v":""},{"$f":"IFERROR(INDEX(PlanningsFilter!$L$6:$L$1000,SMALL(IF(PlanningsFilter!$K$6:$K$1000=$A13,IF(PlanningsFilter!$C$6:$C$1000=T$2,IF(PlanningsFilter!$J$6:$J$1000=T$4,IF(PlanningsFilter!$I$6:$I$1000=\"\",ROW(PlanningsFilter!$I$6:$I$1000)-ROW($I$6)+1)))),$C13)),\"\")","v":""},{"$f":"IFERROR(INDEX(PlanningsFilter!$L$6:$L$1000,SMALL(IF(PlanningsFilter!$K$6:$K$1000=$A13,IF(PlanningsFilter!$C$6:$C$1000=U$2,IF(PlanningsFilter!$J$6:$J$1000=U$4,IF(PlanningsFilter!$I$6:$I$1000=\"\",ROW(PlanningsFilter!$I$6:$I$1000)-ROW($I$6)+1)))),$C13)),\"\")","v":""},{"$f":"IFERROR(INDEX(PlanningsFilter!$L$6:$L$1000,SMALL(IF(PlanningsFilter!$K$6:$K$1000=$A13,IF(PlanningsFilter!$C$6:$C$1000=V$2,IF(PlanningsFilter!$J$6:$J$1000=V$4,IF(PlanningsFilter!$I$6:$I$1000=\"\",ROW(PlanningsFilter!$I$6:$I$1000)-ROW($I$6)+1)))),$C13)),\"\")","v":""},{"$f":"IFERROR(INDEX(PlanningsFilter!$L$6:$L$1000,SMALL(IF(PlanningsFilter!$K$6:$K$1000=$A13,IF(PlanningsFilter!$C$6:$C$1000=W$2,IF(PlanningsFilter!$J$6:$J$1000=W$4,IF(PlanningsFilter!$I$6:$I$1000=\"\",ROW(PlanningsFilter!$I$6:$I$1000)-ROW($I$6)+1)))),$C13)),\"\")","v":""},{"$f":"IFERROR(INDEX(PlanningsFilter!$L$6:$L$1000,SMALL(IF(PlanningsFilter!$K$6:$K$1000=$A13,IF(PlanningsFilter!$C$6:$C$1000=X$2,IF(PlanningsFilter!$J$6:$J$1000=X$4,IF(PlanningsFilter!$I$6:$I$1000=\"\",ROW(PlanningsFilter!$I$6:$I$1000)-ROW($I$6)+1)))),$C13)),\"\")","v":""}]
["WERKTIIJDEN",null,null,"06:00/14:45","14:45/23:30","22:00/06:45","06:00/14:45","14:45/23:30","22:00/06:45","06:00/14:45","14:45/23:30","22:00/06:45","06:00/14:45","14:45/23:30","22:00/06:45","06:00/14:45","14:45/23:30","22:00/06:45","06:00/14:45","14:45/23:30","22:00/06:45","06:00/14:45","14:45/23:30","23:59/08:45"]
["SCHM",null,1,{"$f":"IFERROR(INDEX(PlanningsFilter!$L$6:$L$1000,SMALL(IF(PlanningsFilter!$K$6:$K$1000=$A15,IF(PlanningsFilter!$C$6:$C$1000=D$2,IF(PlanningsFilter!$J$6:$J$1000=D$4,IF(PlanningsFilter!$I$6:$I$1000=\"\",ROW(PlanningsFilter!$I$6:$I$1000)-ROW($I$6)+1)))),$C15)),\"\")","v":"Rachid van der Laan"},{"$f":"IFERROR(INDEX(PlanningsFilter!$L$6:$L$1000,SMALL(IF(PlanningsFilter!$K$6:$K$1000=$A15,IF(PlanningsFilter!$C$6:$C$1000=E$2,IF(PlanningsFilter!$J$6:$J$1000=E$4,IF(PlanningsFilter!$I$6:$I$1000=\"\",ROW(PlanningsFilter!$I$6:$I$1000)-ROW($I$6)+1)))),$C15)),\"\")","v":"Marjolein Martens"},{"$f":"IFERROR(INDEX(PlanningsFilter!$L$6:$L$1000,SMALL(IF(PlanningsFilter!$K$6:$K$1000=$A15,IF(PlanningsFilter!$C$6:$C$1000=F$2,IF(PlanningsFilter!$J$6:$J$1000=F$4,IF(PlanningsFilter!$I$6:$I$1000=\"\",ROW(PlanningsFilter!$I$6:$I$1000)-ROW($I$6)+1)))),$C15)),\"\")","v":"Patrick Bosch"},{"$f":"IFERROR(INDEX(PlanningsFilter!$L$6:$L$1000,SMALL(IF(PlanningsFilter!$K$6:$K$1000=$A15,IF(PlanningsFilter!$C$6:$C$1000=G$2,IF(PlanningsFilter!$J$6:$J$1000=G$4,IF(PlanningsFilter!$I$6:$I$1000=\"\",ROW(PlanningsFilter!$I$6:$I$1000)-ROW($I$6)+1)))),$C15)),\"\")","v":"Rachid van der Laan"},{"$f":"IFERROR(INDEX(PlanningsFilter!$L$6:$L$1000,SMALL(IF(PlanningsFilter!$K$6:$K$1000=$A15,IF(PlanningsFilter!$C$6:$C$1000=H$2,IF(PlanningsFilter!$J$6:$J$1000=H$4,IF(PlanningsFilter!$I$6:$I$1000=\"\",ROW(PlanningsFilter!$I$6:$I$1000)-ROW($I$6)+1)))),$C15)),\"\")","v":"Marjolein Martens"},{"$f":"IFERROR(INDEX(PlanningsFilter!$L$6:$L$1000,SMALL(IF(PlanningsFilter!$K$6:$K$1000=$A15,IF(PlanningsFilter!$C$6:$C$1000=I$2,IF(PlanningsFilter!$J$6:$J$1000=I$4,IF(PlanningsFilter!$I$6:$I$1000=\"\",ROW(PlanningsFilter!$I$6:$I$1000)-ROW($I$6)+1)))),$C15)),\"\")","v":"Patrick Bosch"},{"$f":"IFERROR(INDEX(PlanningsFilter!$L$6:$L$1000,SMALL(IF(PlanningsFilter!$K$6:$K$1000=$A15,IF(PlanningsFilter!$C$6:$C$1000=J$2,IF(PlanningsFilter!$J$6:$J$1000=J$4,IF(PlanningsFilter!$I$6:$I$1000=\"\",ROW(PlanningsFilter!$I$6:$I$1000)-ROW($I$6)+1)))),$C15)),\"\")","v":"Rachid van der Laan"},{"$f":"IFERROR(INDEX(PlanningsFilter!$L$6:$L$1000,SMALL(IF(PlanningsFilter!$K$6:$K$1000=$A15,IF(PlanningsFilter!$C$6:$C$1000=K$2,IF(PlanningsFilter!$J$6:$J$1000=K$4,IF(PlanningsFilter!$I$6:$I$1000=\"\",ROW(PlanningsFilter!$I$6:$I$1000)-ROW($I$6)+1)))),$C15)),\"\")","v":"Marjolein Martens"},{"$f":"IFERROR(INDEX(PlanningsFilter!$L$6:$L$1000,SMALL(IF(PlanningsFilter!$K$6:$K$1000=$A15,IF(PlanningsFilter!$C$6:$C$1000=L$2,IF(PlanningsFilter!$J$6:$J$1000=L$4,IF(PlanningsFilter!$I$6:$I$1000=\"\",ROW(PlanningsFilter!$I$6:$I$1000)-ROW($I$6)+1)))),$C15)),\"\")","v":"Patrick Bosch"},{"$f":"IFERROR(INDEX(PlanningsFilter!$L$6:$L$1000,SMALL(IF(PlanningsFilter!$K$6:$K$1000=$A15,IF(PlanningsFilter!$C$6:$C$1000=M$2,IF(PlanningsFilter!$J$6:$J$1000=M$4,IF(PlanningsFilter!$I$6:$I$1000=\"\",ROW(PlanningsFilter!$I$6:$I$1000)-ROW($I$6)+1)))),$C15)),\"\")","v":"Rachid van der Laan"},{"$f":"IFERROR(INDEX(PlanningsFilter!$L$6:$L$1000,SMALL(IF(PlanningsFilter!$K$6:$K$1000=$A15,IF(PlanningsFilter!$C$6:$C$1000=N$2,IF(PlanningsFilter!$J$6:$J$1000=N$4,IF(PlanningsFilter!$I$6:$I$1000=\"\",ROW(PlanningsFilter!$I$6:$I$1000)-ROW($I$6)+1)))),$C15)),\"\")","v":"Roy van der Meulen"},{"$f":"IFERROR(INDEX(PlanningsFilter!$L$6:$L$1000,SMALL(IF(PlanningsFilter!$K$6:$K$1000=$A15,IF(PlanningsFilter!$C$6:$C$1000=O$2,IF(PlanningsFilter!$J$6:$J$1000=O$4,IF(PlanningsFilter!$I$6:$I$1000=\"\",ROW(PlanningsFilter!$I$6:$I$1000)-ROW($I$6)+1)))),$C15)),\"\")","v":"Patrick Bosch"},{"$f":"IFERROR(INDEX(PlanningsFilter!$L$6:$L$1000,SMALL(IF(PlanningsFilter!$K$6:$K$1000=$A15,IF(PlanningsFilter!$C$6:$C$1000=P$2,IF(PlanningsFilter!$J$6:$J$1000=P$4,IF(PlanningsFilter!$I$6:$I$1000=\"\",ROW(PlanningsFilter!$I$6:$I$1000)-ROW($I$6)+1)))),$C15)),\"\")","v":"Rachid van der Laan"},{"$f":"IFERROR(INDEX(PlanningsFilter!$L$6:$L$1000,SMALL(IF(PlanningsFilter!$K$6:$K$1000=$A15,IF(PlanningsFilter!$C$6:$C$1000=Q$2,IF(PlanningsFilter!$J$6:$J$1000=Q$4,IF(PlanningsFilter!$I$6:$I$1000=\"\",ROW(PlanningsFilter!$I$6:$I$1000)-ROW($I$6)+1)))),$C15)),\"\")","v":"Roy van der Meulen"},{"$f":"IFERROR(INDEX(PlanningsFilter!$L$6:$L$1000,SMALL(IF(PlanningsFilter!$K$6:$K$1000=$A15,IF(PlanningsFilter!$C$6:$C$1000=R$2,IF(PlanningsFilter!$J$6:$J$1000=R$4,IF(PlanningsFilter!$I$6:$I$1000=\"\",ROW(PlanningsFilter!$I$6:$I$1000)-ROW($I$6)+1)))),$C15)),\"\")","v":""},{"$f":"IFERROR(INDEX(PlanningsFilter!$L$6:$L$1000,SMALL(IF(PlanningsFilter!$K$6:$K$1000=$A15,IF(PlanningsFilter!$C$6:$C$1000=S$2,IF(PlanningsFilter!$J$6:$J$1000=S$4,IF(PlanningsFilter!$I$6:$I$1000=\"\",ROW(PlanningsFilter!$I$6:$I$1000)-ROW($I$6)+1)))),$C15)),\"\")","v":""},{"$f":"IFERROR(INDEX(PlanningsFilter!$L$6:$L$1000,SMALL(IF(PlanningsFilter!$K$6:$K$1000=$A15,IF(PlanningsFilter!$C$6:$C$1000=T$2,IF(PlanningsFilter!$J$6:$J$1000=T$4,IF(PlanningsFilter!$I$6:$I$1000=\"\",ROW(PlanningsFilter!$I$6:$I$1000)-ROW($I$6)+1)))),$C15)),\"\")","v":""},{"$f":"IFERROR(INDEX(PlanningsFilter!$L$6:$L$1000,SMALL(IF(PlanningsFilter!$K$6:$K$1000=$A15,IF(PlanningsFilter!$C$6:$C$1000=U$2,IF(PlanningsFilter!$J$6:$J$1000=U$4,IF(PlanningsFilter!$I$6:$I$1000=\"\",ROW(PlanningsFilter!$I$6:$I$1000)-ROW($I$6)+1)))),$C15)),\"\")","v":""},{"$f":"IFERROR(INDEX(PlanningsFilter!$L$6:$L$1000,SMALL(IF(PlanningsFilter!$K$6:$K$1000=$A15,IF(PlanningsFilter!$C$6:$C$1000=V$2,IF(PlanningsFilter!$J$6:$J$1000=V$4,IF(PlanningsFilter!$I$6:$I$1000=\"\",ROW(PlanningsFilter!$I$6:$I$1000)-ROW($I$6)+1)))),$C15)),\"\")","v":""},{"$f":"IFERROR(INDEX(PlanningsFilter!$L$6:$L$1000,SMALL(IF(PlanningsFilter!$K$6:$K$1000=$A15,IF(PlanningsFilter!$C$6:$C$1000=W$2,IF(PlanningsFilter!$J$6:$J$1000=W$4,IF(PlanningsFilter!$I$6:$I$1000=\"\",ROW(PlanningsFilter!$I$6:$I$1000)-ROW($I$6)+1)))),$C15)),\"\")","v":""},{"$f":"IFERROR(INDEX(PlanningsFilter!$L$6:$L$1000,SMALL(IF(PlanningsFilter!$K$6:$K$1000=$A15,IF(PlanningsFilter!$C$6:$C$1000=X$2,IF(PlanningsFilter!$J$6:$J$1000=X$4,IF(PlanningsFilter!$I$6:$I$1000=\"\",ROW(PlanningsFilter!$I$6:$I$1000)-ROW($I$6)+1)))),$C15)),\"\")","v":"Rachid van der Laan"}]
["SCHM",null,2,{"$f":"IFERROR(INDEX(PlanningsFilter!$L$6:$L$1000,SMALL(IF(PlanningsFilter!$K$6:$K$1000=$A16,IF(PlanningsFilter!$C$6:$C$1000=D$2,IF(PlanningsFilter!$J$6:$J$1000=D$4,IF(PlanningsFilter!$I$6:$I$1000=\"\",ROW(PlanningsFilter!$I$6:$I$1000)-ROW($I$6)+1)))),$C16)),\"\")","v":"Evans Vermeulen"},{"$f":"IFERROR(INDEX(PlanningsFilter!$L$6:$L$1000,SMALL(IF(PlanningsFilter!$K$6:$K$1000=$A16,IF(PlanningsFilter!$C$6:$C$1000=E$2,IF(PlanningsFilter!$J$6:$J$1000=E$4,IF(PlanningsFilter!$I$6:$I$1000=\"\",ROW(PlanningsFilter!$I$6:$I$1000)-ROW($I$6)+1)))),$C16)),\"\")","v":"Roy van der Meulen"},{"$f":"IFERROR(INDEX(PlanningsFilter!$L$6:$L$1000,SMALL(IF(PlanningsFilter!$K$6:$K$1000=$A16,IF(PlanningsFilter!$C$6:$C$1000=F$2,IF(PlanningsFilter!$J$6:$J$1000=F$4,IF(PlanningsFilter!$I$6:$I$1000=\"\",ROW(PlanningsFilter!$I$6:$I$1000)-ROW($I$6)+1)))),$C16)),\"\")","v":"Rolinka van den Bosch"},{"$f":"IFERROR(INDEX(PlanningsFilter!$L$6:$L$1000,SMALL(IF(PlanningsFilter!$K$6:$K$1000=$A16,IF(PlanningsFilter!$C$6:$C$1000=G$2,IF(PlanningsFilter!$J$6:$J$1000=G$4,IF(PlanningsFilter!$I$6:$I$1000=\"\",ROW(PlanningsFilter!$I$6:$I$1000)-ROW($I$6)+1)))),$C16)),\"\")","v":"Evans Vermeulen"},{"$f":"IFERROR(INDEX(PlanningsFilter!$L$6:$L$1000,SMALL(IF(PlanningsFilter!$K$6:$K$1000=$A16,IF(PlanningsFilter!$C$6:$C$1000=H$2,IF(PlanningsFilter!$J$6:$J$1000=H$4,IF(PlanningsFilter!$I$6:$I$1000=\"\",ROW(PlanningsFilter!$I$6:$I$1000)-ROW($I$6)+1)))),$C16)),\"\")","v":"Roy van der Meulen"},{"$f":"IFERROR(INDEX(PlanningsFilter!$L$6:$L$1000,SMALL(IF(PlanningsFilter!$K$6:$K$1000=$A16,IF(PlanningsFilter!$C$6:$C$1000=I$2,IF(PlanningsFilter!$J$6:$J$1000=I$4,IF(PlanningsFilter!$I$6:$I$1000=\"\",ROW(PlanningsFilter!$I$6:$I$1000)-ROW($I$6)+1)))),$C16)),\"\")","v":"Rolinka van den Bosch"},{"$f":"IFERROR(INDEX(PlanningsFilter!$L$6:$L$1000,SMALL(IF(PlanningsFilter!$K$6:$K$1000=$A16,IF(PlanningsFilter!$C$6:$C$1000=J$2,IF(PlanningsFilter!$J$6:$J$1000=J$4,IF(PlanningsFilter!$I$6:$I$1000=\"\",ROW(PlanningsFilter!$I$6:$I$1000)-ROW($I$6)+1)))),$C16)),\"\")","v":"Evans Vermeulen"},{"$f":"IFERROR(INDEX(PlanningsFilter!$L$6:$L$1000,SMALL(IF(PlanningsFilter!$K$6:$K$1000=$A16,IF(PlanningsFilter!$C$6:$C$1000=K$2,IF(PlanningsFilter!$J$6:$J$1000=K$4,IF(PlanningsFilter!$I$6:$I$1000=\"\",ROW(PlanningsFilter!$I$6:$I$1000)-ROW($I$6)+1)))),$C16)),\"\")","v":"Roy van der Meulen"},{"$f":"IFERROR(INDEX(PlanningsFilter!$L$6:$L$1000,SMALL(IF(PlanningsFilter!$K$6:$K$1000=$A16,IF(PlanningsFilter!$C$6:$C$1000=L$2,IF(PlanningsFilter!$J$6:$J$1000=L$4,IF(PlanningsFilter!$I$6:$I$1000=\"\",ROW(PlanningsFilter!$I$6:$I$1000)-ROW($I$6)+1)))),$C16)),\"\")","v":"Rolinka van den Bosch"},{"$f":"IFERROR(INDEX(PlanningsFilter!$L$6:$L$1000,SMALL(IF(PlanningsFilter!$K$6:$K$1000=$A16,IF(PlanningsFilter!$C$6:$C$1000=M$2,IF(PlanningsFilter!$J$6:$J$1000=M$4,IF(PlanningsFilter!$I$6:$I$1000=\"\",ROW(PlanningsFilter!$I$6:$I$1000)-ROW($I$6)+1)))),$C16)),\"\")","v":"Evans Vermeulen"},{"$f":"IFERROR(INDEX(PlanningsFilter!$L$6:$L$1000,SMALL(IF(PlanningsFilter!$K$6:$K$1000=$A16,IF(PlanningsFilter!$C$6:$C$1000=N$2,IF(PlanningsFilter!$J$6:$J$1000=N$4,IF(PlanningsFilter!$I$6:$I$1000=\"\",ROW(PlanningsFilter!$I$6:$I$1000)-ROW($I$6)+1)))),$C16)),\"\")","v":""},{"$f":"IFERROR(INDEX(PlanningsFilter!$L$6:$L$1000,SMALL(IF(PlanningsFilter!$K$6:$K$1000=$A16,IF(PlanningsFilter!$C$6:$C$1000=O$2,IF(PlanningsFilter!$J$6:$J$1000=O$4,IF(PlanningsFilter!$I$6:$I$1000=\"\",ROW(PlanningsFilter!$I$6:$I$1000)-ROW($I$6)+1)))),$C16)),\"\")","v":"Rolinka van den Bosch"},{"$f":"IFERROR(INDEX(PlanningsFilter!$L$6:$L$1000,SMALL(IF(PlanningsFilter!$K$6:$K$1000=$A16,IF(PlanningsFilter!$C$6:$C$1000=P$2,IF(PlanningsFilter!$J$6:$J$1000=P$4,IF(PlanningsFilter!$I$6:$I$1000=\"\",ROW(PlanningsFilter!$I$6:$I$1000)-ROW($I$6)+1)))),$C16)),\"\")","v":"Evans Vermeulen"},{"$f":"IFERROR(INDEX(PlanningsFilter!$L$6:$L$1000,SMALL(IF(PlanningsFilter!$K$6:$K$1000=$A16,IF(PlanningsFilter!$C$6:$C$1000=Q$2,IF(PlanningsFilter!$J$6:$J$1000=Q$4,IF(PlanningsFilter!$I$6:$I$1000=\"\",ROW(PlanningsFilter!$I$6:$I$1000)-ROW($I$6)+1)))),$C16)),\"\")","v":"Piet Schipper"},{"$f":"IFERROR(INDEX(PlanningsFilter!$L$6:$L$1000,SMALL(IF(PlanningsFilter!$K$6:$K$1000=$A16,IF(PlanningsFilter!$C$6:$C$1000=R$2,IF(PlanningsFilter!$J$6:$J$1000=R$4,IF(PlanningsFilter!$I$6:$I$1000=\"\",ROW(PlanningsFilter!$I$6:$I$1000)-ROW($I$6)+1)))),$C16)),\"\")","v":""},{"$f":"IFERROR(INDEX(PlanningsFilter!$L$6:$L$1000,SMALL(IF(PlanningsFilter!$K$6:$K$1000=$A16,IF(PlanningsFilter!$C$6:$C$1000=S$2,IF(PlanningsFilter!$J$6:$J$1000=S$4,IF(PlanningsFilter!$I$6:$I$1000=\"\",ROW(PlanningsFilter!$I$6:$I$1000)-ROW($I$6)+1)))),$C16)),\"\")","v":""},{"$f":"IFERROR(INDEX(PlanningsFilter!$L$6:$L$1000,SMALL(IF(PlanningsFilter!$K$6:$K$1000=$A16,IF(PlanningsFilter!$C$6:$C$1000=T$2,IF(PlanningsFilter!$J$6:$J$1000=T$4,IF(PlanningsFilter!$I$6:$I$1000=\"\",ROW(PlanningsFilter!$I$6:$I$1000)-ROW($I$6)+1)))),$C16)),\"\")","v":""},{"$f":"IFERROR(INDEX(PlanningsFilter!$L$6:$L$1000,SMALL(IF(PlanningsFilter!$K$6:$K$1000=$A16,IF(PlanningsFilter!$C$6:$C$1000=U$2,IF(PlanningsFilter!$J$6:$J$1000=U$4,IF(PlanningsFilter!$I$6:$I$1000=\"\",ROW(PlanningsFilter!$I$6:$I$1000)-ROW($I$6)+1)))),$C16)),\"\")","v":""},{"$f":"IFERROR(INDEX(PlanningsFilter!$L$6:$L$1000,SMALL(IF(PlanningsFilter!$K$6:$K$1000=$A16,IF(PlanningsFilter!$C$6:$C$1000=V$2,IF(PlanningsFilter!$J$6:$J$1000=V$4,IF(PlanningsFilter!$I$6:$I$1000=\"\",ROW(PlanningsFilter!$I$6:$I$1000)-ROW($I$6)+1)))),$C16)),\"\")","v":""},{"$f":"IFERROR(INDEX(PlanningsFilter!$L$6:$L$1000,SMALL(IF(PlanningsFilter!$K$6:$K$1000=$A16,IF(PlanningsFilter!$C$6:$C$1000=W$2,IF(PlanningsFilter!$J$6:$J$1000=W$4,IF(PlanningsFilter!$I$6:$I$1000=\"\",ROW(PlanningsFilter!$I$6:$I$1000)-ROW($I$6)+1)))),$C16)),\"\")","v":""},{"$f":"IFERROR(INDEX(PlanningsFilter!$L$6:$L$1000,SMALL(IF(PlanningsFilter!$K$6:$K$1000=$A16,IF(PlanningsFilter!$C$6:$C$1000=X$2,IF(PlanningsFilter!$J$6:$J$1000=X$4,IF(PlanningsFilter!$I$6:$I$1000=\"\",ROW(PlanningsFilter!$I$6:$I$1000)-ROW($I$6)+1)))),$C16)),\"\")","v":"Evans Vermeulen"}]
["SCHM",null,3,{"$f":"IFERROR(INDEX(PlanningsFilter!$L$6:$L$1000,SMALL(IF(PlanningsFilter!$K$6:$K$1000=$A17,IF(PlanningsFilter!$C$6:$C$1000=D$2,IF(PlanningsFilter!$J$6:$J$1000=D$4,IF(PlanningsFilter!$I$6:$I$1000=\"\",ROW(PlanningsFilter!$I$6:$I$1000)-ROW($I$6)+1)))),$C17)),\"\")","v":"Kevin Veenstra"},{"$f":"IFERROR(INDEX(PlanningsFilter!$L$6:$L$1000,SMALL(IF(PlanningsFilter!$K$6:$K$1000=$A17,IF(PlanningsFilter!$C$6:$C$1000=E$2,IF(PlanningsFilter!$J$6:$J$1000=E$4,IF(PlanningsFilter!$I$6:$I$1000=\"\",ROW(PlanningsFilter!$I$6:$I$1000)-ROW($I$6)+1)))),$C17)),\"\")","v":"Piet Schipper"},{"$f":"IFERROR(INDEX(PlanningsFilter!$L$6:$L$1000,SMALL(IF(PlanningsFilter!$K$6:$K$1000=$A17,IF(PlanningsFilter!$C$6:$C$1000=F$2,IF(PlanningsFilter!$J$6:$J$1000=F$4,IF(PlanningsFilter!$I$6:$I$1000=\"\",ROW(PlanningsFilter!$I$6:$I$1000)-ROW($I$6)+1)))),$C17)),\"\")","v":"Erik de Haan"},{"$f":"IFERROR(INDEX(PlanningsFilter!$L$6:$L$1000,SMALL(IF(PlanningsFilter!$K$6:$K$1000=$A17,IF(PlanningsFilter!$C$6:$C$1000=G$2,IF(PlanningsFilter!$J$6:$J$1000=G$4,IF(PlanningsFilter!$I$6:$I$1000=\"\",ROW(PlanningsFilter!$I$6:$I$1000)-ROW($I$6)+1)))),$C17)),\"\")","v":"Kevin Veenstra"},{"$f":"IFERROR(INDEX(PlanningsFilter!$L$6:$L$1000,SMALL(IF(PlanningsFilter!$K$6:$K$1000=$A17,IF(PlanningsFilter!$C$6:$C$1000=H$2,IF(PlanningsFilter!$J$6:$J$1000=H$4,IF(PlanningsFilter!$I$6:$I$1000=\"\",ROW(PlanningsFilter!$I$6:$I$1000)-ROW($I$6)+1)))),$C17)),\"\")","v":"Piet Schipper"},{"$f":"IFERROR(INDEX(PlanningsFilter!$L$6:$L$1000,SMALL(IF(PlanningsFilter!$K$6:$K$1000=$A17,IF(PlanningsFilter!$C$6:$C$1000=I$2,IF(PlanningsFilter!$J$6:$J$1000=I$4,IF(PlanningsFilter!$I$6:$I$1000=\"\",ROW(PlanningsFilter!$I$6:$I$1000)-ROW($I$6)+1)))),$C17)),\"\")","v":"Erik de Haan"},{"$f":"IFERROR(INDEX(PlanningsFilter!$L$6:$L$1000,SMALL(IF(PlanningsFilter!$K$6:$K$1000=$A17,IF(PlanningsFilter!$C$6:$C$1000=J$2,IF(PlanningsFilter!$J$6:$J$1000=J$4,IF(PlanningsFilter!$I$6:$I$1000=\"\",ROW(PlanningsFilter!$I$6:$I$1000)-ROW($I$6)+1)))),$C17)),\"\")","v":"Kevin Veenstra"},{"$f":"IFERROR(INDEX(PlanningsFilter!$L$6:$L$1000,SMALL(IF(PlanningsFilter!$K$6:$K$1000=$A17,IF(PlanningsFilter!$C$6:$C$1000=K$2,IF(PlanningsFilter!$J$6:$J$1000=K$4,IF(PlanningsFilter!$I$6:$I$1000=\"\",ROW(PlanningsFilter!$I$6:$I$1000)-ROW($I$6)+1)))),$C17)),\"\")","v":"Piet Schipper"},{"$f":"IFERROR(INDEX(PlanningsFilter!$L$6:$L$1000,SMALL(IF(PlanningsFilter!$K$6:$K$1000=$A17,IF(PlanningsFilter!$C$6:$C$1000=L$2,IF(PlanningsFilter!$J$6:$J$1000=L$4,IF(PlanningsFilter!$I$6:$I$1000=\"\",ROW(PlanningsFilter!$I$6:$I$1000)-ROW($I$6)+1)))),$C17)),\"\")","v":"Erik de Haan"},{"$f":"IFERROR(INDEX(PlanningsFilter!$L$6:$L$1000,SMALL(IF(PlanningsFilter!$K$6:$K$1000=$A17,IF(PlanningsFilter!$C$6:$C$1000=M$2,IF(PlanningsFilter!$J$6:$J$1000=M$4,IF(PlanningsFilter!$I$6:$I$1000=\"\",ROW(PlanningsFilter!$I$6:$I$1000)-ROW($I$6)+1)))),$C17)),\"\")","v":"Kevin Veenstra"},{"$f":"IFERROR(INDEX(PlanningsFilter!$L$6:$L$1000,SMALL(IF(PlanningsFilter!$K$6:$K$1000=$A17,IF(PlanningsFilter!$C$6:$C$1000=N$2,IF(PlanningsFilter!$J$6:$J$1000=N$4,IF(PlanningsFilter!$I$6:$I$1000=\"\",ROW(PlanningsFilter!$I$6:$I$1000)-ROW($I$6)+1)))),$C17)),\"\")","v":""},{"$f":"IFERROR(INDEX(PlanningsFilter!$L$6:$L$1000,SMALL(IF(PlanningsFilter!$K$6:$K$1000=$A17,IF(PlanningsFilter!$C$6:$C$1000=O$2,IF(PlanningsFilter!$J$6:$J$1000=O$4,IF(PlanningsFilter!$I$6:$I$1000=\"\",ROW(PlanningsFilter!$I$6:$I$1000)-ROW($I$6)+1)))),$C17)),\"\")","v":"Erik de Haan"},{"$f":"IFERROR(INDEX(PlanningsFilter!$L$6:$L$1000,SMALL(IF(PlanningsFilter!$K$6:$K$1000=$A17,IF(PlanningsFilter!$C$6:$C$1000=P$2,IF(PlanningsFilter!$J$6:$J$1000=P$4,IF(PlanningsFilter!$I$6:$I$1000=\"\",ROW(PlanningsFilter!$I$6:$I$1000)-ROW($I$6)+1)))),$C17)),\"\")","v":"Kevin Veenstra"},{"$f":"IFERROR(INDEX(PlanningsFilter!$L$6:$L$1000,SMALL(IF(PlanningsFilter!$K$6:$K$1000=$A17,IF(PlanningsFilter!$C$6:$C$1000=Q$2,IF(PlanningsFilter!$J$6:$J$1000=Q$4,IF(PlanningsFilter!$I$6:$I$1000=\"\",ROW(PlanningsFilter!$I$6:$I$1000)-ROW($I$6)+1)))),$C17)),\"\")","v":""},{"$f":"IFERROR(INDEX(PlanningsFilter!$L$6:$L$1000,SMALL(IF(PlanningsFilter!$K$6:$K$1000=$A17,IF(PlanningsFilter!$C$6:$C$1000=R$2,IF(PlanningsFilter!$J$6:$J$1000=R$4,IF(PlanningsFilter!$I$6:$I$1000=\"\",ROW(PlanningsFilter!$I$6:$I$1000)-ROW($I$6)+1)))),$C17)),\"\")","v":""},{"$f":"IFERROR(INDEX(PlanningsFilter!$L$6:$L$1000,SMALL(IF(PlanningsFilter!$K$6:$K$1000=$A17,IF(PlanningsFilter!$C$6:$C$1000=S$2,IF(PlanningsFilter!$J$6:$J$1000=S$4,IF(PlanningsFilter!$I$6:$I$1000=\"\",ROW(PlanningsFilter!$I$6:$I$1000)-ROW($I$6)+1)))),$C17)),\"\")","v":""},{"$f":"IFERROR(INDEX(PlanningsFilter!$L$6:$L$1000,SMALL(IF(PlanningsFilter!$K$6:$K$1000=$A17,IF(PlanningsFilter!$C$6:$C$1000=T$2,IF(PlanningsFilter!$J$6:$J$1000=T$4,IF(PlanningsFilter!$I$6:$I$1000=\"\",ROW(PlanningsFilter!$I$6:$I$1000)-ROW($I$6)+1)))),$C17)),\"\")","v":""},{"$f":"IFERROR(INDEX(PlanningsFilter!$L$6:$L$1000,SMALL(IF(PlanningsFilter!$K$6:$K$1000=$A17,IF(PlanningsFilter!$C$6:$C$1000=U$2,IF(PlanningsFilter!$J$6:$J$1000=U$4,IF(PlanningsFilter!$I$6:$I$1000=\"\",ROW(PlanningsFilter!$I$6:$I$1000)-ROW($I$6)+1)))),$C17)),\"\")","v":""},{"$f":"IFERROR(INDEX(PlanningsFilter!$L$6:$L$1000,SMALL(IF(PlanningsFilter!$K$6:$K$1000=$A17,IF(PlanningsFilter!$C$6:$C$1000=V$2,IF(PlanningsFilter!$J$6:$J$1000=V$4,IF(PlanningsFilter!$I$6:$I$1000=\"\",ROW(PlanningsFilter!$I$6:$I$1000)-ROW($I$6)+1)))),$C17)),\"\")","v":""},{"$f":"IFERROR(INDEX(PlanningsFilter!$L$6:$L$1000,SMALL(IF(PlanningsFilter!$K$6:$K$1000=$A17,IF(PlanningsFilter!$C$6:$C$1000=W$2,IF(PlanningsFilter!$J$6:$J$1000=W$4,IF(PlanningsFilter!$I$6:$I$1000=\"\",ROW(PlanningsFilter!$I$6:$I$1000)-ROW($I$6)+1)))),$C17)),\"\")","v":""},{"$f":"IFERROR(INDEX(PlanningsFilter!$L$6:$L$1000,SMALL(IF(PlanningsFilter!$K$6:$K$1000=$A17,IF(PlanningsFilter!$C$6:$C$1000=X$2,IF(PlanningsFilter!$J$6:$J$1000=X$4,IF(PlanningsFilter!$I$6:$I$1000=\"\",ROW(PlanningsFilter!$I$6:$I$1000)-ROW($I$6)+1)))),$C17)),\"\")","v":"Kevin Veenstra"}]
["SCHM",null,4,{"$f":"IFERROR(INDEX(PlanningsFilter!$L$6:$L$1000,SMALL(IF(PlanningsFilter!$K$6:$K$1000=$A18,IF(PlanningsFilter!$C$6:$C$1000=D$2,IF(PlanningsFilter!$J$6:$J$1000=D$4,IF(PlanningsFilter!$I$6:$I$1000=\"\",ROW(PlanningsFilter!$I$6:$I$1000)-ROW($I$6)+1)))),$C18)),\"\")","v":""},{"$f":"IFERROR(INDEX(PlanningsFilter!$L$6:$L$1000,SMALL(IF(PlanningsFilter!$K$6:$K$1000=$A18,IF(PlanningsFilter!$C$6:$C$1000=E$2,IF(PlanningsFilter!$J$6:$J$1000=E$4,IF(PlanningsFilter!$I$6:$I$1000=\"\",ROW(PlanningsFilter!$I$6:$I$1000)-ROW($I$6)+1)))),$C18)),\"\")","v":""},{"$f":"IFERROR(INDEX(PlanningsFilter!$L$6:$L$1000,SMALL(IF(PlanningsFilter!$K$6:$K$1000=$A18,IF(PlanningsFilter!$C$6:$C$1000=F$2,IF(PlanningsFilter!$J$6:$J$1000=F$4,IF(PlanningsFilter!$I$6:$I$1000=\"\",ROW(PlanningsFilter!$I$6:$I$1000)-ROW($I$6)+1)))),$C18)),\"\")","v":""},{"$f":"IFERROR(INDEX(PlanningsFilter!$L$6:$L$1000,SMALL(IF(PlanningsFilter!$K$6:$K$1000=$A18,IF(PlanningsFilter!$C$6:$C$1000=G$2,IF(PlanningsFilter!$J$6:$J$1000=G$4,IF(PlanningsFilter!$I$6:$I$1000=\"\",ROW(PlanningsFilter!$I$6:$I$1000)-ROW($I$6)+1)))),$C18)),\"\")","v":""},{"$f":"IFERROR(INDEX(PlanningsFilter!$L$6:$L$1000,SMALL(IF(PlanningsFilter!$K$6:$K$1000=$A18,IF(PlanningsFilter!$C$6:$C$1000=H$2,IF(PlanningsFilter!$J$6:$J$1000=H$4,IF(PlanningsFilter!$I$6:$I$1000=\"\",ROW(PlanningsFilter!$I$6:$I$1000)-ROW($I$6)+1)))),$C18)),\"\")","v":""},{"$f":"IFERROR(INDEX(PlanningsFilter!$L$6:$L$1000,SMALL(IF(PlanningsFilter!$K$6:$K$1000=$A18,IF(PlanningsFilter!$C$6:$C$1000=I$2,IF(PlanningsFilter!$J$6:$J$1000=I$4,IF(PlanningsFilter!$I$6:$I$1000=\"\",ROW(PlanningsFilter!$I$6:$I$1000)-ROW($I$6)+1)))),$C18)),\"\")","v":""},{"$f":"IFERROR(INDEX(PlanningsFilter!$L$6:$L$1000,SMALL(IF(PlanningsFilter!$K$6:$K$1000=$A18,IF(PlanningsFilter!$C$6:$C$1000=J$2,IF(PlanningsFilter!$J$6:$J$1000=J$4,IF(PlanningsFilter!$I$6:$I$1000=\"\",ROW(PlanningsFilter!$I$6:$I$1000)-ROW($I$6)+1)))),$C18)),\"\")","v":""},{"$f":"IFERROR(INDEX(PlanningsFilter!$L$6:$L$1000,SMALL(IF(PlanningsFilter!$K$6:$K$1000=$A18,IF(PlanningsFilter!$C$6:$C$1000=K$2,IF(PlanningsFilter!$J$6:$J$1000=K$4,IF(PlanningsFilter!$I$6:$I$1000=\"\",ROW(PlanningsFilter!$I$6:$I$1000)-ROW($I$6)+1)))),$C18)),\"\")","v":""},{"$f":"IFERROR(INDEX(PlanningsFilter!$L$6:$L$1000,SMALL(IF(PlanningsFilter!$K$6:$K$1000=$A18,IF(PlanningsFilter!$C$6:$C$1000=L$2,IF(PlanningsFilter!$J$6:$J$1000=L$4,IF(PlanningsFilter!$I$6:$I$1000=\"\",ROW(PlanningsFilter!$I$6:$I$1000)-ROW($I$6)+1)))),$C18)),\"\")","v":""},{"$f":"IFERROR(INDEX(PlanningsFilter!$L$6:$L$1000,SMALL(IF(PlanningsFilter!$K$6:$K$1000=$A18,IF(PlanningsFilter!$C$6:$C$1000=M$2,IF(PlanningsFilter!$J$6:$J$1000=M$4,IF(PlanningsFilter!$I$6:$I$1000=\"\",ROW(PlanningsFilter!$I$6:$I$1000)-ROW($I$6)+1)))),$C18)),\"\")","v":""},{"$f":"IFERROR(INDEX(PlanningsFilter!$L$6:$L$1000,SMALL(IF(PlanningsFilter!$K$6:$K$1000=$A18,IF(PlanningsFilter!$C$6:$C$1000=N$2,IF(PlanningsFilter!$J$6:$J$1000=N$4,IF(PlanningsFilter!$I$6:$I$1000=\"\",ROW(PlanningsFilter!$I$6:$I$1000)-ROW($I$6)+1)))),$C18)),\"\")","v":""},{"$f":"IFERROR(INDEX(PlanningsFilter!$L$6:$L$1000,SMALL(IF(PlanningsFilter!$K$6:$K$1000=$A18,IF(PlanningsFilter!$C$6:$C$1000=O$2,IF(PlanningsFilter!$J$6:$J$1000=O$4,IF(PlanningsFilter!$I$6:$I$1000=\"\",ROW(PlanningsFilter!$I$6:$I$1000)-ROW($I$6)+1)))),$C18)),\"\")","v":""},{"$f":"IFERROR(INDEX(PlanningsFilter!$L$6:$L$1000,SMALL(IF(PlanningsFilter!$K$6:$K$1000=$A18,IF(PlanningsFilter!$C$6:$C$1000=P$2,IF(PlanningsFilter!$J$6:$J$1000=P$4,IF(PlanningsFilter!$I$6:$I$1000=\"\",ROW(PlanningsFilter!$I$6:$I$1000)-ROW($I$6)+1)))),$C18)),\"\")","v":""},{"$f":"IFERROR(INDEX(PlanningsFilter!$L$6:$L$1000,SMALL(IF(PlanningsFilter!$K$6:$K$1000=$A18,IF(PlanningsFilter!$C$6:$C$1000=Q$2,IF(PlanningsFilter!$J$6:$J$1000=Q$4,IF(PlanningsFilter!$I$6:$I$1000=\"\",ROW(PlanningsFilter!$I$6:$I$1000)-ROW($I$6)+1)))),$C18)),\"\")","v":""},{"$f":"IFERROR(INDEX(PlanningsFilter!$L$6:$L$1000,SMALL(IF(PlanningsFilter!$K$6:$K$1000=$A18,IF(PlanningsFilter!$C$6:$C$1000=R$2,IF(PlanningsFilter!$J$6:$J$1000=R$4,IF(PlanningsFilter!$I$6:$I$1000=\"\",ROW(PlanningsFilter!$I$6:$I$1000)-ROW($I$6)+1)))),$C18)),\"\")","v":""},{"$f":"IFERROR(INDEX(PlanningsFilter!$L$6:$L$1000,SMALL(IF(PlanningsFilter!$K$6:$K$1000=$A18,IF(PlanningsFilter!$C$6:$C$1000=S$2,IF(PlanningsFilter!$J$6:$J$1000=S$4,IF(PlanningsFilter!$I$6:$I$1000=\"\",ROW(PlanningsFilter!$I$6:$I$1000)-ROW($I$6)+1)))),$C18)),\"\")","v":""},{"$f":"IFERROR(INDEX(PlanningsFilter!$L$6:$L$1000,SMALL(IF(PlanningsFilter!$K$6:$K$1000=$A18,IF(PlanningsFilter!$C$6:$C$1000=T$2,IF(PlanningsFilter!$J$6:$J$1000=T$4,IF(PlanningsFilter!$I$6:$I$1000=\"\",ROW(PlanningsFilter!$I$6:$I$1000)-ROW($I$6)+1)))),$C18)),\"\")","v":""},{"$f":"IFERROR(INDEX(PlanningsFilter!$L$6:$L$1000,SMALL(IF(PlanningsFilter!$K$6:$K$1000=$A18,IF(PlanningsFilter!$C$6:$C$1000=U$2,IF(PlanningsFilter!$J$6:$J$1000=U$4,IF(PlanningsFilter!$I$6:$I$1000=\"\",ROW(PlanningsFilter!$I$6:$I$1000)-ROW($I$6)+1)))),$C18)),\"\")","v":""},{"$f":"IFERROR(INDEX(PlanningsFilter!$L$6:$L$1000,SMALL(IF(PlanningsFilter!$K$6:$K$1000=$A18,IF(PlanningsFilter!$C$6:$C$1000=V$2,IF(PlanningsFilter!$J$6:$J$1000=V$4,IF(PlanningsFilter!$I$6:$I$1000=\"\",ROW(PlanningsFilter!$I$6:$I$1000)-ROW($I$6)+1)))),$C18)),\"\")","v":""},{"$f":"IFERROR(INDEX(PlanningsFilter!$L$6:$L$1000,SMALL(IF(PlanningsFilter!$K$6:$K$1000=$A18,IF(PlanningsFilter!$C$6:$C$1000=W$2,IF(PlanningsFilter!$J$6:$J$1000=W$4,IF(PlanningsFilter!$I$6:$I$1000=\"\",ROW(PlanningsFilter!$I$6:$I$1000)-ROW($I$6)+1)))),$C18)),\"\")","v":""},{"$f":"IFERROR(INDEX(PlanningsFilter!$L$6:$L$1000,SMALL(IF(PlanningsFilter!$K$6:$K$1000=$A18,IF(PlanningsFilter!$C$6:$C$1000=X$2,IF(PlanningsFilter!$J$6:$J$1000=X$4,IF(PlanningsFilter!$I$6:$I$1000=\"\",ROW(PlanningsFilter!$I$6:$I$1000)-ROW($I$6)+1)))),$C18)),\"\")","v":""}]
["SCHM",null,5,{"$f":"IFERROR(INDEX(PlanningsFilter!$L$6:$L$1000,SMALL(IF(PlanningsFilter!$K$6:$K$1000=$A19,IF(PlanningsFilter!$C$6:$C$1000=D$2,IF(PlanningsFilter!$J$6:$J$1000=D$4,IF(PlanningsFilter!$I$6:$I$1000=\"\",ROW(PlanningsFilter!$I$6:$I$1000)-ROW($I$6)+1)))),$C19)),\"\")","v":""},{"$f":"IFERROR(INDEX(PlanningsFilter!$L$6:$L$1000,SMALL(IF(PlanningsFilter!$K$6:$K$1000=$A19,IF(PlanningsFilter!$C$6:$C$1000=E$2,IF(PlanningsFilter!$J$6:$J$1000=E$4,IF(PlanningsFilter!$I$6:$I$1000=\"\",ROW(PlanningsFilter!$I$6:$I$1000)-ROW($I$6)+1)))),$C19)),\"\")","v":""},{"$f":"IFERROR(INDEX(PlanningsFilter!$L$6:$L$1000,SMALL(IF(PlanningsFilter!$K$6:$K$1000=$A19,IF(PlanningsFilter!$C$6:$C$1000=F$2,IF(PlanningsFilter!$J$6:$J$1000=F$4,IF(PlanningsFilter!$I$6:$I$1000=\"\",ROW(PlanningsFilter!$I$6:$I$1000)-ROW($I$6)+1)))),$C19)),\"\")","v":""},{"$f":"IFERROR(INDEX(PlanningsFilter!$L$6:$L$1000,SMALL(IF(PlanningsFilter!$K$6:$K$1000=$A19,IF(PlanningsFilter!$C$6:$C$1000=G$2,IF(PlanningsFilter!$J$6:$J$1000=G$4,IF(PlanningsFilter!$I$6:$I$1000=\"\",ROW(PlanningsFilter!$I$6:$I$1000)-ROW($I$6)+1)))),$C19)),\"\")","v":""},{"$f":"IFERROR(INDEX(PlanningsFilter!$L$6:$L$1000,SMALL(IF(PlanningsFilter!$K$6:$K$1000=$A19,IF(PlanningsFilter!$C$6:$C$1000=H$2,IF(PlanningsFilter!$J$6:$J$1000=H$4,IF(PlanningsFilter!$I$6:$I$1000=\"\",ROW(PlanningsFilter!$I$6:$I$1000)-ROW($I$6)+1)))),$C19)),\"\")","v":""},{"$f":"IFERROR(INDEX(PlanningsFilter!$L$6:$L$1000,SMALL(IF(PlanningsFilter!$K$6:$K$1000=$A19,IF(PlanningsFilter!$C$6:$C$1000=I$2,IF(PlanningsFilter!$J$6:$J$1000=I$4,IF(PlanningsFilter!$I$6:$I$1000=\"\",ROW(PlanningsFilter!$I$6:$I$1000)-ROW($I$6)+1)))),$C19)),\"\")","v":""},{"$f":"IFERROR(INDEX(PlanningsFilter!$L$6:$L$1000,SMALL(IF(PlanningsFilter!$K$6:$K$1000=$A19,IF(PlanningsFilter!$C$6:$C$1000=J$2,IF(PlanningsFilter!$J$6:$J$1000=J$4,IF(PlanningsFilter!$I$6:$I$1000=\"\",ROW(PlanningsFilter!$I$6:$I$1000)-ROW($I$6)+1)))),$C19)),\"\")","v":""},{"$f":"IFERROR(INDEX(PlanningsFilter!$L$6:$L$1000,SMALL(IF(PlanningsFilter!$K$6:$K$1000=$A19,IF(PlanningsFilter!$C$6:$C$1000=K$2,IF(PlanningsFilter!$J$6:$J$1000=K$4,IF(PlanningsFilter!$I$6:$I$1000=\"\",ROW(PlanningsFilter!$I$6:$I$1000)-ROW($I$6)+1)))),$C19)),\"\")","v":""},{"$f":"IFERROR(INDEX(PlanningsFilter!$L$6:$L$1000,SMALL(IF(PlanningsFilter!$K$6:$K$1000=$A19,IF(PlanningsFilter!$C$6:$C$1000=L$2,IF(PlanningsFilter!$J$6:$J$1000=L$4,IF(PlanningsFilter!$I$6:$I$1000=\"\",ROW(PlanningsFilter!$I$6:$I$1000)-ROW($I$6)+1)))),$C19)),\"\")","v":""},{"$f":"IFERROR(INDEX(PlanningsFilter!$L$6:$L$1000,SMALL(IF(PlanningsFilter!$K$6:$K$1000=$A19,IF(PlanningsFilter!$C$6:$C$1000=M$2,IF(PlanningsFilter!$J$6:$J$1000=M$4,IF(PlanningsFilter!$I$6:$I$1000=\"\",ROW(PlanningsFilter!$I$6:$I$1000)-ROW($I$6)+1)))),$C19)),\"\")","v":""},{"$f":"IFERROR(INDEX(PlanningsFilter!$L$6:$L$1000,SMALL(IF(PlanningsFilter!$K$6:$K$1000=$A19,IF(PlanningsFilter!$C$6:$C$1000=N$2,IF(PlanningsFilter!$J$6:$J$1000=N$4,IF(PlanningsFilter!$I$6:$I$1000=\"\",ROW(PlanningsFilter!$I$6:$I$1000)-ROW($I$6)+1)))),$C19)),\"\")","v":""},{"$f":"IFERROR(INDEX(PlanningsFilter!$L$6:$L$1000,SMALL(IF(PlanningsFilter!$K$6:$K$1000=$A19,IF(PlanningsFilter!$C$6:$C$1000=O$2,IF(PlanningsFilter!$J$6:$J$1000=O$4,IF(PlanningsFilter!$I$6:$I$1000=\"\",ROW(PlanningsFilter!$I$6:$I$1000)-ROW($I$6)+1)))),$C19)),\"\")","v":""},{"$f":"IFERROR(INDEX(PlanningsFilter!$L$6:$L$1000,SMALL(IF(PlanningsFilter!$K$6:$K$1000=$A19,IF(PlanningsFilter!$C$6:$C$1000=P$2,IF(PlanningsFilter!$J$6:$J$1000=P$4,IF(PlanningsFilter!$I$6:$I$1000=\"\",ROW(PlanningsFilter!$I$6:$I$1000)-ROW($I$6)+1)))),$C19)),\"\")","v":""},{"$f":"IFERROR(INDEX(PlanningsFilter!$L$6:$L$1000,SMALL(IF(PlanningsFilter!$K$6:$K$1000=$A19,IF(PlanningsFilter!$C$6:$C$1000=Q$2,IF(PlanningsFilter!$J$6:$J$1000=Q$4,IF(PlanningsFilter!$I$6:$I$1000=\"\",ROW(PlanningsFilter!$I$6:$I$1000)-ROW($I$6)+1)))),$C19)),\"\")","v":""},{"$f":"IFERROR(INDEX(PlanningsFilter!$L$6:$L$1000,SMALL(IF(PlanningsFilter!$K$6:$K$1000=$A19,IF(PlanningsFilter!$C$6:$C$1000=R$2,IF(PlanningsFilter!$J$6:$J$1000=R$4,IF(PlanningsFilter!$I$6:$I$1000=\"\",ROW(PlanningsFilter!$I$6:$I$1000)-ROW($I$6)+1)))),$C19)),\"\")","v":""},{"$f":"IFERROR(INDEX(PlanningsFilter!$L$6:$L$1000,SMALL(IF(PlanningsFilter!$K$6:$K$1000=$A19,IF(PlanningsFilter!$C$6:$C$1000=S$2,IF(PlanningsFilter!$J$6:$J$1000=S$4,IF(PlanningsFilter!$I$6:$I$1000=\"\",ROW(PlanningsFilter!$I$6:$I$1000)-ROW($I$6)+1)))),$C19)),\"\")","v":""},{"$f":"IFERROR(INDEX(PlanningsFilter!$L$6:$L$1000,SMALL(IF(PlanningsFilter!$K$6:$K$1000=$A19,IF(PlanningsFilter!$C$6:$C$1000=T$2,IF(PlanningsFilter!$J$6:$J$1000=T$4,IF(PlanningsFilter!$I$6:$I$1000=\"\",ROW(PlanningsFilter!$I$6:$I$1000)-ROW($I$6)+1)))),$C19)),\"\")","v":""},{"$f":"IFERROR(INDEX(PlanningsFilter!$L$6:$L$1000,SMALL(IF(PlanningsFilter!$K$6:$K$1000=$A19,IF(PlanningsFilter!$C$6:$C$1000=U$2,IF(PlanningsFilter!$J$6:$J$1000=U$4,IF(PlanningsFilter!$I$6:$I$1000=\"\",ROW(PlanningsFilter!$I$6:$I$1000)-ROW($I$6)+1)))),$C19)),\"\")","v":""},{"$f":"IFERROR(INDEX(PlanningsFilter!$L$6:$L$1000,SMALL(IF(PlanningsFilter!$K$6:$K$1000=$A19,IF(PlanningsFilter!$C$6:$C$1000=V$2,IF(PlanningsFilter!$J$6:$J$1000=V$4,IF(PlanningsFilter!$I$6:$I$1000=\"\",ROW(PlanningsFilter!$I$6:$I$1000)-ROW($I$6)+1)))),$C19)),\"\")","v":""},{"$f":"IFERROR(INDEX(PlanningsFilter!$L$6:$L$1000,SMALL(IF(PlanningsFilter!$K$6:$K$1000=$A19,IF(PlanningsFilter!$C$6:$C$1000=W$2,IF(PlanningsFilter!$J$6:$J$1000=W$4,IF(PlanningsFilter!$I$6:$I$1000=\"\",ROW(PlanningsFilter!$I$6:$I$1000)-ROW($I$6)+1)))),$C19)),\"\")","v":""},{"$f":"IFERROR(INDEX(PlanningsFilter!$L$6:$L$1000,SMALL(IF(PlanningsFilter!$K$6:$K$1000=$A19,IF(PlanningsFilter!$C$6:$C$1000=X$2,IF(PlanningsFilter!$J$6:$J$1000=X$4,IF(PlanningsFilter!$I$6:$I$1000=\"\",ROW(PlanningsFilter!$I$6:$I$1000)-ROW($I$6)+1)))),$C19)),\"\")","v":""}]
["WERKTIIJDEN",null,null,"06:00/14:45","13:45/22:30",null,"06:00/14:45","13:45/22:30",null,"06:00/14:45","13:45/22:30",null,"06:00/14:45","13:45/22:30",null,"06:00/14:45","13:45/22:30",null,"06:00/14:45","13:45/22:30",null,"06:00/14:45","13:45/22:30"]
["HAS",null,1,{"$f":"IFERROR(INDEX(PlanningsFilter!$L$6:$L$1000,SMALL(IF(PlanningsFilter!$K$6:$K$1000=$A21,IF(PlanningsFilter!$C$6:$C$1000=D$2,IF(PlanningsFilter!$J$6:$J$1000=D$4,IF(PlanningsFilter!$I$6:$I$1000=\"\",ROW(PlanningsFilter!$I$6:$I$1000)-ROW($I$6)+1)))),$C21)),\"\")","v":"Norbert de Lange"},{"$f":"IFERROR(INDEX(PlanningsFilter!$L$6:$L$1000,SMALL(IF(PlanningsFilter!$K$6:$K$1000=$A21,IF(PlanningsFilter!$C$6:$C$1000=E$2,IF(PlanningsFilter!$J$6:$J$1000=E$4,IF(PlanningsFilter!$I$6:$I$1000=\"\",ROW(PlanningsFilter!$I$6:$I$1000)-ROW($I$6)+1)))),$C21)),\"\")","v":"Paul van Dongen"},{"$f":"IFERROR(INDEX(PlanningsFilter!$L$6:$L$1000,SMALL(IF(PlanningsFilter!$K$6:$K$1000=$A21,IF(PlanningsFilter!$C$6:$C$1000=F$2,IF(PlanningsFilter!$J$6:$J$1000=F$4,IF(PlanningsFilter!$I$6:$I$1000=\"\",ROW(PlanningsFilter!$I$6:$I$1000)-ROW($I$6)+1)))),$C21)),\"\")","v":""},{"$f":"IFERROR(INDEX(PlanningsFilter!$L$6:$L$1000,SMALL(IF(PlanningsFilter!$K$6:$K$1000=$A21,IF(PlanningsFilter!$C$6:$C$1000=G$2,IF(PlanningsFilter!$J$6:$J$1000=G$4,IF(PlanningsFilter!$I$6:$I$1000=\"\",ROW(PlanningsFilter!$I$6:$I$1000)-ROW($I$6)+1)))),$C21)),\"\")","v":"Norbert de Lange"},{"$f":"IFERROR(INDEX(PlanningsFilter!$L$6:$L$1000,SMALL(IF(PlanningsFilter!$K$6:$K$1000=$A21,IF(PlanningsFilter!$C$6:$C$1000=H$2,IF(PlanningsFilter!$J$6:$J$1000=H$4,IF(PlanningsFilter!$I$6:$I$1000=\"\",ROW(PlanningsFilter!$I$6:$I$1000)-ROW($I$6)+1)))),$C21)),\"\")","v":"Paul van Dongen"},{"$f":"IFERROR(INDEX(PlanningsFilter!$L$6:$L$1000,SMALL(IF(PlanningsFilter!$K$6:$K$1000=$A21,IF(PlanningsFilter!$C$6:$C$1000=I$2,IF(PlanningsFilter!$J$6:$J$1000=I$4,IF(PlanningsFilter!$I$6:$I$1000=\"\",ROW(PlanningsFilter!$I$6:$I$1000)-ROW($I$6)+1)))),$C21)),\"\")","v":""},{"$f":"IFERROR(INDEX(PlanningsFilter!$L$6:$L$1000,SMALL(IF(PlanningsFilter!$K$6:$K$1000=$A21,IF(PlanningsFilter!$C$6:$C$1000=J$2,IF(PlanningsFilter!$J$6:$J$1000=J$4,IF(PlanningsFilter!$I$6:$I$1000=\"\",ROW(PlanningsFilter!$I$6:$I$1000)-ROW($I$6)+1)))),$C21)),\"\")","v":"Norbert de Lange"},{"$f":"IFERROR(INDEX(PlanningsFilter!$L$6:$L$1000,SMALL(IF(PlanningsFilter!$K$6:$K$1000=$A21,IF(PlanningsFilter!$C$6:$C$1000=K$2,IF(PlanningsFilter!$J$6:$J$1000=K$4,IF(PlanningsFilter!$I$6:$I$1000=\"\",ROW(PlanningsFilter!$I$6:$I$1000)-ROW($I$6)+1)))),$C21)),\"\")","v":"Paul van Dongen"},{"$f":"IFERROR(INDEX(PlanningsFilter!$L$6:$L$1000,SMALL(IF(PlanningsFilter!$K$6:$K$1000=$A21,IF(PlanningsFilter!$C$6:$C$1000=L$2,IF(PlanningsFilter!$J$6:$J$1000=L$4,IF(PlanningsFilter!$I$6:$I$1000=\"\",ROW(PlanningsFilter!$I$6:$I$1000)-ROW($I$6)+1)))),$C21)),\"\")","v":""},{"$f":"IFERROR(INDEX(PlanningsFilter!$L$6:$L$1000,SMALL(IF(PlanningsFilter!$K$6:$K$1000=$A21,IF(PlanningsFilter!$C$6:$C$1000=M$2,IF(PlanningsFilter!$J$6:$J$1000=M$4,IF(PlanningsFilter!$I$6:$I$1000=\"\",ROW(PlanningsFilter!$I$6:$I$1000)-ROW($I$6)+1)))),$C21)),\"\")","v":"Norbert de Lange"},{"$f":"IFERROR(INDEX(PlanningsFilter!$L$6:$L$1000,SMALL(IF(PlanningsFilter!$K$6:$K$1000=$A21,IF(PlanningsFilter!$C$6:$C$1000=N$2,IF(PlanningsFilter!$J$6:$J$1000=N$4,IF(PlanningsFilter!$I$6:$I$1000=\"\",ROW(PlanningsFilter!$I$6:$I$1000)-ROW($I$6)+1)))),$C21)),\"\")","v":"Paul van Dongen"},{"$f":"IFERROR(INDEX(PlanningsFilter!$L$6:$L$1000,SMALL(IF(PlanningsFilter!$K$6:$K$1000=$A21,IF(PlanningsFilter!$C$6:$C$1000=O$2,IF(PlanningsFilter!$J$6:$J$1000=O$4,IF(PlanningsFilter!$I$6:$I$1000=\"\",ROW(PlanningsFilter!$I$6:$I$1000)-ROW($I$6)+1)))),$C21)),\"\")","v":""},{"$f":"IFERROR(INDEX(PlanningsFilter!$L$6:$L$1000,SMALL(IF(PlanningsFilter!$K$6:$K$1000=$A21,IF(PlanningsFilter!$C$6:$C$1000=P$2,IF(PlanningsFilter!$J$6:$J$1000=P$4,IF(PlanningsFilter!$I$6:$I$1000=\"\",ROW(PlanningsFilter!$I$6:$I$1000)-ROW($I$6)+1)))),$C21)),\"\")","v":"Norbert de Lange"},{"$f":"IFERROR(INDEX(PlanningsFilter!$L$6:$L$1000,SMALL(IF(PlanningsFilter!$K$6:$K$1000=$A21,IF(PlanningsFilter!$C$6:$C$1000=Q$2,IF(PlanningsFilter!$J$6:$J$1000=Q$4,IF(PlanningsFilter!$I$6:$I$1000=\"\",ROW(PlanningsFilter!$I$6:$I$1000)-ROW($I$6)+1)))),$C21)),\"\")","v":"Paul van Dongen"},{"$f":"IFERROR(INDEX(PlanningsFilter!$L$6:$L$1000,SMALL(IF(PlanningsFilter!$K$6:$K$1000=$A21,IF(PlanningsFilter!$C$6:$C$1000=R$2,IF(PlanningsFilter!$J$6:$J$1000=R$4,IF(PlanningsFilter!$I$6:$I$1000=\"\",ROW(PlanningsFilter!$I$6:$I$1000)-ROW($I$6)+1)))),$C21)),\"\")","v":""},{"$f":"IFERROR(INDEX(PlanningsFilter!$L$6:$L$1000,SMALL(IF(PlanningsFilter!$K$6:$K$1000=$A21,IF(PlanningsFilter!$C$6:$C$1000=S$2,IF(PlanningsFilter!$J$6:$J$1000=S$4,IF(PlanningsFilter!$I$6:$I$1000=\"\",ROW(PlanningsFilter!$I$6:$I$1000)-ROW($I$6)+1)))),$C21)),\"\")","v":""},{"$f":"IFERROR(INDEX(PlanningsFilter!$L$6:$L$1000,SMALL(IF(PlanningsFilter!$K$6:$K$1000=$A21,IF(PlanningsFilter!$C$6:$C$1000=T$2,IF(PlanningsFilter!$J$6:$J$1000=T$4,IF(PlanningsFilter!$I$6:$I$1000=\"\",ROW(PlanningsFilter!$I$6:$I$1000)-ROW($I$6)+1)))),$C21)),\"\")","v":""},{"$f":"IFERROR(INDEX(PlanningsFilter!$L$6:$L$1000,SMALL(IF(PlanningsFilter!$K$6:$K$1000=$A21,IF(PlanningsFilter!$C$6:$C$1000=U$2,IF(PlanningsFilter!$J$6:$J$1000=U$4,IF(PlanningsFilter!$I$6:$I$1000=\"\",ROW(PlanningsFilter!$I$6:$I$1000)-ROW($I$6)+1)))),$C21)),\"\")","v":""},{"$f":"IFERROR(INDEX(PlanningsFilter!$L$6:$L$1000,SMALL(IF(PlanningsFilter!$K$6:$K$1000=$A21,IF(PlanningsFilter!$C$6:$C$1000=V$2,IF(PlanningsFilter!$J$6:$J$1000=V$4,IF(PlanningsFilter!$I$6:$I$1000=\"\",ROW(PlanningsFilter!$I$6:$I$1000)-ROW($I$6)+1)))),$C21)),\"\")","v":""},{"$f":"IFERROR(INDEX(PlanningsFilter!$L$6:$L$1000,SMALL(IF(PlanningsFilter!$K$6:$K$1000=$A21,IF(PlanningsFilter!$C$6:$C$1000=W$2,IF(PlanningsFilter!$J$6:$J$1000=W$4,IF(PlanningsFilter!$I$6:$I$1000=\"\",ROW(PlanningsFilter!$I$6:$I$1000)-ROW($I$6)+1)))),$C21)),\"\")","v":""},{"$f":"IFERROR(INDEX(PlanningsFilter!$L$6:$L$1000,SMALL(IF(PlanningsFilter!$K$6:$K$1000=$A21,IF(PlanningsFilter!$C$6:$C$1000=X$2,IF(PlanningsFilter!$J$6:$J$1000=X$4,IF(PlanningsFilter!$I$6:$I$1000=\"\",ROW(PlanningsFilter!$I$6:$I$1000)-ROW($I$6)+1)))),$C21)),\"\")","v":""}]
["HAS",null,2,{"$f":"IFERROR(INDEX(PlanningsFilter!$L$6:$L$1000,SMALL(IF(PlanningsFilter!$K$6:$K$1000=$A22,IF(PlanningsFilter!$C$6:$C$1000=D$2,IF(PlanningsFilter!$J$6:$J$1000=D$4,IF(PlanningsFilter!$I$6:$I$1000=\"\",ROW(PlanningsFilter!$I$6:$I$1000)-ROW($I$6)+1)))),$C22)),\"\")","v":"Norbert de Lange"},{"$f":"IFERROR(INDEX(PlanningsFilter!$L$6:$L$1000,SMALL(IF(PlanningsFilter!$K$6:$K$1000=$A22,IF(PlanningsFilter!$C$6:$C$1000=E$2,IF(PlanningsFilter!$J$6:$J$1000=E$4,IF(PlanningsFilter!$I$6:$I$1000=\"\",ROW(PlanningsFilter!$I$6:$I$1000)-ROW($I$6)+1)))),$C22)),\"\")","v":"Paul van Dongen"},{"$f":"IFERROR(INDEX(PlanningsFilter!$L$6:$L$1000,SMALL(IF(PlanningsFilter!$K$6:$K$1000=$A22,IF(PlanningsFilter!$C$6:$C$1000=F$2,IF(PlanningsFilter!$J$6:$J$1000=F$4,IF(PlanningsFilter!$I$6:$I$1000=\"\",ROW(PlanningsFilter!$I$6:$I$1000)-ROW($I$6)+1)))),$C22)),\"\")","v":""},{"$f":"IFERROR(INDEX(PlanningsFilter!$L$6:$L$1000,SMALL(IF(PlanningsFilter!$K$6:$K$1000=$A22,IF(PlanningsFilter!$C$6:$C$1000=G$2,IF(PlanningsFilter!$J$6:$J$1000=G$4,IF(PlanningsFilter!$I$6:$I$1000=\"\",ROW(PlanningsFilter!$I$6:$I$1000)-ROW($I$6)+1)))),$C22)),\"\")","v":"Norbert de Lange"},{"$f":"IFERROR(INDEX(PlanningsFilter!$L$6:$L$1000,SMALL(IF(PlanningsFilter!$K$6:$K$1000=$A22,IF(PlanningsFilter!$C$6:$C$1000=H$2,IF(PlanningsFilter!$J$6:$J$1000=H$4,IF(PlanningsFilter!$I$6:$I$1000=\"\",ROW(PlanningsFilter!$I$6:$I$1000)-ROW($I$6)+1)))),$C22)),\"\")","v":"Paul van Dongen"},{"$f":"IFERROR(INDEX(PlanningsFilter!$L$6:$L$1000,SMALL(IF(PlanningsFilter!$K$6:$K$1000=$A22,IF(PlanningsFilter!$C$6:$C$1000=I$2,IF(PlanningsFilter!$J$6:$J$1000=I$4,IF(PlanningsFilter!$I$6:$I$1000=\"\",ROW(PlanningsFilter!$I$6:$I$1000)-ROW($I$6)+1)))),$C22)),\"\")","v":""},{"$f":"IFERROR(INDEX(PlanningsFilter!$L$6:$L$1000,SMALL(IF(PlanningsFilter!$K$6:$K$1000=$A22,IF(PlanningsFilter!$C$6:$C$1000=J$2,IF(PlanningsFilter!$J$6:$J$1000=J$4,IF(PlanningsFilter!$I$6:$I$1000=\"\",ROW(PlanningsFilter!$I$6:$I$1000)-ROW($I$6)+1)))),$C22)),\"\")","v":"Norbert de Lange"},{"$f":"IFERROR(INDEX(PlanningsFilter!$L$6:$L$1000,SMALL(IF(PlanningsFilter!$K$6:$K$1000=$A22,IF(PlanningsFilter!$C$6:$C$1000=K$2,IF(PlanningsFilter!$J$6:$J$1000=K$4,IF(PlanningsFilter!$I$6:$I$1000=\"\",ROW(PlanningsFilter!$I$6:$I$1000)-ROW($I$6)+1)))),$C22)),\"\")","v":"Paul van Dongen"},{"$f":"IFERROR(INDEX(PlanningsFilter!$L$6:$L$1000,SMALL(IF(PlanningsFilter!$K$6:$K$1000=$A22,IF(PlanningsFilter!$C$6:$C$1000=L$2,IF(PlanningsFilter!$J$6:$J$1000=L$4,IF(PlanningsFilter!$I$6:$I$1000=\"\",ROW(PlanningsFilter!$I$6:$I$1000)-ROW($I$6)+1)))),$C22)),\"\")","v":""},{"$f":"IFERROR(INDEX(PlanningsFilter!$L$6:$L$1000,SMALL(IF(PlanningsFilter!$K$6:$K$1000=$A22,IF(PlanningsFilter!$C$6:$C$1000=M$2,IF(PlanningsFilter!$J$6:$J$1000=M$4,IF(PlanningsFilter!$I$6:$I$1000=\"\",ROW(PlanningsFilter!$I$6:$I$1000)-ROW($I$6)+1)))),$C22)),\"\")","v":"Norbert de Lange"},{"$f":"IFERROR(INDEX(PlanningsFilter!$L$6:$L$1000,SMALL(IF(PlanningsFilter!$K$6:$K$1000=$A22,IF(PlanningsFilter!$C$6:$C$1000=N$2,IF(PlanningsFilter!$J$6:$J$1000=N$4,IF(PlanningsFilter!$I$6:$I$1000=\"\",ROW(PlanningsFilter!$I$6:$I$1000)-ROW($I$6)+1)))),$C22)),\"\")","v":"Paul van Dongen"},{"$f":"IFERROR(INDEX(PlanningsFilter!$L$6:$L$1000,SMALL(IF(PlanningsFilter!$K$6:$K$1000=$A22,IF(PlanningsFilter!$C$6:$C$1000=O$2,IF(PlanningsFilter!$J$6:$J$1000=O$4,IF(PlanningsFilter!$I$6:$I$1000=\"\",ROW(PlanningsFilter!$I$6:$I$1000)-ROW($I$6)+1)))),$C22)),\"\")","v":""},{"$f":"IFERROR(INDEX(PlanningsFilter!$L$6:$L$1000,SMALL(IF(PlanningsFilter!$K$6:$K$1000=$A22,IF(PlanningsFilter!$C$6:$C$1000=P$2,IF(PlanningsFilter!$J$6:$J$1000=P$4,IF(PlanningsFilter!$I$6:$I$1000=\"\",ROW(PlanningsFilter!$I$6:$I$1000)-ROW($I$6)+1)))),$C22)),\"\")","v":"Norbert de Lange"},{"$f":"IFERROR(INDEX(PlanningsFilter!$L$6:$L$1000,SMALL(IF(PlanningsFilter!$K$6:$K$1000=$A22,IF(PlanningsFilter!$C$6:$C$1000=Q$2,IF(PlanningsFilter!$J$6:$J$1000=Q$4,IF(PlanningsFilter!$I$6:$I$1000=\"\",ROW(PlanningsFilter!$I$6:$I$1000)-ROW($I$6)+1)))),$C22)),\"\")","v":"Paul van Dongen"},{"$f":"IFERROR(INDEX(PlanningsFilter!$L$6:$L$1000,SMALL(IF(PlanningsFilter!$K$6:$K$1000=$A22,IF(PlanningsFilter!$C$6:$C$1000=R$2,IF(PlanningsFilter!$J$6:$J$1000=R$4,IF(PlanningsFilter!$I$6:$I$1000=\"\",ROW(PlanningsFilter!$I$6:$I$1000)-ROW($I$6)+1)))),$C22)),\"\")","v":""},{"$f":"IFERROR(INDEX(PlanningsFilter!$L$6:$L$1000,SMALL(IF(PlanningsFilter!$K$6:$K$1000=$A22,IF(PlanningsFilter!$C$6:$C$1000=S$2,IF(PlanningsFilter!$J$6:$J$1000=S$4,IF(PlanningsFilter!$I$6:$I$1000=\"\",ROW(PlanningsFilter!$I$6:$I$1000)-ROW($I$6)+1)))),$C22)),\"\")","v":""},{"$f":"IFERROR(INDEX(PlanningsFilter!$L$6:$L$1000,SMALL(IF(PlanningsFilter!$K$6:$K$1000=$A22,IF(PlanningsFilter!$C$6:$C$1000=T$2,IF(PlanningsFilter!$J$6:$J$1000=T$4,IF(PlanningsFilter!$I$6:$I$1000=\"\",ROW(PlanningsFilter!$I$6:$I$1000)-ROW($I$6)+1)))),$C22)),\"\")","v":""},{"$f":"IFERROR(INDEX(PlanningsFilter!$L$6:$L$1000,SMALL(IF(PlanningsFilter!$K$6:$K$1000=$A22,IF(PlanningsFilter!$C$6:$C$1000=U$2,IF(PlanningsFilter!$J$6:$J$1000=U$4,IF(PlanningsFilter!$I$6:$I$1000=\"\",ROW(PlanningsFilter!$I$6:$I$1000)-ROW($I$6)+1)))),$C22)),\"\")","v":""},{"$f":"IFERROR(INDEX(PlanningsFilter!$L$6:$L$1000,SMALL(IF(PlanningsFilter!$K$6:$K$1000=$A22,IF(PlanningsFilter!$C$6:$C$1000=V$2,IF(PlanningsFilter!$J$6:$J$1000=V$4,IF(PlanningsFilter!$I$6:$I$1000=\"\",ROW(PlanningsFilter!$I$6:$I$1000)-ROW($I$6)+1)))),$C22)),\"\")","v":""},{"$f":"IFERROR(INDEX(PlanningsFilter!$L$6:$L$1000,SMALL(IF(PlanningsFilter!$K$6:$K$1000=$A22,IF(PlanningsFilter!$C$6:$C$1000=W$2,IF(PlanningsFilter!$J$6:$J$1000=W$4,IF(PlanningsFilter!$I$6:$I$1000=\"\",ROW(PlanningsFilter!$I$6:$I$1000)-ROW($I$6)+1)))),$C22)),\"\")","v":""},{"$f":"IFERROR(INDEX(PlanningsFilter!$L$6:$L$1000,SMALL(IF(PlanningsFilter!$K$6:$K$1000=$A22,IF(PlanningsFilter!$C$6:$C$1000=X$2,IF(PlanningsFilter!$J$6:$J$1000=X$4,IF(PlanningsFilter!$I$6:$I$1000=\"\",ROW(PlanningsFilter!$I$6:$I$1000)-ROW($I$6)+1)))),$C22)),\"\")","v":""}]
["HAS",null,3,{"$f":"IFERROR(INDEX(PlanningsFilter!$L$6:$L$1000,SMALL(IF(PlanningsFilter!$K$6:$K$1000=$A23,IF(PlanningsFilter!$C$6:$C$1000=D$2,IF(PlanningsFilter!$J$6:$J$1000=D$4,IF(PlanningsFilter!$I$6:$I$1000=\"\",ROW(PlanningsFilter!$I$6:$I$1000)-ROW($I$6)+1)))),$C23)),\"\")","v":""},{"$f":"IFERROR(INDEX(PlanningsFilter!$L$6:$L$1000,SMALL(IF(PlanningsFilter!$K$6:$K$1000=$A23,IF(PlanningsFilter!$C$6:$C$1000=E$2,IF(PlanningsFilter!$J$6:$J$1000=E$4,IF(PlanningsFilter!$I$6:$I$1000=\"\",ROW(PlanningsFilter!$I$6:$I$1000)-ROW($I$6)+1)))),$C23)),\"\")","v":""},{"$f":"IFERROR(INDEX(PlanningsFilter!$L$6:$L$1000,SMALL(IF(PlanningsFilter!$K$6:$K$1000=$A23,IF(PlanningsFilter!$C$6:$C$1000=F$2,IF(PlanningsFilter!$J$6:$J$1000=F$4,IF(PlanningsFilter!$I$6:$I$1000=\"\",ROW(PlanningsFilter!$I$6:$I$1000)-ROW($I$6)+1)))),$C23)),\"\")","v":""},{"$f":"IFERROR(INDEX(PlanningsFilter!$L$6:$L$1000,SMALL(IF(PlanningsFilter!$K$6:$K$1000=$A23,IF(PlanningsFilter!$C$6:$C$1000=G$2,IF(PlanningsFilter!$J$6:$J$1000=G$4,IF(PlanningsFilter!$I$6:$I$1000=\"\",ROW(PlanningsFilter!$I$6:$I$1000)-ROW($I$6)+1)))),$C23)),\"\")","v":""},{"$f":"IFERROR(INDEX(PlanningsFilter!$L$6:$L$1000,SMALL(IF(PlanningsFilter!$K$6:$K$1000=$A23,IF(PlanningsFilter!$C$6:$C$1000=H$2,IF(PlanningsFilter!$J$6:$J$1000=H$4,IF(PlanningsFilter!$I$6:$I$1000=\"\",ROW(PlanningsFilter!$I$6:$I$1000)-ROW($I$6)+1)))),$C23)),\"\")","v":""},{"$f":"IFERROR(INDEX(PlanningsFilter!$L$6:$L$1000,SMALL(IF(PlanningsFilter!$K$6:$K$1000=$A23,IF(PlanningsFilter!$C$6:$C$1000=I$2,IF(PlanningsFilter!$J$6:$J$1000=I$4,IF(PlanningsFilter!$I$6:$I$1000=\"\",ROW(PlanningsFilter!$I$6:$I$1000)-ROW($I$6)+1)))),$C23)),\"\")","v":""},{"$f":"IFERROR(INDEX(PlanningsFilter!$L$6:$L$1000,SMALL(IF(PlanningsFilter!$K$6:$K$1000=$A23,IF(PlanningsFilter!$C$6:$C$1000=J$2,IF(PlanningsFilter!$J$6:$J$1000=J$4,IF(PlanningsFilter!$I$6:$I$1000=\"\",ROW(PlanningsFilter!$I$6:$I$1000)-ROW($I$6)+1)))),$C23)),\"\")","v":""},{"$f":"IFERROR(INDEX(PlanningsFilter!$L$6:$L$1000,SMALL(IF(PlanningsFilter!$K$6:$K$1000=$A23,IF(PlanningsFilter!$C$6:$C$1000=K$2,IF(PlanningsFilter!$J$6:$J$1000=K$4,IF(PlanningsFilter!$I$6:$I$1000=\"\",ROW(PlanningsFilter!$I$6:$I$1000)-ROW($I$6)+1)))),$C23)),\"\")","v":""},{"$f":"IFERROR(INDEX(PlanningsFilter!$L$6:$L$1000,SMALL(IF(PlanningsFilter!$K$6:$K$1000=$A23,IF(PlanningsFilter!$C$6:$C$1000=L$2,IF(PlanningsFilter!$J$6:$J$1000=L$4,IF(PlanningsFilter!$I$6:$I$1000=\"\",ROW(PlanningsFilter!$I$6:$I$1000)-ROW($I$6)+1)))),$C23)),\"\")","v":""},{"$f":"IFERROR(INDEX(PlanningsFilter!$L$6:$L$1000,SMALL(IF(PlanningsFilter!$K$6:$K$1000=$A23,IF(PlanningsFilter!$C$6:$C$1000=M$2,IF(PlanningsFilter!$J$6:$J$1000=M$4,IF(PlanningsFilter!$I$6:$I$1000=\"\",ROW(PlanningsFilter!$I$6:$I$1000)-ROW($I$6)+1)))),$C23)),\"\")","v":""},{"$f":"IFERROR(INDEX(PlanningsFilter!$L$6:$L$1000,SMALL(IF(PlanningsFilter!$K$6:$K$1000=$A23,IF(PlanningsFilter!$C$6:$C$1000=N$2,IF(PlanningsFilter!$J$6:$J$1000=N$4,IF(PlanningsFilter!$I$6:$I$1000=\"\",ROW(PlanningsFilter!$I$6:$I$1000)-ROW($I$6)+1)))),$C23)),\"\")","v":""},{"$f":"IFERROR(INDEX(PlanningsFilter!$L$6:$L$1000,SMALL(IF(PlanningsFilter!$K$6:$K$1000=$A23,IF(PlanningsFilter!$C$6:$C$1000=O$2,IF(PlanningsFilter!$J$6:$J$1000=O$4,IF(PlanningsFilter!$I$6:$I$1000=\"\",ROW(PlanningsFilter!$I$6:$I$1000)-ROW($I$6)+1)))),$C23)),\"\")","v":""},{"$f":"IFERROR(INDEX(PlanningsFilter!$L$6:$L$1000,SMALL(IF(PlanningsFilter!$K$6:$K$1000=$A23,IF(PlanningsFilter!$C$6:$C$1000=P$2,IF(PlanningsFilter!$J$6:$J$1000=P$4,IF(PlanningsFilter!$I$6:$I$1000=\"\",ROW(PlanningsFilter!$I$6:$I$1000)-ROW($I$6)+1)))),$C23)),\"\")","v":""},{"$f":"IFERROR(INDEX(PlanningsFilter!$L$6:$L$1000,SMALL(IF(PlanningsFilter!$K$6:$K$1000=$A23,IF(PlanningsFilter!$C$6:$C$1000=Q$2,IF(PlanningsFilter!$J$6:$J$1000=Q$4,IF(PlanningsFilter!$I$6:$I$1000=\"\",ROW(PlanningsFilter!$I$6:$I$1000)-ROW($I$6)+1)))),$C23)),\"\")","v":""},{"$f":"IFERROR(INDEX(PlanningsFilter!$L$6:$L$1000,SMALL(IF(PlanningsFilter!$K$6:$K$1000=$A23,IF(PlanningsFilter!$C$6:$C$1000=R$2,IF(PlanningsFilter!$J$6:$J$1000=R$4,IF(PlanningsFilter!$I$6:$I$1000=\"\",ROW(PlanningsFilter!$I$6:$I$1000)-ROW($I$6)+1)))),$C23)),\"\")","v":""},{"$f":"IFERROR(INDEX(PlanningsFilter!$L$6:$L$1000,SMALL(IF(PlanningsFilter!$K$6:$K$1000=$A23,IF(PlanningsFilter!$C$6:$C$1000=S$2,IF(PlanningsFilter!$J$6:$J$1000=S$4,IF(PlanningsFilter!$I$6:$I$1000=\"\",ROW(PlanningsFilter!$I$6:$I$1000)-ROW($I$6)+1)))),$C23)),\"\")","v":""},{"$f":"IFERROR(INDEX(PlanningsFilter!$L$6:$L$1000,SMALL(IF(PlanningsFilter!$K$6:$K$1000=$A23,IF(PlanningsFilter!$C$6:$C$1000=T$2,IF(PlanningsFilter!$J$6:$J$1000=T$4,IF(PlanningsFilter!$I$6:$I$1000=\"\",ROW(PlanningsFilter!$I$6:$I$1000)-ROW($I$6)+1)))),$C23)),\"\")","v":""},{"$f":"IFERROR(INDEX(PlanningsFilter!$L$6:$L$1000,SMALL(IF(PlanningsFilter!$K$6:$K$1000=$A23,IF(PlanningsFilter!$C$6:$C$1000=U$2,IF(PlanningsFilter!$J$6:$J$1000=U$4,IF(PlanningsFilter!$I$6:$I$1000=\"\",ROW(PlanningsFilter!$I$6:$I$1000)-ROW($I$6)+1)))),$C23)),\"\")","v":""},{"$f":"IFERROR(INDEX(PlanningsFilter!$L$6:$L$1000,SMALL(IF(PlanningsFilter!$K$6:$K$1000=$A23,IF(PlanningsFilter!$C$6:$C$1000=V$2,IF(PlanningsFilter!$J$6:$J$1000=V$4,IF(PlanningsFilter!$I$6:$I$1000=\"\",ROW(PlanningsFilter!$I$6:$I$1000)-ROW($I$6)+1)))),$C23)),\"\")","v":""},{"$f":"IFERROR(INDEX(PlanningsFilter!$L$6:$L$1000,SMALL(IF(PlanningsFilter!$K$6:$K$1000=$A23,IF(PlanningsFilter!$C$6:$C$1000=W$2,IF(PlanningsFilter!$J$6:$J$1000=W$4,IF(PlanningsFilter!$I$6:$I$1000=\"\",ROW(PlanningsFilter!$I$6:$I$1000)-ROW($I$6)+1)))),$C23)),\"\")","v":""},{"$f":"IFERROR(INDEX(PlanningsFilter!$L$6:$L$1000,SMALL(IF(PlanningsFilter!$K$6:$K$1000=$A23,IF(PlanningsFilter!$C$6:$C$1000=X$2,IF(PlanningsFilter!$J$6:$J$1000=X$4,IF(PlanningsFilter!$I$6:$I$1000=\"\",ROW(PlanningsFilter!$I$6:$I$1000)-ROW($I$6)+1)))),$C23)),\"\")","v":""}]
["HAS",null,4,{"$f":"IFERROR(INDEX(PlanningsFilter!$L$6:$L$1000,SMALL(IF(PlanningsFilter!$K$6:$K$1000=$A24,IF(PlanningsFilter!$C$6:$C$1000=D$2,IF(PlanningsFilter!$J$6:$J$1000=D$4,IF(PlanningsFilter!$I$6:$I$1000=\"\",ROW(PlanningsFilter!$I$6:$I$1000)-ROW($I$6)+1)))),$C24)),\"\")","v":""},{"$f":"IFERROR(INDEX(PlanningsFilter!$L$6:$L$1000,SMALL(IF(PlanningsFilter!$K$6:$K$1000=$A24,IF(PlanningsFilter!$C$6:$C$1000=E$2,IF(PlanningsFilter!$J$6:$J$1000=E$4,IF(PlanningsFilter!$I$6:$I$1000=\"\",ROW(PlanningsFilter!$I$6:$I$1000)-ROW($I$6)+1)))),$C24)),\"\")","v":""},{"$f":"IFERROR(INDEX(PlanningsFilter!$L$6:$L$1000,SMALL(IF(PlanningsFilter!$K$6:$K$1000=$A24,IF(PlanningsFilter!$C$6:$C$1000=F$2,IF(PlanningsFilter!$J$6:$J$1000=F$4,IF(PlanningsFilter!$I$6:$I$1000=\"\",ROW(PlanningsFilter!$I$6:$I$1000)-ROW($I$6)+1)))),$C24)),\"\")","v":""},{"$f":"IFERROR(INDEX(PlanningsFilter!$L$6:$L$1000,SMALL(IF(PlanningsFilter!$K$6:$K$1000=$A24,IF(PlanningsFilter!$C$6:$C$1000=G$2,IF(PlanningsFilter!$J$6:$J$1000=G$4,IF(PlanningsFilter!$I$6:$I$1000=\"\",ROW(PlanningsFilter!$I$6:$I$1000)-ROW($I$6)+1)))),$C24)),\"\")","v":""},{"$f":"IFERROR(INDEX(PlanningsFilter!$L$6:$L$1000,SMALL(IF(PlanningsFilter!$K$6:$K$1000=$A24,IF(PlanningsFilter!$C$6:$C$1000=H$2,IF(PlanningsFilter!$J$6:$J$1000=H$4,IF(PlanningsFilter!$I$6:$I$1000=\"\",ROW(PlanningsFilter!$I$6:$I$1000)-ROW($I$6)+1)))),$C24)),\"\")","v":""},{"$f":"IFERROR(INDEX(PlanningsFilter!$L$6:$L$1000,SMALL(IF(PlanningsFilter!$K$6:$K$1000=$A24,IF(PlanningsFilter!$C$6:$C$1000=I$2,IF(PlanningsFilter!$J$6:$J$1000=I$4,IF(PlanningsFilter!$I$6:$I$1000=\"\",ROW(PlanningsFilter!$I$6:$I$1000)-ROW($I$6)+1)))),$C24)),\"\")","v":""},{"$f":"IFERROR(INDEX(PlanningsFilter!$L$6:$L$1000,SMALL(IF(PlanningsFilter!$K$6:$K$1000=$A24,IF(PlanningsFilter!$C$6:$C$1000=J$2,IF(PlanningsFilter!$J$6:$J$1000=J$4,IF(PlanningsFilter!$I$6:$I$1000=\"\",ROW(PlanningsFilter!$I$6:$I$1000)-ROW($I$6)+1)))),$C24)),\"\")","v":""},{"$f":"IFERROR(INDEX(PlanningsFilter!$L$6:$L$1000,SMALL(IF(PlanningsFilter!$K$6:$K$1000=$A24,IF(PlanningsFilter!$C$6:$C$1000=K$2,IF(PlanningsFilter!$J$6:$J$1000=K$4,IF(PlanningsFilter!$I$6:$I$1000=\"\",ROW(PlanningsFilter!$I$6:$I$1000)-ROW($I$6)+1)))),$C24)),\"\")","v":""},{"$f":"IFERROR(INDEX(PlanningsFilter!$L$6:$L$1000,SMALL(IF(PlanningsFilter!$K$6:$K$1000=$A24,IF(PlanningsFilter!$C$6:$C$1000=L$2,IF(PlanningsFilter!$J$6:$J$1000=L$4,IF(PlanningsFilter!$I$6:$I$1000=\"\",ROW(PlanningsFilter!$I$6:$I$1000)-ROW($I$6)+1)))),$C24)),\"\")","v":""},{"$f":"IFERROR(INDEX(PlanningsFilter!$L$6:$L$1000,SMALL(IF(PlanningsFilter!$K$6:$K$1000=$A24,IF(PlanningsFilter!$C$6:$C$1000=M$2,IF(PlanningsFilter!$J$6:$J$1000=M$4,IF(PlanningsFilter!$I$6:$I$1000=\"\",ROW(PlanningsFilter!$I$6:$I$1000)-ROW($I$6)+1)))),$C24)),\"\")","v":""},{"$f":"IFERROR(INDEX(PlanningsFilter!$L$6:$L$1000,SMALL(IF(PlanningsFilter!$K$6:$K$1000=$A24,IF(PlanningsFilter!$C$6:$C$1000=N$2,IF(PlanningsFilter!$J$6:$J$1000=N$4,IF(PlanningsFilter!$I$6:$I$1000=\"\",ROW(PlanningsFilter!$I$6:$I$1000)-ROW($I$6)+1)))),$C24)),\"\")","v":""},{"$f":"IFERROR(INDEX(PlanningsFilter!$L$6:$L$1000,SMALL(IF(PlanningsFilter!$K$6:$K$1000=$A24,IF(PlanningsFilter!$C$6:$C$1000=O$2,IF(PlanningsFilter!$J$6:$J$1000=O$4,IF(PlanningsFilter!$I$6:$I$1000=\"\",ROW(PlanningsFilter!$I$6:$I$1000)-ROW($I$6)+1)))),$C24)),\"\")","v":""},{"$f":"IFERROR(INDEX(PlanningsFilter!$L$6:$L$1000,SMALL(IF(PlanningsFilter!$K$6:$K$1000=$A24,IF(PlanningsFilter!$C$6:$C$1000=P$2,IF(PlanningsFilter!$J$6:$J$1000=P$4,IF(PlanningsFilter!$I$6:$I$1000=\"\",ROW(PlanningsFilter!$I$6:$I$1000)-ROW($I$6)+1)))),$C24)),\"\")","v":""},{"$f":"IFERROR(INDEX(PlanningsFilter!$L$6:$L$1000,SMALL(IF(PlanningsFilter!$K$6:$K$1000=$A24,IF(PlanningsFilter!$C$6:$C$1000=Q$2,IF(PlanningsFilter!$J$6:$J$1000=Q$4,IF(PlanningsFilter!$I$6:$I$1000=\"\",ROW(PlanningsFilter!$I$6:$I$1000)-ROW($I$6)+1)))),$C24)),\"\")","v":""},{"$f":"IFERROR(INDEX(PlanningsFilter!$L$6:$L$1000,SMALL(IF(PlanningsFilter!$K$6:$K$1000=$A24,IF(PlanningsFilter!$C$6:$C$1000=R$2,IF(PlanningsFilter!$J$6:$J$1000=R$4,IF(PlanningsFilter!$I$6:$I$1000=\"\",ROW(PlanningsFilter!$I$6:$I$1000)-ROW($I$6)+1)))),$C24)),\"\")","v":""},{"$f":"IFERROR(INDEX(PlanningsFilter!$L$6:$L$1000,SMALL(IF(PlanningsFilter!$K$6:$K$1000=$A24,IF(PlanningsFilter!$C$6:$C$1000=S$2,IF(PlanningsFilter!$J$6:$J$1000=S$4,IF(PlanningsFilter!$I$6:$I$1000=\"\",ROW(PlanningsFilter!$I$6:$I$1000)-ROW($I$6)+1)))),$C24)),\"\")","v":""},{"$f":"IFERROR(INDEX(PlanningsFilter!$L$6:$L$1000,SMALL(IF(PlanningsFilter!$K$6:$K$1000=$A24,IF(PlanningsFilter!$C$6:$C$1000=T$2,IF(PlanningsFilter!$J$6:$J$1000=T$4,IF(PlanningsFilter!$I$6:$I$1000=\"\",ROW(PlanningsFilter!$I$6:$I$1000)-ROW($I$6)+1)))),$C24)),\"\")","v":""},{"$f":"IFERROR(INDEX(PlanningsFilter!$L$6:$L$1000,SMALL(IF(PlanningsFilter!$K$6:$K$1000=$A24,IF(PlanningsFilter!$C$6:$C$1000=U$2,IF(PlanningsFilter!$J$6:$J$1000=U$4,IF(PlanningsFilter!$I$6:$I$1000=\"\",ROW(PlanningsFilter!$I$6:$I$1000)-ROW($I$6)+1)))),$C24)),\"\")","v":""},{"$f":"IFERROR(INDEX(PlanningsFilter!$L$6:$L$1000,SMALL(IF(PlanningsFilter!$K$6:$K$1000=$A24,IF(PlanningsFilter!$C$6:$C$1000=V$2,IF(PlanningsFilter!$J$6:$J$1000=V$4,IF(PlanningsFilter!$I$6:$I$1000=\"\",ROW(PlanningsFilter!$I$6:$I$1000)-ROW($I$6)+1)))),$C24)),\"\")","v":""},{"$f":"IFERROR(INDEX(PlanningsFilter!$L$6:$L$1000,SMALL(IF(PlanningsFilter!$K$6:$K$1000=$A24,IF(PlanningsFilter!$C$6:$C$1000=W$2,IF(PlanningsFilter!$J$6:$J$1000=W$4,IF(PlanningsFilter!$I$6:$I$1000=\"\",ROW(PlanningsFilter!$I$6:$I$1000)-ROW($I$6)+1)))),$C24)),\"\")","v":""},{"$f":"IFERROR(INDEX(PlanningsFilter!$L$6:$L$1000,SMALL(IF(PlanningsFilter!$K$6:$K$1000=$A24,IF(PlanningsFilter!$C$6:$C$1000=X$2,IF(PlanningsFilter!$J$6:$J$1000=X$4,IF(PlanningsFilter!$I$6:$I$1000=\"\",ROW(PlanningsFilter!$I$6:$I$1000)-ROW($I$6)+1)))),$C24)),\"\")","v":""}]
["LCR",null,1,{"$f":"IFERROR(INDEX(PlanningsFilter!$L$6:$L$1000,SMALL(IF(PlanningsFilter!$K$6:$K$1000=$A25,IF(PlanningsFilter!$C$6:$C$1000=D$2,IF(PlanningsFilter!$J$6:$J$1000=D$4,IF(PlanningsFilter!$I$6:$I$1000=\"\",ROW(PlanningsFilter!$I$6:$I$1000)-ROW($I$6)+1)))),$C25)),\"\")","v":"Wolter De bolder"},{"$f":"IFERROR(INDEX(PlanningsFilter!$L$6:$L$1000,SMALL(IF(PlanningsFilter!$K$6:$K$1000=$A25,IF(PlanningsFilter!$C$6:$C$1000=E$2,IF(PlanningsFilter!$J$6:$J$1000=E$4,IF(PlanningsFilter!$I$6:$I$1000=\"\",ROW(PlanningsFilter!$I$6:$I$1000)-ROW($I$6)+1)))),$C25)),\"\")","v":"Christiaan de Wit"},{"$f":"IFERROR(INDEX(PlanningsFilter!$L$6:$L$1000,SMALL(IF(PlanningsFilter!$K$6:$K$1000=$A25,IF(PlanningsFilter!$C$6:$C$1000=F$2,IF(PlanningsFilter!$J$6:$J$1000=F$4,IF(PlanningsFilter!$I$6:$I$1000=\"\",ROW(PlanningsFilter!$I$6:$I$1000)-ROW($I$6)+1)))),$C25)),\"\")","v":""},{"$f":"IFERROR(INDEX(PlanningsFilter!$L$6:$L$1000,SMALL(IF(PlanningsFilter!$K$6:$K$1000=$A25,IF(PlanningsFilter!$C$6:$C$1000=G$2,IF(PlanningsFilter!$J$6:$J$1000=G$4,IF(PlanningsFilter!$I$6:$I$1000=\"\",ROW(PlanningsFilter!$I$6:$I$1000)-ROW($I$6)+1)))),$C25)),\"\")","v":"Wolter De bolder"},{"$f":"IFERROR(INDEX(PlanningsFilter!$L$6:$L$1000,SMALL(IF(PlanningsFilter!$K$6:$K$1000=$A25,IF(PlanningsFilter!$C$6:$C$1000=H$2,IF(PlanningsFilter!$J$6:$J$1000=H$4,IF(PlanningsFilter!$I$6:$I$1000=\"\",ROW(PlanningsFilter!$I$6:$I$1000)-ROW($I$6)+1)))),$C25)),\"\")","v":"Christiaan de Wit"},{"$f":"IFERROR(INDEX(PlanningsFilter!$L$6:$L$1000,SMALL(IF(PlanningsFilter!$K$6:$K$1000=$A25,IF(PlanningsFilter!$C$6:$C$1000=I$2,IF(PlanningsFilter!$J$6:$J$1000=I$4,IF(PlanningsFilter!$I$6:$I$1000=\"\",ROW(PlanningsFilter!$I$6:$I$1000)-ROW($I$6)+1)))),$C25)),\"\")","v":""},{"$f":"IFERROR(INDEX(PlanningsFilter!$L$6:$L$1000,SMALL(IF(PlanningsFilter!$K$6:$K$1000=$A25,IF(PlanningsFilter!$C$6:$C$1000=J$2,IF(PlanningsFilter!$J$6:$J$1000=J$4,IF(PlanningsFilter!$I$6:$I$1000=\"\",ROW(PlanningsFilter!$I$6:$I$1000)-ROW($I$6)+1)))),$C25)),\"\")","v":"Wolter De bolder"},{"$f":"IFERROR(INDEX(PlanningsFilter!$L$6:$L$1000,SMALL(IF(PlanningsFilter!$K$6:$K$1000=$A25,IF(PlanningsFilter!$C$6:$C$1000=K$2,IF(PlanningsFilter!$J$6:$J$1000=K$4,IF(PlanningsFilter!$I$6:$I$1000=\"\",ROW(PlanningsFilter!$I$6:$I$1000)-ROW($I$6)+1)))),$C25)),\"\")","v":"Christiaan de Wit"},{"$f":"IFERROR(INDEX(PlanningsFilter!$L$6:$L$1000,SMALL(IF(PlanningsFilter!$K$6:$K$1000=$A25,IF(PlanningsFilter!$C$6:$C$1000=L$2,IF(PlanningsFilter!$J$6:$J$1000=L$4,IF(PlanningsFilter!$I$6:$I$1000=\"\",ROW(PlanningsFilter!$I$6:$I$1000)-ROW($I$6)+1)))),$C25)),\"\")","v":""},{"$f":"IFERROR(INDEX(PlanningsFilter!$L$6:$L$1000,SMALL(IF(PlanningsFilter!$K$6:$K$1000=$A25,IF(PlanningsFilter!$C$6:$C$1000=M$2,IF(PlanningsFilter!$J$6:$J$1000=M$4,IF(PlanningsFilter!$I$6:$I$1000=\"\",ROW(PlanningsFilter!$I$6:$I$1000)-ROW($I$6)+1)))),$C25)),\"\")","v":"Wolter De bolder"},{"$f":"IFERROR(INDEX(PlanningsFilter!$L$6:$L$1000,SMALL(IF(PlanningsFilter!$K$6:$K$1000=$A25,IF(PlanningsFilter!$C$6:$C$1000=N$2,IF(PlanningsFilter!$J$6:$J$1000=N$4,IF(PlanningsFilter!$I$6:$I$1000=\"\",ROW(PlanningsFilter!$I$6:$I$1000)-ROW($I$6)+1)))),$C25)),\"\")","v":"Christiaan de Wit"},{"$f":"IFERROR(INDEX(PlanningsFilter!$L$6:$L$1000,SMALL(IF(PlanningsFilter!$K$6:$K$1000=$A25,IF(PlanningsFilter!$C$6:$C$1000=O$2,IF(PlanningsFilter!$J$6:$J$1000=O$4,IF(PlanningsFilter!$I$6:$I$1000=\"\",ROW(PlanningsFilter!$I$6:$I$1000)-ROW($I$6)+1)))),$C25)),\"\")","v":""},{"$f":"IFERROR(INDEX(PlanningsFilter!$L$6:$L$1000,SMALL(IF(PlanningsFilter!$K$6:$K$1000=$A25,IF(PlanningsFilter!$C$6:$C$1000=P$2,IF(PlanningsFilter!$J$6:$J$1000=P$4,IF(PlanningsFilter!$I$6:$I$1000=\"\",ROW(PlanningsFilter!$I$6:$I$1000)-ROW($I$6)+1)))),$C25)),\"\")","v":"Wolter De bolder"},{"$f":"IFERROR(INDEX(PlanningsFilter!$L$6:$L$1000,SMALL(IF(PlanningsFilter!$K$6:$K$1000=$A25,IF(PlanningsFilter!$C$6:$C$1000=Q$2,IF(PlanningsFilter!$J$6:$J$1000=Q$4,IF(PlanningsFilter!$I$6:$I$1000=\"\",ROW(PlanningsFilter!$I$6:$I$1000)-ROW($I$6)+1)))),$C25)),\"\")","v":"Christiaan de Wit"},{"$f":"IFERROR(INDEX(PlanningsFilter!$L$6:$L$1000,SMALL(IF(PlanningsFilter!$K$6:$K$1000=$A25,IF(PlanningsFilter!$C$6:$C$1000=R$2,IF(PlanningsFilter!$J$6:$J$1000=R$4,IF(PlanningsFilter!$I$6:$I$1000=\"\",ROW(PlanningsFilter!$I$6:$I$1000)-ROW($I$6)+1)))),$C25)),\"\")","v":""},{"$f":"IFERROR(INDEX(PlanningsFilter!$L$6:$L$1000,SMALL(IF(PlanningsFilter!$K$6:$K$1000=$A25,IF(PlanningsFilter!$C$6:$C$1000=S$2,IF(PlanningsFilter!$J$6:$J$1000=S$4,IF(PlanningsFilter!$I$6:$I$1000=\"\",ROW(PlanningsFilter!$I$6:$I$1000)-ROW($I$6)+1)))),$C25)),\"\")","v":""},{"$f":"IFERROR(INDEX(PlanningsFilter!$L$6:$L$1000,SMALL(IF(PlanningsFilter!$K$6:$K$1000=$A25,IF(PlanningsFilter!$C$6:$C$1000=T$2,IF(PlanningsFilter!$J$6:$J$1000=T$4,IF(PlanningsFilter!$I$6:$I$1000=\"\",ROW(PlanningsFilter!$I$6:$I$1000)-ROW($I$6)+1)))),$C25)),\"\")","v":""},{"$f":"IFERROR(INDEX(PlanningsFilter!$L$6:$L$1000,SMALL(IF(PlanningsFilter!$K$6:$K$1000=$A25,IF(PlanningsFilter!$C$6:$C$1000=U$2,IF(PlanningsFilter!$J$6:$J$1000=U$4,IF(PlanningsFilter!$I$6:$I$1000=\"\",ROW(PlanningsFilter!$I$6:$I$1000)-ROW($I$6)+1)))),$C25)),\"\")","v":""},{"$f":"IFERROR(INDEX(PlanningsFilter!$L$6:$L$1000,SMALL(IF(PlanningsFilter!$K$6:$K$1000=$A25,IF(PlanningsFilter!$C$6:$C$1000=V$2,IF(PlanningsFilter!$J$6:$J$1000=V$4,IF(PlanningsFilter!$I$6:$I$1000=\"\",ROW(PlanningsFilter!$I$6:$I$1000)-ROW($I$6)+1)))),$C25)),\"\")","v":""},{"$f":"IFERROR(INDEX(PlanningsFilter!$L$6:$L$1000,SMALL(IF(PlanningsFilter!$K$6:$K$1000=$A25,IF(PlanningsFilter!$C$6:$C$1000=W$2,IF(PlanningsFilter!$J$6:$J$1000=W$4,IF(PlanningsFilter!$I$6:$I$1000=\"\",ROW(PlanningsFilter!$I$6:$I$1000)-ROW($I$6)+1)))),$C25)),\"\")","v":""},{"$f":"IFERROR(INDEX(PlanningsFilter!$L$6:$L$1000,SMALL(IF(PlanningsFilter!$K$6:$K$1000=$A25,IF(PlanningsFilter!$C$6:$C$1000=X$2,IF(PlanningsFilter!$J$6:$J$1000=X$4,IF(PlanningsFilter!$I$6:$I$1000=\"\",ROW(PlanningsFilter!$I$6:$I$1000)-ROW($I$6)+1)))),$C25)),\"\")","v":""}]
["LCR",null,2,{"$f":"IFERROR(INDEX(PlanningsFilter!$L$6:$L$1000,SMALL(IF(PlanningsFilter!$K$6:$K$1000=$A26,IF(PlanningsFilter!$C$6:$C$1000=D$2,IF(PlanningsFilter!$J$6:$J$1000=D$4,IF(PlanningsFilter!$I$6:$I$1000=\"\",ROW(PlanningsFilter!$I$6:$I$1000)-ROW($I$6)+1)))),$C26)),\"\")","v":""},{"$f":"IFERROR(INDEX(PlanningsFilter!$L$6:$L$1000,SMALL(IF(PlanningsFilter!$K$6:$K$1000=$A26,IF(PlanningsFilter!$C$6:$C$1000=E$2,IF(PlanningsFilter!$J$6:$J$1000=E$4,IF(PlanningsFilter!$I$6:$I$1000=\"\",ROW(PlanningsFilter!$I$6:$I$1000)-ROW($I$6)+1)))),$C26)),\"\")","v":""},{"$f":"IFERROR(INDEX(PlanningsFilter!$L$6:$L$1000,SMALL(IF(PlanningsFilter!$K$6:$K$1000=$A26,IF(PlanningsFilter!$C$6:$C$1000=F$2,IF(PlanningsFilter!$J$6:$J$1000=F$4,IF(PlanningsFilter!$I$6:$I$1000=\"\",ROW(PlanningsFilter!$I$6:$I$1000)-ROW($I$6)+1)))),$C26)),\"\")","v":""},{"$f":"IFERROR(INDEX(PlanningsFilter!$L$6:$L$1000,SMALL(IF(PlanningsFilter!$K$6:$K$1000=$A26,IF(PlanningsFilter!$C$6:$C$1000=G$2,IF(PlanningsFilter!$J$6:$J$1000=G$4,IF(PlanningsFilter!$I$6:$I$1000=\"\",ROW(PlanningsFilter!$I$6:$I$1000)-ROW($I$6)+1)))),$C26)),\"\")","v":""},{"$f":"IFERROR(INDEX(PlanningsFilter!$L$6:$L$1000,SMALL(IF(PlanningsFilter!$K$6:$K$1000=$A26,IF(PlanningsFilter!$C$6:$C$1000=H$2,IF(PlanningsFilter!$J$6:$J$1000=H$4,IF(PlanningsFilter!$I$6:$I$1000=\"\",ROW(PlanningsFilter!$I$6:$I$1000)-ROW($I$6)+1)))),$C26)),\"\")","v":""},{"$f":"IFERROR(INDEX(PlanningsFilter!$L$6:$L$1000,SMALL(IF(PlanningsFilter!$K$6:$K$1000=$A26,IF(PlanningsFilter!$C$6:$C$1000=I$2,IF(PlanningsFilter!$J$6:$J$1000=I$4,IF(PlanningsFilter!$I$6:$I$1000=\"\",ROW(PlanningsFilter!$I$6:$I$1000)-ROW($I$6)+1)))),$C26)),\"\")","v":""},{"$f":"IFERROR(INDEX(PlanningsFilter!$L$6:$L$1000,SMALL(IF(PlanningsFilter!$K$6:$K$1000=$A26,IF(PlanningsFilter!$C$6:$C$1000=J$2,IF(PlanningsFilter!$J$6:$J$1000=J$4,IF(PlanningsFilter!$I$6:$I$1000=\"\",ROW(PlanningsFilter!$I$6:$I$1000)-ROW($I$6)+1)))),$C26)),\"\")","v":""},{"$f":"IFERROR(INDEX(PlanningsFilter!$L$6:$L$1000,SMALL(IF(PlanningsFilter!$K$6:$K$1000=$A26,IF(PlanningsFilter!$C$6:$C$1000=K$2,IF(PlanningsFilter!$J$6:$J$1000=K$4,IF(PlanningsFilter!$I$6:$I$1000=\"\",ROW(PlanningsFilter!$I$6:$I$1000)-ROW($I$6)+1)))),$C26)),\"\")","v":""},{"$f":"IFERROR(INDEX(PlanningsFilter!$L$6:$L$1000,SMALL(IF(PlanningsFilter!$K$6:$K$1000=$A26,IF(PlanningsFilter!$C$6:$C$1000=L$2,IF(PlanningsFilter!$J$6:$J$1000=L$4,IF(PlanningsFilter!$I$6:$I$1000=\"\",ROW(PlanningsFilter!$I$6:$I$1000)-ROW($I$6)+1)))),$C26)),\"\")","v":""},{"$f":"IFERROR(INDEX(PlanningsFilter!$L$6:$L$1000,SMALL(IF(PlanningsFilter!$K$6:$K$1000=$A26,IF(PlanningsFilter!$C$6:$C$1000=M$2,IF(PlanningsFilter!$J$6:$J$1000=M$4,IF(PlanningsFilter!$I$6:$I$1000=\"\",ROW(PlanningsFilter!$I$6:$I$1000)-ROW($I$6)+1)))),$C26)),\"\")","v":""},{"$f":"IFERROR(INDEX(PlanningsFilter!$L$6:$L$1000,SMALL(IF(PlanningsFilter!$K$6:$K$1000=$A26,IF(PlanningsFilter!$C$6:$C$1000=N$2,IF(PlanningsFilter!$J$6:$J$1000=N$4,IF(PlanningsFilter!$I$6:$I$1000=\"\",ROW(PlanningsFilter!$I$6:$I$1000)-ROW($I$6)+1)))),$C26)),\"\")","v":""},{"$f":"IFERROR(INDEX(PlanningsFilter!$L$6:$L$1000,SMALL(IF(PlanningsFilter!$K$6:$K$1000=$A26,IF(PlanningsFilter!$C$6:$C$1000=O$2,IF(PlanningsFilter!$J$6:$J$1000=O$4,IF(PlanningsFilter!$I$6:$I$1000=\"\",ROW(PlanningsFilter!$I$6:$I$1000)-ROW($I$6)+1)))),$C26)),\"\")","v":""},{"$f":"IFERROR(INDEX(PlanningsFilter!$L$6:$L$1000,SMALL(IF(PlanningsFilter!$K$6:$K$1000=$A26,IF(PlanningsFilter!$C$6:$C$1000=P$2,IF(PlanningsFilter!$J$6:$J$1000=P$4,IF(PlanningsFilter!$I$6:$I$1000=\"\",ROW(PlanningsFilter!$I$6:$I$1000)-ROW($I$6)+1)))),$C26)),\"\")","v":""},{"$f":"IFERROR(INDEX(PlanningsFilter!$L$6:$L$1000,SMALL(IF(PlanningsFilter!$K$6:$K$1000=$A26,IF(PlanningsFilter!$C$6:$C$1000=Q$2,IF(PlanningsFilter!$J$6:$J$1000=Q$4,IF(PlanningsFilter!$I$6:$I$1000=\"\",ROW(PlanningsFilter!$I$6:$I$1000)-ROW($I$6)+1)))),$C26)),\"\")","v":""},{"$f":"IFERROR(INDEX(PlanningsFilter!$L$6:$L$1000,SMALL(IF(PlanningsFilter!$K$6:$K$1000=$A26,IF(PlanningsFilter!$C$6:$C$1000=R$2,IF(PlanningsFilter!$J$6:$J$1000=R$4,IF(PlanningsFilter!$I$6:$I$1000=\"\",ROW(PlanningsFilter!$I$6:$I$1000)-ROW($I$6)+1)))),$C26)),\"\")","v":""},{"$f":"IFERROR(INDEX(PlanningsFilter!$L$6:$L$1000,SMALL(IF(PlanningsFilter!$K$6:$K$1000=$A26,IF(PlanningsFilter!$C$6:$C$1000=S$2,IF(PlanningsFilter!$J$6:$J$1000=S$4,IF(PlanningsFilter!$I$6:$I$1000=\"\",ROW(PlanningsFilter!$I$6:$I$1000)-ROW($I$6)+1)))),$C26)),\"\")","v":""},{"$f":"IFERROR(INDEX(PlanningsFilter!$L$6:$L$1000,SMALL(IF(PlanningsFilter!$K$6:$K$1000=$A26,IF(PlanningsFilter!$C$6:$C$1000=T$2,IF(PlanningsFilter!$J$6:$J$1000=T$4,IF(PlanningsFilter!$I$6:$I$1000=\"\",ROW(PlanningsFilter!$I$6:$I$1000)-ROW($I$6)+1)))),$C26)),\"\")","v":""},{"$f":"IFERROR(INDEX(PlanningsFilter!$L$6:$L$1000,SMALL(IF(PlanningsFilter!$K$6:$K$1000=$A26,IF(PlanningsFilter!$C$6:$C$1000=U$2,IF(PlanningsFilter!$J$6:$J$1000=U$4,IF(PlanningsFilter!$I$6:$I$1000=\"\",ROW(PlanningsFilter!$I$6:$I$1000)-ROW($I$6)+1)))),$C26)),\"\")","v":""},{"$f":"IFERROR(INDEX(PlanningsFilter!$L$6:$L$1000,SMALL(IF(PlanningsFilter!$K$6:$K$1000=$A26,IF(PlanningsFilter!$C$6:$C$1000=V$2,IF(PlanningsFilter!$J$6:$J$1000=V$4,IF(PlanningsFilter!$I$6:$I$1000=\"\",ROW(PlanningsFilter!$I$6:$I$1000)-ROW($I$6)+1)))),$C26)),\"\")","v":""},{"$f":"IFERROR(INDEX(PlanningsFilter!$L$6:$L$1000,SMALL(IF(PlanningsFilter!$K$6:$K$1000=$A26,IF(PlanningsFilter!$C$6:$C$1000=W$2,IF(PlanningsFilter!$J$6:$J$1000=W$4,IF(PlanningsFilter!$I$6:$I$1000=\"\",ROW(PlanningsFilter!$I$6:$I$1000)-ROW($I$6)+1)))),$C26)),\"\")","v":""},{"$f":"IFERROR(INDEX(PlanningsFilter!$L$6:$L$1000,SMALL(IF(PlanningsFilter!$K$6:$K$1000=$A26,IF(PlanningsFilter!$C$6:$C$1000=X$2,IF(PlanningsFilter!$J$6:$J$1000=X$4,IF(PlanningsFilter!$I$6:$I$1000=\"\",ROW(PlanningsFilter!$I$6:$I$1000)-ROW($I$6)+1)))),$C26)),\"\")","v":""}]
["LCR",null,3,{"$f":"IFERROR(INDEX(PlanningsFilter!$L$6:$L$1000,SMALL(IF(PlanningsFilter!$K$6:$K$1000=$A27,IF(PlanningsFilter!$C$6:$C$1000=D$2,IF(PlanningsFilter!$J$6:$J$1000=D$4,IF(PlanningsFilter!$I$6:$I$1000=\"\",ROW(PlanningsFilter!$I$6:$I$1000)-ROW($I$6)+1)))),$C27)),\"\")","v":""},{"$f":"IFERROR(INDEX(PlanningsFilter!$L$6:$L$1000,SMALL(IF(PlanningsFilter!$K$6:$K$1000=$A27,IF(PlanningsFilter!$C$6:$C$1000=E$2,IF(PlanningsFilter!$J$6:$J$1000=E$4,IF(PlanningsFilter!$I$6:$I$1000=\"\",ROW(PlanningsFilter!$I$6:$I$1000)-ROW($I$6)+1)))),$C27)),\"\")","v":""},{"$f":"IFERROR(INDEX(PlanningsFilter!$L$6:$L$1000,SMALL(IF(PlanningsFilter!$K$6:$K$1000=$A27,IF(PlanningsFilter!$C$6:$C$1000=F$2,IF(PlanningsFilter!$J$6:$J$1000=F$4,IF(PlanningsFilter!$I$6:$I$1000=\"\",ROW(PlanningsFilter!$I$6:$I$1000)-ROW($I$6)+1)))),$C27)),\"\")","v":""},{"$f":"IFERROR(INDEX(PlanningsFilter!$L$6:$L$1000,SMALL(IF(PlanningsFilter!$K$6:$K$1000=$A27,IF(PlanningsFilter!$C$6:$C$1000=G$2,IF(PlanningsFilter!$J$6:$J$1000=G$4,IF(PlanningsFilter!$I$6:$I$1000=\"\",ROW(PlanningsFilter!$I$6:$I$1000)-ROW($I$6)+1)))),$C27)),\"\")","v":""},{"$f":"IFERROR(INDEX(PlanningsFilter!$L$6:$L$1000,SMALL(IF(PlanningsFilter!$K$6:$K$1000=$A27,IF(PlanningsFilter!$C$6:$C$1000=H$2,IF(PlanningsFilter!$J$6:$J$1000=H$4,IF(PlanningsFilter!$I$6:$I$1000=\"\",ROW(PlanningsFilter!$I$6:$I$1000)-ROW($I$6)+1)))),$C27)),\"\")","v":""},{"$f":"IFERROR(INDEX(PlanningsFilter!$L$6:$L$1000,SMALL(IF(PlanningsFilter!$K$6:$K$1000=$A27,IF(PlanningsFilter!$C$6:$C$1000=I$2,IF(PlanningsFilter!$J$6:$J$1000=I$4,IF(PlanningsFilter!$I$6:$I$1000=\"\",ROW(PlanningsFilter!$I$6:$I$1000)-ROW($I$6)+1)))),$C27)),\"\")","v":""},{"$f":"IFERROR(INDEX(PlanningsFilter!$L$6:$L$1000,SMALL(IF(PlanningsFilter!$K$6:$K$1000=$A27,IF(PlanningsFilter!$C$6:$C$1000=J$2,IF(PlanningsFilter!$J$6:$J$1000=J$4,IF(PlanningsFilter!$I$6:$I$1000=\"\",ROW(PlanningsFilter!$I$6:$I$1000)-ROW($I$6)+1)))),$C27)),\"\")","v":""},{"$f":"IFERROR(INDEX(PlanningsFilter!$L$6:$L$1000,SMALL(IF(PlanningsFilter!$K$6:$K$1000=$A27,IF(PlanningsFilter!$C$6:$C$1000=K$2,IF(PlanningsFilter!$J$6:$J$1000=K$4,IF(PlanningsFilter!$I$6:$I$1000=\"\",ROW(PlanningsFilter!$I$6:$I$1000)-ROW($I$6)+1)))),$C27)),\"\")","v":""},{"$f":"IFERROR(INDEX(PlanningsFilter!$L$6:$L$1000,SMALL(IF(PlanningsFilter!$K$6:$K$1000=$A27,IF(PlanningsFilter!$C$6:$C$1000=L$2,IF(PlanningsFilter!$J$6:$J$1000=L$4,IF(PlanningsFilter!$I$6:$I$1000=\"\",ROW(PlanningsFilter!$I$6:$I$1000)-ROW($I$6)+1)))),$C27)),\"\")","v":""},{"$f":"IFERROR(INDEX(PlanningsFilter!$L$6:$L$1000,SMALL(IF(PlanningsFilter!$K$6:$K$1000=$A27,IF(PlanningsFilter!$C$6:$C$1000=M$2,IF(PlanningsFilter!$J$6:$J$1000=M$4,IF(PlanningsFilter!$I$6:$I$1000=\"\",ROW(PlanningsFilter!$I$6:$I$1000)-ROW($I$6)+1)))),$C27)),\"\")","v":""},{"$f":"IFERROR(INDEX(PlanningsFilter!$L$6:$L$1000,SMALL(IF(PlanningsFilter!$K$6:$K$1000=$A27,IF(PlanningsFilter!$C$6:$C$1000=N$2,IF(PlanningsFilter!$J$6:$J$1000=N$4,IF(PlanningsFilter!$I$6:$I$1000=\"\",ROW(PlanningsFilter!$I$6:$I$1000)-ROW($I$6)+1)))),$C27)),\"\")","v":""},{"$f":"IFERROR(INDEX(PlanningsFilter!$L$6:$L$1000,SMALL(IF(PlanningsFilter!$K$6:$K$1000=$A27,IF(PlanningsFilter!$C$6:$C$1000=O$2,IF(PlanningsFilter!$J$6:$J$1000=O$4,IF(PlanningsFilter!$I$6:$I$1000=\"\",ROW(PlanningsFilter!$I$6:$I$1000)-ROW($I$6)+1)))),$C27)),\"\")","v":""},{"$f":"IFERROR(INDEX(PlanningsFilter!$L$6:$L$1000,SMALL(IF(PlanningsFilter!$K$6:$K$1000=$A27,IF(PlanningsFilter!$C$6:$C$1000=P$2,IF(PlanningsFilter!$J$6:$J$1000=P$4,IF(PlanningsFilter!$I$6:$I$1000=\"\",ROW(PlanningsFilter!$I$6:$I$1000)-ROW($I$6)+1)))),$C27)),\"\")","v":""},{"$f":"IFERROR(INDEX(PlanningsFilter!$L$6:$L$1000,SMALL(IF(PlanningsFilter!$K$6:$K$1000=$A27,IF(PlanningsFilter!$C$6:$C$1000=Q$2,IF(PlanningsFilter!$J$6:$J$1000=Q$4,IF(PlanningsFilter!$I$6:$I$1000=\"\",ROW(PlanningsFilter!$I$6:$I$1000)-ROW($I$6)+1)))),$C27)),\"\")","v":""},{"$f":"IFERROR(INDEX(PlanningsFilter!$L$6:$L$1000,SMALL(IF(PlanningsFilter!$K$6:$K$1000=$A27,IF(PlanningsFilter!$C$6:$C$1000=R$2,IF(PlanningsFilter!$J$6:$J$1000=R$4,IF(PlanningsFilter!$I$6:$I$1000=\"\",ROW(PlanningsFilter!$I$6:$I$1000)-ROW($I$6)+1)))),$C27)),\"\")","v":""},{"$f":"IFERROR(INDEX(PlanningsFilter!$L$6:$L$1000,SMALL(IF(PlanningsFilter!$K$6:$K$1000=$A27,IF(PlanningsFilter!$C$6:$C$1000=S$2,IF(PlanningsFilter!$J$6:$J$1000=S$4,IF(PlanningsFilter!$I$6:$I$1000=\"\",ROW(PlanningsFilter!$I$6:$I$1000)-ROW($I$6)+1)))),$C27)),\"\")","v":""},{"$f":"IFERROR(INDEX(PlanningsFilter!$L$6:$L$1000,SMALL(IF(PlanningsFilter!$K$6:$K$1000=$A27,IF(PlanningsFilter!$C$6:$C$1000=T$2,IF(PlanningsFilter!$J$6:$J$1000=T$4,IF(PlanningsFilter!$I$6:$I$1000=\"\",ROW(PlanningsFilter!$I$6:$I$1000)-ROW($I$6)+1)))),$C27)),\"\")","v":""},{"$f":"IFERROR(INDEX(PlanningsFilter!$L$6:$L$1000,SMALL(IF(PlanningsFilter!$K$6:$K$1000=$A27,IF(PlanningsFilter!$C$6:$C$1000=U$2,IF(PlanningsFilter!$J$6:$J$1000=U$4,IF(PlanningsFilter!$I$6:$I$1000=\"\",ROW(PlanningsFilter!$I$6:$I$1000)-ROW($I$6)+1)))),$C27)),\"\")","v":""},{"$f":"IFERROR(INDEX(PlanningsFilter!$L$6:$L$1000,SMALL(IF(PlanningsFilter!$K$6:$K$1000=$A27,IF(PlanningsFilter!$C$6:$C$1000=V$2,IF(PlanningsFilter!$J$6:$J$1000=V$4,IF(PlanningsFilter!$I$6:$I$1000=\"\",ROW(PlanningsFilter!$I$6:$I$1000)-ROW($I$6)+1)))),$C27)),\"\")","v":""},{"$f":"IFERROR(INDEX(PlanningsFilter!$L$6:$L$1000,SMALL(IF(PlanningsFilter!$K$6:$K$1000=$A27,IF(PlanningsFilter!$C$6:$C$1000=W$2,IF(PlanningsFilter!$J$6:$J$1000=W$4,IF(PlanningsFilter!$I$6:$I$1000=\"\",ROW(PlanningsFilter!$I$6:$I$1000)-ROW($I$6)+1)))),$C27)),\"\")","v":""},{"$f":"IFERROR(INDEX(PlanningsFilter!$L$6:$L$1000,SMALL(IF(PlanningsFilter!$K$6:$K$1000=$A27,IF(PlanningsFilter!$C$6:$C$1000=X$2,IF(PlanningsFilter!$J$6:$J$1000=X$4,IF(PlanningsFilter!$I$6:$I$1000=\"\",ROW(PlanningsFilter!$I$6:$I$1000)-ROW($I$6)+1)))),$C27)),\"\")","v":""}]
["LCR",null,4,{"$f":"IFERROR(INDEX(PlanningsFilter!$L$6:$L$1000,SMALL(IF(PlanningsFilter!$K$6:$K$1000=$A28,IF(PlanningsFilter!$C$6:$C$1000=D$2,IF(PlanningsFilter!$J$6:$J$1000=D$4,IF(PlanningsFilter!$I$6:$I$1000=\"\",ROW(PlanningsFilter!$I$6:$I$1000)-ROW($I$6)+1)))),$C28)),\"\")","v":""},{"$f":"IFERROR(INDEX(PlanningsFilter!$L$6:$L$1000,SMALL(IF(PlanningsFilter!$K$6:$K$1000=$A28,IF(PlanningsFilter!$C$6:$C$1000=E$2,IF(PlanningsFilter!$J$6:$J$1000=E$4,IF(PlanningsFilter!$I$6:$I$1000=\"\",ROW(PlanningsFilter!$I$6:$I$1000)-ROW($I$6)+1)))),$C28)),\"\")","v":""},{"$f":"IFERROR(INDEX(PlanningsFilter!$L$6:$L$1000,SMALL(IF(PlanningsFilter!$K$6:$K$1000=$A28,IF(PlanningsFilter!$C$6:$C$1000=F$2,IF(PlanningsFilter!$J$6:$J$1000=F$4,IF(PlanningsFilter!$I$6:$I$1000=\"\",ROW(PlanningsFilter!$I$6:$I$1000)-ROW($I$6)+1)))),$C28)),\"\")","v":""},{"$f":"IFERROR(INDEX(PlanningsFilter!$L$6:$L$1000,SMALL(IF(PlanningsFilter!$K$6:$K$1000=$A28,IF(PlanningsFilter!$C$6:$C$1000=G$2,IF(PlanningsFilter!$J$6:$J$1000=G$4,IF(PlanningsFilter!$I$6:$I$1000=\"\",ROW(PlanningsFilter!$I$6:$I$1000)-ROW($I$6)+1)))),$C28)),\"\")","v":""},{"$f":"IFERROR(INDEX(PlanningsFilter!$L$6:$L$1000,SMALL(IF(PlanningsFilter!$K$6:$K$1000=$A28,IF(PlanningsFilter!$C$6:$C$1000=H$2,IF(PlanningsFilter!$J$6:$J$1000=H$4,IF(PlanningsFilter!$I$6:$I$1000=\"\",ROW(PlanningsFilter!$I$6:$I$1000)-ROW($I$6)+1)))),$C28)),\"\")","v":""},{"$f":"IFERROR(INDEX(PlanningsFilter!$L$6:$L$1000,SMALL(IF(PlanningsFilter!$K$6:$K$1000=$A28,IF(PlanningsFilter!$C$6:$C$1000=I$2,IF(PlanningsFilter!$J$6:$J$1000=I$4,IF(PlanningsFilter!$I$6:$I$1000=\"\",ROW(PlanningsFilter!$I$6:$I$1000)-ROW($I$6)+1)))),$C28)),\"\")","v":""},{"$f":"IFERROR(INDEX(PlanningsFilter!$L$6:$L$1000,SMALL(IF(PlanningsFilter!$K$6:$K$1000=$A28,IF(PlanningsFilter!$C$6:$C$1000=J$2,IF(PlanningsFilter!$J$6:$J$1000=J$4,IF(PlanningsFilter!$I$6:$I$1000=\"\",ROW(PlanningsFilter!$I$6:$I$1000)-ROW($I$6)+1)))),$C28)),\"\")","v":""},{"$f":"IFERROR(INDEX(PlanningsFilter!$L$6:$L$1000,SMALL(IF(PlanningsFilter!$K$6:$K$1000=$A28,IF(PlanningsFilter!$C$6:$C$1000=K$2,IF(PlanningsFilter!$J$6:$J$1000=K$4,IF(PlanningsFilter!$I$6:$I$1000=\"\",ROW(PlanningsFilter!$I$6:$I$1000)-ROW($I$6)+1)))),$C28)),\"\")","v":""},{"$f":"IFERROR(INDEX(PlanningsFilter!$L$6:$L$1000,SMALL(IF(PlanningsFilter!$K$6:$K$1000=$A28,IF(PlanningsFilter!$C$6:$C$1000=L$2,IF(PlanningsFilter!$J$6:$J$1000=L$4,IF(PlanningsFilter!$I$6:$I$1000=\"\",ROW(PlanningsFilter!$I$6:$I$1000)-ROW($I$6)+1)))),$C28)),\"\")","v":""},{"$f":"IFERROR(INDEX(PlanningsFilter!$L$6:$L$1000,SMALL(IF(PlanningsFilter!$K$6:$K$1000=$A28,IF(PlanningsFilter!$C$6:$C$1000=M$2,IF(PlanningsFilter!$J$6:$J$1000=M$4,IF(PlanningsFilter!$I$6:$I$1000=\"\",ROW(PlanningsFilter!$I$6:$I$1000)-ROW($I$6)+1)))),$C28)),\"\")","v":""},{"$f":"IFERROR(INDEX(PlanningsFilter!$L$6:$L$1000,SMALL(IF(PlanningsFilter!$K$6:$K$1000=$A28,IF(PlanningsFilter!$C$6:$C$1000=N$2,IF(PlanningsFilter!$J$6:$J$1000=N$4,IF(PlanningsFilter!$I$6:$I$1000=\"\",ROW(PlanningsFilter!$I$6:$I$1000)-ROW($I$6)+1)))),$C28)),\"\")","v":""},{"$f":"IFERROR(INDEX(PlanningsFilter!$L$6:$L$1000,SMALL(IF(PlanningsFilter!$K$6:$K$1000=$A28,IF(PlanningsFilter!$C$6:$C$1000=O$2,IF(PlanningsFilter!$J$6:$J$1000=O$4,IF(PlanningsFilter!$I$6:$I$1000=\"\",ROW(PlanningsFilter!$I$6:$I$1000)-ROW($I$6)+1)))),$C28)),\"\")","v":""},{"$f":"IFERROR(INDEX(PlanningsFilter!$L$6:$L$1000,SMALL(IF(PlanningsFilter!$K$6:$K$1000=$A28,IF(PlanningsFilter!$C$6:$C$1000=P$2,IF(PlanningsFilter!$J$6:$J$1000=P$4,IF(PlanningsFilter!$I$6:$I$1000=\"\",ROW(PlanningsFilter!$I$6:$I$1000)-ROW($I$6)+1)))),$C28)),\"\")","v":""},{"$f":"IFERROR(INDEX(PlanningsFilter!$L$6:$L$1000,SMALL(IF(PlanningsFilter!$K$6:$K$1000=$A28,IF(PlanningsFilter!$C$6:$C$1000=Q$2,IF(PlanningsFilter!$J$6:$J$1000=Q$4,IF(PlanningsFilter!$I$6:$I$1000=\"\",ROW(PlanningsFilter!$I$6:$I$1000)-ROW($I$6)+1)))),$C28)),\"\")","v":""},{"$f":"IFERROR(INDEX(PlanningsFilter!$L$6:$L$1000,SMALL(IF(PlanningsFilter!$K$6:$K$1000=$A28,IF(PlanningsFilter!$C$6:$C$1000=R$2,IF(PlanningsFilter!$J$6:$J$1000=R$4,IF(PlanningsFilter!$I$6:$I$1000=\"\",ROW(PlanningsFilter!$I$6:$I$1000)-ROW($I$6)+1)))),$C28)),\"\")","v":""},{"$f":"IFERROR(INDEX(PlanningsFilter!$L$6:$L$1000,SMALL(IF(PlanningsFilter!$K$6:$K$1000=$A28,IF(PlanningsFilter!$C$6:$C$1000=S$2,IF(PlanningsFilter!$J$6:$J$1000=S$4,IF(PlanningsFilter!$I$6:$I$1000=\"\",ROW(PlanningsFilter!$I$6:$I$1000)-ROW($I$6)+1)))),$C28)),\"\")","v":""},{"$f":"IFERROR(INDEX(PlanningsFilter!$L$6:$L$1000,SMALL(IF(PlanningsFilter!$K$6:$K$1000=$A28,IF(PlanningsFilter!$C$6:$C$1000=T$2,IF(PlanningsFilter!$J$6:$J$1000=T$4,IF(PlanningsFilter!$I$6:$I$1000=\"\",ROW(PlanningsFilter!$I$6:$I$1000)-ROW($I$6)+1)))),$C28)),\"\")","v":""},{"$f":"IFERROR(INDEX(PlanningsFilter!$L$6:$L$1000,SMALL(IF(PlanningsFilter!$K$6:$K$1000=$A28,IF(PlanningsFilter!$C$6:$C$1000=U$2,IF(PlanningsFilter!$J$6:$J$1000=U$4,IF(PlanningsFilter!$I$6:$I$1000=\"\",ROW(PlanningsFilter!$I$6:$I$1000)-ROW($I$6)+1)))),$C28)),\"\")","v":""},{"$f":"IFERROR(INDEX(PlanningsFilter!$L$6:$L$1000,SMALL(IF(PlanningsFilter!$K$6:$K$1000=$A28,IF(PlanningsFilter!$C$6:$C$1000=V$2,IF(PlanningsFilter!$J$6:$J$1000=V$4,IF(PlanningsFilter!$I$6:$I$1000=\"\",ROW(PlanningsFilter!$I$6:$I$1000)-ROW($I$6)+1)))),$C28)),\"\")","v":""},{"$f":"IFERROR(INDEX(PlanningsFilter!$L$6:$L$1000,SMALL(IF(PlanningsFilter!$K$6:$K$1000=$A28,IF(PlanningsFilter!$C$6:$C$1000=W$2,IF(PlanningsFilter!$J$6:$J$1000=W$4,IF(PlanningsFilter!$I$6:$I$1000=\"\",ROW(PlanningsFilter!$I$6:$I$1000)-ROW($I$6)+1)))),$C28)),\"\")","v":""},{"$f":"IFERROR(INDEX(PlanningsFilter!$L$6:$L$1000,SMALL(IF(PlanningsFilter!$K$6:$K$1000=$A28,IF(PlanningsFilter!$C$6:$C$1000=X$2,IF(PlanningsFilter!$J$6:$J$1000=X$4,IF(PlanningsFilter!$I$6:$I$1000=\"\",ROW(PlanningsFilter!$I$6:$I$1000)-ROW($I$6)+1)))),$C28)),\"\")","v":""}]
["ABB",null,1,{"$f":"IFERROR(INDEX(PlanningsFilter!$L$6:$L$1000,SMALL(IF(PlanningsFilter!$K$6:$K$1000=$A29,IF(PlanningsFilter!$C$6:$C$1000=D$2,IF(PlanningsFilter!$J$6:$J$1000=D$4,IF(PlanningsFilter!$I$6:$I$1000=\"\",ROW(PlanningsFilter!$I$6:$I$1000)-ROW($I$6)+1)))),$C29)),\"\")","v":"Flavi van der Heyden"},{"$f":"IFERROR(INDEX(PlanningsFilter!$L$6:$L$1000,SMALL(IF(PlanningsFilter!$K$6:$K$1000=$A29,IF(PlanningsFilter!$C$6:$C$1000=E$2,IF(PlanningsFilter!$J$6:$J$1000=E$4,IF(PlanningsFilter!$I$6:$I$1000=\"\",ROW(PlanningsFilter!$I$6:$I$1000)-ROW($I$6)+1)))),$C29)),\"\")","v":"Trienko Spooren"},{"$f":"IFERROR(INDEX(PlanningsFilter!$L$6:$L$1000,SMALL(IF(PlanningsFilter!$K$6:$K$1000=$A29,IF(PlanningsFilter!$C$6:$C$1000=F$2,IF(PlanningsFilter!$J$6:$J$1000=F$4,IF(PlanningsFilter!$I$6:$I$1000=\"\",ROW(PlanningsFilter!$I$6:$I$1000)-ROW($I$6)+1)))),$C29)),\"\")","v":""},{"$f":"IFERROR(INDEX(PlanningsFilter!$L$6:$L$1000,SMALL(IF(PlanningsFilter!$K$6:$K$1000=$A29,IF(PlanningsFilter!$C$6:$C$1000=G$2,IF(PlanningsFilter!$J$6:$J$1000=G$4,IF(PlanningsFilter!$I$6:$I$1000=\"\",ROW(PlanningsFilter!$I$6:$I$1000)-ROW($I$6)+1)))),$C29)),\"\")","v":"Flavi van der Heyden"},{"$f":"IFERROR(INDEX(PlanningsFilter!$L$6:$L$1000,SMALL(IF(PlanningsFilter!$K$6:$K$1000=$A29,IF(PlanningsFilter!$C$6:$C$1000=H$2,IF(PlanningsFilter!$J$6:$J$1000=H$4,IF(PlanningsFilter!$I$6:$I$1000=\"\",ROW(PlanningsFilter!$I$6:$I$1000)-ROW($I$6)+1)))),$C29)),\"\")","v":"Trienko Spooren"},{"$f":"IFERROR(INDEX(PlanningsFilter!$L$6:$L$1000,SMALL(IF(PlanningsFilter!$K$6:$K$1000=$A29,IF(PlanningsFilter!$C$6:$C$1000=I$2,IF(PlanningsFilter!$J$6:$J$1000=I$4,IF(PlanningsFilter!$I$6:$I$1000=\"\",ROW(PlanningsFilter!$I$6:$I$1000)-ROW($I$6)+1)))),$C29)),\"\")","v":""},{"$f":"IFERROR(INDEX(PlanningsFilter!$L$6:$L$1000,SMALL(IF(PlanningsFilter!$K$6:$K$1000=$A29,IF(PlanningsFilter!$C$6:$C$1000=J$2,IF(PlanningsFilter!$J$6:$J$1000=J$4,IF(PlanningsFilter!$I$6:$I$1000=\"\",ROW(PlanningsFilter!$I$6:$I$1000)-ROW($I$6)+1)))),$C29)),\"\")","v":"Flavi van der Heyden"},{"$f":"IFERROR(INDEX(PlanningsFilter!$L$6:$L$1000,SMALL(IF(PlanningsFilter!$K$6:$K$1000=$A29,IF(PlanningsFilter!$C$6:$C$1000=K$2,IF(PlanningsFilter!$J$6:$J$1000=K$4,IF(PlanningsFilter!$I$6:$I$1000=\"\",ROW(PlanningsFilter!$I$6:$I$1000)-ROW($I$6)+1)))),$C29)),\"\")","v":"Trienko Spooren"},{"$f":"IFERROR(INDEX(PlanningsFilter!$L$6:$L$1000,SMALL(IF(PlanningsFilter!$K$6:$K$1000=$A29,IF(PlanningsFilter!$C$6:$C$1000=L$2,IF(PlanningsFilter!$J$6:$J$1000=L$4,IF(PlanningsFilter!$I$6:$I$1000=\"\",ROW(PlanningsFilter!$I$6:$I$1000)-ROW($I$6)+1)))),$C29)),\"\")","v":""},{"$f":"IFERROR(INDEX(PlanningsFilter!$L$6:$L$1000,SMALL(IF(PlanningsFilter!$K$6:$K$1000=$A29,IF(PlanningsFilter!$C$6:$C$1000=M$2,IF(PlanningsFilter!$J$6:$J$1000=M$4,IF(PlanningsFilter!$I$6:$I$1000=\"\",ROW(PlanningsFilter!$I$6:$I$1000)-ROW($I$6)+1)))),$C29)),\"\")","v":"Flavi van der Heyden"},{"$f":"IFERROR(INDEX(PlanningsFilter!$L$6:$L$1000,SMALL(IF(PlanningsFilter!$K$6:$K$1000=$A29,IF(PlanningsFilter!$C$6:$C$1000=N$2,IF(PlanningsFilter!$J$6:$J$1000=N$4,IF(PlanningsFilter!$I$6:$I$1000=\"\",ROW(PlanningsFilter!$I$6:$I$1000)-ROW($I$6)+1)))),$C29)),\"\")","v":"Trienko Spooren"},{"$f":"IFERROR(INDEX(PlanningsFilter!$L$6:$L$1000,SMALL(IF(PlanningsFilter!$K$6:$K$1000=$A29,IF(PlanningsFilter!$C$6:$C$1000=O$2,IF(PlanningsFilter!$J$6:$J$1000=O$4,IF(PlanningsFilter!$I$6:$I$1000=\"\",ROW(PlanningsFilter!$I$6:$I$1000)-ROW($I$6)+1)))),$C29)),\"\")","v":""},{"$f":"IFERROR(INDEX(PlanningsFilter!$L$6:$L$1000,SMALL(IF(PlanningsFilter!$K$6:$K$1000=$A29,IF(PlanningsFilter!$C$6:$C$1000=P$2,IF(PlanningsFilter!$J$6:$J$1000=P$4,IF(PlanningsFilter!$I$6:$I$1000=\"\",ROW(PlanningsFilter!$I$6:$I$1000)-ROW($I$6)+1)))),$C29)),\"\")","v":"Flavi van der Heyden"},{"$f":"IFERROR(INDEX(PlanningsFilter!$L$6:$L$1000,SMALL(IF(PlanningsFilter!$K$6:$K$1000=$A29,IF(PlanningsFilter!$C$6:$C$1000=Q$2,IF(PlanningsFilter!$J$6:$J$1000=Q$4,IF(PlanningsFilter!$I$6:$I$1000=\"\",ROW(PlanningsFilter!$I$6:$I$1000)-ROW($I$6)+1)))),$C29)),\"\")","v":"Trienko Spooren"},{"$f":"IFERROR(INDEX(PlanningsFilter!$L$6:$L$1000,SMALL(IF(PlanningsFilter!$K$6:$K$1000=$A29,IF(PlanningsFilter!$C$6:$C$1000=R$2,IF(PlanningsFilter!$J$6:$J$1000=R$4,IF(PlanningsFilter!$I$6:$I$1000=\"\",ROW(PlanningsFilter!$I$6:$I$1000)-ROW($I$6)+1)))),$C29)),\"\")","v":""},{"$f":"IFERROR(INDEX(PlanningsFilter!$L$6:$L$1000,SMALL(IF(PlanningsFilter!$K$6:$K$1000=$A29,IF(PlanningsFilter!$C$6:$C$1000=S$2,IF(PlanningsFilter!$J$6:$J$1000=S$4,IF(PlanningsFilter!$I$6:$I$1000=\"\",ROW(PlanningsFilter!$I$6:$I$1000)-ROW($I$6)+1)))),$C29)),\"\")","v":"Arkan de Boer"},{"$f":"IFERROR(INDEX(PlanningsFilter!$L$6:$L$1000,SMALL(IF(PlanningsFilter!$K$6:$K$1000=$A29,IF(PlanningsFilter!$C$6:$C$1000=T$2,IF(PlanningsFilter!$J$6:$J$1000=T$4,IF(PlanningsFilter!$I$6:$I$1000=\"\",ROW(PlanningsFilter!$I$6:$I$1000)-ROW($I$6)+1)))),$C29)),\"\")","v":""},{"$f":"IFERROR(INDEX(PlanningsFilter!$L$6:$L$1000,SMALL(IF(PlanningsFilter!$K$6:$K$1000=$A29,IF(PlanningsFilter!$C$6:$C$1000=U$2,IF(PlanningsFilter!$J$6:$J$1000=U$4,IF(PlanningsFilter!$I$6:$I$1000=\"\",ROW(PlanningsFilter!$I$6:$I$1000)-ROW($I$6)+1)))),$C29)),\"\")","v":""},{"$f":"IFERROR(INDEX(PlanningsFilter!$L$6:$L$1000,SMALL(IF(PlanningsFilter!$K$6:$K$1000=$A29,IF(PlanningsFilter!$C$6:$C$1000=V$2,IF(PlanningsFilter!$J$6:$J$1000=V$4,IF(PlanningsFilter!$I$6:$I$1000=\"\",ROW(PlanningsFilter!$I$6:$I$1000)-ROW($I$6)+1)))),$C29)),\"\")","v":"Baki Bos"},{"$f":"IFERROR(INDEX(PlanningsFilter!$L$6:$L$1000,SMALL(IF(PlanningsFilter!$K$6:$K$1000=$A29,IF(PlanningsFilter!$C$6:$C$1000=W$2,IF(PlanningsFilter!$J$6:$J$1000=W$4,IF(PlanningsFilter!$I$6:$I$1000=\"\",ROW(PlanningsFilter!$I$6:$I$1000)-ROW($I$6)+1)))),$C29)),\"\")","v":"Flavi van der Heyden"},{"$f":"IFERROR(INDEX(PlanningsFilter!$L$6:$L$1000,SMALL(IF(PlanningsFilter!$K$6:$K$1000=$A29,IF(PlanningsFilter!$C$6:$C$1000=X$2,IF(PlanningsFilter!$J$6:$J$1000=X$4,IF(PlanningsFilter!$I$6:$I$1000=\"\",ROW(PlanningsFilter!$I$6:$I$1000)-ROW($I$6)+1)))),$C29)),\"\")","v":""}]
["ABB",null,2,{"$f":"IFERROR(INDEX(PlanningsFilter!$L$6:$L$1000,SMALL(IF(PlanningsFilter!$K$6:$K$1000=$A30,IF(PlanningsFilter!$C$6:$C$1000=D$2,IF(PlanningsFilter!$J$6:$J$1000=D$4,IF(PlanningsFilter!$I$6:$I$1000=\"\",ROW(PlanningsFilter!$I$6:$I$1000)-ROW($I$6)+1)))),$C30)),\"\")","v":""},{"$f":"IFERROR(INDEX(PlanningsFilter!$L$6:$L$1000,SMALL(IF(PlanningsFilter!$K$6:$K$1000=$A30,IF(PlanningsFilter!$C$6:$C$1000=E$2,IF(PlanningsFilter!$J$6:$J$1000=E$4,IF(PlanningsFilter!$I$6:$I$1000=\"\",ROW(PlanningsFilter!$I$6:$I$1000)-ROW($I$6)+1)))),$C30)),\"\")","v":""},{"$f":"IFERROR(INDEX(PlanningsFilter!$L$6:$L$1000,SMALL(IF(PlanningsFilter!$K$6:$K$1000=$A30,IF(PlanningsFilter!$C$6:$C$1000=F$2,IF(PlanningsFilter!$J$6:$J$1000=F$4,IF(PlanningsFilter!$I$6:$I$1000=\"\",ROW(PlanningsFilter!$I$6:$I$1000)-ROW($I$6)+1)))),$C30)),\"\")","v":""},{"$f":"IFERROR(INDEX(PlanningsFilter!$L$6:$L$1000,SMALL(IF(PlanningsFilter!$K$6:$K$1000=$A30,IF(PlanningsFilter!$C$6:$C$1000=G$2,IF(PlanningsFilter!$J$6:$J$1000=G$4,IF(PlanningsFilter!$I$6:$I$1000=\"\",ROW(PlanningsFilter!$I$6:$I$1000)-ROW($I$6)+1)))),$C30)),\"\")","v":""},{"$f":"IFERROR(INDEX(PlanningsFilter!$L$6:$L$1000,SMALL(IF(PlanningsFilter!$K$6:$K$1000=$A30,IF(PlanningsFilter!$C$6:$C$1000=H$2,IF(PlanningsFilter!$J$6:$J$1000=H$4,IF(PlanningsFilter!$I$6:$I$1000=\"\",ROW(PlanningsFilter!$I$6:$I$1000)-ROW($I$6)+1)))),$C30)),\"\")","v":""},{"$f":"IFERROR(INDEX(PlanningsFilter!$L$6:$L$1000,SMALL(IF(PlanningsFilter!$K$6:$K$1000=$A30,IF(PlanningsFilter!$C$6:$C$1000=I$2,IF(PlanningsFilter!$J$6:$J$1000=I$4,IF(PlanningsFilter!$I$6:$I$1000=\"\",ROW(PlanningsFilter!$I$6:$I$1000)-ROW($I$6)+1)))),$C30)),\"\")","v":""},{"$f":"IFERROR(INDEX(PlanningsFilter!$L$6:$L$1000,SMALL(IF(PlanningsFilter!$K$6:$K$1000=$A30,IF(PlanningsFilter!$C$6:$C$1000=J$2,IF(PlanningsFilter!$J$6:$J$1000=J$4,IF(PlanningsFilter!$I$6:$I$1000=\"\",ROW(PlanningsFilter!$I$6:$I$1000)-ROW($I$6)+1)))),$C30)),\"\")","v":""},{"$f":"IFERROR(INDEX(PlanningsFilter!$L$6:$L$1000,SMALL(IF(PlanningsFilter!$K$6:$K$1000=$A30,IF(PlanningsFilter!$C$6:$C$1000=K$2,IF(PlanningsFilter!$J$6:$J$1000=K$4,IF(PlanningsFilter!$I$6:$I$1000=\"\",ROW(PlanningsFilter!$I$6:$I$1000)-ROW($I$6)+1)))),$C30)),\"\")","v":""},{"$f":"IFERROR(INDEX(PlanningsFilter!$L$6:$L$1000,SMALL(IF(PlanningsFilter!$K$6:$K$1000=$A30,IF(PlanningsFilter!$C$6:$C$1000=L$2,IF(PlanningsFilter!$J$6:$J$1000=L$4,IF(PlanningsFilter!$I$6:$I$1000=\"\",ROW(PlanningsFilter!$I$6:$I$1000)-ROW($I$6)+1)))),$C30)),\"\")","v":""},{"$f":"IFERROR(INDEX(PlanningsFilter!$L$6:$L$1000,SMALL(IF(PlanningsFilter!$K$6:$K$1000=$A30,IF(PlanningsFilter!$C$6:$C$1000=M$2,IF(PlanningsFilter!$J$6:$J$1000=M$4,IF(PlanningsFilter!$I$6:$I$1000=\"\",ROW(PlanningsFilter!$I$6:$I$1000)-ROW($I$6)+1)))),$C30)),\"\")","v":""},{"$f":"IFERROR(INDEX(PlanningsFilter!$L$6:$L$1000,SMALL(IF(PlanningsFilter!$K$6:$K$1000=$A30,IF(PlanningsFilter!$C$6:$C$1000=N$2,IF(PlanningsFilter!$J$6:$J$1000=N$4,IF(PlanningsFilter!$I$6:$I$1000=\"\",ROW(PlanningsFilter!$I$6:$I$1000)-ROW($I$6)+1)))),$C30)),\"\")","v":""},{"$f":"IFERROR(INDEX(PlanningsFilter!$L$6:$L$1000,SMALL(IF(PlanningsFilter!$K$6:$K$1000=$A30,IF(PlanningsFilter!$C$6:$C$1000=O$2,IF(PlanningsFilter!$J$6:$J$1000=O$4,IF(PlanningsFilter!$I$6:$I$1000=\"\",ROW(PlanningsFilter!$I$6:$I$1000)-ROW($I$6)+1)))),$C30)),\"\")","v":""},{"$f":"IFERROR(INDEX(PlanningsFilter!$L$6:$L$1000,SMALL(IF(PlanningsFilter!$K$6:$K$1000=$A30,IF(PlanningsFilter!$C$6:$C$1000=P$2,IF(PlanningsFilter!$J$6:$J$1000=P$4,IF(PlanningsFilter!$I$6:$I$1000=\"\",ROW(PlanningsFilter!$I$6:$I$1000)-ROW($I$6)+1)))),$C30)),\"\")","v":""},{"$f":"IFERROR(INDEX(PlanningsFilter!$L$6:$L$1000,SMALL(IF(PlanningsFilter!$K$6:$K$1000=$A30,IF(PlanningsFilter!$C$6:$C$1000=Q$2,IF(PlanningsFilter!$J$6:$J$1000=Q$4,IF(PlanningsFilter!$I$6:$I$1000=\"\",ROW(PlanningsFilter!$I$6:$I$1000)-ROW($I$6)+1)))),$C30)),\"\")","v":""},{"$f":"IFERROR(INDEX(PlanningsFilter!$L$6:$L$1000,SMALL(IF(PlanningsFilter!$K$6:$K$1000=$A30,IF(PlanningsFilter!$C$6:$C$1000=R$2,IF(PlanningsFilter!$J$6:$J$1000=R$4,IF(PlanningsFilter!$I$6:$I$1000=\"\",ROW(PlanningsFilter!$I$6:$I$1000)-ROW($I$6)+1)))),$C30)),\"\")","v":""},{"$f":"IFERROR(INDEX(PlanningsFilter!$L$6:$L$1000,SMALL(IF(PlanningsFilter!$K$6:$K$1000=$A30,IF(PlanningsFilter!$C$6:$C$1000=S$2,IF(PlanningsFilter!$J$6:$J$1000=S$4,IF(PlanningsFilter!$I$6:$I$1000=\"\",ROW(PlanningsFilter!$I$6:$I$1000)-ROW($I$6)+1)))),$C30)),\"\")","v":""},{"$f":"IFERROR(INDEX(PlanningsFilter!$L$6:$L$1000,SMALL(IF(PlanningsFilter!$K$6:$K$1000=$A30,IF(PlanningsFilter!$C$6:$C$1000=T$2,IF(PlanningsFilter!$J$6:$J$1000=T$4,IF(PlanningsFilter!$I$6:$I$1000=\"\",ROW(PlanningsFilter!$I$6:$I$1000)-ROW($I$6)+1)))),$C30)),\"\")","v":""},{"$f":"IFERROR(INDEX(PlanningsFilter!$L$6:$L$1000,SMALL(IF(PlanningsFilter!$K$6:$K$1000=$A30,IF(PlanningsFilter!$C$6:$C$1000=U$2,IF(PlanningsFilter!$J$6:$J$1000=U$4,IF(PlanningsFilter!$I$6:$I$1000=\"\",ROW(PlanningsFilter!$I$6:$I$1000)-ROW($I$6)+1)))),$C30)),\"\")","v":""},{"$f":"IFERROR(INDEX(PlanningsFilter!$L$6:$L$1000,SMALL(IF(PlanningsFilter!$K$6:$K$1000=$A30,IF(PlanningsFilter!$C$6:$C$1000=V$2,IF(PlanningsFilter!$J$6:$J$1000=V$4,IF(PlanningsFilter!$I$6:$I$1000=\"\",ROW(PlanningsFilter!$I$6:$I$1000)-ROW($I$6)+1)))),$C30)),\"\")","v":""},{"$f":"IFERROR(INDEX(PlanningsFilter!$L$6:$L$1000,SMALL(IF(PlanningsFilter!$K$6:$K$1000=$A30,IF(PlanningsFilter!$C$6:$C$1000=W$2,IF(PlanningsFilter!$J$6:$J$1000=W$4,IF(PlanningsFilter!$I$6:$I$1000=\"\",ROW(PlanningsFilter!$I$6:$I$1000)-ROW($I$6)+1)))),$C30)),\"\")","v":""},{"$f":"IFERROR(INDEX(PlanningsFilter!$L$6:$L$1000,SMALL(IF(PlanningsFilter!$K$6:$K$1000=$A30,IF(PlanningsFilter!$C$6:$C$1000=X$2,IF(PlanningsFilter!$J$6:$J$1000=X$4,IF(PlanningsFilter!$I$6:$I$1000=\"\",ROW(PlanningsFilter!$I$6:$I$1000)-ROW($I$6)+1)))),$C30)),\"\")","v":""}]
["ABB",null,3,{"$f":"IFERROR(INDEX(PlanningsFilter!$L$6:$L$1000,SMALL(IF(PlanningsFilter!$K$6:$K$1000=$A31,IF(PlanningsFilter!$C$6:$C$1000=D$2,IF(PlanningsFilter!$J$6:$J$1000=D$4,IF(PlanningsFilter!$I$6:$I$1000=\"\",ROW(PlanningsFilter!$I$6:$I$1000)-ROW($I$6)+1)))),$C31)),\"\")","v":""},{"$f":"IFERROR(INDEX(PlanningsFilter!$L$6:$L$1000,SMALL(IF(PlanningsFilter!$K$6:$K$1000=$A31,IF(PlanningsFilter!$C$6:$C$1000=E$2,IF(PlanningsFilter!$J$6:$J$1000=E$4,IF(PlanningsFilter!$I$6:$I$1000=\"\",ROW(PlanningsFilter!$I$6:$I$1000)-ROW($I$6)+1)))),$C31)),\"\")","v":""},{"$f":"IFERROR(INDEX(PlanningsFilter!$L$6:$L$1000,SMALL(IF(PlanningsFilter!$K$6:$K$1000=$A31,IF(PlanningsFilter!$C$6:$C$1000=F$2,IF(PlanningsFilter!$J$6:$J$1000=F$4,IF(PlanningsFilter!$I$6:$I$1000=\"\",ROW(PlanningsFilter!$I$6:$I$1000)-ROW($I$6)+1)))),$C31)),\"\")","v":""},{"$f":"IFERROR(INDEX(PlanningsFilter!$L$6:$L$1000,SMALL(IF(PlanningsFilter!$K$6:$K$1000=$A31,IF(PlanningsFilter!$C$6:$C$1000=G$2,IF(PlanningsFilter!$J$6:$J$1000=G$4,IF(PlanningsFilter!$I$6:$I$1000=\"\",ROW(PlanningsFilter!$I$6:$I$1000)-ROW($I$6)+1)))),$C31)),\"\")","v":""},{"$f":"IFERROR(INDEX(PlanningsFilter!$L$6:$L$1000,SMALL(IF(PlanningsFilter!$K$6:$K$1000=$A31,IF(PlanningsFilter!$C$6:$C$1000=H$2,IF(PlanningsFilter!$J$6:$J$1000=H$4,IF(PlanningsFilter!$I$6:$I$1000=\"\",ROW(PlanningsFilter!$I$6:$I$1000)-ROW($I$6)+1)))),$C31)),\"\")","v":""},{"$f":"IFERROR(INDEX(PlanningsFilter!$L$6:$L$1000,SMALL(IF(PlanningsFilter!$K$6:$K$1000=$A31,IF(PlanningsFilter!$C$6:$C$1000=I$2,IF(PlanningsFilter!$J$6:$J$1000=I$4,IF(PlanningsFilter!$I$6:$I$1000=\"\",ROW(PlanningsFilter!$I$6:$I$1000)-ROW($I$6)+1)))),$C31)),\"\")","v":""},{"$f":"IFERROR(INDEX(PlanningsFilter!$L$6:$L$1000,SMALL(IF(PlanningsFilter!$K$6:$K$1000=$A31,IF(PlanningsFilter!$C$6:$C$1000=J$2,IF(PlanningsFilter!$J$6:$J$1000=J$4,IF(PlanningsFilter!$I$6:$I$1000=\"\",ROW(PlanningsFilter!$I$6:$I$1000)-ROW($I$6)+1)))),$C31)),\"\")","v":""},{"$f":"IFERROR(INDEX(PlanningsFilter!$L$6:$L$1000,SMALL(IF(PlanningsFilter!$K$6:$K$1000=$A31,IF(PlanningsFilter!$C$6:$C$1000=K$2,IF(PlanningsFilter!$J$6:$J$1000=K$4,IF(PlanningsFilter!$I$6:$I$1000=\"\",ROW(PlanningsFilter!$I$6:$I$1000)-ROW($I$6)+1)))),$C31)),\"\")","v":""},{"$f":"IFERROR(INDEX(PlanningsFilter!$L$6:$L$1000,SMALL(IF(PlanningsFilter!$K$6:$K$1000=$A31,IF(PlanningsFilter!$C$6:$C$1000=L$2,IF(PlanningsFilter!$J$6:$J$1000=L$4,IF(PlanningsFilter!$I$6:$I$1000=\"\",ROW(PlanningsFilter!$I$6:$I$1000)-ROW($I$6)+1)))),$C31)),\"\")","v":""},{"$f":"IFERROR(INDEX(PlanningsFilter!$L$6:$L$1000,SMALL(IF(PlanningsFilter!$K$6:$K$1000=$A31,IF(PlanningsFilter!$C$6:$C$1000=M$2,IF(PlanningsFilter!$J$6:$J$1000=M$4,IF(PlanningsFilter!$I$6:$I$1000=\"\",ROW(PlanningsFilter!$I$6:$I$1000)-ROW($I$6)+1)))),$C31)),\"\")","v":""},{"$f":"IFERROR(INDEX(PlanningsFilter!$L$6:$L$1000,SMALL(IF(PlanningsFilter!$K$6:$K$1000=$A31,IF(PlanningsFilter!$C$6:$C$1000=N$2,IF(PlanningsFilter!$J$6:$J$1000=N$4,IF(PlanningsFilter!$I$6:$I$1000=\"\",ROW(PlanningsFilter!$I$6:$I$1000)-ROW($I$6)+1)))),$C31)),\"\")","v":""},{"$f":"IFERROR(INDEX(PlanningsFilter!$L$6:$L$1000,SMALL(IF(PlanningsFilter!$K$6:$K$1000=$A31,IF(PlanningsFilter!$C$6:$C$1000=O$2,IF(PlanningsFilter!$J$6:$J$1000=O$4,IF(PlanningsFilter!$I$6:$I$1000=\"\",ROW(PlanningsFilter!$I$6:$I$1000)-ROW($I$6)+1)))),$C31)),\"\")","v":""},{"$f":"IFERROR(INDEX(PlanningsFilter!$L$6:$L$1000,SMALL(IF(PlanningsFilter!$K$6:$K$1000=$A31,IF(PlanningsFilter!$C$6:$C$1000=P$2,IF(PlanningsFilter!$J$6:$J$1000=P$4,IF(PlanningsFilter!$I$6:$I$1000=\"\",ROW(PlanningsFilter!$I$6:$I$1000)-ROW($I$6)+1)))),$C31)),\"\")","v":""},{"$f":"IFERROR(INDEX(PlanningsFilter!$L$6:$L$1000,SMALL(IF(PlanningsFilter!$K$6:$K$1000=$A31,IF(PlanningsFilter!$C$6:$C$1000=Q$2,IF(PlanningsFilter!$J$6:$J$1000=Q$4,IF(PlanningsFilter!$I$6:$I$1000=\"\",ROW(PlanningsFilter!$I$6:$I$1000)-ROW($I$6)+1)))),$C31)),\"\")","v":""},{"$f":"IFERROR(INDEX(PlanningsFilter!$L$6:$L$1000,SMALL(IF(PlanningsFilter!$K$6:$K$1000=$A31,IF(PlanningsFilter!$C$6:$C$1000=R$2,IF(PlanningsFilter!$J$6:$J$1000=R$4,IF(PlanningsFilter!$I$6:$I$1000=\"\",ROW(PlanningsFilter!$I$6:$I$1000)-ROW($I$6)+1)))),$C31)),\"\")","v":""},{"$f":"IFERROR(INDEX(PlanningsFilter!$L$6:$L$1000,SMALL(IF(PlanningsFilter!$K$6:$K$1000=$A31,IF(PlanningsFilter!$C$6:$C$1000=S$2,IF(PlanningsFilter!$J$6:$J$1000=S$4,IF(PlanningsFilter!$I$6:$I$1000=\"\",ROW(PlanningsFilter!$I$6:$I$1000)-ROW($I$6)+1)))),$C31)),\"\")","v":""},{"$f":"IFERROR(INDEX(PlanningsFilter!$L$6:$L$1000,SMALL(IF(PlanningsFilter!$K$6:$K$1000=$A31,IF(PlanningsFilter!$C$6:$C$1000=T$2,IF(PlanningsFilter!$J$6:$J$1000=T$4,IF(PlanningsFilter!$I$6:$I$1000=\"\",ROW(PlanningsFilter!$I$6:$I$1000)-ROW($I$6)+1)))),$C31)),\"\")","v":""},{"$f":"IFERROR(INDEX(PlanningsFilter!$L$6:$L$1000,SMALL(IF(PlanningsFilter!$K$6:$K$1000=$A31,IF(PlanningsFilter!$C$6:$C$1000=U$2,IF(PlanningsFilter!$J$6:$J$1000=U$4,IF(PlanningsFilter!$I$6:$I$1000=\"\",ROW(PlanningsFilter!$I$6:$I$1000)-ROW($I$6)+1)))),$C31)),\"\")","v":""},{"$f":"IFERROR(INDEX(PlanningsFilter!$L$6:$L$1000,SMALL(IF(PlanningsFilter!$K$6:$K$1000=$A31,IF(PlanningsFilter!$C$6:$C$1000=V$2,IF(PlanningsFilter!$J$6:$J$1000=V$4,IF(PlanningsFilter!$I$6:$I$1000=\"\",ROW(PlanningsFilter!$I$6:$I$1000)-ROW($I$6)+1)))),$C31)),\"\")","v":""},{"$f":"IFERROR(INDEX(PlanningsFilter!$L$6:$L$1000,SMALL(IF(PlanningsFilter!$K$6:$K$1000=$A31,IF(PlanningsFilter!$C$6:$C$1000=W$2,IF(PlanningsFilter!$J$6:$J$1000=W$4,IF(PlanningsFilter!$I$6:$I$1000=\"\",ROW(PlanningsFilter!$I$6:$I$1000)-ROW($I$6)+1)))),$C31)),\"\")","v":""},{"$f":"IFERROR(INDEX(PlanningsFilter!$L$6:$L$1000,SMALL(IF(PlanningsFilter!$K$6:$K$1000=$A31,IF(PlanningsFilter!$C$6:$C$1000=X$2,IF(PlanningsFilter!$J$6:$J$1000=X$4,IF(PlanningsFilter!$I$6:$I$1000=\"\",ROW(PlanningsFilter!$I$6:$I$1000)-ROW($I$6)+1)))),$C31)),\"\")","v":""}]
["ABB",null,4,{"$f":"IFERROR(INDEX(PlanningsFilter!$L$6:$L$1000,SMALL(IF(PlanningsFilter!$K$6:$K$1000=$A32,IF(PlanningsFilter!$C$6:$C$1000=D$2,IF(PlanningsFilter!$J$6:$J$1000=D$4,IF(PlanningsFilter!$I$6:$I$1000=\"\",ROW(PlanningsFilter!$I$6:$I$1000)-ROW($I$6)+1)))),$C32)),\"\")","v":""},{"$f":"IFERROR(INDEX(PlanningsFilter!$L$6:$L$1000,SMALL(IF(PlanningsFilter!$K$6:$K$1000=$A32,IF(PlanningsFilter!$C$6:$C$1000=E$2,IF(PlanningsFilter!$J$6:$J$1000=E$4,IF(PlanningsFilter!$I$6:$I$1000=\"\",ROW(PlanningsFilter!$I$6:$I$1000)-ROW($I$6)+1)))),$C32)),\"\")","v":""},{"$f":"IFERROR(INDEX(PlanningsFilter!$L$6:$L$1000,SMALL(IF(PlanningsFilter!$K$6:$K$1000=$A32,IF(PlanningsFilter!$C$6:$C$1000=F$2,IF(PlanningsFilter!$J$6:$J$1000=F$4,IF(PlanningsFilter!$I$6:$I$1000=\"\",ROW(PlanningsFilter!$I$6:$I$1000)-ROW($I$6)+1)))),$C32)),\"\")","v":""},{"$f":"IFERROR(INDEX(PlanningsFilter!$L$6:$L$1000,SMALL(IF(PlanningsFilter!$K$6:$K$1000=$A32,IF(PlanningsFilter!$C$6:$C$1000=G$2,IF(PlanningsFilter!$J$6:$J$1000=G$4,IF(PlanningsFilter!$I$6:$I$1000=\"\",ROW(PlanningsFilter!$I$6:$I$1000)-ROW($I$6)+1)))),$C32)),\"\")","v":""},{"$f":"IFERROR(INDEX(PlanningsFilter!$L$6:$L$1000,SMALL(IF(PlanningsFilter!$K$6:$K$1000=$A32,IF(PlanningsFilter!$C$6:$C$1000=H$2,IF(PlanningsFilter!$J$6:$J$1000=H$4,IF(PlanningsFilter!$I$6:$I$1000=\"\",ROW(PlanningsFilter!$I$6:$I$1000)-ROW($I$6)+1)))),$C32)),\"\")","v":""},{"$f":"IFERROR(INDEX(PlanningsFilter!$L$6:$L$1000,SMALL(IF(PlanningsFilter!$K$6:$K$1000=$A32,IF(PlanningsFilter!$C$6:$C$1000=I$2,IF(PlanningsFilter!$J$6:$J$1000=I$4,IF(PlanningsFilter!$I$6:$I$1000=\"\",ROW(PlanningsFilter!$I$6:$I$1000)-ROW($I$6)+1)))),$C32)),\"\")","v":""},{"$f":"IFERROR(INDEX(PlanningsFilter!$L$6:$L$1000,SMALL(IF(PlanningsFilter!$K$6:$K$1000=$A32,IF(PlanningsFilter!$C$6:$C$1000=J$2,IF(PlanningsFilter!$J$6:$J$1000=J$4,IF(PlanningsFilter!$I$6:$I$1000=\"\",ROW(PlanningsFilter!$I$6:$I$1000)-ROW($I$6)+1)))),$C32)),\"\")","v":""},{"$f":"IFERROR(INDEX(PlanningsFilter!$L$6:$L$1000,SMALL(IF(PlanningsFilter!$K$6:$K$1000=$A32,IF(PlanningsFilter!$C$6:$C$1000=K$2,IF(PlanningsFilter!$J$6:$J$1000=K$4,IF(PlanningsFilter!$I$6:$I$1000=\"\",ROW(PlanningsFilter!$I$6:$I$1000)-ROW($I$6)+1)))),$C32)),\"\")","v":""},{"$f":"IFERROR(INDEX(PlanningsFilter!$L$6:$L$1000,SMALL(IF(PlanningsFilter!$K$6:$K$1000=$A32,IF(PlanningsFilter!$C$6:$C$1000=L$2,IF(PlanningsFilter!$J$6:$J$1000=L$4,IF(PlanningsFilter!$I$6:$I$1000=\"\",ROW(PlanningsFilter!$I$6:$I$1000)-ROW($I$6)+1)))),$C32)),\"\")","v":""},{"$f":"IFERROR(INDEX(PlanningsFilter!$L$6:$L$1000,SMALL(IF(PlanningsFilter!$K$6:$K$1000=$A32,IF(PlanningsFilter!$C$6:$C$1000=M$2,IF(PlanningsFilter!$J$6:$J$1000=M$4,IF(PlanningsFilter!$I$6:$I$1000=\"\",ROW(PlanningsFilter!$I$6:$I$1000)-ROW($I$6)+1)))),$C32)),\"\")","v":""},{"$f":"IFERROR(INDEX(PlanningsFilter!$L$6:$L$1000,SMALL(IF(PlanningsFilter!$K$6:$K$1000=$A32,IF(PlanningsFilter!$C$6:$C$1000=N$2,IF(PlanningsFilter!$J$6:$J$1000=N$4,IF(PlanningsFilter!$I$6:$I$1000=\"\",ROW(PlanningsFilter!$I$6:$I$1000)-ROW($I$6)+1)))),$C32)),\"\")","v":""},{"$f":"IFERROR(INDEX(PlanningsFilter!$L$6:$L$1000,SMALL(IF(PlanningsFilter!$K$6:$K$1000=$A32,IF(PlanningsFilter!$C$6:$C$1000=O$2,IF(PlanningsFilter!$J$6:$J$1000=O$4,IF(PlanningsFilter!$I$6:$I$1000=\"\",ROW(PlanningsFilter!$I$6:$I$1000)-ROW($I$6)+1)))),$C32)),\"\")","v":""},{"$f":"IFERROR(INDEX(PlanningsFilter!$L$6:$L$1000,SMALL(IF(PlanningsFilter!$K$6:$K$1000=$A32,IF(PlanningsFilter!$C$6:$C$1000=P$2,IF(PlanningsFilter!$J$6:$J$1000=P$4,IF(PlanningsFilter!$I$6:$I$1000=\"\",ROW(PlanningsFilter!$I$6:$I$1000)-ROW($I$6)+1)))),$C32)),\"\")","v":""},{"$f":"IFERROR(INDEX(PlanningsFilter!$L$6:$L$1000,SMALL(IF(PlanningsFilter!$K$6:$K$1000=$A32,IF(PlanningsFilter!$C$6:$C$1000=Q$2,IF(PlanningsFilter!$J$6:$J$1000=Q$4,IF(PlanningsFilter!$I$6:$I$1000=\"\",ROW(PlanningsFilter!$I$6:$I$1000)-ROW($I$6)+1)))),$C32)),\"\")","v":""},{"$f":"IFERROR(INDEX(PlanningsFilter!$L$6:$L$1000,SMALL(IF(PlanningsFilter!$K$6:$K$1000=$A32,IF(PlanningsFilter!$C$6:$C$1000=R$2,IF(PlanningsFilter!$J$6:$J$1000=R$4,IF(PlanningsFilter!$I$6:$I$1000=\"\",ROW(PlanningsFilter!$I$6:$I$1000)-ROW($I$6)+1)))),$C32)),\"\")","v":""},{"$f":"IFERROR(INDEX(PlanningsFilter!$L$6:$L$1000,SMALL(IF(PlanningsFilter!$K$6:$K$1000=$A32,IF(PlanningsFilter!$C$6:$C$1000=S$2,IF(PlanningsFilter!$J$6:$J$1000=S$4,IF(PlanningsFilter!$I$6:$I$1000=\"\",ROW(PlanningsFilter!$I$6:$I$1000)-ROW($I$6)+1)))),$C32)),\"\")","v":""},{"$f":"IFERROR(INDEX(PlanningsFilter!$L$6:$L$1000,SMALL(IF(PlanningsFilter!$K$6:$K$1000=$A32,IF(PlanningsFilter!$C$6:$C$1000=T$2,IF(PlanningsFilter!$J$6:$J$1000=T$4,IF(PlanningsFilter!$I$6:$I$1000=\"\",ROW(PlanningsFilter!$I$6:$I$1000)-ROW($I$6)+1)))),$C32)),\"\")","v":""},{"$f":"IFERROR(INDEX(PlanningsFilter!$L$6:$L$1000,SMALL(IF(PlanningsFilter!$K$6:$K$1000=$A32,IF(PlanningsFilter!$C$6:$C$1000=U$2,IF(PlanningsFilter!$J$6:$J$1000=U$4,IF(PlanningsFilter!$I$6:$I$1000=\"\",ROW(PlanningsFilter!$I$6:$I$1000)-ROW($I$6)+1)))),$C32)),\"\")","v":""},{"$f":"IFERROR(INDEX(PlanningsFilter!$L$6:$L$1000,SMALL(IF(PlanningsFilter!$K$6:$K$1000=$A32,IF(PlanningsFilter!$C$6:$C$1000=V$2,IF(PlanningsFilter!$J$6:$J$1000=V$4,IF(PlanningsFilter!$I$6:$I$1000=\"\",ROW(PlanningsFilter!$I$6:$I$1000)-ROW($I$6)+1)))),$C32)),\"\")","v":""},{"$f":"IFERROR(INDEX(PlanningsFilter!$L$6:$L$1000,SMALL(IF(PlanningsFilter!$K$6:$K$1000=$A32,IF(PlanningsFilter!$C$6:$C$1000=W$2,IF(PlanningsFilter!$J$6:$J$1000=W$4,IF(PlanningsFilter!$I$6:$I$1000=\"\",ROW(PlanningsFilter!$I$6:$I$1000)-ROW($I$6)+1)))),$C32)),\"\")","v":""},{"$f":"IFERROR(INDEX(PlanningsFilter!$L$6:$L$1000,SMALL(IF(PlanningsFilter!$K$6:$K$1000=$A32,IF(PlanningsFilter!$C$6:$C$1000=X$2,IF(PlanningsFilter!$J$6:$J$1000=X$4,IF(PlanningsFilter!$I$6:$I$1000=\"\",ROW(PlanningsFilter!$I$6:$I$1000)-ROW($I$6)+1)))),$C32)),\"\")","v":""}]
["MEP",null,1,{"$f":"IFERROR(INDEX(PlanningsFilter!$L$6:$L$1000,SMALL(IF(PlanningsFilter!$K$6:$K$1000=$A33,IF(PlanningsFilter!$C$6:$C$1000=D$2,IF(PlanningsFilter!$J$6:$J$1000=D$4,IF(PlanningsFilter!$I$6:$I$1000=\"\",ROW(PlanningsFilter!$I$6:$I$1000)-ROW($I$6)+1)))),$C33)),\"\")","v":"Houcin Huisman"},{"$f":"IFERROR(INDEX(PlanningsFilter!$L$6:$L$1000,SMALL(IF(PlanningsFilter!$K$6:$K$1000=$A33,IF(PlanningsFilter!$C$6:$C$1000=E$2,IF(PlanningsFilter!$J$6:$J$1000=E$4,IF(PlanningsFilter!$I$6:$I$1000=\"\",ROW(PlanningsFilter!$I$6:$I$1000)-ROW($I$6)+1)))),$C33)),\"\")","v":"Rijk van Doorn"},{"$f":"IFERROR(INDEX(PlanningsFilter!$L$6:$L$1000,SMALL(IF(PlanningsFilter!$K$6:$K$1000=$A33,IF(PlanningsFilter!$C$6:$C$1000=F$2,IF(PlanningsFilter!$J$6:$J$1000=F$4,IF(PlanningsFilter!$I$6:$I$1000=\"\",ROW(PlanningsFilter!$I$6:$I$1000)-ROW($I$6)+1)))),$C33)),\"\")","v":""},{"$f":"IFERROR(INDEX(PlanningsFilter!$L$6:$L$1000,SMALL(IF(PlanningsFilter!$K$6:$K$1000=$A33,IF(PlanningsFilter!$C$6:$C$1000=G$2,IF(PlanningsFilter!$J$6:$J$1000=G$4,IF(PlanningsFilter!$I$6:$I$1000=\"\",ROW(PlanningsFilter!$I$6:$I$1000)-ROW($I$6)+1)))),$C33)),\"\")","v":"Houcin Huisman"},{"$f":"IFERROR(INDEX(PlanningsFilter!$L$6:$L$1000,SMALL(IF(PlanningsFilter!$K$6:$K$1000=$A33,IF(PlanningsFilter!$C$6:$C$1000=H$2,IF(PlanningsFilter!$J$6:$J$1000=H$4,IF(PlanningsFilter!$I$6:$I$1000=\"\",ROW(PlanningsFilter!$I$6:$I$1000)-ROW($I$6)+1)))),$C33)),\"\")","v":"Rijk van Doorn"},{"$f":"IFERROR(INDEX(PlanningsFilter!$L$6:$L$1000,SMALL(IF(PlanningsFilter!$K$6:$K$1000=$A33,IF(PlanningsFilter!$C$6:$C$1000=I$2,IF(PlanningsFilter!$J$6:$J$1000=I$4,IF(PlanningsFilter!$I$6:$I$1000=\"\",ROW(PlanningsFilter!$I$6:$I$1000)-ROW($I$6)+1)))),$C33)),\"\")","v":""},{"$f":"IFERROR(INDEX(PlanningsFilter!$L$6:$L$1000,SMALL(IF(PlanningsFilter!$K$6:$K$1000=$A33,IF(PlanningsFilter!$C$6:$C$1000=J$2,IF(PlanningsFilter!$J$6:$J$1000=J$4,IF(PlanningsFilter!$I$6:$I$1000=\"\",ROW(PlanningsFilter!$I$6:$I$1000)-ROW($I$6)+1)))),$C33)),\"\")","v":"Houcin Huisman"},{"$f":"IFERROR(INDEX(PlanningsFilter!$L$6:$L$1000,SMALL(IF(PlanningsFilter!$K$6:$K$1000=$A33,IF(PlanningsFilter!$C$6:$C$1000=K$2,IF(PlanningsFilter!$J$6:$J$1000=K$4,IF(PlanningsFilter!$I$6:$I$1000=\"\",ROW(PlanningsFilter!$I$6:$I$1000)-ROW($I$6)+1)))),$C33)),\"\")","v":"Rijk van Doorn"},{"$f":"IFERROR(INDEX(PlanningsFilter!$L$6:$L$1000,SMALL(IF(PlanningsFilter!$K$6:$K$1000=$A33,IF(PlanningsFilter!$C$6:$C$1000=L$2,IF(PlanningsFilter!$J$6:$J$1000=L$4,IF(PlanningsFilter!$I$6:$I$1000=\"\",ROW(PlanningsFilter!$I$6:$I$1000)-ROW($I$6)+1)))),$C33)),\"\")","v":""},{"$f":"IFERROR(INDEX(PlanningsFilter!$L$6:$L$1000,SMALL(IF(PlanningsFilter!$K$6:$K$1000=$A33,IF(PlanningsFilter!$C$6:$C$1000=M$2,IF(PlanningsFilter!$J$6:$J$1000=M$4,IF(PlanningsFilter!$I$6:$I$1000=\"\",ROW(PlanningsFilter!$I$6:$I$1000)-ROW($I$6)+1)))),$C33)),\"\")","v":"Houcin Huisman"},{"$f":"IFERROR(INDEX(PlanningsFilter!$L$6:$L$1000,SMALL(IF(PlanningsFilter!$K$6:$K$1000=$A33,IF(PlanningsFilter!$C$6:$C$1000=N$2,IF(PlanningsFilter!$J$6:$J$1000=N$4,IF(PlanningsFilter!$I$6:$I$1000=\"\",ROW(PlanningsFilter!$I$6:$I$1000)-ROW($I$6)+1)))),$C33)),\"\")","v":"Rijk van Doorn"},{"$f":"IFERROR(INDEX(PlanningsFilter!$L$6:$L$1000,SMALL(IF(PlanningsFilter!$K$6:$K$1000=$A33,IF(PlanningsFilter!$C$6:$C$1000=O$2,IF(PlanningsFilter!$J$6:$J$1000=O$4,IF(PlanningsFilter!$I$6:$I$1000=\"\",ROW(PlanningsFilter!$I$6:$I$1000)-ROW($I$6)+1)))),$C33)),\"\")","v":""},{"$f":"IFERROR(INDEX(PlanningsFilter!$L$6:$L$1000,SMALL(IF(PlanningsFilter!$K$6:$K$1000=$A33,IF(PlanningsFilter!$C$6:$C$1000=P$2,IF(PlanningsFilter!$J$6:$J$1000=P$4,IF(PlanningsFilter!$I$6:$I$1000=\"\",ROW(PlanningsFilter!$I$6:$I$1000)-ROW($I$6)+1)))),$C33)),\"\")","v":"Houcin Huisman"},{"$f":"IFERROR(INDEX(PlanningsFilter!$L$6:$L$1000,SMALL(IF(PlanningsFilter!$K$6:$K$1000=$A33,IF(PlanningsFilter!$C$6:$C$1000=Q$2,IF(PlanningsFilter!$J$6:$J$1000=Q$4,IF(PlanningsFilter!$I$6:$I$1000=\"\",ROW(PlanningsFilter!$I$6:$I$1000)-ROW($I$6)+1)))),$C33)),\"\")","v":"Rijk van Doorn"},{"$f":"IFERROR(INDEX(PlanningsFilter!$L$6:$L$1000,SMALL(IF(PlanningsFilter!$K$6:$K$1000=$A33,IF(PlanningsFilter!$C$6:$C$1000=R$2,IF(PlanningsFilter!$J$6:$J$1000=R$4,IF(PlanningsFilter!$I$6:$I$1000=\"\",ROW(PlanningsFilter!$I$6:$I$1000)-ROW($I$6)+1)))),$C33)),\"\")","v":""},{"$f":"IFERROR(INDEX(PlanningsFilter!$L$6:$L$1000,SMALL(IF(PlanningsFilter!$K$6:$K$1000=$A33,IF(PlanningsFilter!$C$6:$C$1000=S$2,IF(PlanningsFilter!$J$6:$J$1000=S$4,IF(PlanningsFilter!$I$6:$I$1000=\"\",ROW(PlanningsFilter!$I$6:$I$1000)-ROW($I$6)+1)))),$C33)),\"\")","v":""},{"$f":"IFERROR(INDEX(PlanningsFilter!$L$6:$L$1000,SMALL(IF(PlanningsFilter!$K$6:$K$1000=$A33,IF(PlanningsFilter!$C$6:$C$1000=T$2,IF(PlanningsFilter!$J$6:$J$1000=T$4,IF(PlanningsFilter!$I$6:$I$1000=\"\",ROW(PlanningsFilter!$I$6:$I$1000)-ROW($I$6)+1)))),$C33)),\"\")","v":""},{"$f":"IFERROR(INDEX(PlanningsFilter!$L$6:$L$1000,SMALL(IF(PlanningsFilter!$K$6:$K$1000=$A33,IF(PlanningsFilter!$C$6:$C$1000=U$2,IF(PlanningsFilter!$J$6:$J$1000=U$4,IF(PlanningsFilter!$I$6:$I$1000=\"\",ROW(PlanningsFilter!$I$6:$I$1000)-ROW($I$6)+1)))),$C33)),\"\")","v":""},{"$f":"IFERROR(INDEX(PlanningsFilter!$L$6:$L$1000,SMALL(IF(PlanningsFilter!$K$6:$K$1000=$A33,IF(PlanningsFilter!$C$6:$C$1000=V$2,IF(PlanningsFilter!$J$6:$J$1000=V$4,IF(PlanningsFilter!$I$6:$I$1000=\"\",ROW(PlanningsFilter!$I$6:$I$1000)-ROW($I$6)+1)))),$C33)),\"\")","v":""},{"$f":"IFERROR(INDEX(PlanningsFilter!$L$6:$L$1000,SMALL(IF(PlanningsFilter!$K$6:$K$1000=$A33,IF(PlanningsFilter!$C$6:$C$1000=W$2,IF(PlanningsFilter!$J$6:$J$1000=W$4,IF(PlanningsFilter!$I$6:$I$1000=\"\",ROW(PlanningsFilter!$I$6:$I$1000)-ROW($I$6)+1)))),$C33)),\"\")","v":""},{"$f":"IFERROR(INDEX(PlanningsFilter!$L$6:$L$1000,SMALL(IF(PlanningsFilter!$K$6:$K$1000=$A33,IF(PlanningsFilter!$C$6:$C$1000=X$2,IF(PlanningsFilter!$J$6:$J$1000=X$4,IF(PlanningsFilter!$I$6:$I$1000=\"\",ROW(PlanningsFilter!$I$6:$I$1000)-ROW($I$6)+1)))),$C33)),\"\")","v":""}]
["MEP",null,2,{"$f":"IFERROR(INDEX(PlanningsFilter!$L$6:$L$1000,SMALL(IF(PlanningsFilter!$K$6:$K$1000=$A34,IF(PlanningsFilter!$C$6:$C$1000=D$2,IF(PlanningsFilter!$J$6:$J$1000=D$4,IF(PlanningsFilter!$I$6:$I$1000=\"\",ROW(PlanningsFilter!$I$6:$I$1000)-ROW($I$6)+1)))),$C34)),\"\")","v":"Rudolf Hofman"},{"$f":"IFERROR(INDEX(PlanningsFilter!$L$6:$L$1000,SMALL(IF(PlanningsFilter!$K$6:$K$1000=$A34,IF(PlanningsFilter!$C$6:$C$1000=E$2,IF(PlanningsFilter!$J$6:$J$1000=E$4,IF(PlanningsFilter!$I$6:$I$1000=\"\",ROW(PlanningsFilter!$I$6:$I$1000)-ROW($I$6)+1)))),$C34)),\"\")","v":""},{"$f":"IFERROR(INDEX(PlanningsFilter!$L$6:$L$1000,SMALL(IF(PlanningsFilter!$K$6:$K$1000=$A34,IF(PlanningsFilter!$C$6:$C$1000=F$2,IF(PlanningsFilter!$J$6:$J$1000=F$4,IF(PlanningsFilter!$I$6:$I$1000=\"\",ROW(PlanningsFilter!$I$6:$I$1000)-ROW($I$6)+1)))),$C34)),\"\")","v":""},{"$f":"IFERROR(INDEX(PlanningsFilter!$L$6:$L$1000,SMALL(IF(PlanningsFilter!$K$6:$K$1000=$A34,IF(PlanningsFilter!$C$6:$C$1000=G$2,IF(PlanningsFilter!$J$6:$J$1000=G$4,IF(PlanningsFilter!$I$6:$I$1000=\"\",ROW(PlanningsFilter!$I$6:$I$1000)-ROW($I$6)+1)))),$C34)),\"\")","v":"Rudolf Hofman"},{"$f":"IFERROR(INDEX(PlanningsFilter!$L$6:$L$1000,SMALL(IF(PlanningsFilter!$K$6:$K$1000=$A34,IF(PlanningsFilter!$C$6:$C$1000=H$2,IF(PlanningsFilter!$J$6:$J$1000=H$4,IF(PlanningsFilter!$I$6:$I$1000=\"\",ROW(PlanningsFilter!$I$6:$I$1000)-ROW($I$6)+1)))),$C34)),\"\")","v":""},{"$f":"IFERROR(INDEX(PlanningsFilter!$L$6:$L$1000,SMALL(IF(PlanningsFilter!$K$6:$K$1000=$A34,IF(PlanningsFilter!$C$6:$C$1000=I$2,IF(PlanningsFilter!$J$6:$J$1000=I$4,IF(PlanningsFilter!$I$6:$I$1000=\"\",ROW(PlanningsFilter!$I$6:$I$1000)-ROW($I$6)+1)))),$C34)),\"\")","v":""},{"$f":"IFERROR(INDEX(PlanningsFilter!$L$6:$L$1000,SMALL(IF(PlanningsFilter!$K$6:$K$1000=$A34,IF(PlanningsFilter!$C$6:$C$1000=J$2,IF(PlanningsFilter!$J$6:$J$1000=J$4,IF(PlanningsFilter!$I$6:$I$1000=\"\",ROW(PlanningsFilter!$I$6:$I$1000)-ROW($I$6)+1)))),$C34)),\"\")","v":"Rudolf Hofman"},{"$f":"IFERROR(INDEX(PlanningsFilter!$L$6:$L$1000,SMALL(IF(PlanningsFilter!$K$6:$K$1000=$A34,IF(PlanningsFilter!$C$6:$C$1000=K$2,IF(PlanningsFilter!$J$6:$J$1000=K$4,IF(PlanningsFilter!$I$6:$I$1000=\"\",ROW(PlanningsFilter!$I$6:$I$1000)-ROW($I$6)+1)))),$C34)),\"\")","v":""},{"$f":"IFERROR(INDEX(PlanningsFilter!$L$6:$L$1000,SMALL(IF(PlanningsFilter!$K$6:$K$1000=$A34,IF(PlanningsFilter!$C$6:$C$1000=L$2,IF(PlanningsFilter!$J$6:$J$1000=L$4,IF(PlanningsFilter!$I$6:$I$1000=\"\",ROW(PlanningsFilter!$I$6:$I$1000)-ROW($I$6)+1)))),$C34)),\"\")","v":""},{"$f":"IFERROR(INDEX(PlanningsFilter!$L$6:$L$1000,SMALL(IF(PlanningsFilter!$K$6:$K$1000=$A34,IF(PlanningsFilter!$C$6:$C$1000=M$2,IF(PlanningsFilter!$J$6:$J$1000=M$4,IF(PlanningsFilter!$I$6:$I$1000=\"\",ROW(PlanningsFilter!$I$6:$I$1000)-ROW($I$6)+1)))),$C34)),\"\")","v":"Rudolf Hofman"},{"$f":"IFERROR(INDEX(PlanningsFilter!$L$6:$L$1000,SMALL(IF(PlanningsFilter!$K$6:$K$1000=$A34,IF(PlanningsFilter!$C$6:$C$1000=N$2,IF(PlanningsFilter!$J$6:$J$1000=N$4,IF(PlanningsFilter!$I$6:$I$1000=\"\",ROW(PlanningsFilter!$I$6:$I$1000)-ROW($I$6)+1)))),$C34)),\"\")","v":""},{"$f":"IFERROR(INDEX(PlanningsFilter!$L$6:$L$1000,SMALL(IF(PlanningsFilter!$K$6:$K$1000=$A34,IF(PlanningsFilter!$C$6:$C$1000=O$2,IF(PlanningsFilter!$J$6:$J$1000=O$4,IF(PlanningsFilter!$I$6:$I$1000=\"\",ROW(PlanningsFilter!$I$6:$I$1000)-ROW($I$6)+1)))),$C34)),\"\")","v":""},{"$f":"IFERROR(INDEX(PlanningsFilter!$L$6:$L$1000,SMALL(IF(PlanningsFilter!$K$6:$K$1000=$A34,IF(PlanningsFilter!$C$6:$C$1000=P$2,IF(PlanningsFilter!$J$6:$J$1000=P$4,IF(PlanningsFilter!$I$6:$I$1000=\"\",ROW(PlanningsFilter!$I$6:$I$1000)-ROW($I$6)+1)))),$C34)),\"\")","v":"Rudolf Hofman"},{"$f":"IFERROR(INDEX(PlanningsFilter!$L$6:$L$1000,SMALL(IF(PlanningsFilter!$K$6:$K$1000=$A34,IF(PlanningsFilter!$C$6:$C$1000=Q$2,IF(PlanningsFilter!$J$6:$J$1000=Q$4,IF(PlanningsFilter!$I$6:$I$1000=\"\",ROW(PlanningsFilter!$I$6:$I$1000)-ROW($I$6)+1)))),$C34)),\"\")","v":""},{"$f":"IFERROR(INDEX(PlanningsFilter!$L$6:$L$1000,SMALL(IF(PlanningsFilter!$K$6:$K$1000=$A34,IF(PlanningsFilter!$C$6:$C$1000=R$2,IF(PlanningsFilter!$J$6:$J$1000=R$4,IF(PlanningsFilter!$I$6:$I$1000=\"\",ROW(PlanningsFilter!$I$6:$I$1000)-ROW($I$6)+1)))),$C34)),\"\")","v":""},{"$f":"IFERROR(INDEX(PlanningsFilter!$L$6:$L$1000,SMALL(IF(PlanningsFilter!$K$6:$K$1000=$A34,IF(PlanningsFilter!$C$6:$C$1000=S$2,IF(PlanningsFilter!$J$6:$J$1000=S$4,IF(PlanningsFilter!$I$6:$I$1000=\"\",ROW(PlanningsFilter!$I$6:$I$1000)-ROW($I$6)+1)))),$C34)),\"\")","v":""},{"$f":"IFERROR(INDEX(PlanningsFilter!$L$6:$L$1000,SMALL(IF(PlanningsFilter!$K$6:$K$1000=$A34,IF(PlanningsFilter!$C$6:$C$1000=T$2,IF(PlanningsFilter!$J$6:$J$1000=T$4,IF(PlanningsFilter!$I$6:$I$1000=\"\",ROW(PlanningsFilter!$I$6:$I$1000)-ROW($I$6)+1)))),$C34)),\"\")","v":""},{"$f":"IFERROR(INDEX(PlanningsFilter!$L$6:$L$1000,SMALL(IF(PlanningsFilter!$K$6:$K$1000=$A34,IF(PlanningsFilter!$C$6:$C$1000=U$2,IF(PlanningsFilter!$J$6:$J$1000=U$4,IF(PlanningsFilter!$I$6:$I$1000=\"\",ROW(PlanningsFilter!$I$6:$I$1000)-ROW($I$6)+1)))),$C34)),\"\")","v":""},{"$f":"IFERROR(INDEX(PlanningsFilter!$L$6:$L$1000,SMALL(IF(PlanningsFilter!$K$6:$K$1000=$A34,IF(PlanningsFilter!$C$6:$C$1000=V$2,IF(PlanningsFilter!$J$6:$J$1000=V$4,IF(PlanningsFilter!$I$6:$I$1000=\"\",ROW(PlanningsFilter!$I$6:$I$1000)-ROW($I$6)+1)))),$C34)),\"\")","v":""},{"$f":"IFERROR(INDEX(PlanningsFilter!$L$6:$L$1000,SMALL(IF(PlanningsFilter!$K$6:$K$1000=$A34,IF(PlanningsFilter!$C$6:$C$1000=W$2,IF(PlanningsFilter!$J$6:$J$1000=W$4,IF(PlanningsFilter!$I$6:$I$1000=\"\",ROW(PlanningsFilter!$I$6:$I$1000)-ROW($I$6)+1)))),$C34)),\"\")","v":""},{"$f":"IFERROR(INDEX(PlanningsFilter!$L$6:$L$1000,SMALL(IF(PlanningsFilter!$K$6:$K$1000=$A34,IF(PlanningsFilter!$C$6:$C$1000=X$2,IF(PlanningsFilter!$J$6:$J$1000=X$4,IF(PlanningsFilter!$I$6:$I$1000=\"\",ROW(PlanningsFilter!$I$6:$I$1000)-ROW($I$6)+1)))),$C34)),\"\")","v":""}]
["MEP",null,3,{"$f":"IFERROR(INDEX(PlanningsFilter!$L$6:$L$1000,SMALL(IF(PlanningsFilter!$K$6:$K$1000=$A35,IF(PlanningsFilter!$C$6:$C$1000=D$2,IF(PlanningsFilter!$J$6:$J$1000=D$4,IF(PlanningsFilter!$I$6:$I$1000=\"\",ROW(PlanningsFilter!$I$6:$I$1000)-ROW($I$6)+1)))),$C35)),\"\")","v":""},{"$f":"IFERROR(INDEX(PlanningsFilter!$L$6:$L$1000,SMALL(IF(PlanningsFilter!$K$6:$K$1000=$A35,IF(PlanningsFilter!$C$6:$C$1000=E$2,IF(PlanningsFilter!$J$6:$J$1000=E$4,IF(PlanningsFilter!$I$6:$I$1000=\"\",ROW(PlanningsFilter!$I$6:$I$1000)-ROW($I$6)+1)))),$C35)),\"\")","v":""},{"$f":"IFERROR(INDEX(PlanningsFilter!$L$6:$L$1000,SMALL(IF(PlanningsFilter!$K$6:$K$1000=$A35,IF(PlanningsFilter!$C$6:$C$1000=F$2,IF(PlanningsFilter!$J$6:$J$1000=F$4,IF(PlanningsFilter!$I$6:$I$1000=\"\",ROW(PlanningsFilter!$I$6:$I$1000)-ROW($I$6)+1)))),$C35)),\"\")","v":""},{"$f":"IFERROR(INDEX(PlanningsFilter!$L$6:$L$1000,SMALL(IF(PlanningsFilter!$K$6:$K$1000=$A35,IF(PlanningsFilter!$C$6:$C$1000=G$2,IF(PlanningsFilter!$J$6:$J$1000=G$4,IF(PlanningsFilter!$I$6:$I$1000=\"\",ROW(PlanningsFilter!$I$6:$I$1000)-ROW($I$6)+1)))),$C35)),\"\")","v":""},{"$f":"IFERROR(INDEX(PlanningsFilter!$L$6:$L$1000,SMALL(IF(PlanningsFilter!$K$6:$K$1000=$A35,IF(PlanningsFilter!$C$6:$C$1000=H$2,IF(PlanningsFilter!$J$6:$J$1000=H$4,IF(PlanningsFilter!$I$6:$I$1000=\"\",ROW(PlanningsFilter!$I$6:$I$1000)-ROW($I$6)+1)))),$C35)),\"\")","v":""},{"$f":"IFERROR(INDEX(PlanningsFilter!$L$6:$L$1000,SMALL(IF(PlanningsFilter!$K$6:$K$1000=$A35,IF(PlanningsFilter!$C$6:$C$1000=I$2,IF(PlanningsFilter!$J$6:$J$1000=I$4,IF(PlanningsFilter!$I$6:$I$1000=\"\",ROW(PlanningsFilter!$I$6:$I$1000)-ROW($I$6)+1)))),$C35)),\"\")","v":""},{"$f":"IFERROR(INDEX(PlanningsFilter!$L$6:$L$1000,SMALL(IF(PlanningsFilter!$K$6:$K$1000=$A35,IF(PlanningsFilter!$C$6:$C$1000=J$2,IF(PlanningsFilter!$J$6:$J$1000=J$4,IF(PlanningsFilter!$I$6:$I$1000=\"\",ROW(PlanningsFilter!$I$6:$I$1000)-ROW($I$6)+1)))),$C35)),\"\")","v":""},{"$f":"IFERROR(INDEX(PlanningsFilter!$L$6:$L$1000,SMALL(IF(PlanningsFilter!$K$6:$K$1000=$A35,IF(PlanningsFilter!$C$6:$C$1000=K$2,IF(PlanningsFilter!$J$6:$J$1000=K$4,IF(PlanningsFilter!$I$6:$I$1000=\"\",ROW(PlanningsFilter!$I$6:$I$1000)-ROW($I$6)+1)))),$C35)),\"\")","v":""},{"$f":"IFERROR(INDEX(PlanningsFilter!$L$6:$L$1000,SMALL(IF(PlanningsFilter!$K$6:$K$1000=$A35,IF(PlanningsFilter!$C$6:$C$1000=L$2,IF(PlanningsFilter!$J$6:$J$1000=L$4,IF(PlanningsFilter!$I$6:$I$1000=\"\",ROW(PlanningsFilter!$I$6:$I$1000)-ROW($I$6)+1)))),$C35)),\"\")","v":""},{"$f":"IFERROR(INDEX(PlanningsFilter!$L$6:$L$1000,SMALL(IF(PlanningsFilter!$K$6:$K$1000=$A35,IF(PlanningsFilter!$C$6:$C$1000=M$2,IF(PlanningsFilter!$J$6:$J$1000=M$4,IF(PlanningsFilter!$I$6:$I$1000=\"\",ROW(PlanningsFilter!$I$6:$I$1000)-ROW($I$6)+1)))),$C35)),\"\")","v":""},{"$f":"IFERROR(INDEX(PlanningsFilter!$L$6:$L$1000,SMALL(IF(PlanningsFilter!$K$6:$K$1000=$A35,IF(PlanningsFilter!$C$6:$C$1000=N$2,IF(PlanningsFilter!$J$6:$J$1000=N$4,IF(PlanningsFilter!$I$6:$I$1000=\"\",ROW(PlanningsFilter!$I$6:$I$1000)-ROW($I$6)+1)))),$C35)),\"\")","v":""},{"$f":"IFERROR(INDEX(PlanningsFilter!$L$6:$L$1000,SMALL(IF(PlanningsFilter!$K$6:$K$1000=$A35,IF(PlanningsFilter!$C$6:$C$1000=O$2,IF(PlanningsFilter!$J$6:$J$1000=O$4,IF(PlanningsFilter!$I$6:$I$1000=\"\",ROW(PlanningsFilter!$I$6:$I$1000)-ROW($I$6)+1)))),$C35)),\"\")","v":""},{"$f":"IFERROR(INDEX(PlanningsFilter!$L$6:$L$1000,SMALL(IF(PlanningsFilter!$K$6:$K$1000=$A35,IF(PlanningsFilter!$C$6:$C$1000=P$2,IF(PlanningsFilter!$J$6:$J$1000=P$4,IF(PlanningsFilter!$I$6:$I$1000=\"\",ROW(PlanningsFilter!$I$6:$I$1000)-ROW($I$6)+1)))),$C35)),\"\")","v":""},{"$f":"IFERROR(INDEX(PlanningsFilter!$L$6:$L$1000,SMALL(IF(PlanningsFilter!$K$6:$K$1000=$A35,IF(PlanningsFilter!$C$6:$C$1000=Q$2,IF(PlanningsFilter!$J$6:$J$1000=Q$4,IF(PlanningsFilter!$I$6:$I$1000=\"\",ROW(PlanningsFilter!$I$6:$I$1000)-ROW($I$6)+1)))),$C35)),\"\")","v":""},{"$f":"IFERROR(INDEX(PlanningsFilter!$L$6:$L$1000,SMALL(IF(PlanningsFilter!$K$6:$K$1000=$A35,IF(PlanningsFilter!$C$6:$C$1000=R$2,IF(PlanningsFilter!$J$6:$J$1000=R$4,IF(PlanningsFilter!$I$6:$I$1000=\"\",ROW(PlanningsFilter!$I$6:$I$1000)-ROW($I$6)+1)))),$C35)),\"\")","v":""},{"$f":"IFERROR(INDEX(PlanningsFilter!$L$6:$L$1000,SMALL(IF(PlanningsFilter!$K$6:$K$1000=$A35,IF(PlanningsFilter!$C$6:$C$1000=S$2,IF(PlanningsFilter!$J$6:$J$1000=S$4,IF(PlanningsFilter!$I$6:$I$1000=\"\",ROW(PlanningsFilter!$I$6:$I$1000)-ROW($I$6)+1)))),$C35)),\"\")","v":""},{"$f":"IFERROR(INDEX(PlanningsFilter!$L$6:$L$1000,SMALL(IF(PlanningsFilter!$K$6:$K$1000=$A35,IF(PlanningsFilter!$C$6:$C$1000=T$2,IF(PlanningsFilter!$J$6:$J$1000=T$4,IF(PlanningsFilter!$I$6:$I$1000=\"\",ROW(PlanningsFilter!$I$6:$I$1000)-ROW($I$6)+1)))),$C35)),\"\")","v":""},{"$f":"IFERROR(INDEX(PlanningsFilter!$L$6:$L$1000,SMALL(IF(PlanningsFilter!$K$6:$K$1000=$A35,IF(PlanningsFilter!$C$6:$C$1000=U$2,IF(PlanningsFilter!$J$6:$J$1000=U$4,IF(PlanningsFilter!$I$6:$I$1000=\"\",ROW(PlanningsFilter!$I$6:$I$1000)-ROW($I$6)+1)))),$C35)),\"\")","v":""},{"$f":"IFERROR(INDEX(PlanningsFilter!$L$6:$L$1000,SMALL(IF(PlanningsFilter!$K$6:$K$1000=$A35,IF(PlanningsFilter!$C$6:$C$1000=V$2,IF(PlanningsFilter!$J$6:$J$1000=V$4,IF(PlanningsFilter!$I$6:$I$1000=\"\",ROW(PlanningsFilter!$I$6:$I$1000)-ROW($I$6)+1)))),$C35)),\"\")","v":""},{"$f":"IFERROR(INDEX(PlanningsFilter!$L$6:$L$1000,SMALL(IF(PlanningsFilter!$K$6:$K$1000=$A35,IF(PlanningsFilter!$C$6:$C$1000=W$2,IF(PlanningsFilter!$J$6:$J$1000=W$4,IF(PlanningsFilter!$I$6:$I$1000=\"\",ROW(PlanningsFilter!$I$6:$I$1000)-ROW($I$6)+1)))),$C35)),\"\")","v":""},{"$f":"IFERROR(INDEX(PlanningsFilter!$L$6:$L$1000,SMALL(IF(PlanningsFilter!$K$6:$K$1000=$A35,IF(PlanningsFilter!$C$6:$C$1000=X$2,IF(PlanningsFilter!$J$6:$J$1000=X$4,IF(PlanningsFilter!$I$6:$I$1000=\"\",ROW(PlanningsFilter!$I$6:$I$1000)-ROW($I$6)+1)))),$C35)),\"\")","v":""}]
["MEP",null,4,{"$f":"IFERROR(INDEX(PlanningsFilter!$L$6:$L$1000,SMALL(IF(PlanningsFilter!$K$6:$K$1000=$A36,IF(PlanningsFilter!$C$6:$C$1000=D$2,IF(PlanningsFilter!$J$6:$J$1000=D$4,IF(PlanningsFilter!$I$6:$I$1000=\"\",ROW(PlanningsFilter!$I$6:$I$1000)-ROW($I$6)+1)))),$C36)),\"\")","v":""},{"$f":"IFERROR(INDEX(PlanningsFilter!$L$6:$L$1000,SMALL(IF(PlanningsFilter!$K$6:$K$1000=$A36,IF(PlanningsFilter!$C$6:$C$1000=E$2,IF(PlanningsFilter!$J$6:$J$1000=E$4,IF(PlanningsFilter!$I$6:$I$1000=\"\",ROW(PlanningsFilter!$I$6:$I$1000)-ROW($I$6)+1)))),$C36)),\"\")","v":""},{"$f":"IFERROR(INDEX(PlanningsFilter!$L$6:$L$1000,SMALL(IF(PlanningsFilter!$K$6:$K$1000=$A36,IF(PlanningsFilter!$C$6:$C$1000=F$2,IF(PlanningsFilter!$J$6:$J$1000=F$4,IF(PlanningsFilter!$I$6:$I$1000=\"\",ROW(PlanningsFilter!$I$6:$I$1000)-ROW($I$6)+1)))),$C36)),\"\")","v":""},{"$f":"IFERROR(INDEX(PlanningsFilter!$L$6:$L$1000,SMALL(IF(PlanningsFilter!$K$6:$K$1000=$A36,IF(PlanningsFilter!$C$6:$C$1000=G$2,IF(PlanningsFilter!$J$6:$J$1000=G$4,IF(PlanningsFilter!$I$6:$I$1000=\"\",ROW(PlanningsFilter!$I$6:$I$1000)-ROW($I$6)+1)))),$C36)),\"\")","v":""},{"$f":"IFERROR(INDEX(PlanningsFilter!$L$6:$L$1000,SMALL(IF(PlanningsFilter!$K$6:$K$1000=$A36,IF(PlanningsFilter!$C$6:$C$1000=H$2,IF(PlanningsFilter!$J$6:$J$1000=H$4,IF(PlanningsFilter!$I$6:$I$1000=\"\",ROW(PlanningsFilter!$I$6:$I$1000)-ROW($I$6)+1)))),$C36)),\"\")","v":""},{"$f":"IFERROR(INDEX(PlanningsFilter!$L$6:$L$1000,SMALL(IF(PlanningsFilter!$K$6:$K$1000=$A36,IF(PlanningsFilter!$C$6:$C$1000=I$2,IF(PlanningsFilter!$J$6:$J$1000=I$4,IF(PlanningsFilter!$I$6:$I$1000=\"\",ROW(PlanningsFilter!$I$6:$I$1000)-ROW($I$6)+1)))),$C36)),\"\")","v":""},{"$f":"IFERROR(INDEX(PlanningsFilter!$L$6:$L$1000,SMALL(IF(PlanningsFilter!$K$6:$K$1000=$A36,IF(PlanningsFilter!$C$6:$C$1000=J$2,IF(PlanningsFilter!$J$6:$J$1000=J$4,IF(PlanningsFilter!$I$6:$I$1000=\"\",ROW(PlanningsFilter!$I$6:$I$1000)-ROW($I$6)+1)))),$C36)),\"\")","v":""},{"$f":"IFERROR(INDEX(PlanningsFilter!$L$6:$L$1000,SMALL(IF(PlanningsFilter!$K$6:$K$1000=$A36,IF(PlanningsFilter!$C$6:$C$1000=K$2,IF(PlanningsFilter!$J$6:$J$1000=K$4,IF(PlanningsFilter!$I$6:$I$1000=\"\",ROW(PlanningsFilter!$I$6:$I$1000)-ROW($I$6)+1)))),$C36)),\"\")","v":""},{"$f":"IFERROR(INDEX(PlanningsFilter!$L$6:$L$1000,SMALL(IF(PlanningsFilter!$K$6:$K$1000=$A36,IF(PlanningsFilter!$C$6:$C$1000=L$2,IF(PlanningsFilter!$J$6:$J$1000=L$4,IF(PlanningsFilter!$I$6:$I$1000=\"\",ROW(PlanningsFilter!$I$6:$I$1000)-ROW($I$6)+1)))),$C36)),\"\")","v":""},{"$f":"IFERROR(INDEX(PlanningsFilter!$L$6:$L$1000,SMALL(IF(PlanningsFilter!$K$6:$K$1000=$A36,IF(PlanningsFilter!$C$6:$C$1000=M$2,IF(PlanningsFilter!$J$6:$J$1000=M$4,IF(PlanningsFilter!$I$6:$I$1000=\"\",ROW(PlanningsFilter!$I$6:$I$1000)-ROW($I$6)+1)))),$C36)),\"\")","v":""},{"$f":"IFERROR(INDEX(PlanningsFilter!$L$6:$L$1000,SMALL(IF(PlanningsFilter!$K$6:$K$1000=$A36,IF(PlanningsFilter!$C$6:$C$1000=N$2,IF(PlanningsFilter!$J$6:$J$1000=N$4,IF(PlanningsFilter!$I$6:$I$1000=\"\",ROW(PlanningsFilter!$I$6:$I$1000)-ROW($I$6)+1)))),$C36)),\"\")","v":""},{"$f":"IFERROR(INDEX(PlanningsFilter!$L$6:$L$1000,SMALL(IF(PlanningsFilter!$K$6:$K$1000=$A36,IF(PlanningsFilter!$C$6:$C$1000=O$2,IF(PlanningsFilter!$J$6:$J$1000=O$4,IF(PlanningsFilter!$I$6:$I$1000=\"\",ROW(PlanningsFilter!$I$6:$I$1000)-ROW($I$6)+1)))),$C36)),\"\")","v":""},{"$f":"IFERROR(INDEX(PlanningsFilter!$L$6:$L$1000,SMALL(IF(PlanningsFilter!$K$6:$K$1000=$A36,IF(PlanningsFilter!$C$6:$C$1000=P$2,IF(PlanningsFilter!$J$6:$J$1000=P$4,IF(PlanningsFilter!$I$6:$I$1000=\"\",ROW(PlanningsFilter!$I$6:$I$1000)-ROW($I$6)+1)))),$C36)),\"\")","v":""},{"$f":"IFERROR(INDEX(PlanningsFilter!$L$6:$L$1000,SMALL(IF(PlanningsFilter!$K$6:$K$1000=$A36,IF(PlanningsFilter!$C$6:$C$1000=Q$2,IF(PlanningsFilter!$J$6:$J$1000=Q$4,IF(PlanningsFilter!$I$6:$I$1000=\"\",ROW(PlanningsFilter!$I$6:$I$1000)-ROW($I$6)+1)))),$C36)),\"\")","v":""},{"$f":"IFERROR(INDEX(PlanningsFilter!$L$6:$L$1000,SMALL(IF(PlanningsFilter!$K$6:$K$1000=$A36,IF(PlanningsFilter!$C$6:$C$1000=R$2,IF(PlanningsFilter!$J$6:$J$1000=R$4,IF(PlanningsFilter!$I$6:$I$1000=\"\",ROW(PlanningsFilter!$I$6:$I$1000)-ROW($I$6)+1)))),$C36)),\"\")","v":""},{"$f":"IFERROR(INDEX(PlanningsFilter!$L$6:$L$1000,SMALL(IF(PlanningsFilter!$K$6:$K$1000=$A36,IF(PlanningsFilter!$C$6:$C$1000=S$2,IF(PlanningsFilter!$J$6:$J$1000=S$4,IF(PlanningsFilter!$I$6:$I$1000=\"\",ROW(PlanningsFilter!$I$6:$I$1000)-ROW($I$6)+1)))),$C36)),\"\")","v":""},{"$f":"IFERROR(INDEX(PlanningsFilter!$L$6:$L$1000,SMALL(IF(PlanningsFilter!$K$6:$K$1000=$A36,IF(PlanningsFilter!$C$6:$C$1000=T$2,IF(PlanningsFilter!$J$6:$J$1000=T$4,IF(PlanningsFilter!$I$6:$I$1000=\"\",ROW(PlanningsFilter!$I$6:$I$1000)-ROW($I$6)+1)))),$C36)),\"\")","v":""},{"$f":"IFERROR(INDEX(PlanningsFilter!$L$6:$L$1000,SMALL(IF(PlanningsFilter!$K$6:$K$1000=$A36,IF(PlanningsFilter!$C$6:$C$1000=U$2,IF(PlanningsFilter!$J$6:$J$1000=U$4,IF(PlanningsFilter!$I$6:$I$1000=\"\",ROW(PlanningsFilter!$I$6:$I$1000)-ROW($I$6)+1)))),$C36)),\"\")","v":""},{"$f":"IFERROR(INDEX(PlanningsFilter!$L$6:$L$1000,SMALL(IF(PlanningsFilter!$K$6:$K$1000=$A36,IF(PlanningsFilter!$C$6:$C$1000=V$2,IF(PlanningsFilter!$J$6:$J$1000=V$4,IF(PlanningsFilter!$I$6:$I$1000=\"\",ROW(PlanningsFilter!$I$6:$I$1000)-ROW($I$6)+1)))),$C36)),\"\")","v":""},{"$f":"IFERROR(INDEX(PlanningsFilter!$L$6:$L$1000,SMALL(IF(PlanningsFilter!$K$6:$K$1000=$A36,IF(PlanningsFilter!$C$6:$C$1000=W$2,IF(PlanningsFilter!$J$6:$J$1000=W$4,IF(PlanningsFilter!$I$6:$I$1000=\"\",ROW(PlanningsFilter!$I$6:$I$1000)-ROW($I$6)+1)))),$C36)),\"\")","v":""},{"$f":"IFERROR(INDEX(PlanningsFilter!$L$6:$L$1000,SMALL(IF(PlanningsFilter!$K$6:$K$1000=$A36,IF(PlanningsFilter!$C$6:$C$1000=X$2,IF(PlanningsFilter!$J$6:$J$1000=X$4,IF(PlanningsFilter!$I$6:$I$1000=\"\",ROW(PlanningsFilter!$I$6:$I$1000)-ROW($I$6)+1)))),$C36)),\"\")","v":""}]
["MEP",null,5,{"$f":"IFERROR(INDEX(PlanningsFilter!$L$6:$L$1000,SMALL(IF(PlanningsFilter!$K$6:$K$1000=$A37,IF(PlanningsFilter!$C$6:$C$1000=D$2,IF(PlanningsFilter!$J$6:$J$1000=D$4,IF(PlanningsFilter!$I$6:$I$1000=\"\",ROW(PlanningsFilter!$I$6:$I$1000)-ROW($I$6)+1)))),$C37)),\"\")","v":""},{"$f":"IFERROR(INDEX(PlanningsFilter!$L$6:$L$1000,SMALL(IF(PlanningsFilter!$K$6:$K$1000=$A37,IF(PlanningsFilter!$C$6:$C$1000=E$2,IF(PlanningsFilter!$J$6:$J$1000=E$4,IF(PlanningsFilter!$I$6:$I$1000=\"\",ROW(PlanningsFilter!$I$6:$I$1000)-ROW($I$6)+1)))),$C37)),\"\")","v":""},{"$f":"IFERROR(INDEX(PlanningsFilter!$L$6:$L$1000,SMALL(IF(PlanningsFilter!$K$6:$K$1000=$A37,IF(PlanningsFilter!$C$6:$C$1000=F$2,IF(PlanningsFilter!$J$6:$J$1000=F$4,IF(PlanningsFilter!$I$6:$I$1000=\"\",ROW(PlanningsFilter!$I$6:$I$1000)-ROW($I$6)+1)))),$C37)),\"\")","v":""},{"$f":"IFERROR(INDEX(PlanningsFilter!$L$6:$L$1000,SMALL(IF(PlanningsFilter!$K$6:$K$1000=$A37,IF(PlanningsFilter!$C$6:$C$1000=G$2,IF(PlanningsFilter!$J$6:$J$1000=G$4,IF(PlanningsFilter!$I$6:$I$1000=\"\",ROW(PlanningsFilter!$I$6:$I$1000)-ROW($I$6)+1)))),$C37)),\"\")","v":""},{"$f":"IFERROR(INDEX(PlanningsFilter!$L$6:$L$1000,SMALL(IF(PlanningsFilter!$K$6:$K$1000=$A37,IF(PlanningsFilter!$C$6:$C$1000=H$2,IF(PlanningsFilter!$J$6:$J$1000=H$4,IF(PlanningsFilter!$I$6:$I$1000=\"\",ROW(PlanningsFilter!$I$6:$I$1000)-ROW($I$6)+1)))),$C37)),\"\")","v":""},{"$f":"IFERROR(INDEX(PlanningsFilter!$L$6:$L$1000,SMALL(IF(PlanningsFilter!$K$6:$K$1000=$A37,IF(PlanningsFilter!$C$6:$C$1000=I$2,IF(PlanningsFilter!$J$6:$J$1000=I$4,IF(PlanningsFilter!$I$6:$I$1000=\"\",ROW(PlanningsFilter!$I$6:$I$1000)-ROW($I$6)+1)))),$C37)),\"\")","v":""},{"$f":"IFERROR(INDEX(PlanningsFilter!$L$6:$L$1000,SMALL(IF(PlanningsFilter!$K$6:$K$1000=$A37,IF(PlanningsFilter!$C$6:$C$1000=J$2,IF(PlanningsFilter!$J$6:$J$1000=J$4,IF(PlanningsFilter!$I$6:$I$1000=\"\",ROW(PlanningsFilter!$I$6:$I$1000)-ROW($I$6)+1)))),$C37)),\"\")","v":""},{"$f":"IFERROR(INDEX(PlanningsFilter!$L$6:$L$1000,SMALL(IF(PlanningsFilter!$K$6:$K$1000=$A37,IF(PlanningsFilter!$C$6:$C$1000=K$2,IF(PlanningsFilter!$J$6:$J$1000=K$4,IF(PlanningsFilter!$I$6:$I$1000=\"\",ROW(PlanningsFilter!$I$6:$I$1000)-ROW($I$6)+1)))),$C37)),\"\")","v":""},{"$f":"IFERROR(INDEX(PlanningsFilter!$L$6:$L$1000,SMALL(IF(PlanningsFilter!$K$6:$K$1000=$A37,IF(PlanningsFilter!$C$6:$C$1000=L$2,IF(PlanningsFilter!$J$6:$J$1000=L$4,IF(PlanningsFilter!$I$6:$I$1000=\"\",ROW(PlanningsFilter!$I$6:$I$1000)-ROW($I$6)+1)))),$C37)),\"\")","v":""},{"$f":"IFERROR(INDEX(PlanningsFilter!$L$6:$L$1000,SMALL(IF(PlanningsFilter!$K$6:$K$1000=$A37,IF(PlanningsFilter!$C$6:$C$1000=M$2,IF(PlanningsFilter!$J$6:$J$1000=M$4,IF(PlanningsFilter!$I$6:$I$1000=\"\",ROW(PlanningsFilter!$I$6:$I$1000)-ROW($I$6)+1)))),$C37)),\"\")","v":""},{"$f":"IFERROR(INDEX(PlanningsFilter!$L$6:$L$1000,SMALL(IF(PlanningsFilter!$K$6:$K$1000=$A37,IF(PlanningsFilter!$C$6:$C$1000=N$2,IF(PlanningsFilter!$J$6:$J$1000=N$4,IF(PlanningsFilter!$I$6:$I$1000=\"\",ROW(PlanningsFilter!$I$6:$I$1000)-ROW($I$6)+1)))),$C37)),\"\")","v":""},{"$f":"IFERROR(INDEX(PlanningsFilter!$L$6:$L$1000,SMALL(IF(PlanningsFilter!$K$6:$K$1000=$A37,IF(PlanningsFilter!$C$6:$C$1000=O$2,IF(PlanningsFilter!$J$6:$J$1000=O$4,IF(PlanningsFilter!$I$6:$I$1000=\"\",ROW(PlanningsFilter!$I$6:$I$1000)-ROW($I$6)+1)))),$C37)),\"\")","v":""},{"$f":"IFERROR(INDEX(PlanningsFilter!$L$6:$L$1000,SMALL(IF(PlanningsFilter!$K$6:$K$1000=$A37,IF(PlanningsFilter!$C$6:$C$1000=P$2,IF(PlanningsFilter!$J$6:$J$1000=P$4,IF(PlanningsFilter!$I$6:$I$1000=\"\",ROW(PlanningsFilter!$I$6:$I$1000)-ROW($I$6)+1)))),$C37)),\"\")","v":""},{"$f":"IFERROR(INDEX(PlanningsFilter!$L$6:$L$1000,SMALL(IF(PlanningsFilter!$K$6:$K$1000=$A37,IF(PlanningsFilter!$C$6:$C$1000=Q$2,IF(PlanningsFilter!$J$6:$J$1000=Q$4,IF(PlanningsFilter!$I$6:$I$1000=\"\",ROW(PlanningsFilter!$I$6:$I$1000)-ROW($I$6)+1)))),$C37)),\"\")","v":""},{"$f":"IFERROR(INDEX(PlanningsFilter!$L$6:$L$1000,SMALL(IF(PlanningsFilter!$K$6:$K$1000=$A37,IF(PlanningsFilter!$C$6:$C$1000=R$2,IF(PlanningsFilter!$J$6:$J$1000=R$4,IF(PlanningsFilter!$I$6:$I$1000=\"\",ROW(PlanningsFilter!$I$6:$I$1000)-ROW($I$6)+1)))),$C37)),\"\")","v":""},{"$f":"IFERROR(INDEX(PlanningsFilter!$L$6:$L$1000,SMALL(IF(PlanningsFilter!$K$6:$K$1000=$A37,IF(PlanningsFilter!$C$6:$C$1000=S$2,IF(PlanningsFilter!$J$6:$J$1000=S$4,IF(PlanningsFilter!$I$6:$I$1000=\"\",ROW(PlanningsFilter!$I$6:$I$1000)-ROW($I$6)+1)))),$C37)),\"\")","v":""},{"$f":"IFERROR(INDEX(PlanningsFilter!$L$6:$L$1000,SMALL(IF(PlanningsFilter!$K$6:$K$1000=$A37,IF(PlanningsFilter!$C$6:$C$1000=T$2,IF(PlanningsFilter!$J$6:$J$1000=T$4,IF(PlanningsFilter!$I$6:$I$1000=\"\",ROW(PlanningsFilter!$I$6:$I$1000)-ROW($I$6)+1)))),$C37)),\"\")","v":""},{"$f":"IFERROR(INDEX(PlanningsFilter!$L$6:$L$1000,SMALL(IF(PlanningsFilter!$K$6:$K$1000=$A37,IF(PlanningsFilter!$C$6:$C$1000=U$2,IF(PlanningsFilter!$J$6:$J$1000=U$4,IF(PlanningsFilter!$I$6:$I$1000=\"\",ROW(PlanningsFilter!$I$6:$I$1000)-ROW($I$6)+1)))),$C37)),\"\")","v":""},{"$f":"IFERROR(INDEX(PlanningsFilter!$L$6:$L$1000,SMALL(IF(PlanningsFilter!$K$6:$K$1000=$A37,IF(PlanningsFilter!$C$6:$C$1000=V$2,IF(PlanningsFilter!$J$6:$J$1000=V$4,IF(PlanningsFilter!$I$6:$I$1000=\"\",ROW(PlanningsFilter!$I$6:$I$1000)-ROW($I$6)+1)))),$C37)),\"\")","v":""},{"$f":"IFERROR(INDEX(PlanningsFilter!$L$6:$L$1000,SMALL(IF(PlanningsFilter!$K$6:$K$1000=$A37,IF(PlanningsFilter!$C$6:$C$1000=W$2,IF(PlanningsFilter!$J$6:$J$1000=W$4,IF(PlanningsFilter!$I$6:$I$1000=\"\",ROW(PlanningsFilter!$I$6:$I$1000)-ROW($I$6)+1)))),$C37)),\"\")","v":""},{"$f":"IFERROR(INDEX(PlanningsFilter!$L$6:$L$1000,SMALL(IF(PlanningsFilter!$K$6:$K$1000=$A37,IF(PlanningsFilter!$C$6:$C$1000=X$2,IF(PlanningsFilter!$J$6:$J$1000=X$4,IF(PlanningsFilter!$I$6:$I$1000=\"\",ROW(PlanningsFilter!$I$6:$I$1000)-ROW($I$6)+1)))),$C37)),\"\")","v":""}]
["MEP",null,6,{"$f":"IFERROR(INDEX(PlanningsFilter!$L$6:$L$1000,SMALL(IF(PlanningsFilter!$K$6:$K$1000=$A38,IF(PlanningsFilter!$C$6:$C$1000=D$2,IF(PlanningsFilter!$J$6:$J$1000=D$4,IF(PlanningsFilter!$I$6:$I$1000=\"\",ROW(PlanningsFilter!$I$6:$I$1000)-ROW($I$6)+1)))),$C38)),\"\")","v":""},{"$f":"IFERROR(INDEX(PlanningsFilter!$L$6:$L$1000,SMALL(IF(PlanningsFilter!$K$6:$K$1000=$A38,IF(PlanningsFilter!$C$6:$C$1000=E$2,IF(PlanningsFilter!$J$6:$J$1000=E$4,IF(PlanningsFilter!$I$6:$I$1000=\"\",ROW(PlanningsFilter!$I$6:$I$1000)-ROW($I$6)+1)))),$C38)),\"\")","v":""},{"$f":"IFERROR(INDEX(PlanningsFilter!$L$6:$L$1000,SMALL(IF(PlanningsFilter!$K$6:$K$1000=$A38,IF(PlanningsFilter!$C$6:$C$1000=F$2,IF(PlanningsFilter!$J$6:$J$1000=F$4,IF(PlanningsFilter!$I$6:$I$1000=\"\",ROW(PlanningsFilter!$I$6:$I$1000)-ROW($I$6)+1)))),$C38)),\"\")","v":""},{"$f":"IFERROR(INDEX(PlanningsFilter!$L$6:$L$1000,SMALL(IF(PlanningsFilter!$K$6:$K$1000=$A38,IF(PlanningsFilter!$C$6:$C$1000=G$2,IF(PlanningsFilter!$J$6:$J$1000=G$4,IF(PlanningsFilter!$I$6:$I$1000=\"\",ROW(PlanningsFilter!$I$6:$I$1000)-ROW($I$6)+1)))),$C38)),\"\")","v":""},{"$f":"IFERROR(INDEX(PlanningsFilter!$L$6:$L$1000,SMALL(IF(PlanningsFilter!$K$6:$K$1000=$A38,IF(PlanningsFilter!$C$6:$C$1000=H$2,IF(PlanningsFilter!$J$6:$J$1000=H$4,IF(PlanningsFilter!$I$6:$I$1000=\"\",ROW(PlanningsFilter!$I$6:$I$1000)-ROW($I$6)+1)))),$C38)),\"\")","v":""},{"$f":"IFERROR(INDEX(PlanningsFilter!$L$6:$L$1000,SMALL(IF(PlanningsFilter!$K$6:$K$1000=$A38,IF(PlanningsFilter!$C$6:$C$1000=I$2,IF(PlanningsFilter!$J$6:$J$1000=I$4,IF(PlanningsFilter!$I$6:$I$1000=\"\",ROW(PlanningsFilter!$I$6:$I$1000)-ROW($I$6)+1)))),$C38)),\"\")","v":""},{"$f":"IFERROR(INDEX(PlanningsFilter!$L$6:$L$1000,SMALL(IF(PlanningsFilter!$K$6:$K$1000=$A38,IF(PlanningsFilter!$C$6:$C$1000=J$2,IF(PlanningsFilter!$J$6:$J$1000=J$4,IF(PlanningsFilter!$I$6:$I$1000=\"\",ROW(PlanningsFilter!$I$6:$I$1000)-ROW($I$6)+1)))),$C38)),\"\")","v":""},{"$f":"IFERROR(INDEX(PlanningsFilter!$L$6:$L$1000,SMALL(IF(PlanningsFilter!$K$6:$K$1000=$A38,IF(PlanningsFilter!$C$6:$C$1000=K$2,IF(PlanningsFilter!$J$6:$J$1000=K$4,IF(PlanningsFilter!$I$6:$I$1000=\"\",ROW(PlanningsFilter!$I$6:$I$1000)-ROW($I$6)+1)))),$C38)),\"\")","v":""},{"$f":"IFERROR(INDEX(PlanningsFilter!$L$6:$L$1000,SMALL(IF(PlanningsFilter!$K$6:$K$1000=$A38,IF(PlanningsFilter!$C$6:$C$1000=L$2,IF(PlanningsFilter!$J$6:$J$1000=L$4,IF(PlanningsFilter!$I$6:$I$1000=\"\",ROW(PlanningsFilter!$I$6:$I$1000)-ROW($I$6)+1)))),$C38)),\"\")","v":""},{"$f":"IFERROR(INDEX(PlanningsFilter!$L$6:$L$1000,SMALL(IF(PlanningsFilter!$K$6:$K$1000=$A38,IF(PlanningsFilter!$C$6:$C$1000=M$2,IF(PlanningsFilter!$J$6:$J$1000=M$4,IF(PlanningsFilter!$I$6:$I$1000=\"\",ROW(PlanningsFilter!$I$6:$I$1000)-ROW($I$6)+1)))),$C38)),\"\")","v":""},{"$f":"IFERROR(INDEX(PlanningsFilter!$L$6:$L$1000,SMALL(IF(PlanningsFilter!$K$6:$K$1000=$A38,IF(PlanningsFilter!$C$6:$C$1000=N$2,IF(PlanningsFilter!$J$6:$J$1000=N$4,IF(PlanningsFilter!$I$6:$I$1000=\"\",ROW(PlanningsFilter!$I$6:$I$1000)-ROW($I$6)+1)))),$C38)),\"\")","v":""},{"$f":"IFERROR(INDEX(PlanningsFilter!$L$6:$L$1000,SMALL(IF(PlanningsFilter!$K$6:$K$1000=$A38,IF(PlanningsFilter!$C$6:$C$1000=O$2,IF(PlanningsFilter!$J$6:$J$1000=O$4,IF(PlanningsFilter!$I$6:$I$1000=\"\",ROW(PlanningsFilter!$I$6:$I$1000)-ROW($I$6)+1)))),$C38)),\"\")","v":""},{"$f":"IFERROR(INDEX(PlanningsFilter!$L$6:$L$1000,SMALL(IF(PlanningsFilter!$K$6:$K$1000=$A38,IF(PlanningsFilter!$C$6:$C$1000=P$2,IF(PlanningsFilter!$J$6:$J$1000=P$4,IF(PlanningsFilter!$I$6:$I$1000=\"\",ROW(PlanningsFilter!$I$6:$I$1000)-ROW($I$6)+1)))),$C38)),\"\")","v":""},{"$f":"IFERROR(INDEX(PlanningsFilter!$L$6:$L$1000,SMALL(IF(PlanningsFilter!$K$6:$K$1000=$A38,IF(PlanningsFilter!$C$6:$C$1000=Q$2,IF(PlanningsFilter!$J$6:$J$1000=Q$4,IF(PlanningsFilter!$I$6:$I$1000=\"\",ROW(PlanningsFilter!$I$6:$I$1000)-ROW($I$6)+1)))),$C38)),\"\")","v":""},{"$f":"IFERROR(INDEX(PlanningsFilter!$L$6:$L$1000,SMALL(IF(PlanningsFilter!$K$6:$K$1000=$A38,IF(PlanningsFilter!$C$6:$C$1000=R$2,IF(PlanningsFilter!$J$6:$J$1000=R$4,IF(PlanningsFilter!$I$6:$I$1000=\"\",ROW(PlanningsFilter!$I$6:$I$1000)-ROW($I$6)+1)))),$C38)),\"\")","v":""},{"$f":"IFERROR(INDEX(PlanningsFilter!$L$6:$L$1000,SMALL(IF(PlanningsFilter!$K$6:$K$1000=$A38,IF(PlanningsFilter!$C$6:$C$1000=S$2,IF(PlanningsFilter!$J$6:$J$1000=S$4,IF(PlanningsFilter!$I$6:$I$1000=\"\",ROW(PlanningsFilter!$I$6:$I$1000)-ROW($I$6)+1)))),$C38)),\"\")","v":""},{"$f":"IFERROR(INDEX(PlanningsFilter!$L$6:$L$1000,SMALL(IF(PlanningsFilter!$K$6:$K$1000=$A38,IF(PlanningsFilter!$C$6:$C$1000=T$2,IF(PlanningsFilter!$J$6:$J$1000=T$4,IF(PlanningsFilter!$I$6:$I$1000=\"\",ROW(PlanningsFilter!$I$6:$I$1000)-ROW($I$6)+1)))),$C38)),\"\")","v":""},{"$f":"IFERROR(INDEX(PlanningsFilter!$L$6:$L$1000,SMALL(IF(PlanningsFilter!$K$6:$K$1000=$A38,IF(PlanningsFilter!$C$6:$C$1000=U$2,IF(PlanningsFilter!$J$6:$J$1000=U$4,IF(PlanningsFilter!$I$6:$I$1000=\"\",ROW(PlanningsFilter!$I$6:$I$1000)-ROW($I$6)+1)))),$C38)),\"\")","v":""},{"$f":"IFERROR(INDEX(PlanningsFilter!$L$6:$L$1000,SMALL(IF(PlanningsFilter!$K$6:$K$1000=$A38,IF(PlanningsFilter!$C$6:$C$1000=V$2,IF(PlanningsFilter!$J$6:$J$1000=V$4,IF(PlanningsFilter!$I$6:$I$1000=\"\",ROW(PlanningsFilter!$I$6:$I$1000)-ROW($I$6)+1)))),$C38)),\"\")","v":""},{"$f":"IFERROR(INDEX(PlanningsFilter!$L$6:$L$1000,SMALL(IF(PlanningsFilter!$K$6:$K$1000=$A38,IF(PlanningsFilter!$C$6:$C$1000=W$2,IF(PlanningsFilter!$J$6:$J$1000=W$4,IF(PlanningsFilter!$I$6:$I$1000=\"\",ROW(PlanningsFilter!$I$6:$I$1000)-ROW($I$6)+1)))),$C38)),\"\")","v":""},{"$f":"IFERROR(INDEX(PlanningsFilter!$L$6:$L$1000,SMALL(IF(PlanningsFilter!$K$6:$K$1000=$A38,IF(PlanningsFilter!$C$6:$C$1000=X$2,IF(PlanningsFilter!$J$6:$J$1000=X$4,IF(PlanningsFilter!$I$6:$I$1000=\"\",ROW(PlanningsFilter!$I$6:$I$1000)-ROW($I$6)+1)))),$C38)),\"\")","v":""}]

{"sheet":"PlanningsFilter","index":3,"n_rows":600,"n_cols":12,"rows_kept":600,"cut":false,"hidden":false,"merged":[]}
[null,"Info","Info","Functie","Starttijd","Eindtijd","Voornaam","Achternaam"]
[null,">43800","<43808"]
[]
[]
[null,null,"Info","Functie","Starttijd","Eindtijd","Voornaam","Achternaam","Verlof","Post","PA","Vn & A"]
[null,null,"2019-12-02","ABB ochtend ",43801.25,43801.614583333336,"Flavi","van der Heyden",{"$f":"IF(H6=\"\",\"\",IF(SUMPRODUCT(--(Tabel1[[Afwezig ]]=H6),--(Tabel1[van]<=C6),--(Tabel1[tot en met]>=C6)*(1))>0,\"V\",\"\"))","v":""},{"$f":"IF(C6=\"\",\"\",INDEX(Validatie!$Q$2:$Q$6,MATCH(MOD(E6,1),Validatie!$P$2:$P$6,1)))","v":"Vroeg"},{"$f":"IF(C6=\"\",\"\",IFERROR(VLOOKUP(D6,DataMijnAfdeling,2,0),\"?\"))","v":"ABB"},{"$f":"IF(C6=\"\",\"\",CONCATENATE(G6,\" \",H6))","v":"Flavi van der Heyden"}]
[null,null,"2019-12-02","AFV HAS",43801.25,43801.40625,"Norbert","de Lange",null,{"$f":"IF(C7=\"\",\"\",INDEX(Validatie!$Q$2:$Q$6,MATCH(MOD(E7,1),Validatie!$P$2:$P$6,1)))","v":"Vroeg"},{"$f":"IF(C7=\"\",\"\",IFERROR(VLOOKUP(D7,DataMijnAfdeling,2,0),\"?\"))","v":"HAS"},{"$f":"IF(C7=\"\",\"\",CONCATENATE(G7,\" \",H7))","v":"Norbert de Lange"}]
[null,null,"2019-12-02","AFV MEP",43801.25,43801.614583333336,"Houcin","Huisman",null,{"$f":"IF(C8=\"\",\"\",INDEX(Validatie!$Q$2:$Q$6,MATCH(MOD(E8,1),Validatie!$P$2:$P$6,1)))","v":"Vroeg"},{"$f":"IF(C8=\"\",\"\",IFERROR(VLOOKUP(D8,DataMijnAfdeling,2,0),\"?\"))","v":"MEP"},"Houcin Huisman"]
[null,null,"2019-12-02","LCR ochtend",43801.25,43801.614583333336,"Wolter","De bolder",null,{"$f":"IF(C9=\"\",\"\",INDEX(Validatie!$Q$2:$Q$6,MATCH(MOD(E9,1),Validatie!$P$2:$P$6,1)))","v":"Vroeg"},{"$f":"IF(C9=\"\",\"\",IFERROR(VLOOKUP(D9,DataMijnAfdeling,2,0),\"?\"))","v":"LCR"},"Wolter De bolder"]
[null,null,"2019-12-02","PALL HAS",43801.25,43801.614583333336,"Henk","Koster",null,{"$f":"IF(C10=\"\",\"\",INDEX(Validatie!$Q$2:$Q$6,MATCH(MOD(E10,1),Validatie!$P$2:$P$6,1)))","v":"Vroeg"},{"$f":"IF(C10=\"\",\"\",IFERROR(VLOOKUP(D10,DataMijnAfdeling,2,0),\"?\"))","v":"-"},"Henk Koster"]
[null,null,"2019-12-02","PALL MEP",43801.25,43801.614583333336,"Latie","van Wijk",null,{"$f":"IF(C11=\"\",\"\",INDEX(Validatie!$Q$2:$Q$6,MATCH(MOD(E11,1),Validatie!$P$2:$P$6,1)))","v":"Vroeg"},{"$f":"IF(C11=\"\",\"\",IFERROR(VLOOKUP(D11,DataMijnAfdeling,2,0),\"?\"))","v":"-"},"Latie van Wijk"]
[null,null,"2019-12-02","PALL MEP",43801.25,43801.614583333336,"Michael","Gerritsen",null,{"$f":"IF(C12=\"\",\"\",INDEX(Validatie!$Q$2:$Q$6,MATCH(MOD(E12,1),Validatie!$P$2:$P$6,1)))","v":"Vroeg"},{"$f":"IF(C12=\"\",\"\",IFERROR(VLOOKUP(D12,DataMijnAfdeling,2,0),\"?\"))","v":"-"},"Michael Gerritsen"]
[null,null,"2019-12-02","PALL MEP",43801.25,43801.614583333336,"Abdurahman Ibrahim","de Vries",null,{"$f":"IF(C13=\"\",\"\",INDEX(Validatie!$Q$2:$Q$6,MATCH(MOD(E13,1),Validatie!$P$2:$P$6,1)))","v":"Vroeg"},{"$f":"IF(C13=\"\",\"\",IFERROR(VLOOKUP(D13,DataMijnAfdeling,2,0),\"?\"))","v":"-"},"Abdurahman Ibrahim de Vries"]
[null,null,"2019-12-02","PALL MEP",43801.25,43801.614583333336,"Hans","van de Ven ",null,{"$f":"IF(C14=\"\",\"\",INDEX(Validatie!$Q$2:$Q$6,MATCH(MOD(E14,1),Validatie!$P$2:$P$6,1)))","v":"Vroeg"},{"$f":"IF(C14=\"\",\"\",IFERROR(VLOOKUP(D14,DataMijnAfdeling,2,0),\"?\"))","v":"-"},"Hans van de Ven "]
[null,null,"2019-12-02","PALL MEP",43801.25,43801.614583333336,"Jeroen","Post",null,{"$f":"IF(C15=\"\",\"\",INDEX(Validatie!$Q$2:$Q$6,MATCH(MOD(E15,1),Validatie!$P$2:$P$6,1)))","v":"Vroeg"},{"$f":"IF(C15=\"\",\"\",IFERROR(VLOOKUP(D15,DataMijnAfdeling,2,0),\"?\"))","v":"-"},"Jeroen Post"]
[null,null,"2019-12-02","PALL Rweg",43801.25,43801.614583333336,"Akela","van Dijk",null,{"$f":"IF(C16=\"\",\"\",INDEX(Validatie!$Q$2:$Q$6,MATCH(MOD(E16,1),Validatie!$P$2:$P$6,1)))","v":"Vroeg"},{"$f":"IF(C16=\"\",\"\",IFERROR(VLOOKUP(D16,DataMijnAfdeling,2,0),\"?\"))","v":"-"},"Akela van Dijk"]
[null,null,"2019-12-02","PALL Rweg",43801.25,43801.614583333336,"Karrar","Kuiper",null,{"$f":"IF(C17=\"\",\"\",INDEX(Validatie!$Q$2:$Q$6,MATCH(MOD(E17,1),Validatie!$P$2:$P$6,1)))","v":"Vroeg"},{"$f":"IF(C17=\"\",\"\",IFERROR(VLOOKUP(D17,DataMijnAfdeling,2,0),\"?\"))","v":"-"},"Karrar Kuiper"]
[null,null,"2019-12-02","PALL Rweg",43801.25,43801.614583333336,"Sebastian","Kuijpers",null,{"$f":"IF(C18=\"\",\"\",INDEX(Validatie!$Q$2:$Q$6,MATCH(MOD(E18,1),Validatie!$P$2:$P$6,1)))","v":"Vroeg"},{"$f":"IF(C18=\"\",\"\",IFERROR(VLOOKUP(D18,DataMijnAfdeling,2,0),\"?\"))","v":"-"},"Sebastian Kuijpers"]
[null,null,"2019-12-02","PALL Rweg",43801.25,43801.614583333336,"Abdul","Jansen",null,{"$f":"IF(C19=\"\",\"\",INDEX(Validatie!$Q$2:$Q$6,MATCH(MOD(E19,1),Validatie!$P$2:$P$6,1)))","v":"Vroeg"},{"$f":"IF(C19=\"\",\"\",IFERROR(VLOOKUP(D19,DataMijnAfdeling,2,0),\"?\"))","v":"-"},"Abdul Jansen"]
[null,null,"2019-12-02","PALL Rweg",43801.25,43801.614583333336,"Apollonia","Meijer",null,{"$f":"IF(C20=\"\",\"\",INDEX(Validatie!$Q$2:$Q$6,MATCH(MOD(E20,1),Validatie!$P$2:$P$6,1)))","v":"Vroeg"},{"$f":"IF(C20=\"\",\"\",IFERROR(VLOOKUP(D20,DataMijnAfdeling,2,0),\"?\"))","v":"-"},"Apollonia Meijer"]
[null,null,"2019-12-02","PALL Rweg",43801.25,43801.614583333336,"Naoufel","van de Velde ",null,{"$f":"IF(C21=\"\",\"\",INDEX(Validatie!$Q$2:$Q$6,MATCH(MOD(E21,1),Validatie!$P$2:$P$6,1)))","v":"Vroeg"},{"$f":"IF(C21=\"\",\"\",IFERROR(VLOOKUP(D21,DataMijnAfdeling,2,0),\"?\"))","v":"-"},"Naoufel van de Velde "]
[null,null,"2019-12-02","PALL Rweg",43801.25,43801.614583333336,"Jelte","van Veen",null,{"$f":"IF(C22=\"\",\"\",INDEX(Validatie!$Q$2:$Q$6,MATCH(MOD(E22,1),Validatie!$P$2:$P$6,1)))","v":"Vroeg"},{"$f":"IF(C22=\"\",\"\",IFERROR(VLOOKUP(D22,DataMijnAfdeling,2,0),\"?\"))","v":"-"},"Jelte van Veen"]
[null,null,"2019-12-02","PALL Rweg",43801.25,43801.614583333336,"Agathe","van de Berg ",null,{"$f":"IF(C23=\"\",\"\",INDEX(Validatie!$Q$2:$Q$6,MATCH(MOD(E23,1),Validatie!$P$2:$P$6,1)))","v":"Vroeg"},{"$f":"IF(C23=\"\",\"\",IFERROR(VLOOKUP(D23,DataMijnAfdeling,2,0),\"?\"))","v":"-"},"Agathe van de Berg "]
[null,null,"2019-12-02","PALL Rweg",43801.25,43801.614583333336,"Heruy","van de Wal ",null,{"$f":"IF(C24=\"\",\"\",INDEX(Validatie!$Q$2:$Q$6,MATCH(MOD(E24,1),Validatie!$P$2:$P$6,1)))","v":"Vroeg"},{"$f":"IF(C24=\"\",\"\",IFERROR(VLOOKUP(D24,DataMijnAfdeling,2,0),\"?\"))","v":"-"},"Heruy van de Wal "]
[null,null,"2019-12-02","PALL Rweg",43801.25,43801.614583333336,"Hassan","Verhoeven",null,{"$f":"IF(C25=\"\",\"\",INDEX(Validatie!$Q$2:$Q$6,MATCH(MOD(E25,1),Validatie!$P$2:$P$6,1)))","v":"Vroeg"},{"$f":"IF(C25=\"\",\"\",IFERROR(VLOOKUP(D25,DataMijnAfdeling,2,0),\"?\"))","v":"-"},"Hassan Verhoeven"]
[null,null,"2019-12-02","PALL Rweg",43801.25,43801.614583333336,"Sied"," van der Pol",null,{"$f":"IF(C26=\"\",\"\",INDEX(Validatie!$Q$2:$Q$6,MATCH(MOD(E26,1),Validatie!$P$2:$P$6,1)))","v":"Vroeg"},{"$f":"IF(C26=\"\",\"\",IFERROR(VLOOKUP(D26,DataMijnAfdeling,2,0),\"?\"))","v":"-"},"Sied  van der Pol"]
[null,null,"2019-12-02","PALL Rweg",43801.25,43801.614583333336,"Jarek","Kuipers",null,{"$f":"IF(C27=\"\",\"\",INDEX(Validatie!$Q$2:$Q$6,MATCH(MOD(E27,1),Validatie!$P$2:$P$6,1)))","v":"Vroeg"},{"$f":"IF(C27=\"\",\"\",IFERROR(VLOOKUP(D27,DataMijnAfdeling,2,0),\"?\"))","v":"-"},"Jarek Kuipers"]
[null,null,"2019-12-02","PALL Rweg",43801.25,43801.614583333336,"Martijn","de Ruiter",null,{"$f":"IF(C28=\"\",\"\",INDEX(Validatie!$Q$2:$Q$6,MATCH(MOD(E28,1),Validatie!$P$2:$P$6,1)))","v":"Vroeg"},{"$f":"IF(C28=\"\",\"\",IFERROR(VLOOKUP(D28,DataMijnAfdeling,2,0),\"?\"))","v":"-"},"Martijn de Ruiter"]
[null,null,"2019-12-02","PALL Rweg",43801.25,43801.614583333336,"Mark","Vink",null,{"$f":"IF(C29=\"\",\"\",INDEX(Validatie!$Q$2:$Q$6,MATCH(MOD(E29,1),Validatie!$P$2:$P$6,1)))","v":"Vroeg"},{"$f":"IF(C29=\"\",\"\",IFERROR(VLOOKUP(D29,DataMijnAfdeling,2,0),\"?\"))","v":"-"},"Mark Vink"]
[null,null,"2019-12-02","PALL Rweg",43801.25,43801.614583333336,"Laszlo","Scholten",null,{"$f":"IF(C30=\"\",\"\",INDEX(Validatie!$Q$2:$Q$6,MATCH(MOD(E30,1),Validatie!$P$2:$P$6,1)))","v":"Vroeg"},{"$f":"IF(C30=\"\",\"\",IFERROR(VLOOKUP(D30,DataMijnAfdeling,2,0),\"?\"))","v":"-"},"Laszlo Scholten"]
[null,null,"2019-12-02","PALL Rweg",43801.25,43801.614583333336,"Abdiqadir","de Jong",null,{"$f":"IF(C31=\"\",\"\",INDEX(Validatie!$Q$2:$Q$6,MATCH(MOD(E31,1),Validatie!$P$2:$P$6,1)))","v":"Vroeg"},{"$f":"IF(C31=\"\",\"\",IFERROR(VLOOKUP(D31,DataMijnAfdeling,2,0),\"?\"))","v":"-"},"Abdiqadir de Jong"]
[null,null,"2019-12-02","PALL Rweg",43801.25,43801.614583333336,"Atobhran","de Groot",null,{"$f":"IF(C32=\"\",\"\",INDEX(Validatie!$Q$2:$Q$6,MATCH(MOD(E32,1),Validatie!$P$2:$P$6,1)))","v":"Vroeg"},{"$f":"IF(C32=\"\",\"\",IFERROR(VLOOKUP(D32,DataMijnAfdeling,2,0),\"?\"))","v":"-"},"Atobhran de Groot"]
[null,null,"2019-12-02","PALL Rweg",43801.25,43801.614583333336,"Barend","Vos",null,{"$f":"IF(C33=\"\",\"\",INDEX(Validatie!$Q$2:$Q$6,MATCH(MOD(E33,1),Validatie!$P$2:$P$6,1)))","v":"Vroeg"},{"$f":"IF(C33=\"\",\"\",IFERROR(VLOOKUP(D33,DataMijnAfdeling,2,0),\"?\"))","v":"-"},"Barend Vos"]
[null,null,"2019-12-02","PALL Rweg",43801.25,43801.614583333336,"Nexhmedi","Willemsen",null,{"$f":"IF(C34=\"\",\"\",INDEX(Validatie!$Q$2:$Q$6,MATCH(MOD(E34,1),Validatie!$P$2:$P$6,1)))","v":"Vroeg"},{"$f":"IF(C34=\"\",\"\",IFERROR(VLOOKUP(D34,DataMijnAfdeling,2,0),\"?\"))","v":"-"},"Nexhmedi Willemsen"]
[null,null,"2019-12-02","SCHM",43801.25,43801.614583333336,"Rachid","van der Laan",null,{"$f":"IF(C35=\"\",\"\",INDEX(Validatie!$Q$2:$Q$6,MATCH(MOD(E35,1),Validatie!$P$2:$P$6,1)))","v":"Vroeg"},{"$f":"IF(C35=\"\",\"\",IFERROR(VLOOKUP(D35,DataMijnAfdeling,2,0),\"?\"))","v":"SCHM"},"Rachid van der Laan"]
[null,null,"2019-12-02","SCHM",43801.25,43801.614583333336,"Evans","Vermeulen",null,{"$f":"IF(C36=\"\",\"\",INDEX(Validatie!$Q$2:$Q$6,MATCH(MOD(E36,1),Validatie!$P$2:$P$6,1)))","v":"Vroeg"},{"$f":"IF(C36=\"\",\"\",IFERROR(VLOOKUP(D36,DataMijnAfdeling,2,0),\"?\"))","v":"SCHM"},"Evans Vermeulen"]
[null,null,"2019-12-02","SCHM",43801.25,43801.614583333336,"Kevin","Veenstra",null,{"$f":"IF(C37=\"\",\"\",INDEX(Validatie!$Q$2:$Q$6,MATCH(MOD(E37,1),Validatie!$P$2:$P$6,1)))","v":"Vroeg"},{"$f":"IF(C37=\"\",\"\",IFERROR(VLOOKUP(D37,DataMijnAfdeling,2,0),\"?\"))","v":"SCHM"},"Kevin Veenstra"]
[null,null,"2019-12-02","SCHM AFV",43801.25,43801.614583333336,"Baki","Bos",null,{"$f":"IF(C38=\"\",\"\",INDEX(Validatie!$Q$2:$Q$6,MATCH(MOD(E38,1),Validatie!$P$2:$P$6,1)))","v":"Vroeg"},{"$f":"IF(C38=\"\",\"\",IFERROR(VLOOKUP(D38,DataMijnAfdeling,2,0),\"?\"))","v":"AFV"},"Baki Bos"]
[null,null,"2019-12-02","SCHM AFV",43801.25,43801.614583333336,"Ilker","Peeters",null,{"$f":"IF(C39=\"\",\"\",INDEX(Validatie!$Q$2:$Q$6,MATCH(MOD(E39,1),Validatie!$P$2:$P$6,1)))","v":"Vroeg"},{"$f":"IF(C39=\"\",\"\",IFERROR(VLOOKUP(D39,DataMijnAfdeling,2,0),\"?\"))","v":"AFV"},"Ilker Peeters"]
[null,null,"2019-12-02","SCHM AFV",43801.25,43801.614583333336,"Miquel","van Loon",null,{"$f":"IF(C40=\"\",\"\",INDEX(Validatie!$Q$2:$Q$6,MATCH(MOD(E40,1),Validatie!$P$2:$P$6,1)))","v":"Vroeg"},{"$f":"IF(C40=\"\",\"\",IFERROR(VLOOKUP(D40,DataMijnAfdeling,2,0),\"?\"))","v":"AFV"},"Miquel van Loon"]
[null,null,"2019-12-02","SCHM AFV",43801.25,43801.614583333336,"Klaas","Kramer",null,{"$f":"IF(C41=\"\",\"\",INDEX(Validatie!$Q$2:$Q$6,MATCH(MOD(E41,1),Validatie!$P$2:$P$6,1)))","v":"Vroeg"},{"$f":"IF(C41=\"\",\"\",IFERROR(VLOOKUP(D41,DataMijnAfdeling,2,0),\"?\"))","v":"AFV"},"Klaas Kramer"]
[null,null,"2019-12-02","SCHM AFV",43801.25,43801.614583333336,"Sebastiaan","Mol",null,{"$f":"IF(C42=\"\",\"\",INDEX(Validatie!$Q$2:$Q$6,MATCH(MOD(E42,1),Validatie!$P$2:$P$6,1)))","v":"Vroeg"},{"$f":"IF(C42=\"\",\"\",IFERROR(VLOOKUP(D42,DataMijnAfdeling,2,0),\"?\"))","v":"AFV"},"Sebastiaan Mol"]
[null,null,"2019-12-02","TRSP",43801.25,43801.614583333336,"Emsud","Kok",null,{"$f":"IF(C43=\"\",\"\",INDEX(Validatie!$Q$2:$Q$6,MATCH(MOD(E43,1),Validatie!$P$2:$P$6,1)))","v":"Vroeg"},{"$f":"IF(C43=\"\",\"\",IFERROR(VLOOKUP(D43,DataMijnAfdeling,2,0),\"?\"))","v":"?"},"Emsud Kok"]
[null,null,"2019-12-02","TRSP",43801.25,43801.614583333336,"Reinder","Koning",null,{"$f":"IF(C44=\"\",\"\",INDEX(Validatie!$Q$2:$Q$6,MATCH(MOD(E44,1),Validatie!$P$2:$P$6,1)))","v":"Vroeg"},{"$f":"IF(C44=\"\",\"\",IFERROR(VLOOKUP(D44,DataMijnAfdeling,2,0),\"?\"))","v":"?"},"Reinder Koning"]
[null,null,"2019-12-02","AFV MEP",43801.291666666664,43801.65625,"Rudolf","Hofman",null,{"$f":"IF(C45=\"\",\"\",INDEX(Validatie!$Q$2:$Q$6,MATCH(MOD(E45,1),Validatie!$P$2:$P$6,1)))","v":"Vroeg"},{"$f":"IF(C45=\"\",\"\",IFERROR(VLOOKUP(D45,DataMijnAfdeling,2,0),\"?\"))","v":"MEP"},"Rudolf Hofman"]
[null,null,"2019-12-02","PALL Rweg",43801.3125,43801.677083333336,"Hilko","Prins",null,{"$f":"IF(C46=\"\",\"\",INDEX(Validatie!$Q$2:$Q$6,MATCH(MOD(E46,1),Validatie!$P$2:$P$6,1)))","v":"Vroeg"},{"$f":"IF(C46=\"\",\"\",IFERROR(VLOOKUP(D46,DataMijnAfdeling,2,0),\"?\"))","v":"-"},"Hilko Prins"]
[null,null,"2019-12-02","TRSP",43801.333333333336,43801.697916666664,"Harrie","Hoekstra",null,{"$f":"IF(C47=\"\",\"\",INDEX(Validatie!$Q$2:$Q$6,MATCH(MOD(E47,1),Validatie!$P$2:$P$6,1)))","v":"Vroeg"},{"$f":"IF(C47=\"\",\"\",IFERROR(VLOOKUP(D47,DataMijnAfdeling,2,0),\"?\"))","v":"?"},"Harrie Hoekstra"]
[null,null,"2019-12-02","SCHM HAS",43801.40625,43801.614583333336,"Norbert","de Lange",null,{"$f":"IF(C48=\"\",\"\",INDEX(Validatie!$Q$2:$Q$6,MATCH(MOD(E48,1),Validatie!$P$2:$P$6,1)))","v":"Vroeg"},{"$f":"IF(C48=\"\",\"\",IFERROR(VLOOKUP(D48,DataMijnAfdeling,2,0),\"?\"))","v":"HAS"},"Norbert de Lange"]
[null,null,"2019-12-02","ABB middag",43801.572916666664,43801.9375,"Trienko","Spooren",null,{"$f":"IF(C49=\"\",\"\",INDEX(Validatie!$Q$2:$Q$6,MATCH(MOD(E49,1),Validatie!$P$2:$P$6,1)))","v":"Laat"},{"$f":"IF(C49=\"\",\"\",IFERROR(VLOOKUP(D49,DataMijnAfdeling,2,0),\"?\"))","v":"ABB"},"Trienko Spooren"]
[null,null,"2019-12-02","AFV HAS",43801.572916666664,43801.697916666664,"Paul","van Dongen",null,{"$f":"IF(C50=\"\",\"\",INDEX(Validatie!$Q$2:$Q$6,MATCH(MOD(E50,1),Validatie!$P$2:$P$6,1)))","v":"Laat"},{"$f":"IF(C50=\"\",\"\",IFERROR(VLOOKUP(D50,DataMijnAfdeling,2,0),\"?\"))","v":"HAS"},"Paul van Dongen"]
[null,null,"2019-12-02","AFV MEP",43801.572916666664,43801.9375,"Rijk","van Doorn",null,{"$f":"IF(C51=\"\",\"\",INDEX(Validatie!$Q$2:$Q$6,MATCH(MOD(E51,1),Validatie!$P$2:$P$6,1)))","v":"Laat"},{"$f":"IF(C51=\"\",\"\",IFERROR(VLOOKUP(D51,DataMijnAfdeling,2,0),\"?\"))","v":"MEP"},"Rijk van Doorn"]
[null,null,"2019-12-02","LCR middag",43801.572916666664,43801.9375,"Christiaan","de Wit",null,{"$f":"IF(C52=\"\",\"\",INDEX(Validatie!$Q$2:$Q$6,MATCH(MOD(E52,1),Validatie!$P$2:$P$6,1)))","v":"Laat"},{"$f":"IF(C52=\"\",\"\",IFERROR(VLOOKUP(D52,DataMijnAfdeling,2,0),\"?\"))","v":"LCR"},"Christiaan de Wit"]
[null,null,"2019-12-02","PALL MEP",43801.614583333336,43801.979166666664,"Wenaron","Kurkema",null,{"$f":"IF(C53=\"\",\"\",INDEX(Validatie!$Q$2:$Q$6,MATCH(MOD(E53,1),Validatie!$P$2:$P$6,1)))","v":"Laat"},{"$f":"IF(C53=\"\",\"\",IFERROR(VLOOKUP(D53,DataMijnAfdeling,2,0),\"?\"))","v":"-"},"Wenaron Kurkema"]
[null,null,"2019-12-02","PALL MEP",43801.614583333336,43801.979166666664,"Engin","Jacobs",null,{"$f":"IF(C54=\"\",\"\",INDEX(Validatie!$Q$2:$Q$6,MATCH(MOD(E54,1),Validatie!$P$2:$P$6,1)))","v":"Laat"},{"$f":"IF(C54=\"\",\"\",IFERROR(VLOOKUP(D54,DataMijnAfdeling,2,0),\"?\"))","v":"-"},"Engin Jacobs"]
[null,null,"2019-12-02","PALL MEP",43801.614583333336,43801.979166666664,"Salahadin","Wolters",null,{"$f":"IF(C55=\"\",\"\",INDEX(Validatie!$Q$2:$Q$6,MATCH(MOD(E55,1),Validatie!$P$2:$P$6,1)))","v":"Laat"},{"$f":"IF(C55=\"\",\"\",IFERROR(VLOOKUP(D55,DataMijnAfdeling,2,0),\"?\"))","v":"-"},"Salahadin Wolters"]
[null,null,"2019-12-02","PALL MEP",43801.614583333336,43801.979166666664,"Dikkie","van der Meer",null,{"$f":"IF(C56=\"\",\"\",INDEX(Validatie!$Q$2:$Q$6,MATCH(MOD(E56,1),Validatie!$P$2:$P$6,1)))","v":"Laat"},{"$f":"IF(C56=\"\",\"\",IFERROR(VLOOKUP(D56,DataMijnAfdeling,2,0),\"?\"))","v":"-"},"Dikkie van der Meer"]
[null,null,"2019-12-02","PALL MEP",43801.614583333336,43801.979166666664,"Rene","van der Velden",null,{"$f":"IF(C57=\"\",\"\",INDEX(Validatie!$Q$2:$Q$6,MATCH(MOD(E57,1),Validatie!$P$2:$P$6,1)))","v":"Laat"},{"$f":"IF(C57=\"\",\"\",IFERROR(VLOOKUP(D57,DataMijnAfdeling,2,0),\"?\"))","v":"-"},"Rene van der Velden"]
[null,null,"2019-12-02","PALL MEP",43801.614583333336,43801.979166666664,"Richard","Driessen",null,{"$f":"IF(C58=\"\",\"\",INDEX(Validatie!$Q$2:$Q$6,MATCH(MOD(E58,1),Validatie!$P$2:$P$6,1)))","v":"Laat"},{"$f":"IF(C58=\"\",\"\",IFERROR(VLOOKUP(D58,DataMijnAfdeling,2,0),\"?\"))","v":"-"},"Richard Driessen"]
[null,null,"2019-12-02","PALL Rweg",43801.614583333336,43801.979166666664,"Felicia","van den Broek",null,{"$f":"IF(C59=\"\",\"\",INDEX(Validatie!$Q$2:$Q$6,MATCH(MOD(E59,1),Validatie!$P$2:$P$6,1)))","v":"Laat"},{"$f":"IF(C59=\"\",\"\",IFERROR(VLOOKUP(D59,DataMijnAfdeling,2,0),\"?\"))","v":"-"},"Felicia van den Broek"]
[null,null,"2019-12-02","PALL Rweg",43801.614583333336,43801.979166666664,"Gerrit","van Beek",null,{"$f":"IF(C60=\"\",\"\",INDEX(Validatie!$Q$2:$Q$6,MATCH(MOD(E60,1),Validatie!$P$2:$P$6,1)))","v":"Laat"},{"$f":"IF(C60=\"\",\"\",IFERROR(VLOOKUP(D60,DataMijnAfdeling,2,0),\"?\"))","v":"-"},"Gerrit van Beek"]
[null,null,"2019-12-02","PALL Rweg",43801.614583333336,43801.979166666664,"Shawn","Molenaar",null,{"$f":"IF(C61=\"\",\"\",INDEX(Validatie!$Q$2:$Q$6,MATCH(MOD(E61,1),Validatie!$P$2:$P$6,1)))","v":"Laat"},{"$f":"IF(C61=\"\",\"\",IFERROR(VLOOKUP(D61,DataMijnAfdeling,2,0),\"?\"))","v":"-"},"Shawn Molenaar"]
[null,null,"2019-12-02","PALL Rweg",43801.614583333336,43801.979166666664,"Elroy","van der Linden",null,{"$f":"IF(C62=\"\",\"\",INDEX(Validatie!$Q$2:$Q$6,MATCH(MOD(E62,1),Validatie!$P$2:$P$6,1)))","v":"Laat"},{"$f":"IF(C62=\"\",\"\",IFERROR(VLOOKUP(D62,DataMijnAfdeling,2,0),\"?\"))","v":"-"},"Elroy van der Linden"]
[null,null,"2019-12-02","PALL Rweg",43801.614583333336,43801.979166666664,"Everon","van den Heuvel",null,{"$f":"IF(C63=\"\",\"\",INDEX(Validatie!$Q$2:$Q$6,MATCH(MOD(E63,1),Validatie!$P$2:$P$6,1)))","v":"Laat"},{"$f":"IF(C63=\"\",\"\",IFERROR(VLOOKUP(D63,DataMijnAfdeling,2,0),\"?\"))","v":"-"},"Everon van den Heuvel"]
[null,null,"2019-12-02","PALL Rweg",43801.614583333336,43801.979166666664,"Davood","Smits",null,{"$f":"IF(C64=\"\",\"\",INDEX(Validatie!$Q$2:$Q$6,MATCH(MOD(E64,1),Validatie!$P$2:$P$6,1)))","v":"Laat"},{"$f":"IF(C64=\"\",\"\",IFERROR(VLOOKUP(D64,DataMijnAfdeling,2,0),\"?\"))","v":"-"},"Davood Smits"]
[null,null,"2019-12-02","PALL Rweg",43801.614583333336,43801.979166666664,"Arsenio","Mulder",null,{"$f":"IF(C65=\"\",\"\",INDEX(Validatie!$Q$2:$Q$6,MATCH(MOD(E65,1),Validatie!$P$2:$P$6,1)))","v":"Laat"},{"$f":"IF(C65=\"\",\"\",IFERROR(VLOOKUP(D65,DataMijnAfdeling,2,0),\"?\"))","v":"-"},"Arsenio Mulder"]
[null,null,"2019-12-02","PALL Rweg",43801.614583333336,43801.979166666664,"Viorel","Triest",null,{"$f":"IF(C66=\"\",\"\",INDEX(Validatie!$Q$2:$Q$6,MATCH(MOD(E66,1),Validatie!$P$2:$P$6,1)))","v":"Laat"},{"$f":"IF(C66=\"\",\"\",IFERROR(VLOOKUP(D66,DataMijnAfdeling,2,0),\"?\"))","v":"-"},"Viorel Triest"]
[null,null,"2019-12-02","PALL Rweg",43801.614583333336,43801.979166666664,"Saidou","Bosman",null,{"$f":"IF(C67=\"\",\"\",INDEX(Validatie!$Q$2:$Q$6,MATCH(MOD(E67,1),Validatie!$P$2:$P$6,1)))","v":"Laat"},{"$f":"IF(C67=\"\",\"\",IFERROR(VLOOKUP(D67,DataMijnAfdeling,2,0),\"?\"))","v":"-"},"Saidou Bosman"]
[null,null,"2019-12-02","PALL Rweg",43801.614583333336,43801.979166666664,"Wim","Vogel",null,{"$f":"IF(C68=\"\",\"\",INDEX(Validatie!$Q$2:$Q$6,MATCH(MOD(E68,1),Validatie!$P$2:$P$6,1)))","v":"Laat"},{"$f":"IF(C68=\"\",\"\",IFERROR(VLOOKUP(D68,DataMijnAfdeling,2,0),\"?\"))","v":"-"},"Wim Vogel"]
[null,null,"2019-12-02","PALL Rweg",43801.614583333336,43801.979166666664,"Sebastiaan","Mol",null,{"$f":"IF(C69=\"\",\"\",INDEX(Validatie!$Q$2:$Q$6,MATCH(MOD(E69,1),Validatie!$P$2:$P$6,1)))","v":"Laat"},{"$f":"IF(C69=\"\",\"\",IFERROR(VLOOKUP(D69,DataMijnAfdeling,2,0),\"?\"))","v":"-"},"Sebastiaan Mol"]
[null,null,"2019-12-02","PALL Rweg",43801.614583333336,43801.979166666664,"Amadou","Bakker",null,{"$f":"IF(C70=\"\",\"\",INDEX(Validatie!$Q$2:$Q$6,MATCH(MOD(E70,1),Validatie!$P$2:$P$6,1)))","v":"Laat"},{"$f":"IF(C70=\"\",\"\",IFERROR(VLOOKUP(D70,DataMijnAfdeling,2,0),\"?\"))","v":"-"},"Amadou Bakker"]
[null,null,"2019-12-02","PALL Rweg",43801.614583333336,43801.979166666664,"Wout","Van Goud",null,{"$f":"IF(C71=\"\",\"\",INDEX(Validatie!$Q$2:$Q$6,MATCH(MOD(E71,1),Validatie!$P$2:$P$6,1)))","v":"Laat"},{"$f":"IF(C71=\"\",\"\",IFERROR(VLOOKUP(D71,DataMijnAfdeling,2,0),\"?\"))","v":"-"},{"$f":"IF(C71=\"\",\"\",CONCATENATE(G71,\" \",H71))","v":"Wout Van Goud"}]
[null,null,"2019-12-02","PALL Rweg",43801.614583333336,43801.979166666664,"Fars","van de Veen",null,{"$f":"IF(C72=\"\",\"\",INDEX(Validatie!$Q$2:$Q$6,MATCH(MOD(E72,1),Validatie!$P$2:$P$6,1)))","v":"Laat"},{"$f":"IF(C72=\"\",\"\",IFERROR(VLOOKUP(D72,DataMijnAfdeling,2,0),\"?\"))","v":"-"},"Fars van de Veen"]
[null,null,"2019-12-02","PALL Rweg",43801.614583333336,43801.979166666664,"Charles","Dekker",null,{"$f":"IF(C73=\"\",\"\",INDEX(Validatie!$Q$2:$Q$6,MATCH(MOD(E73,1),Validatie!$P$2:$P$6,1)))","v":"Laat"},{"$f":"IF(C73=\"\",\"\",IFERROR(VLOOKUP(D73,DataMijnAfdeling,2,0),\"?\"))","v":"-"},"Charles Dekker"]
[null,null,"2019-12-02","PALL Rweg",43801.614583333336,43801.979166666664,"Henk","Koster",null,{"$f":"IF(C74=\"\",\"\",INDEX(Validatie!$Q$2:$Q$6,MATCH(MOD(E74,1),Validatie!$P$2:$P$6,1)))","v":"Laat"},{"$f":"IF(C74=\"\",\"\",IFERROR(VLOOKUP(D74,DataMijnAfdeling,2,0),\"?\"))","v":"-"},"Henk Koster"]
[null,null,"2019-12-02","PALL Rweg",43801.614583333336,43801.979166666664,"Ko","van de Brink",null,{"$f":"IF(C75=\"\",\"\",INDEX(Validatie!$Q$2:$Q$6,MATCH(MOD(E75,1),Validatie!$P$2:$P$6,1)))","v":"Laat"},{"$f":"IF(C75=\"\",\"\",IFERROR(VLOOKUP(D75,DataMijnAfdeling,2,0),\"?\"))","v":"-"},"Ko van de Brink"]
[null,null,"2019-12-02","PALL Rweg",43801.614583333336,43801.979166666664,"Robin","Evers",null,{"$f":"IF(C76=\"\",\"\",INDEX(Validatie!$Q$2:$Q$6,MATCH(MOD(E76,1),Validatie!$P$2:$P$6,1)))","v":"Laat"},{"$f":"IF(C76=\"\",\"\",IFERROR(VLOOKUP(D76,DataMijnAfdeling,2,0),\"?\"))","v":"-"},"Robin Evers"]
[null,null,"2019-12-02","SCHM",43801.614583333336,43801.979166666664,"Marjolein","Martens",null,{"$f":"IF(C77=\"\",\"\",INDEX(Validatie!$Q$2:$Q$6,MATCH(MOD(E77,1),Validatie!$P$2:$P$6,1)))","v":"Laat"},{"$f":"IF(C77=\"\",\"\",IFERROR(VLOOKUP(D77,DataMijnAfdeling,2,0),\"?\"))","v":"SCHM"},"Marjolein Martens"]
[null,null,"2019-12-02","SCHM",43801.614583333336,43801.979166666664,"Roy","van der Meulen",null,{"$f":"IF(C78=\"\",\"\",INDEX(Validatie!$Q$2:$Q$6,MATCH(MOD(E78,1),Validatie!$P$2:$P$6,1)))","v":"Laat"},{"$f":"IF(C78=\"\",\"\",IFERROR(VLOOKUP(D78,DataMijnAfdeling,2,0),\"?\"))","v":"SCHM"},"Roy van der Meulen"]
[null,null,"2019-12-02","SCHM",43801.614583333336,43801.979166666664,"Piet","Schipper",null,{"$f":"IF(C79=\"\",\"\",INDEX(Validatie!$Q$2:$Q$6,MATCH(MOD(E79,1),Validatie!$P$2:$P$6,1)))","v":"Laat"},{"$f":"IF(C79=\"\",\"\",IFERROR(VLOOKUP(D79,DataMijnAfdeling,2,0),\"?\"))","v":"SCHM"},"Piet Schipper"]
[null,null,"2019-12-02","SCHM AFV",43801.614583333336,43801.979166666664,"Jan","de Jonge",null,{"$f":"IF(C80=\"\",\"\",INDEX(Validatie!$Q$2:$Q$6,MATCH(MOD(E80,1),Validatie!$P$2:$P$6,1)))","v":"Laat"},{"$f":"IF(C80=\"\",\"\",IFERROR(VLOOKUP(D80,DataMijnAfdeling,2,0),\"?\"))","v":"AFV"},"Jan de Jonge"]
[null,null,"2019-12-02","SCHM AFV",43801.614583333336,43801.979166666664,"Boyan","van Leeuwen",null,{"$f":"IF(C81=\"\",\"\",INDEX(Validatie!$Q$2:$Q$6,MATCH(MOD(E81,1),Validatie!$P$2:$P$6,1)))","v":"Laat"},{"$f":"IF(C81=\"\",\"\",IFERROR(VLOOKUP(D81,DataMijnAfdeling,2,0),\"?\"))","v":"AFV"},"Boyan van Leeuwen"]
[null,null,"2019-12-02","SCHM AFV",43801.614583333336,43801.979166666664,"Sami","van der Horst",null,{"$f":"IF(C82=\"\",\"\",INDEX(Validatie!$Q$2:$Q$6,MATCH(MOD(E82,1),Validatie!$P$2:$P$6,1)))","v":"Laat"},{"$f":"IF(C82=\"\",\"\",IFERROR(VLOOKUP(D82,DataMijnAfdeling,2,0),\"?\"))","v":"AFV"},"Sami van der Horst"]
[null,null,"2019-12-02","SCHM AFV",43801.614583333336,43801.979166666664,"Henri","van Dam",null,{"$f":"IF(C83=\"\",\"\",INDEX(Validatie!$Q$2:$Q$6,MATCH(MOD(E83,1),Validatie!$P$2:$P$6,1)))","v":"Laat"},{"$f":"IF(C83=\"\",\"\",IFERROR(VLOOKUP(D83,DataMijnAfdeling,2,0),\"?\"))","v":"AFV"},"Henri van Dam"]
[null,null,"2019-12-02","SCHM AFV",43801.614583333336,43801.979166666664,"Michel","Jonker",null,{"$f":"IF(C84=\"\",\"\",INDEX(Validatie!$Q$2:$Q$6,MATCH(MOD(E84,1),Validatie!$P$2:$P$6,1)))","v":"Laat"},{"$f":"IF(C84=\"\",\"\",IFERROR(VLOOKUP(D84,DataMijnAfdeling,2,0),\"?\"))","v":"AFV"},"Michel Jonker"]
[null,null,"2019-12-02","TRSP",43801.614583333336,43801.979166666664,"Henk","Koster",null,{"$f":"IF(C85=\"\",\"\",INDEX(Validatie!$Q$2:$Q$6,MATCH(MOD(E85,1),Validatie!$P$2:$P$6,1)))","v":"Laat"},{"$f":"IF(C85=\"\",\"\",IFERROR(VLOOKUP(D85,DataMijnAfdeling,2,0),\"?\"))","v":"?"},"Henk Koster"]
[null,null,"2019-12-02","PALL Rweg",43801.645833333336,43801.979166666664,"Amanuel","Janssen",null,{"$f":"IF(C86=\"\",\"\",INDEX(Validatie!$Q$2:$Q$6,MATCH(MOD(E86,1),Validatie!$P$2:$P$6,1)))","v":"Laat"},{"$f":"IF(C86=\"\",\"\",IFERROR(VLOOKUP(D86,DataMijnAfdeling,2,0),\"?\"))","v":"-"},"Amanuel Janssen"]
[null,null,"2019-12-02","SCHM HAS",43801.697916666664,43801.9375,"Paul","van Dongen",null,{"$f":"IF(C87=\"\",\"\",INDEX(Validatie!$Q$2:$Q$6,MATCH(MOD(E87,1),Validatie!$P$2:$P$6,1)))","v":"Laat"},{"$f":"IF(C87=\"\",\"\",IFERROR(VLOOKUP(D87,DataMijnAfdeling,2,0),\"?\"))","v":"HAS"},"Paul van Dongen"]
[null,null,"2019-12-02","PALL Rweg",43801.708333333336,43801.979166666664,"Merhawi","Groen",null,{"$f":"IF(C88=\"\",\"\",INDEX(Validatie!$Q$2:$Q$6,MATCH(MOD(E88,1),Validatie!$P$2:$P$6,1)))","v":"Laat"},{"$f":"IF(C88=\"\",\"\",IFERROR(VLOOKUP(D88,DataMijnAfdeling,2,0),\"?\"))","v":"-"},"Merhawi Groen"]
[null,null,"2019-12-02","SCHM",43801.916666666664,43802.28125,"Patrick","Bosch",null,{"$f":"IF(C89=\"\",\"\",INDEX(Validatie!$Q$2:$Q$6,MATCH(MOD(E89,1),Validatie!$P$2:$P$6,1)))","v":"Nacht"},{"$f":"IF(C89=\"\",\"\",IFERROR(VLOOKUP(D89,DataMijnAfdeling,2,0),\"?\"))","v":"SCHM"},"Patrick Bosch"]
[null,null,"2019-12-02","SCHM",43801.916666666664,43802.28125,"Rolinka","van den Bosch",null,{"$f":"IF(C90=\"\",\"\",INDEX(Validatie!$Q$2:$Q$6,MATCH(MOD(E90,1),Validatie!$P$2:$P$6,1)))","v":"Nacht"},{"$f":"IF(C90=\"\",\"\",IFERROR(VLOOKUP(D90,DataMijnAfdeling,2,0),\"?\"))","v":"SCHM"},"Rolinka van den Bosch"]
[null,null,"2019-12-02","SCHM",43801.916666666664,43802.28125,"Erik","de Haan",null,{"$f":"IF(C91=\"\",\"\",INDEX(Validatie!$Q$2:$Q$6,MATCH(MOD(E91,1),Validatie!$P$2:$P$6,1)))","v":"Nacht"},{"$f":"IF(C91=\"\",\"\",IFERROR(VLOOKUP(D91,DataMijnAfdeling,2,0),\"?\"))","v":"SCHM"},"Erik de Haan"]
[null,null,"2019-12-03","ABB ochtend ",43802.25,43802.614583333336,"Flavi","van der Heyden",null,{"$f":"IF(C92=\"\",\"\",INDEX(Validatie!$Q$2:$Q$6,MATCH(MOD(E92,1),Validatie!$P$2:$P$6,1)))","v":"Vroeg"},{"$f":"IF(C92=\"\",\"\",IFERROR(VLOOKUP(D92,DataMijnAfdeling,2,0),\"?\"))","v":"ABB"},"Flavi van der Heyden"]
[null,null,"2019-12-03","AFV HAS",43802.25,43802.40625,"Norbert","de Lange",null,{"$f":"IF(C93=\"\",\"\",INDEX(Validatie!$Q$2:$Q$6,MATCH(MOD(E93,1),Validatie!$P$2:$P$6,1)))","v":"Vroeg"},{"$f":"IF(C93=\"\",\"\",IFERROR(VLOOKUP(D93,DataMijnAfdeling,2,0),\"?\"))","v":"HAS"},"Norbert de Lange"]
[null,null,"2019-12-03","AFV MEP",43802.25,43802.614583333336,"Houcin","Huisman",null,{"$f":"IF(C94=\"\",\"\",INDEX(Validatie!$Q$2:$Q$6,MATCH(MOD(E94,1),Validatie!$P$2:$P$6,1)))","v":"Vroeg"},{"$f":"IF(C94=\"\",\"\",IFERROR(VLOOKUP(D94,DataMijnAfdeling,2,0),\"?\"))","v":"MEP"},"Houcin Huisman"]
[null,null,"2019-12-03","LCR ochtend",43802.25,43802.614583333336,"Wolter","De bolder",null,{"$f":"IF(C95=\"\",\"\",INDEX(Validatie!$Q$2:$Q$6,MATCH(MOD(E95,1),Validatie!$P$2:$P$6,1)))","v":"Vroeg"},{"$f":"IF(C95=\"\",\"\",IFERROR(VLOOKUP(D95,DataMijnAfdeling,2,0),\"?\"))","v":"LCR"},"Wolter De bolder"]
[null,null,"2019-12-03","PALL HAS",43802.25,43802.614583333336,"Henk","Koster",null,{"$f":"IF(C96=\"\",\"\",INDEX(Validatie!$Q$2:$Q$6,MATCH(MOD(E96,1),Validatie!$P$2:$P$6,1)))","v":"Vroeg"},{"$f":"IF(C96=\"\",\"\",IFERROR(VLOOKUP(D96,DataMijnAfdeling,2,0),\"?\"))","v":"-"},"Henk Koster"]
[null,null,"2019-12-03","PALL MEP",43802.25,43802.614583333336,"Latie","van Wijk",null,{"$f":"IF(C97=\"\",\"\",INDEX(Validatie!$Q$2:$Q$6,MATCH(MOD(E97,1),Validatie!$P$2:$P$6,1)))","v":"Vroeg"},{"$f":"IF(C97=\"\",\"\",IFERROR(VLOOKUP(D97,DataMijnAfdeling,2,0),\"?\"))","v":"-"},"Latie van Wijk"]
[null,null,"2019-12-03","PALL MEP",43802.25,43802.614583333336,"Michael","Gerritsen",null,{"$f":"IF(C98=\"\",\"\",INDEX(Validatie!$Q$2:$Q$6,MATCH(MOD(E98,1),Validatie!$P$2:$P$6,1)))","v":"Vroeg"},{"$f":"IF(C98=\"\",\"\",IFERROR(VLOOKUP(D98,DataMijnAfdeling,2,0),\"?\"))","v":"-"},"Michael Gerritsen"]
[null,null,"2019-12-03","PALL MEP",43802.25,43802.614583333336,"Abdurahman Ibrahim","de Vries",null,{"$f":"IF(C99=\"\",\"\",INDEX(Validatie!$Q$2:$Q$6,MATCH(MOD(E99,1),Validatie!$P$2:$P$6,1)))","v":"Vroeg"},{"$f":"IF(C99=\"\",\"\",IFERROR(VLOOKUP(D99,DataMijnAfdeling,2,0),\"?\"))","v":"-"},"Abdurahman Ibrahim de Vries"]
[null,null,"2019-12-03","PALL MEP",43802.25,43802.614583333336,"Hans","van de Ven ",null,{"$f":"IF(C100=\"\",\"\",INDEX(Validatie!$Q$2:$Q$6,MATCH(MOD(E100,1),Validatie!$P$2:$P$6,1)))","v":"Vroeg"},{"$f":"IF(C100=\"\",\"\",IFERROR(VLOOKUP(D100,DataMijnAfdeling,2,0),\"?\"))","v":"-"},"Hans van de Ven "]
[null,null,"2019-12-03","PALL MEP",43802.25,43802.614583333336,"Jeroen","Post",null,{"$f":"IF(C101=\"\",\"\",INDEX(Validatie!$Q$2:$Q$6,MATCH(MOD(E101,1),Validatie!$P$2:$P$6,1)))","v":"Vroeg"},{"$f":"IF(C101=\"\",\"\",IFERROR(VLOOKUP(D101,DataMijnAfdeling,2,0),\"?\"))","v":"-"},"Jeroen Post"]
[null,null,"2019-12-03","PALL Rweg",43802.25,43802.614583333336,"Akela","van Dijk",null,{"$f":"IF(C102=\"\",\"\",INDEX(Validatie!$Q$2:$Q$6,MATCH(MOD(E102,1),Validatie!$P$2:$P$6,1)))","v":"Vroeg"},{"$f":"IF(C102=\"\",\"\",IFERROR(VLOOKUP(D102,DataMijnAfdeling,2,0),\"?\"))","v":"-"},"Akela van Dijk"]
[null,null,"2019-12-03","PALL Rweg",43802.25,43802.614583333336,"Karrar","Kuiper",null,{"$f":"IF(C103=\"\",\"\",INDEX(Validatie!$Q$2:$Q$6,MATCH(MOD(E103,1),Validatie!$P$2:$P$6,1)))","v":"Vroeg"},{"$f":"IF(C103=\"\",\"\",IFERROR(VLOOKUP(D103,DataMijnAfdeling,2,0),\"?\"))","v":"-"},"Karrar Kuiper"]
[null,null,"2019-12-03","PALL Rweg",43802.25,43802.614583333336,"Harry","Maas",null,{"$f":"IF(C104=\"\",\"\",INDEX(Validatie!$Q$2:$Q$6,MATCH(MOD(E104,1),Validatie!$P$2:$P$6,1)))","v":"Vroeg"},{"$f":"IF(C104=\"\",\"\",IFERROR(VLOOKUP(D104,DataMijnAfdeling,2,0),\"?\"))","v":"-"},"Harry Maas"]
[null,null,"2019-12-03","PALL Rweg",43802.25,43802.614583333336,"Apollonia","Meijer",null,{"$f":"IF(C105=\"\",\"\",INDEX(Validatie!$Q$2:$Q$6,MATCH(MOD(E105,1),Validatie!$P$2:$P$6,1)))","v":"Vroeg"},{"$f":"IF(C105=\"\",\"\",IFERROR(VLOOKUP(D105,DataMijnAfdeling,2,0),\"?\"))","v":"-"},"Apollonia Meijer"]
[null,null,"2019-12-03","PALL Rweg",43802.25,43802.614583333336,"Naoufel","van de Velde ",null,{"$f":"IF(C106=\"\",\"\",INDEX(Validatie!$Q$2:$Q$6,MATCH(MOD(E106,1),Validatie!$P$2:$P$6,1)))","v":"Vroeg"},{"$f":"IF(C106=\"\",\"\",IFERROR(VLOOKUP(D106,DataMijnAfdeling,2,0),\"?\"))","v":"-"},"Naoufel van de Velde "]
[null,null,"2019-12-03","PALL Rweg",43802.25,43802.614583333336,"Dennis","de Graaf",null,{"$f":"IF(C107=\"\",\"\",INDEX(Validatie!$Q$2:$Q$6,MATCH(MOD(E107,1),Validatie!$P$2:$P$6,1)))","v":"Vroeg"},{"$f":"IF(C107=\"\",\"\",IFERROR(VLOOKUP(D107,DataMijnAfdeling,2,0),\"?\"))","v":"-"},"Dennis de Graaf"]
[null,null,"2019-12-03","PALL Rweg",43802.25,43802.614583333336,"Agathe","van de Berg ",null,{"$f":"IF(C108=\"\",\"\",INDEX(Validatie!$Q$2:$Q$6,MATCH(MOD(E108,1),Validatie!$P$2:$P$6,1)))","v":"Vroeg"},{"$f":"IF(C108=\"\",\"\",IFERROR(VLOOKUP(D108,DataMijnAfdeling,2,0),\"?\"))","v":"-"},"Agathe van de Berg "]
[null,null,"2019-12-03","PALL Rweg",43802.25,43802.614583333336,"Heruy","van de Wal ",null,{"$f":"IF(C109=\"\",\"\",INDEX(Validatie!$Q$2:$Q$6,MATCH(MOD(E109,1),Validatie!$P$2:$P$6,1)))","v":"Vroeg"},{"$f":"IF(C109=\"\",\"\",IFERROR(VLOOKUP(D109,DataMijnAfdeling,2,0),\"?\"))","v":"-"},"Heruy van de Wal "]
[null,null,"2019-12-03","PALL Rweg",43802.25,43802.614583333336,"Hassan","Verhoeven",null,{"$f":"IF(C110=\"\",\"\",INDEX(Validatie!$Q$2:$Q$6,MATCH(MOD(E110,1),Validatie!$P$2:$P$6,1)))","v":"Vroeg"},{"$f":"IF(C110=\"\",\"\",IFERROR(VLOOKUP(D110,DataMijnAfdeling,2,0),\"?\"))","v":"-"},"Hassan Verhoeven"]
[null,null,"2019-12-03","PALL Rweg",43802.25,43802.614583333336,"Samantha","Sanders",null,{"$f":"IF(C111=\"\",\"\",INDEX(Validatie!$Q$2:$Q$6,MATCH(MOD(E111,1),Validatie!$P$2:$P$6,1)))","v":"Vroeg"},{"$f":"IF(C111=\"\",\"\",IFERROR(VLOOKUP(D111,DataMijnAfdeling,2,0),\"?\"))","v":"-"},"Samantha Sanders"]
[null,null,"2019-12-03","PALL Rweg",43802.25,43802.614583333336,"Jarek","Kuipers",null,{"$f":"IF(C112=\"\",\"\",INDEX(Validatie!$Q$2:$Q$6,MATCH(MOD(E112,1),Validatie!$P$2:$P$6,1)))","v":"Vroeg"},{"$f":"IF(C112=\"\",\"\",IFERROR(VLOOKUP(D112,DataMijnAfdeling,2,0),\"?\"))","v":"-"},"Jarek Kuipers"]
[null,null,"2019-12-03","PALL Rweg",43802.25,43802.614583333336,"Martijn","de Ruiter",null,{"$f":"IF(C113=\"\",\"\",INDEX(Validatie!$Q$2:$Q$6,MATCH(MOD(E113,1),Validatie!$P$2:$P$6,1)))","v":"Vroeg"},{"$f":"IF(C113=\"\",\"\",IFERROR(VLOOKUP(D113,DataMijnAfdeling,2,0),\"?\"))","v":"-"},"Martijn de Ruiter"]
[null,null,"2019-12-03","PALL Rweg",43802.25,43802.614583333336,"Mark","Vink",null,{"$f":"IF(C114=\"\",\"\",INDEX(Validatie!$Q$2:$Q$6,MATCH(MOD(E114,1),Validatie!$P$2:$P$6,1)))","v":"Vroeg"},{"$f":"IF(C114=\"\",\"\",IFERROR(VLOOKUP(D114,DataMijnAfdeling,2,0),\"?\"))","v":"-"},"Mark Vink"]
[null,null,"2019-12-03","PALL Rweg",43802.25,43802.614583333336,"Laszlo","Scholten",null,{"$f":"IF(C115=\"\",\"\",INDEX(Validatie!$Q$2:$Q$6,MATCH(MOD(E115,1),Validatie!$P$2:$P$6,1)))","v":"Vroeg"},{"$f":"IF(C115=\"\",\"\",IFERROR(VLOOKUP(D115,DataMijnAfdeling,2,0),\"?\"))","v":"-"},"Laszlo Scholten"]
[null,null,"2019-12-03","PALL Rweg",43802.25,43802.614583333336,"Abdiqadir","de Jong",null,{"$f":"IF(C116=\"\",\"\",INDEX(Validatie!$Q$2:$Q$6,MATCH(MOD(E116,1),Validatie!$P$2:$P$6,1)))","v":"Vroeg"},{"$f":"IF(C116=\"\",\"\",IFERROR(VLOOKUP(D116,DataMijnAfdeling,2,0),\"?\"))","v":"-"},"Abdiqadir de Jong"]
[null,null,"2019-12-03","PALL Rweg",43802.25,43802.614583333336,"Atobhran","de Groot",null,{"$f":"IF(C117=\"\",\"\",INDEX(Validatie!$Q$2:$Q$6,MATCH(MOD(E117,1),Validatie!$P$2:$P$6,1)))","v":"Vroeg"},{"$f":"IF(C117=\"\",\"\",IFERROR(VLOOKUP(D117,DataMijnAfdeling,2,0),\"?\"))","v":"-"},"Atobhran de Groot"]
[null,null,"2019-12-03","PALL Rweg",43802.25,43802.614583333336,"Nexhmedi","Willemsen",null,{"$f":"IF(C118=\"\",\"\",INDEX(Validatie!$Q$2:$Q$6,MATCH(MOD(E118,1),Validatie!$P$2:$P$6,1)))","v":"Vroeg"},{"$f":"IF(C118=\"\",\"\",IFERROR(VLOOKUP(D118,DataMijnAfdeling,2,0),\"?\"))","v":"-"},"Nexhmedi Willemsen"]
[null,null,"2019-12-03","PALL Rweg",43802.25,43802.614583333336,"Chevindio","Brouwer",null,{"$f":"IF(C119=\"\",\"\",INDEX(Validatie!$Q$2:$Q$6,MATCH(MOD(E119,1),Validatie!$P$2:$P$6,1)))","v":"Vroeg"},{"$f":"IF(C119=\"\",\"\",IFERROR(VLOOKUP(D119,DataMijnAfdeling,2,0),\"?\"))","v":"-"},"Chevindio Brouwer"]
[null,null,"2019-12-03","PALL Rweg",43802.25,43802.614583333336,"Sied"," van der Pol",null,{"$f":"IF(C120=\"\",\"\",INDEX(Validatie!$Q$2:$Q$6,MATCH(MOD(E120,1),Validatie!$P$2:$P$6,1)))","v":"Vroeg"},{"$f":"IF(C120=\"\",\"\",IFERROR(VLOOKUP(D120,DataMijnAfdeling,2,0),\"?\"))","v":"-"},"Sied  van der Pol"]
[null,null,"2019-12-03","SCHM",43802.25,43802.614583333336,"Rachid","van der Laan",null,{"$f":"IF(C121=\"\",\"\",INDEX(Validatie!$Q$2:$Q$6,MATCH(MOD(E121,1),Validatie!$P$2:$P$6,1)))","v":"Vroeg"},{"$f":"IF(C121=\"\",\"\",IFERROR(VLOOKUP(D121,DataMijnAfdeling,2,0),\"?\"))","v":"SCHM"},"Rachid van der Laan"]
[null,null,"2019-12-03","SCHM",43802.25,43802.614583333336,"Evans","Vermeulen",null,{"$f":"IF(C122=\"\",\"\",INDEX(Validatie!$Q$2:$Q$6,MATCH(MOD(E122,1),Validatie!$P$2:$P$6,1)))","v":"Vroeg"},{"$f":"IF(C122=\"\",\"\",IFERROR(VLOOKUP(D122,DataMijnAfdeling,2,0),\"?\"))","v":"SCHM"},"Evans Vermeulen"]
[null,null,"2019-12-03","SCHM",43802.25,43802.614583333336,"Kevin","Veenstra",null,{"$f":"IF(C123=\"\",\"\",INDEX(Validatie!$Q$2:$Q$6,MATCH(MOD(E123,1),Validatie!$P$2:$P$6,1)))","v":"Vroeg"},{"$f":"IF(C123=\"\",\"\",IFERROR(VLOOKUP(D123,DataMijnAfdeling,2,0),\"?\"))","v":"SCHM"},"Kevin Veenstra"]
[null,null,"2019-12-03","SCHM AFV",43802.25,43802.614583333336,"Baki","Bos",null,{"$f":"IF(C124=\"\",\"\",INDEX(Validatie!$Q$2:$Q$6,MATCH(MOD(E124,1),Validatie!$P$2:$P$6,1)))","v":"Vroeg"},{"$f":"IF(C124=\"\",\"\",IFERROR(VLOOKUP(D124,DataMijnAfdeling,2,0),\"?\"))","v":"AFV"},"Baki Bos"]
[null,null,"2019-12-03","SCHM AFV",43802.25,43802.614583333336,"Ilker","Peeters",null,{"$f":"IF(C125=\"\",\"\",INDEX(Validatie!$Q$2:$Q$6,MATCH(MOD(E125,1),Validatie!$P$2:$P$6,1)))","v":"Vroeg"},{"$f":"IF(C125=\"\",\"\",IFERROR(VLOOKUP(D125,DataMijnAfdeling,2,0),\"?\"))","v":"AFV"},"Ilker Peeters"]
[null,null,"2019-12-03","SCHM AFV",43802.25,43802.614583333336,"Miquel","van Loon",null,{"$f":"IF(C126=\"\",\"\",INDEX(Validatie!$Q$2:$Q$6,MATCH(MOD(E126,1),Validatie!$P$2:$P$6,1)))","v":"Vroeg"},{"$f":"IF(C126=\"\",\"\",IFERROR(VLOOKUP(D126,DataMijnAfdeling,2,0),\"?\"))","v":"AFV"},"Miquel van Loon"]
[null,null,"2019-12-03","SCHM AFV",43802.25,43802.614583333336,"Klaas","Kramer",null,{"$f":"IF(C127=\"\",\"\",INDEX(Validatie!$Q$2:$Q$6,MATCH(MOD(E127,1),Validatie!$P$2:$P$6,1)))","v":"Vroeg"},{"$f":"IF(C127=\"\",\"\",IFERROR(VLOOKUP(D127,DataMijnAfdeling,2,0),\"?\"))","v":"AFV"},"Klaas Kramer"]
[null,null,"2019-12-03","SCHM AFV",43802.25,43802.614583333336,"Sebastiaan","Mol",null,{"$f":"IF(C128=\"\",\"\",INDEX(Validatie!$Q$2:$Q$6,MATCH(MOD(E128,1),Validatie!$P$2:$P$6,1)))","v":"Vroeg"},{"$f":"IF(C128=\"\",\"\",IFERROR(VLOOKUP(D128,DataMijnAfdeling,2,0),\"?\"))","v":"AFV"},"Sebastiaan Mol"]
[null,null,"2019-12-03","TRSP",43802.25,43802.614583333336,"Emsud","Kok",null,{"$f":"IF(C129=\"\",\"\",INDEX(Validatie!$Q$2:$Q$6,MATCH(MOD(E129,1),Validatie!$P$2:$P$6,1)))","v":"Vroeg"},{"$f":"IF(C129=\"\",\"\",IFERROR(VLOOKUP(D129,DataMijnAfdeling,2,0),\"?\"))","v":"?"},"Emsud Kok"]
[null,null,"2019-12-03","TRSP",43802.25,43802.614583333336,"Reinder","Koning",null,{"$f":"IF(C130=\"\",\"\",INDEX(Validatie!$Q$2:$Q$6,MATCH(MOD(E130,1),Validatie!$P$2:$P$6,1)))","v":"Vroeg"},{"$f":"IF(C130=\"\",\"\",IFERROR(VLOOKUP(D130,DataMijnAfdeling,2,0),\"?\"))","v":"?"},"Reinder Koning"]
[null,null,"2019-12-03","AFV MEP",43802.291666666664,43802.65625,"Rudolf","Hofman",null,{"$f":"IF(C131=\"\",\"\",INDEX(Validatie!$Q$2:$Q$6,MATCH(MOD(E131,1),Validatie!$P$2:$P$6,1)))","v":"Vroeg"},{"$f":"IF(C131=\"\",\"\",IFERROR(VLOOKUP(D131,DataMijnAfdeling,2,0),\"?\"))","v":"MEP"},"Rudolf Hofman"]
[null,null,"2019-12-03","PALL Rweg",43802.3125,43802.677083333336,"Hilko","Prins",null,{"$f":"IF(C132=\"\",\"\",INDEX(Validatie!$Q$2:$Q$6,MATCH(MOD(E132,1),Validatie!$P$2:$P$6,1)))","v":"Vroeg"},{"$f":"IF(C132=\"\",\"\",IFERROR(VLOOKUP(D132,DataMijnAfdeling,2,0),\"?\"))","v":"-"},"Hilko Prins"]
[null,null,"2019-12-03","TRSP",43802.333333333336,43802.697916666664,"Harrie","Hoekstra",null,{"$f":"IF(C133=\"\",\"\",INDEX(Validatie!$Q$2:$Q$6,MATCH(MOD(E133,1),Validatie!$P$2:$P$6,1)))","v":"Vroeg"},{"$f":"IF(C133=\"\",\"\",IFERROR(VLOOKUP(D133,DataMijnAfdeling,2,0),\"?\"))","v":"?"},"Harrie Hoekstra"]
[null,null,"2019-12-03","SCHM HAS",43802.40625,43802.614583333336,"Norbert","de Lange",null,{"$f":"IF(C134=\"\",\"\",INDEX(Validatie!$Q$2:$Q$6,MATCH(MOD(E134,1),Validatie!$P$2:$P$6,1)))","v":"Vroeg"},{"$f":"IF(C134=\"\",\"\",IFERROR(VLOOKUP(D134,DataMijnAfdeling,2,0),\"?\"))","v":"HAS"},"Norbert de Lange"]
[null,null,"2019-12-03","ABB middag",43802.572916666664,43802.9375,"Trienko","Spooren",null,{"$f":"IF(C135=\"\",\"\",INDEX(Validatie!$Q$2:$Q$6,MATCH(MOD(E135,1),Validatie!$P$2:$P$6,1)))","v":"Laat"},{"$f":"IF(C135=\"\",\"\",IFERROR(VLOOKUP(D135,DataMijnAfdeling,2,0),\"?\"))","v":"ABB"},{"$f":"IF(C135=\"\",\"\",CONCATENATE(G135,\" \",H135))","v":"Trienko Spooren"}]
[null,null,"2019-12-03","AFV HAS",43802.572916666664,43802.697916666664,"Paul","van Dongen",null,{"$f":"IF(C136=\"\",\"\",INDEX(Validatie!$Q$2:$Q$6,MATCH(MOD(E136,1),Validatie!$P$2:$P$6,1)))","v":"Laat"},{"$f":"IF(C136=\"\",\"\",IFERROR(VLOOKUP(D136,DataMijnAfdeling,2,0),\"?\"))","v":"HAS"},"Paul van Dongen"]
[null,null,"2019-12-03","AFV MEP",43802.572916666664,43802.9375,"Rijk","van Doorn",null,{"$f":"IF(C137=\"\",\"\",INDEX(Validatie!$Q$2:$Q$6,MATCH(MOD(E137,1),Validatie!$P$2:$P$6,1)))","v":"Laat"},{"$f":"IF(C137=\"\",\"\",IFERROR(VLOOKUP(D137,DataMijnAfdeling,2,0),\"?\"))","v":"MEP"},"Rijk van Doorn"]
[null,null,"2019-12-03","LCR middag",43802.572916666664,43802.9375,"Christiaan","de Wit",null,{"$f":"IF(C138=\"\",\"\",INDEX(Validatie!$Q$2:$Q$6,MATCH(MOD(E138,1),Validatie!$P$2:$P$6,1)))","v":"Laat"},{"$f":"IF(C138=\"\",\"\",IFERROR(VLOOKUP(D138,DataMijnAfdeling,2,0),\"?\"))","v":"LCR"},"Christiaan de Wit"]
[null,null,"2019-12-03","PALL MEP",43802.614583333336,43802.979166666664,"Wenaron","Kurkema",null,{"$f":"IF(C139=\"\",\"\",INDEX(Validatie!$Q$2:$Q$6,MATCH(MOD(E139,1),Validatie!$P$2:$P$6,1)))","v":"Laat"},{"$f":"IF(C139=\"\",\"\",IFERROR(VLOOKUP(D139,DataMijnAfdeling,2,0),\"?\"))","v":"-"},"Wenaron Kurkema"]
[null,null,"2019-12-03","PALL MEP",43802.614583333336,43802.979166666664,"Engin","Jacobs",null,{"$f":"IF(C140=\"\",\"\",INDEX(Validatie!$Q$2:$Q$6,MATCH(MOD(E140,1),Validatie!$P$2:$P$6,1)))","v":"Laat"},{"$f":"IF(C140=\"\",\"\",IFERROR(VLOOKUP(D140,DataMijnAfdeling,2,0),\"?\"))","v":"-"},"Engin Jacobs"]
[null,null,"2019-12-03","PALL MEP",43802.614583333336,43802.979166666664,"Salahadin","Wolters",null,{"$f":"IF(C141=\"\",\"\",INDEX(Validatie!$Q$2:$Q$6,MATCH(MOD(E141,1),Validatie!$P$2:$P$6,1)))","v":"Laat"},{"$f":"IF(C141=\"\",\"\",IFERROR(VLOOKUP(D141,DataMijnAfdeling,2,0),\"?\"))","v":"-"},"Salahadin Wolters"]
[null,null,"2019-12-03","PALL MEP",43802.614583333336,43802.979166666664,"Dikkie","van der Meer",null,{"$f":"IF(C142=\"\",\"\",INDEX(Validatie!$Q$2:$Q$6,MATCH(MOD(E142,1),Validatie!$P$2:$P$6,1)))","v":"Laat"},{"$f":"IF(C142=\"\",\"\",IFERROR(VLOOKUP(D142,DataMijnAfdeling,2,0),\"?\"))","v":"-"},"Dikkie van der Meer"]
[null,null,"2019-12-03","PALL MEP",43802.614583333336,43802.979166666664,"Rene","van der Velden",null,{"$f":"IF(C143=\"\",\"\",INDEX(Validatie!$Q$2:$Q$6,MATCH(MOD(E143,1),Validatie!$P$2:$P$6,1)))","v":"Laat"},{"$f":"IF(C143=\"\",\"\",IFERROR(VLOOKUP(D143,DataMijnAfdeling,2,0),\"?\"))","v":"-"},"Rene van der Velden"]
[null,null,"2019-12-03","PALL MEP",43802.614583333336,43802.979166666664,"Richard","Driessen",null,{"$f":"IF(C144=\"\",\"\",INDEX(Validatie!$Q$2:$Q$6,MATCH(MOD(E144,1),Validatie!$P$2:$P$6,1)))","v":"Laat"},{"$f":"IF(C144=\"\",\"\",IFERROR(VLOOKUP(D144,DataMijnAfdeling,2,0),\"?\"))","v":"-"},"Richard Driessen"]
[null,null,"2019-12-03","PALL Rweg",43802.614583333336,43802.979166666664,"Merhawi","Groen",null,{"$f":"IF(C145=\"\",\"\",INDEX(Validatie!$Q$2:$Q$6,MATCH(MOD(E145,1),Validatie!$P$2:$P$6,1)))","v":"Laat"},{"$f":"IF(C145=\"\",\"\",IFERROR(VLOOKUP(D145,DataMijnAfdeling,2,0),\"?\"))","v":"-"},"Merhawi Groen"]
[null,null,"2019-12-03","PALL Rweg",43802.614583333336,43802.979166666664,"Gerrit","van Beek",null,{"$f":"IF(C146=\"\",\"\",INDEX(Validatie!$Q$2:$Q$6,MATCH(MOD(E146,1),Validatie!$P$2:$P$6,1)))","v":"Laat"},{"$f":"IF(C146=\"\",\"\",IFERROR(VLOOKUP(D146,DataMijnAfdeling,2,0),\"?\"))","v":"-"},"Gerrit van Beek"]
[null,null,"2019-12-03","PALL Rweg",43802.614583333336,43802.979166666664,"Shawn","Molenaar",null,{"$f":"IF(C147=\"\",\"\",INDEX(Validatie!$Q$2:$Q$6,MATCH(MOD(E147,1),Validatie!$P$2:$P$6,1)))","v":"Laat"},{"$f":"IF(C147=\"\",\"\",IFERROR(VLOOKUP(D147,DataMijnAfdeling,2,0),\"?\"))","v":"-"},"Shawn Molenaar"]
[null,null,"2019-12-03","PALL Rweg",43802.614583333336,43802.979166666664,"Elroy","van der Linden",null,{"$f":"IF(C148=\"\",\"\",INDEX(Validatie!$Q$2:$Q$6,MATCH(MOD(E148,1),Validatie!$P$2:$P$6,1)))","v":"Laat"},{"$f":"IF(C148=\"\",\"\",IFERROR(VLOOKUP(D148,DataMijnAfdeling,2,0),\"?\"))","v":"-"},"Elroy van der Linden"]
[null,null,"2019-12-03","PALL Rweg",43802.614583333336,43802.979166666664,"Everon","van den Heuvel",null,{"$f":"IF(C149=\"\",\"\",INDEX(Validatie!$Q$2:$Q$6,MATCH(MOD(E149,1),Validatie!$P$2:$P$6,1)))","v":"Laat"},{"$f":"IF(C149=\"\",\"\",IFERROR(VLOOKUP(D149,DataMijnAfdeling,2,0),\"?\"))","v":"-"},"Everon van den Heuvel"]
[null,null,"2019-12-03","PALL Rweg",43802.614583333336,43802.979166666664,"Davood","Smits",null,{"$f":"IF(C150=\"\",\"\",INDEX(Validatie!$Q$2:$Q$6,MATCH(MOD(E150,1),Validatie!$P$2:$P$6,1)))","v":"Laat"},{"$f":"IF(C150=\"\",\"\",IFERROR(VLOOKUP(D150,DataMijnAfdeling,2,0),\"?\"))","v":"-"},"Davood Smits"]
[null,null,"2019-12-03","PALL Rweg",43802.614583333336,43802.979166666664,"Arsenio","Mulder",null,{"$f":"IF(C151=\"\",\"\",INDEX(Validatie!$Q$2:$Q$6,MATCH(MOD(E151,1),Validatie!$P$2:$P$6,1)))","v":"Laat"},{"$f":"IF(C151=\"\",\"\",IFERROR(VLOOKUP(D151,DataMijnAfdeling,2,0),\"?\"))","v":"-"},"Arsenio Mulder"]
[null,null,"2019-12-03","PALL Rweg",43802.614583333336,43802.979166666664,"Viorel","Triest",null,{"$f":"IF(C152=\"\",\"\",INDEX(Validatie!$Q$2:$Q$6,MATCH(MOD(E152,1),Validatie!$P$2:$P$6,1)))","v":"Laat"},{"$f":"IF(C152=\"\",\"\",IFERROR(VLOOKUP(D152,DataMijnAfdeling,2,0),\"?\"))","v":"-"},"Viorel Triest"]
[null,null,"2019-12-03","PALL Rweg",43802.614583333336,43802.979166666664,"Saidou","Bosman",null,{"$f":"IF(C153=\"\",\"\",INDEX(Validatie!$Q$2:$Q$6,MATCH(MOD(E153,1),Validatie!$P$2:$P$6,1)))","v":"Laat"},{"$f":"IF(C153=\"\",\"\",IFERROR(VLOOKUP(D153,DataMijnAfdeling,2,0),\"?\"))","v":"-"},"Saidou Bosman"]
[null,null,"2019-12-03","PALL Rweg",43802.614583333336,43802.979166666664,"Wim","Vogel",null,{"$f":"IF(C154=\"\",\"\",INDEX(Validatie!$Q$2:$Q$6,MATCH(MOD(E154,1),Validatie!$P$2:$P$6,1)))","v":"Laat"},{"$f":"IF(C154=\"\",\"\",IFERROR(VLOOKUP(D154,DataMijnAfdeling,2,0),\"?\"))","v":"-"},"Wim Vogel"]
[null,null,"2019-12-03","PALL Rweg",43802.614583333336,43802.979166666664,"Sebastiaan","Mol",null,{"$f":"IF(C155=\"\",\"\",INDEX(Validatie!$Q$2:$Q$6,MATCH(MOD(E155,1),Validatie!$P$2:$P$6,1)))","v":"Laat"},{"$f":"IF(C155=\"\",\"\",IFERROR(VLOOKUP(D155,DataMijnAfdeling,2,0),\"?\"))","v":"-"},"Sebastiaan Mol"]
[null,null,"2019-12-03","PALL Rweg",43802.614583333336,43802.979166666664,"Amadou","Bakker",null,{"$f":"IF(C156=\"\",\"\",INDEX(Validatie!$Q$2:$Q$6,MATCH(MOD(E156,1),Validatie!$P$2:$P$6,1)))","v":"Laat"},{"$f":"IF(C156=\"\",\"\",IFERROR(VLOOKUP(D156,DataMijnAfdeling,2,0),\"?\"))","v":"-"},"Amadou Bakker"]
[null,null,"2019-12-03","PALL Rweg",43802.614583333336,43802.979166666664,"Quincy","de Koning",null,{"$f":"IF(C157=\"\",\"\",INDEX(Validatie!$Q$2:$Q$6,MATCH(MOD(E157,1),Validatie!$P$2:$P$6,1)))","v":"Laat"},{"$f":"IF(C157=\"\",\"\",IFERROR(VLOOKUP(D157,DataMijnAfdeling,2,0),\"?\"))","v":"-"},"Quincy de Koning"]
[null,null,"2019-12-03","PALL Rweg",43802.614583333336,43802.979166666664,"Wout","Van Goud",null,{"$f":"IF(C158=\"\",\"\",INDEX(Validatie!$Q$2:$Q$6,MATCH(MOD(E158,1),Validatie!$P$2:$P$6,1)))","v":"Laat"},{"$f":"IF(C158=\"\",\"\",IFERROR(VLOOKUP(D158,DataMijnAfdeling,2,0),\"?\"))","v":"-"},"Wout Van Goud"]
[null,null,"2019-12-03","PALL Rweg",43802.614583333336,43802.979166666664,"Fetehawi","de Bruyn",null,{"$f":"IF(C159=\"\",\"\",INDEX(Validatie!$Q$2:$Q$6,MATCH(MOD(E159,1),Validatie!$P$2:$P$6,1)))","v":"Laat"},{"$f":"IF(C159=\"\",\"\",IFERROR(VLOOKUP(D159,DataMijnAfdeling,2,0),\"?\"))","v":"-"},"Fetehawi de Bruyn"]
[null,null,"2019-12-03","PALL Rweg",43802.614583333336,43802.979166666664,"Charles","Dekker",null,{"$f":"IF(C160=\"\",\"\",INDEX(Validatie!$Q$2:$Q$6,MATCH(MOD(E160,1),Validatie!$P$2:$P$6,1)))","v":"Laat"},{"$f":"IF(C160=\"\",\"\",IFERROR(VLOOKUP(D160,DataMijnAfdeling,2,0),\"?\"))","v":"-"},"Charles Dekker"]
[null,null,"2019-12-03","PALL Rweg",43802.614583333336,43802.979166666664,"Henk","Koster",null,{"$f":"IF(C161=\"\",\"\",INDEX(Validatie!$Q$2:$Q$6,MATCH(MOD(E161,1),Validatie!$P$2:$P$6,1)))","v":"Laat"},{"$f":"IF(C161=\"\",\"\",IFERROR(VLOOKUP(D161,DataMijnAfdeling,2,0),\"?\"))","v":"-"},"Henk Koster"]
[null,null,"2019-12-03","PALL Rweg",43802.614583333336,43802.979166666664,"Ko","van de Brink",null,{"$f":"IF(C162=\"\",\"\",INDEX(Validatie!$Q$2:$Q$6,MATCH(MOD(E162,1),Validatie!$P$2:$P$6,1)))","v":"Laat"},{"$f":"IF(C162=\"\",\"\",IFERROR(VLOOKUP(D162,DataMijnAfdeling,2,0),\"?\"))","v":"-"},"Ko van de Brink"]
[null,null,"2019-12-03","PALL Rweg",43802.614583333336,43802.979166666664,"Robin","Evers",null,{"$f":"IF(C163=\"\",\"\",INDEX(Validatie!$Q$2:$Q$6,MATCH(MOD(E163,1),Validatie!$P$2:$P$6,1)))","v":"Laat"},{"$f":"IF(C163=\"\",\"\",IFERROR(VLOOKUP(D163,DataMijnAfdeling,2,0),\"?\"))","v":"-"},"Robin Evers"]
[null,null,"2019-12-03","PALL Rweg",43802.614583333336,43802.979166666664,"Olcay","de Vos",null,{"$f":"IF(C164=\"\",\"\",INDEX(Validatie!$Q$2:$Q$6,MATCH(MOD(E164,1),Validatie!$P$2:$P$6,1)))","v":"Laat"},{"$f":"IF(C164=\"\",\"\",IFERROR(VLOOKUP(D164,DataMijnAfdeling,2,0),\"?\"))","v":"-"},"Olcay de Vos"]
[null,null,"2019-12-03","SCHM",43802.614583333336,43802.979166666664,"Marjolein","Martens",null,{"$f":"IF(C165=\"\",\"\",INDEX(Validatie!$Q$2:$Q$6,MATCH(MOD(E165,1),Validatie!$P$2:$P$6,1)))","v":"Laat"},{"$f":"IF(C165=\"\",\"\",IFERROR(VLOOKUP(D165,DataMijnAfdeling,2,0),\"?\"))","v":"SCHM"},"Marjolein Martens"]
[null,null,"2019-12-03","SCHM",43802.614583333336,43802.979166666664,"Roy","van der Meulen",null,{"$f":"IF(C166=\"\",\"\",INDEX(Validatie!$Q$2:$Q$6,MATCH(MOD(E166,1),Validatie!$P$2:$P$6,1)))","v":"Laat"},{"$f":"IF(C166=\"\",\"\",IFERROR(VLOOKUP(D166,DataMijnAfdeling,2,0),\"?\"))","v":"SCHM"},"Roy van der Meulen"]
[null,null,"2019-12-03","SCHM",43802.614583333336,43802.979166666664,"Piet","Schipper",null,{"$f":"IF(C167=\"\",\"\",INDEX(Validatie!$Q$2:$Q$6,MATCH(MOD(E167,1),Validatie!$P$2:$P$6,1)))","v":"Laat"},{"$f":"IF(C167=\"\",\"\",IFERROR(VLOOKUP(D167,DataMijnAfdeling,2,0),\"?\"))","v":"SCHM"},"Piet Schipper"]
[null,null,"2019-12-03","SCHM AFV",43802.614583333336,43802.979166666664,"Jan","de Jonge",null,{"$f":"IF(C168=\"\",\"\",INDEX(Validatie!$Q$2:$Q$6,MATCH(MOD(E168,1),Validatie!$P$2:$P$6,1)))","v":"Laat"},{"$f":"IF(C168=\"\",\"\",IFERROR(VLOOKUP(D168,DataMijnAfdeling,2,0),\"?\"))","v":"AFV"},"Jan de Jonge"]
[null,null,"2019-12-03","SCHM AFV",43802.614583333336,43802.979166666664,"Boyan","van Leeuwen",null,{"$f":"IF(C169=\"\",\"\",INDEX(Validatie!$Q$2:$Q$6,MATCH(MOD(E169,1),Validatie!$P$2:$P$6,1)))","v":"Laat"},{"$f":"IF(C169=\"\",\"\",IFERROR(VLOOKUP(D169,DataMijnAfdeling,2,0),\"?\"))","v":"AFV"},"Boyan van Leeuwen"]
[null,null,"2019-12-03","SCHM AFV",43802.614583333336,43802.979166666664,"Sami","van der Horst",null,{"$f":"IF(C170=\"\",\"\",INDEX(Validatie!$Q$2:$Q$6,MATCH(MOD(E170,1),Validatie!$P$2:$P$6,1)))","v":"Laat"},{"$f":"IF(C170=\"\",\"\",IFERROR(VLOOKUP(D170,DataMijnAfdeling,2,0),\"?\"))","v":"AFV"},"Sami van der Horst"]
[null,null,"2019-12-03","SCHM AFV",43802.614583333336,43802.979166666664,"Henri","van Dam",null,{"$f":"IF(C171=\"\",\"\",INDEX(Validatie!$Q$2:$Q$6,MATCH(MOD(E171,1),Validatie!$P$2:$P$6,1)))","v":"Laat"},{"$f":"IF(C171=\"\",\"\",IFERROR(VLOOKUP(D171,DataMijnAfdeling,2,0),\"?\"))","v":"AFV"},"Henri van Dam"]
[null,null,"2019-12-03","SCHM AFV",43802.614583333336,43802.979166666664,"Michel","Jonker",null,{"$f":"IF(C172=\"\",\"\",INDEX(Validatie!$Q$2:$Q$6,MATCH(MOD(E172,1),Validatie!$P$2:$P$6,1)))","v":"Laat"},{"$f":"IF(C172=\"\",\"\",IFERROR(VLOOKUP(D172,DataMijnAfdeling,2,0),\"?\"))","v":"AFV"},"Michel Jonker"]
[null,null,"2019-12-03","TRSP",43802.614583333336,43802.979166666664,"Henk","Koster",null,{"$f":"IF(C173=\"\",\"\",INDEX(Validatie!$Q$2:$Q$6,MATCH(MOD(E173,1),Validatie!$P$2:$P$6,1)))","v":"Laat"},{"$f":"IF(C173=\"\",\"\",IFERROR(VLOOKUP(D173,DataMijnAfdeling,2,0),\"?\"))","v":"?"},"Henk Koster"]
[null,null,"2019-12-03","TRSP",43802.614583333336,43802.979166666664,"Anton","Smit",null,{"$f":"IF(C174=\"\",\"\",INDEX(Validatie!$Q$2:$Q$6,MATCH(MOD(E174,1),Validatie!$P$2:$P$6,1)))","v":"Laat"},{"$f":"IF(C174=\"\",\"\",IFERROR(VLOOKUP(D174,DataMijnAfdeling,2,0),\"?\"))","v":"?"},"Anton Smit"]
[null,null,"2019-12-03","PALL Rweg",43802.645833333336,43802.979166666664,"Amanuel","Janssen",null,{"$f":"IF(C175=\"\",\"\",INDEX(Validatie!$Q$2:$Q$6,MATCH(MOD(E175,1),Validatie!$P$2:$P$6,1)))","v":"Laat"},{"$f":"IF(C175=\"\",\"\",IFERROR(VLOOKUP(D175,DataMijnAfdeling,2,0),\"?\"))","v":"-"},"Amanuel Janssen"]
[null,null,"2019-12-03","PALL Rweg",43802.645833333336,43802.979166666664,"Yemane","Masout",null,{"$f":"IF(C176=\"\",\"\",INDEX(Validatie!$Q$2:$Q$6,MATCH(MOD(E176,1),Validatie!$P$2:$P$6,1)))","v":"Laat"},{"$f":"IF(C176=\"\",\"\",IFERROR(VLOOKUP(D176,DataMijnAfdeling,2,0),\"?\"))","v":"-"},"Yemane Masout"]
[null,null,"2019-12-03","PALL Rweg",43802.666666666664,43802.979166666664,"Hishelu","Blom",null,{"$f":"IF(C177=\"\",\"\",INDEX(Validatie!$Q$2:$Q$6,MATCH(MOD(E177,1),Validatie!$P$2:$P$6,1)))","v":"Laat"},{"$f":"IF(C177=\"\",\"\",IFERROR(VLOOKUP(D177,DataMijnAfdeling,2,0),\"?\"))","v":"-"},"Hishelu Blom"]
[null,null,"2019-12-03","SCHM HAS",43802.697916666664,43802.9375,"Paul","van Dongen",null,{"$f":"IF(C178=\"\",\"\",INDEX(Validatie!$Q$2:$Q$6,MATCH(MOD(E178,1),Validatie!$P$2:$P$6,1)))","v":"Laat"},{"$f":"IF(C178=\"\",\"\",IFERROR(VLOOKUP(D178,DataMijnAfdeling,2,0),\"?\"))","v":"HAS"},"Paul van Dongen"]
[null,null,"2019-12-03","SCHM",43802.916666666664,43803.28125,"Patrick","Bosch",null,{"$f":"IF(C179=\"\",\"\",INDEX(Validatie!$Q$2:$Q$6,MATCH(MOD(E179,1),Validatie!$P$2:$P$6,1)))","v":"Nacht"},{"$f":"IF(C179=\"\",\"\",IFERROR(VLOOKUP(D179,DataMijnAfdeling,2,0),\"?\"))","v":"SCHM"},"Patrick Bosch"]
[null,null,"2019-12-03","SCHM",43802.916666666664,43803.28125,"Rolinka","van den Bosch",null,{"$f":"IF(C180=\"\",\"\",INDEX(Validatie!$Q$2:$Q$6,MATCH(MOD(E180,1),Validatie!$P$2:$P$6,1)))","v":"Nacht"},{"$f":"IF(C180=\"\",\"\",IFERROR(VLOOKUP(D180,DataMijnAfdeling,2,0),\"?\"))","v":"SCHM"},"Rolinka van den Bosch"]
[null,null,"2019-12-03","SCHM",43802.916666666664,43803.28125,"Erik","de Haan",null,{"$f":"IF(C181=\"\",\"\",INDEX(Validatie!$Q$2:$Q$6,MATCH(MOD(E181,1),Validatie!$P$2:$P$6,1)))","v":"Nacht"},{"$f":"IF(C181=\"\",\"\",IFERROR(VLOOKUP(D181,DataMijnAfdeling,2,0),\"?\"))","v":"SCHM"},"Erik de Haan"]
[null,null,"2019-12-04","ABB ochtend ",43803.25,43803.614583333336,"Flavi","van der Heyden",null,{"$f":"IF(C182=\"\",\"\",INDEX(Validatie!$Q$2:$Q$6,MATCH(MOD(E182,1),Validatie!$P$2:$P$6,1)))","v":"Vroeg"},{"$f":"IF(C182=\"\",\"\",IFERROR(VLOOKUP(D182,DataMijnAfdeling,2,0),\"?\"))","v":"ABB"},"Flavi van der Heyden"]
[null,null,"2019-12-04","AFV HAS",43803.25,43803.40625,"Norbert","de Lange",null,{"$f":"IF(C183=\"\",\"\",INDEX(Validatie!$Q$2:$Q$6,MATCH(MOD(E183,1),Validatie!$P$2:$P$6,1)))","v":"Vroeg"},{"$f":"IF(C183=\"\",\"\",IFERROR(VLOOKUP(D183,DataMijnAfdeling,2,0),\"?\"))","v":"HAS"},"Norbert de Lange"]
[null,null,"2019-12-04","AFV MEP",43803.25,43803.614583333336,"Houcin","Huisman",null,{"$f":"IF(C184=\"\",\"\",INDEX(Validatie!$Q$2:$Q$6,MATCH(MOD(E184,1),Validatie!$P$2:$P$6,1)))","v":"Vroeg"},{"$f":"IF(C184=\"\",\"\",IFERROR(VLOOKUP(D184,DataMijnAfdeling,2,0),\"?\"))","v":"MEP"},"Houcin Huisman"]
[null,null,"2019-12-04","LCR ochtend",43803.25,43803.614583333336,"Wolter","De bolder",null,{"$f":"IF(C185=\"\",\"\",INDEX(Validatie!$Q$2:$Q$6,MATCH(MOD(E185,1),Validatie!$P$2:$P$6,1)))","v":"Vroeg"},{"$f":"IF(C185=\"\",\"\",IFERROR(VLOOKUP(D185,DataMijnAfdeling,2,0),\"?\"))","v":"LCR"},"Wolter De bolder"]
[null,null,"2019-12-04","PALL HAS",43803.25,43803.614583333336,"Henk","Koster",null,{"$f":"IF(C186=\"\",\"\",INDEX(Validatie!$Q$2:$Q$6,MATCH(MOD(E186,1),Validatie!$P$2:$P$6,1)))","v":"Vroeg"},{"$f":"IF(C186=\"\",\"\",IFERROR(VLOOKUP(D186,DataMijnAfdeling,2,0),\"?\"))","v":"-"},"Henk Koster"]
[null,null,"2019-12-04","PALL MEP",43803.25,43803.614583333336,"Latie","van Wijk",null,{"$f":"IF(C187=\"\",\"\",INDEX(Validatie!$Q$2:$Q$6,MATCH(MOD(E187,1),Validatie!$P$2:$P$6,1)))","v":"Vroeg"},{"$f":"IF(C187=\"\",\"\",IFERROR(VLOOKUP(D187,DataMijnAfdeling,2,0),\"?\"))","v":"-"},"Latie van Wijk"]
[null,null,"2019-12-04","PALL MEP",43803.25,43803.614583333336,"Michael","Gerritsen",null,{"$f":"IF(C188=\"\",\"\",INDEX(Validatie!$Q$2:$Q$6,MATCH(MOD(E188,1),Validatie!$P$2:$P$6,1)))","v":"Vroeg"},{"$f":"IF(C188=\"\",\"\",IFERROR(VLOOKUP(D188,DataMijnAfdeling,2,0),\"?\"))","v":"-"},"Michael Gerritsen"]
[null,null,"2019-12-04","PALL MEP",43803.25,43803.614583333336,"Abdurahman Ibrahim","de Vries",null,{"$f":"IF(C189=\"\",\"\",INDEX(Validatie!$Q$2:$Q$6,MATCH(MOD(E189,1),Validatie!$P$2:$P$6,1)))","v":"Vroeg"},{"$f":"IF(C189=\"\",\"\",IFERROR(VLOOKUP(D189,DataMijnAfdeling,2,0),\"?\"))","v":"-"},"Abdurahman Ibrahim de Vries"]
[null,null,"2019-12-04","PALL MEP",43803.25,43803.614583333336,"Hans","van de Ven ",null,{"$f":"IF(C190=\"\",\"\",INDEX(Validatie!$Q$2:$Q$6,MATCH(MOD(E190,1),Validatie!$P$2:$P$6,1)))","v":"Vroeg"},{"$f":"IF(C190=\"\",\"\",IFERROR(VLOOKUP(D190,DataMijnAfdeling,2,0),\"?\"))","v":"-"},"Hans van de Ven "]
[null,null,"2019-12-04","PALL MEP",43803.25,43803.614583333336,"Jeroen","Post",null,{"$f":"IF(C191=\"\",\"\",INDEX(Validatie!$Q$2:$Q$6,MATCH(MOD(E191,1),Validatie!$P$2:$P$6,1)))","v":"Vroeg"},{"$f":"IF(C191=\"\",\"\",IFERROR(VLOOKUP(D191,DataMijnAfdeling,2,0),\"?\"))","v":"-"},"Jeroen Post"]
[null,null,"2019-12-04","PALL Rweg",43803.25,43803.614583333336,"Akela","van Dijk",null,{"$f":"IF(C192=\"\",\"\",INDEX(Validatie!$Q$2:$Q$6,MATCH(MOD(E192,1),Validatie!$P$2:$P$6,1)))","v":"Vroeg"},{"$f":"IF(C192=\"\",\"\",IFERROR(VLOOKUP(D192,DataMijnAfdeling,2,0),\"?\"))","v":"-"},"Akela van Dijk"]
[null,null,"2019-12-04","PALL Rweg",43803.25,43803.614583333336,"Karrar","Kuiper",null,{"$f":"IF(C193=\"\",\"\",INDEX(Validatie!$Q$2:$Q$6,MATCH(MOD(E193,1),Validatie!$P$2:$P$6,1)))","v":"Vroeg"},{"$f":"IF(C193=\"\",\"\",IFERROR(VLOOKUP(D193,DataMijnAfdeling,2,0),\"?\"))","v":"-"},"Karrar Kuiper"]
[null,null,"2019-12-04","PALL Rweg",43803.25,43803.614583333336,"Sebastian","Kuijpers",null,{"$f":"IF(C194=\"\",\"\",INDEX(Validatie!$Q$2:$Q$6,MATCH(MOD(E194,1),Validatie!$P$2:$P$6,1)))","v":"Vroeg"},{"$f":"IF(C194=\"\",\"\",IFERROR(VLOOKUP(D194,DataMijnAfdeling,2,0),\"?\"))","v":"-"},"Sebastian Kuijpers"]
[null,null,"2019-12-04","PALL Rweg",43803.25,43803.614583333336,"Abdul","Jansen",null,{"$f":"IF(C195=\"\",\"\",INDEX(Validatie!$Q$2:$Q$6,MATCH(MOD(E195,1),Validatie!$P$2:$P$6,1)))","v":"Vroeg"},{"$f":"IF(C195=\"\",\"\",IFERROR(VLOOKUP(D195,DataMijnAfdeling,2,0),\"?\"))","v":"-"},"Abdul Jansen"]
[null,null,"2019-12-04","PALL Rweg",43803.25,43803.614583333336,"Harry","Maas",null,{"$f":"IF(C196=\"\",\"\",INDEX(Validatie!$Q$2:$Q$6,MATCH(MOD(E196,1),Validatie!$P$2:$P$6,1)))","v":"Vroeg"},{"$f":"IF(C196=\"\",\"\",IFERROR(VLOOKUP(D196,DataMijnAfdeling,2,0),\"?\"))","v":"-"},"Harry Maas"]
[null,null,"2019-12-04","PALL Rweg",43803.25,43803.614583333336,"Naoufel","van de Velde ",null,{"$f":"IF(C197=\"\",\"\",INDEX(Validatie!$Q$2:$Q$6,MATCH(MOD(E197,1),Validatie!$P$2:$P$6,1)))","v":"Vroeg"},{"$f":"IF(C197=\"\",\"\",IFERROR(VLOOKUP(D197,DataMijnAfdeling,2,0),\"?\"))","v":"-"},"Naoufel van de Velde "]
[null,null,"2019-12-04","PALL Rweg",43803.25,43803.614583333336,"Dennis","de Graaf",null,{"$f":"IF(C198=\"\",\"\",INDEX(Validatie!$Q$2:$Q$6,MATCH(MOD(E198,1),Validatie!$P$2:$P$6,1)))","v":"Vroeg"},{"$f":"IF(C198=\"\",\"\",IFERROR(VLOOKUP(D198,DataMijnAfdeling,2,0),\"?\"))","v":"-"},"Dennis de Graaf"]
[null,null,"2019-12-04","PALL Rweg",43803.25,43803.614583333336,"Jelte","van Veen",null,{"$f":"IF(C199=\"\",\"\",INDEX(Validatie!$Q$2:$Q$6,MATCH(MOD(E199,1),Validatie!$P$2:$P$6,1)))","v":"Vroeg"},{"$f":"IF(C199=\"\",\"\",IFERROR(VLOOKUP(D199,DataMijnAfdeling,2,0),\"?\"))","v":"-"},{"$f":"IF(C199=\"\",\"\",CONCATENATE(G199,\" \",H199))","v":"Jelte van Veen"}]
[null,null,"2019-12-04","PALL Rweg",43803.25,43803.614583333336,"Agathe","van de Berg ",null,{"$f":"IF(C200=\"\",\"\",INDEX(Validatie!$Q$2:$Q$6,MATCH(MOD(E200,1),Validatie!$P$2:$P$6,1)))","v":"Vroeg"},{"$f":"IF(C200=\"\",\"\",IFERROR(VLOOKUP(D200,DataMijnAfdeling,2,0),\"?\"))","v":"-"},"Agathe van de Berg "]
[null,null,"2019-12-04","PALL Rweg",43803.25,43803.614583333336,"Heruy","van de Wal ",null,{"$f":"IF(C201=\"\",\"\",INDEX(Validatie!$Q$2:$Q$6,MATCH(MOD(E201,1),Validatie!$P$2:$P$6,1)))","v":"Vroeg"},{"$f":"IF(C201=\"\",\"\",IFERROR(VLOOKUP(D201,DataMijnAfdeling,2,0),\"?\"))","v":"-"},"Heruy van de Wal "]
[null,null,"2019-12-04","PALL Rweg",43803.25,43803.614583333336,"Hassan","Verhoeven",null,{"$f":"IF(C202=\"\",\"\",INDEX(Validatie!$Q$2:$Q$6,MATCH(MOD(E202,1),Validatie!$P$2:$P$6,1)))","v":"Vroeg"},{"$f":"IF(C202=\"\",\"\",IFERROR(VLOOKUP(D202,DataMijnAfdeling,2,0),\"?\"))","v":"-"},"Hassan Verhoeven"]
[null,null,"2019-12-04","PALL Rweg",43803.25,43803.614583333336,"Samantha","Sanders",null,{"$f":"IF(C203=\"\",\"\",INDEX(Validatie!$Q$2:$Q$6,MATCH(MOD(E203,1),Validatie!$P$2:$P$6,1)))","v":"Vroeg"},{"$f":"IF(C203=\"\",\"\",IFERROR(VLOOKUP(D203,DataMijnAfdeling,2,0),\"?\"))","v":"-"},"Samantha Sanders"]
[null,null,"2019-12-04","PALL Rweg",43803.25,43803.614583333336,"Sied"," van der Pol",null,{"$f":"IF(C204=\"\",\"\",INDEX(Validatie!$Q$2:$Q$6,MATCH(MOD(E204,1),Validatie!$P$2:$P$6,1)))","v":"Vroeg"},{"$f":"IF(C204=\"\",\"\",IFERROR(VLOOKUP(D204,DataMijnAfdeling,2,0),\"?\"))","v":"-"},"Sied  van der Pol"]
[null,null,"2019-12-04","PALL Rweg",43803.25,43803.614583333336,"Jarek","Kuipers",null,{"$f":"IF(C205=\"\",\"\",INDEX(Validatie!$Q$2:$Q$6,MATCH(MOD(E205,1),Validatie!$P$2:$P$6,1)))","v":"Vroeg"},{"$f":"IF(C205=\"\",\"\",IFERROR(VLOOKUP(D205,DataMijnAfdeling,2,0),\"?\"))","v":"-"},"Jarek Kuipers"]
[null,null,"2019-12-04","PALL Rweg",43803.25,43803.614583333336,"Martijn","de Ruiter",null,{"$f":"IF(C206=\"\",\"\",INDEX(Validatie!$Q$2:$Q$6,MATCH(MOD(E206,1),Validatie!$P$2:$P$6,1)))","v":"Vroeg"},{"$f":"IF(C206=\"\",\"\",IFERROR(VLOOKUP(D206,DataMijnAfdeling,2,0),\"?\"))","v":"-"},"Martijn de Ruiter"]
[null,null,"2019-12-04","PALL Rweg",43803.25,43803.614583333336,"Mark","Vink",null,{"$f":"IF(C207=\"\",\"\",INDEX(Validatie!$Q$2:$Q$6,MATCH(MOD(E207,1),Validatie!$P$2:$P$6,1)))","v":"Vroeg"},{"$f":"IF(C207=\"\",\"\",IFERROR(VLOOKUP(D207,DataMijnAfdeling,2,0),\"?\"))","v":"-"},"Mark Vink"]
[null,null,"2019-12-04","PALL Rweg",43803.25,43803.614583333336,"Abdiqadir","de Jong",null,{"$f":"IF(C208=\"\",\"\",INDEX(Validatie!$Q$2:$Q$6,MATCH(MOD(E208,1),Validatie!$P$2:$P$6,1)))","v":"Vroeg"},{"$f":"IF(C208=\"\",\"\",IFERROR(VLOOKUP(D208,DataMijnAfdeling,2,0),\"?\"))","v":"-"},"Abdiqadir de Jong"]
[null,null,"2019-12-04","PALL Rweg",43803.25,43803.614583333336,"Mebrathu","Timmermans",null,{"$f":"IF(C209=\"\",\"\",INDEX(Validatie!$Q$2:$Q$6,MATCH(MOD(E209,1),Validatie!$P$2:$P$6,1)))","v":"Vroeg"},{"$f":"IF(C209=\"\",\"\",IFERROR(VLOOKUP(D209,DataMijnAfdeling,2,0),\"?\"))","v":"-"},"Mebrathu Timmermans"]
[null,null,"2019-12-04","PALL Rweg",43803.25,43803.614583333336,"Nexhmedi","Willemsen",null,{"$f":"IF(C210=\"\",\"\",INDEX(Validatie!$Q$2:$Q$6,MATCH(MOD(E210,1),Validatie!$P$2:$P$6,1)))","v":"Vroeg"},{"$f":"IF(C210=\"\",\"\",IFERROR(VLOOKUP(D210,DataMijnAfdeling,2,0),\"?\"))","v":"-"},"Nexhmedi Willemsen"]
[null,null,"2019-12-04","SCHM",43803.25,43803.614583333336,"Rachid","van der Laan",null,{"$f":"IF(C211=\"\",\"\",INDEX(Validatie!$Q$2:$Q$6,MATCH(MOD(E211,1),Validatie!$P$2:$P$6,1)))","v":"Vroeg"},{"$f":"IF(C211=\"\",\"\",IFERROR(VLOOKUP(D211,DataMijnAfdeling,2,0),\"?\"))","v":"SCHM"},"Rachid van der Laan"]
[null,null,"2019-12-04","SCHM",43803.25,43803.614583333336,"Evans","Vermeulen",null,{"$f":"IF(C212=\"\",\"\",INDEX(Validatie!$Q$2:$Q$6,MATCH(MOD(E212,1),Validatie!$P$2:$P$6,1)))","v":"Vroeg"},{"$f":"IF(C212=\"\",\"\",IFERROR(VLOOKUP(D212,DataMijnAfdeling,2,0),\"?\"))","v":"SCHM"},"Evans Vermeulen"]
[null,null,"2019-12-04","SCHM",43803.25,43803.614583333336,"Kevin","Veenstra",null,{"$f":"IF(C213=\"\",\"\",INDEX(Validatie!$Q$2:$Q$6,MATCH(MOD(E213,1),Validatie!$P$2:$P$6,1)))","v":"Vroeg"},{"$f":"IF(C213=\"\",\"\",IFERROR(VLOOKUP(D213,DataMijnAfdeling,2,0),\"?\"))","v":"SCHM"},"Kevin Veenstra"]
[null,null,"2019-12-04","SCHM AFV",43803.25,43803.614583333336,"Baki","Bos",null,{"$f":"IF(C214=\"\",\"\",INDEX(Validatie!$Q$2:$Q$6,MATCH(MOD(E214,1),Validatie!$P$2:$P$6,1)))","v":"Vroeg"},{"$f":"IF(C214=\"\",\"\",IFERROR(VLOOKUP(D214,DataMijnAfdeling,2,0),\"?\"))","v":"AFV"},"Baki Bos"]
[null,null,"2019-12-04","SCHM AFV",43803.25,43803.614583333336,"Ilker","Peeters",null,{"$f":"IF(C215=\"\",\"\",INDEX(Validatie!$Q$2:$Q$6,MATCH(MOD(E215,1),Validatie!$P$2:$P$6,1)))","v":"Vroeg"},{"$f":"IF(C215=\"\",\"\",IFERROR(VLOOKUP(D215,DataMijnAfdeling,2,0),\"?\"))","v":"AFV"},"Ilker Peeters"]
[null,null,"2019-12-04","SCHM AFV",43803.25,43803.614583333336,"Miquel","van Loon",null,{"$f":"IF(C216=\"\",\"\",INDEX(Validatie!$Q$2:$Q$6,MATCH(MOD(E216,1),Validatie!$P$2:$P$6,1)))","v":"Vroeg"},{"$f":"IF(C216=\"\",\"\",IFERROR(VLOOKUP(D216,DataMijnAfdeling,2,0),\"?\"))","v":"AFV"},"Miquel van Loon"]
[null,null,"2019-12-04","SCHM AFV",43803.25,43803.614583333336,"Klaas","Kramer",null,{"$f":"IF(C217=\"\",\"\",INDEX(Validatie!$Q$2:$Q$6,MATCH(MOD(E217,1),Validatie!$P$2:$P$6,1)))","v":"Vroeg"},{"$f":"IF(C217=\"\",\"\",IFERROR(VLOOKUP(D217,DataMijnAfdeling,2,0),\"?\"))","v":"AFV"},"Klaas Kramer"]
[null,null,"2019-12-04","SCHM AFV",43803.25,43803.614583333336,"Sebastiaan","Mol",null,{"$f":"IF(C218=\"\",\"\",INDEX(Validatie!$Q$2:$Q$6,MATCH(MOD(E218,1),Validatie!$P$2:$P$6,1)))","v":"Vroeg"},{"$f":"IF(C218=\"\",\"\",IFERROR(VLOOKUP(D218,DataMijnAfdeling,2,0),\"?\"))","v":"AFV"},"Sebastiaan Mol"]
[null,null,"2019-12-04","TRSP",43803.25,43803.614583333336,"Emsud","Kok",null,{"$f":"IF(C219=\"\",\"\",INDEX(Validatie!$Q$2:$Q$6,MATCH(MOD(E219,1),Validatie!$P$2:$P$6,1)))","v":"Vroeg"},{"$f":"IF(C219=\"\",\"\",IFERROR(VLOOKUP(D219,DataMijnAfdeling,2,0),\"?\"))","v":"?"},"Emsud Kok"]
[null,null,"2019-12-04","TRSP",43803.25,43803.614583333336,"Reinder","Koning",null,{"$f":"IF(C220=\"\",\"\",INDEX(Validatie!$Q$2:$Q$6,MATCH(MOD(E220,1),Validatie!$P$2:$P$6,1)))","v":"Vroeg"},{"$f":"IF(C220=\"\",\"\",IFERROR(VLOOKUP(D220,DataMijnAfdeling,2,0),\"?\"))","v":"?"},"Reinder Koning"]
[null,null,"2019-12-04","AFV MEP",43803.291666666664,43803.65625,"Rudolf","Hofman",null,{"$f":"IF(C221=\"\",\"\",INDEX(Validatie!$Q$2:$Q$6,MATCH(MOD(E221,1),Validatie!$P$2:$P$6,1)))","v":"Vroeg"},{"$f":"IF(C221=\"\",\"\",IFERROR(VLOOKUP(D221,DataMijnAfdeling,2,0),\"?\"))","v":"MEP"},"Rudolf Hofman"]
[null,null,"2019-12-04","PALL Rweg",43803.3125,43803.677083333336,"Hilko","Prins",null,{"$f":"IF(C222=\"\",\"\",INDEX(Validatie!$Q$2:$Q$6,MATCH(MOD(E222,1),Validatie!$P$2:$P$6,1)))","v":"Vroeg"},{"$f":"IF(C222=\"\",\"\",IFERROR(VLOOKUP(D222,DataMijnAfdeling,2,0),\"?\"))","v":"-"},"Hilko Prins"]
[null,null,"2019-12-04","TRSP",43803.333333333336,43803.697916666664,"Harrie","Hoekstra",null,{"$f":"IF(C223=\"\",\"\",INDEX(Validatie!$Q$2:$Q$6,MATCH(MOD(E223,1),Validatie!$P$2:$P$6,1)))","v":"Vroeg"},{"$f":"IF(C223=\"\",\"\",IFERROR(VLOOKUP(D223,DataMijnAfdeling,2,0),\"?\"))","v":"?"},"Harrie Hoekstra"]
[null,null,"2019-12-04","SCHM HAS",43803.40625,43803.614583333336,"Norbert","de Lange",null,{"$f":"IF(C224=\"\",\"\",INDEX(Validatie!$Q$2:$Q$6,MATCH(MOD(E224,1),Validatie!$P$2:$P$6,1)))","v":"Vroeg"},{"$f":"IF(C224=\"\",\"\",IFERROR(VLOOKUP(D224,DataMijnAfdeling,2,0),\"?\"))","v":"HAS"},"Norbert de Lange"]
[null,null,"2019-12-04","ABB middag",43803.572916666664,43803.9375,"Trienko","Spooren",null,{"$f":"IF(C225=\"\",\"\",INDEX(Validatie!$Q$2:$Q$6,MATCH(MOD(E225,1),Validatie!$P$2:$P$6,1)))","v":"Laat"},{"$f":"IF(C225=\"\",\"\",IFERROR(VLOOKUP(D225,DataMijnAfdeling,2,0),\"?\"))","v":"ABB"},"Trienko Spooren"]
[null,null,"2019-12-04","AFV HAS",43803.572916666664,43803.697916666664,"Paul","van Dongen",null,{"$f":"IF(C226=\"\",\"\",INDEX(Validatie!$Q$2:$Q$6,MATCH(MOD(E226,1),Validatie!$P$2:$P$6,1)))","v":"Laat"},{"$f":"IF(C226=\"\",\"\",IFERROR(VLOOKUP(D226,DataMijnAfdeling,2,0),\"?\"))","v":"HAS"},"Paul van Dongen"]
[null,null,"2019-12-04","AFV MEP",43803.572916666664,43803.9375,"Rijk","van Doorn",null,{"$f":"IF(C227=\"\",\"\",INDEX(Validatie!$Q$2:$Q$6,MATCH(MOD(E227,1),Validatie!$P$2:$P$6,1)))","v":"Laat"},{"$f":"IF(C227=\"\",\"\",IFERROR(VLOOKUP(D227,DataMijnAfdeling,2,0),\"?\"))","v":"MEP"},"Rijk van Doorn"]
[null,null,"2019-12-04","LCR middag",43803.572916666664,43803.9375,"Christiaan","de Wit",null,{"$f":"IF(C228=\"\",\"\",INDEX(Validatie!$Q$2:$Q$6,MATCH(MOD(E228,1),Validatie!$P$2:$P$6,1)))","v":"Laat"},{"$f":"IF(C228=\"\",\"\",IFERROR(VLOOKUP(D228,DataMijnAfdeling,2,0),\"?\"))","v":"LCR"},"Christiaan de Wit"]
[null,null,"2019-12-04","PALL MEP",43803.614583333336,43803.979166666664,"Wenaron","Kurkema",null,{"$f":"IF(C229=\"\",\"\",INDEX(Validatie!$Q$2:$Q$6,MATCH(MOD(E229,1),Validatie!$P$2:$P$6,1)))","v":"Laat"},{"$f":"IF(C229=\"\",\"\",IFERROR(VLOOKUP(D229,DataMijnAfdeling,2,0),\"?\"))","v":"-"},"Wenaron Kurkema"]
[null,null,"2019-12-04","PALL MEP",43803.614583333336,43803.979166666664,"Engin","Jacobs",null,{"$f":"IF(C230=\"\",\"\",INDEX(Validatie!$Q$2:$Q$6,MATCH(MOD(E230,1),Validatie!$P$2:$P$6,1)))","v":"Laat"},{"$f":"IF(C230=\"\",\"\",IFERROR(VLOOKUP(D230,DataMijnAfdeling,2,0),\"?\"))","v":"-"},"Engin Jacobs"]
[null,null,"2019-12-04","PALL MEP",43803.614583333336,43803.979166666664,"Salahadin","Wolters",null,{"$f":"IF(C231=\"\",\"\",INDEX(Validatie!$Q$2:$Q$6,MATCH(MOD(E231,1),Validatie!$P$2:$P$6,1)))","v":"Laat"},{"$f":"IF(C231=\"\",\"\",IFERROR(VLOOKUP(D231,DataMijnAfdeling,2,0),\"?\"))","v":"-"},"Salahadin Wolters"]
[null,null,"2019-12-04","PALL MEP",43803.614583333336,43803.979166666664,"Dikkie","van der Meer",null,{"$f":"IF(C232=\"\",\"\",INDEX(Validatie!$Q$2:$Q$6,MATCH(MOD(E232,1),Validatie!$P$2:$P$6,1)))","v":"Laat"},{"$f":"IF(C232=\"\",\"\",IFERROR(VLOOKUP(D232,DataMijnAfdeling,2,0),\"?\"))","v":"-"},"Dikkie van der Meer"]
[null,null,"2019-12-04","PALL MEP",43803.614583333336,43803.979166666664,"Rene","van der Velden",null,{"$f":"IF(C233=\"\",\"\",INDEX(Validatie!$Q$2:$Q$6,MATCH(MOD(E233,1),Validatie!$P$2:$P$6,1)))","v":"Laat"},{"$f":"IF(C233=\"\",\"\",IFERROR(VLOOKUP(D233,DataMijnAfdeling,2,0),\"?\"))","v":"-"},"Rene van der Velden"]
[null,null,"2019-12-04","PALL MEP",43803.614583333336,43803.979166666664,"Richard","Driessen",null,{"$f":"IF(C234=\"\",\"\",INDEX(Validatie!$Q$2:$Q$6,MATCH(MOD(E234,1),Validatie!$P$2:$P$6,1)))","v":"Laat"},{"$f":"IF(C234=\"\",\"\",IFERROR(VLOOKUP(D234,DataMijnAfdeling,2,0),\"?\"))","v":"-"},"Richard Driessen"]
[null,null,"2019-12-04","PALL Rweg",43803.614583333336,43803.979166666664,"Felicia","van den Broek",null,{"$f":"IF(C235=\"\",\"\",INDEX(Validatie!$Q$2:$Q$6,MATCH(MOD(E235,1),Validatie!$P$2:$P$6,1)))","v":"Laat"},{"$f":"IF(C235=\"\",\"\",IFERROR(VLOOKUP(D235,DataMijnAfdeling,2,0),\"?\"))","v":"-"},"Felicia van den Broek"]
[null,null,"2019-12-04","PALL Rweg",43803.614583333336,43803.979166666664,"Merhawi","Groen",null,{"$f":"IF(C236=\"\",\"\",INDEX(Validatie!$Q$2:$Q$6,MATCH(MOD(E236,1),Validatie!$P$2:$P$6,1)))","v":"Laat"},{"$f":"IF(C236=\"\",\"\",IFERROR(VLOOKUP(D236,DataMijnAfdeling,2,0),\"?\"))","v":"-"},"Merhawi Groen"]
[null,null,"2019-12-04","PALL Rweg",43803.614583333336,43803.979166666664,"Gerrit","van Beek",null,{"$f":"IF(C237=\"\",\"\",INDEX(Validatie!$Q$2:$Q$6,MATCH(MOD(E237,1),Validatie!$P$2:$P$6,1)))","v":"Laat"},{"$f":"IF(C237=\"\",\"\",IFERROR(VLOOKUP(D237,DataMijnAfdeling,2,0),\"?\"))","v":"-"},"Gerrit van Beek"]
[null,null,"2019-12-04","PALL Rweg",43803.614583333336,43803.979166666664,"Shawn","Molenaar",null,{"$f":"IF(C238=\"\",\"\",INDEX(Validatie!$Q$2:$Q$6,MATCH(MOD(E238,1),Validatie!$P$2:$P$6,1)))","v":"Laat"},{"$f":"IF(C238=\"\",\"\",IFERROR(VLOOKUP(D238,DataMijnAfdeling,2,0),\"?\"))","v":"-"},"Shawn Molenaar"]
[null,null,"2019-12-04","PALL Rweg",43803.614583333336,43803.979166666664,"Elroy","van der Linden",null,{"$f":"IF(C239=\"\",\"\",INDEX(Validatie!$Q$2:$Q$6,MATCH(MOD(E239,1),Validatie!$P$2:$P$6,1)))","v":"Laat"},{"$f":"IF(C239=\"\",\"\",IFERROR(VLOOKUP(D239,DataMijnAfdeling,2,0),\"?\"))","v":"-"},"Elroy van der Linden"]
[null,null,"2019-12-04","PALL Rweg",43803.614583333336,43803.979166666664,"Everon","van den Heuvel",null,{"$f":"IF(C240=\"\",\"\",INDEX(Validatie!$Q$2:$Q$6,MATCH(MOD(E240,1),Validatie!$P$2:$P$6,1)))","v":"Laat"},{"$f":"IF(C240=\"\",\"\",IFERROR(VLOOKUP(D240,DataMijnAfdeling,2,0),\"?\"))","v":"-"},"Everon van den Heuvel"]
[null,null,"2019-12-04","PALL Rweg",43803.614583333336,43803.979166666664,"Davood","Smits",null,{"$f":"IF(C241=\"\",\"\",INDEX(Validatie!$Q$2:$Q$6,MATCH(MOD(E241,1),Validatie!$P$2:$P$6,1)))","v":"Laat"},{"$f":"IF(C241=\"\",\"\",IFERROR(VLOOKUP(D241,DataMijnAfdeling,2,0),\"?\"))","v":"-"},"Davood Smits"]
[null,null,"2019-12-04","PALL Rweg",43803.614583333336,43803.979166666664,"Arsenio","Mulder",null,{"$f":"IF(C242=\"\",\"\",INDEX(Validatie!$Q$2:$Q$6,MATCH(MOD(E242,1),Validatie!$P$2:$P$6,1)))","v":"Laat"},{"$f":"IF(C242=\"\",\"\",IFERROR(VLOOKUP(D242,DataMijnAfdeling,2,0),\"?\"))","v":"-"},"Arsenio Mulder"]
[null,null,"2019-12-04","PALL Rweg",43803.614583333336,43803.979166666664,"Viorel","Triest",null,{"$f":"IF(C243=\"\",\"\",INDEX(Validatie!$Q$2:$Q$6,MATCH(MOD(E243,1),Validatie!$P$2:$P$6,1)))","v":"Laat"},{"$f":"IF(C243=\"\",\"\",IFERROR(VLOOKUP(D243,DataMijnAfdeling,2,0),\"?\"))","v":"-"},"Viorel Triest"]
[null,null,"2019-12-04","PALL Rweg",43803.614583333336,43803.979166666664,"Saidou","Bosman",null,{"$f":"IF(C244=\"\",\"\",INDEX(Validatie!$Q$2:$Q$6,MATCH(MOD(E244,1),Validatie!$P$2:$P$6,1)))","v":"Laat"},{"$f":"IF(C244=\"\",\"\",IFERROR(VLOOKUP(D244,DataMijnAfdeling,2,0),\"?\"))","v":"-"},"Saidou Bosman"]
[null,null,"2019-12-04","PALL Rweg",43803.614583333336,43803.979166666664,"Wim","Vogel",null,{"$f":"IF(C245=\"\",\"\",INDEX(Validatie!$Q$2:$Q$6,MATCH(MOD(E245,1),Validatie!$P$2:$P$6,1)))","v":"Laat"},{"$f":"IF(C245=\"\",\"\",IFERROR(VLOOKUP(D245,DataMijnAfdeling,2,0),\"?\"))","v":"-"},"Wim Vogel"]
[null,null,"2019-12-04","PALL Rweg",43803.614583333336,43803.979166666664,"Sebastiaan","Mol",null,{"$f":"IF(C246=\"\",\"\",INDEX(Validatie!$Q$2:$Q$6,MATCH(MOD(E246,1),Validatie!$P$2:$P$6,1)))","v":"Laat"},{"$f":"IF(C246=\"\",\"\",IFERROR(VLOOKUP(D246,DataMijnAfdeling,2,0),\"?\"))","v":"-"},"Sebastiaan Mol"]
[null,null,"2019-12-04","PALL Rweg",43803.614583333336,43803.979166666664,"Amadou","Bakker",null,{"$f":"IF(C247=\"\",\"\",INDEX(Validatie!$Q$2:$Q$6,MATCH(MOD(E247,1),Validatie!$P$2:$P$6,1)))","v":"Laat"},{"$f":"IF(C247=\"\",\"\",IFERROR(VLOOKUP(D247,DataMijnAfdeling,2,0),\"?\"))","v":"-"},"Amadou Bakker"]
[null,null,"2019-12-04","PALL Rweg",43803.614583333336,43803.979166666664,"Wout","Van Goud",null,{"$f":"IF(C248=\"\",\"\",INDEX(Validatie!$Q$2:$Q$6,MATCH(MOD(E248,1),Validatie!$P$2:$P$6,1)))","v":"Laat"},{"$f":"IF(C248=\"\",\"\",IFERROR(VLOOKUP(D248,DataMijnAfdeling,2,0),\"?\"))","v":"-"},"Wout Van Goud"]
[null,null,"2019-12-04","PALL Rweg",43803.614583333336,43803.979166666664,"Fars","van de Veen",null,{"$f":"IF(C249=\"\",\"\",INDEX(Validatie!$Q$2:$Q$6,MATCH(MOD(E249,1),Validatie!$P$2:$P$6,1)))","v":"Laat"},{"$f":"IF(C249=\"\",\"\",IFERROR(VLOOKUP(D249,DataMijnAfdeling,2,0),\"?\"))","v":"-"},"Fars van de Veen"]
[null,null,"2019-12-04","PALL Rweg",43803.614583333336,43803.979166666664,"Fetehawi","de Bruyn",null,{"$f":"IF(C250=\"\",\"\",INDEX(Validatie!$Q$2:$Q$6,MATCH(MOD(E250,1),Validatie!$P$2:$P$6,1)))","v":"Laat"},{"$f":"IF(C250=\"\",\"\",IFERROR(VLOOKUP(D250,DataMijnAfdeling,2,0),\"?\"))","v":"-"},"Fetehawi de Bruyn"]
[null,null,"2019-12-04","PALL Rweg",43803.614583333336,43803.979166666664,"Charles","Dekker",null,{"$f":"IF(C251=\"\",\"\",INDEX(Validatie!$Q$2:$Q$6,MATCH(MOD(E251,1),Validatie!$P$2:$P$6,1)))","v":"Laat"},{"$f":"IF(C251=\"\",\"\",IFERROR(VLOOKUP(D251,DataMijnAfdeling,2,0),\"?\"))","v":"-"},"Charles Dekker"]
[null,null,"2019-12-04","PALL Rweg",43803.614583333336,43803.979166666664,"Henk","Koster",null,{"$f":"IF(C252=\"\",\"\",INDEX(Validatie!$Q$2:$Q$6,MATCH(MOD(E252,1),Validatie!$P$2:$P$6,1)))","v":"Laat"},{"$f":"IF(C252=\"\",\"\",IFERROR(VLOOKUP(D252,DataMijnAfdeling,2,0),\"?\"))","v":"-"},"Henk Koster"]
[null,null,"2019-12-04","PALL Rweg",43803.614583333336,43803.979166666664,"Ko","van de Brink",null,{"$f":"IF(C253=\"\",\"\",INDEX(Validatie!$Q$2:$Q$6,MATCH(MOD(E253,1),Validatie!$P$2:$P$6,1)))","v":"Laat"},{"$f":"IF(C253=\"\",\"\",IFERROR(VLOOKUP(D253,DataMijnAfdeling,2,0),\"?\"))","v":"-"},"Ko van de Brink"]
[null,null,"2019-12-04","PALL Rweg",43803.614583333336,43803.979166666664,"Haben","Willems",null,{"$f":"IF(C254=\"\",\"\",INDEX(Validatie!$Q$2:$Q$6,MATCH(MOD(E254,1),Validatie!$P$2:$P$6,1)))","v":"Laat"},{"$f":"IF(C254=\"\",\"\",IFERROR(VLOOKUP(D254,DataMijnAfdeling,2,0),\"?\"))","v":"-"},"Haben Willems"]
[null,null,"2019-12-04","PALL Rweg",43803.614583333336,43803.979166666664,"Robel","Hermans",null,{"$f":"IF(C255=\"\",\"\",INDEX(Validatie!$Q$2:$Q$6,MATCH(MOD(E255,1),Validatie!$P$2:$P$6,1)))","v":"Laat"},{"$f":"IF(C255=\"\",\"\",IFERROR(VLOOKUP(D255,DataMijnAfdeling,2,0),\"?\"))","v":"-"},"Robel Hermans"]
[null,null,"2019-12-04","PALL Rweg",43803.614583333336,43803.979166666664,"Quincy","de Koning",null,{"$f":"IF(C256=\"\",\"\",INDEX(Validatie!$Q$2:$Q$6,MATCH(MOD(E256,1),Validatie!$P$2:$P$6,1)))","v":"Laat"},{"$f":"IF(C256=\"\",\"\",IFERROR(VLOOKUP(D256,DataMijnAfdeling,2,0),\"?\"))","v":"-"},"Quincy de Koning"]
[null,null,"2019-12-04","PALL Rweg",43803.614583333336,43803.979166666664,"Robin","Evers",null,{"$f":"IF(C257=\"\",\"\",INDEX(Validatie!$Q$2:$Q$6,MATCH(MOD(E257,1),Validatie!$P$2:$P$6,1)))","v":"Laat"},{"$f":"IF(C257=\"\",\"\",IFERROR(VLOOKUP(D257,DataMijnAfdeling,2,0),\"?\"))","v":"-"},"Robin Evers"]
[null,null,"2019-12-04","SCHM",43803.614583333336,43803.979166666664,"Marjolein","Martens",null,{"$f":"IF(C258=\"\",\"\",INDEX(Validatie!$Q$2:$Q$6,MATCH(MOD(E258,1),Validatie!$P$2:$P$6,1)))","v":"Laat"},{"$f":"IF(C258=\"\",\"\",IFERROR(VLOOKUP(D258,DataMijnAfdeling,2,0),\"?\"))","v":"SCHM"},"Marjolein Martens"]
[null,null,"2019-12-04","SCHM",43803.614583333336,43803.979166666664,"Roy","van der Meulen",null,{"$f":"IF(C259=\"\",\"\",INDEX(Validatie!$Q$2:$Q$6,MATCH(MOD(E259,1),Validatie!$P$2:$P$6,1)))","v":"Laat"},{"$f":"IF(C259=\"\",\"\",IFERROR(VLOOKUP(D259,DataMijnAfdeling,2,0),\"?\"))","v":"SCHM"},"Roy van der Meulen"]
[null,null,"2019-12-04","SCHM",43803.614583333336,43803.979166666664,"Piet","Schipper",null,{"$f":"IF(C260=\"\",\"\",INDEX(Validatie!$Q$2:$Q$6,MATCH(MOD(E260,1),Validatie!$P$2:$P$6,1)))","v":"Laat"},{"$f":"IF(C260=\"\",\"\",IFERROR(VLOOKUP(D260,DataMijnAfdeling,2,0),\"?\"))","v":"SCHM"},"Piet Schipper"]
[null,null,"2019-12-04","SCHM AFV",43803.614583333336,43803.979166666664,"Jan","de Jonge",null,{"$f":"IF(C261=\"\",\"\",INDEX(Validatie!$Q$2:$Q$6,MATCH(MOD(E261,1),Validatie!$P$2:$P$6,1)))","v":"Laat"},{"$f":"IF(C261=\"\",\"\",IFERROR(VLOOKUP(D261,DataMijnAfdeling,2,0),\"?\"))","v":"AFV"},"Jan de Jonge"]
[null,null,"2019-12-04","SCHM AFV",43803.614583333336,43803.979166666664,"Boyan","van Leeuwen",null,{"$f":"IF(C262=\"\",\"\",INDEX(Validatie!$Q$2:$Q$6,MATCH(MOD(E262,1),Validatie!$P$2:$P$6,1)))","v":"Laat"},{"$f":"IF(C262=\"\",\"\",IFERROR(VLOOKUP(D262,DataMijnAfdeling,2,0),\"?\"))","v":"AFV"},"Boyan van Leeuwen"]
[null,null,"2019-12-04","SCHM AFV",43803.614583333336,43803.979166666664,"Sami","van der Horst",null,{"$f":"IF(C263=\"\",\"\",INDEX(Validatie!$Q$2:$Q$6,MATCH(MOD(E263,1),Validatie!$P$2:$P$6,1)))","v":"Laat"},{"$f":"IF(C263=\"\",\"\",IFERROR(VLOOKUP(D263,DataMijnAfdeling,2,0),\"?\"))","v":"AFV"},{"$f":"IF(C263=\"\",\"\",CONCATENATE(G263,\" \",H263))","v":"Sami van der Horst"}]
[null,null,"2019-12-04","SCHM AFV",43803.614583333336,43803.979166666664,"Henri","van Dam",null,{"$f":"IF(C264=\"\",\"\",INDEX(Validatie!$Q$2:$Q$6,MATCH(MOD(E264,1),Validatie!$P$2:$P$6,1)))","v":"Laat"},{"$f":"IF(C264=\"\",\"\",IFERROR(VLOOKUP(D264,DataMijnAfdeling,2,0),\"?\"))","v":"AFV"},"Henri van Dam"]
[null,null,"2019-12-04","SCHM AFV",43803.614583333336,43803.979166666664,"Michel","Jonker",null,{"$f":"IF(C265=\"\",\"\",INDEX(Validatie!$Q$2:$Q$6,MATCH(MOD(E265,1),Validatie!$P$2:$P$6,1)))","v":"Laat"},{"$f":"IF(C265=\"\",\"\",IFERROR(VLOOKUP(D265,DataMijnAfdeling,2,0),\"?\"))","v":"AFV"},"Michel Jonker"]
[null,null,"2019-12-04","TRSP",43803.614583333336,43803.979166666664,"Henk","Koster",null,{"$f":"IF(C266=\"\",\"\",INDEX(Validatie!$Q$2:$Q$6,MATCH(MOD(E266,1),Validatie!$P$2:$P$6,1)))","v":"Laat"},{"$f":"IF(C266=\"\",\"\",IFERROR(VLOOKUP(D266,DataMijnAfdeling,2,0),\"?\"))","v":"?"},"Henk Koster"]
[null,null,"2019-12-04","TRSP",43803.614583333336,43803.979166666664,"Anton","Smit",null,{"$f":"IF(C267=\"\",\"\",INDEX(Validatie!$Q$2:$Q$6,MATCH(MOD(E267,1),Validatie!$P$2:$P$6,1)))","v":"Laat"},{"$f":"IF(C267=\"\",\"\",IFERROR(VLOOKUP(D267,DataMijnAfdeling,2,0),\"?\"))","v":"?"},"Anton Smit"]
[null,null,"2019-12-04","PALL Rweg",43803.677083333336,43803.979166666664,"Gebrehiwet","Schouten",null,{"$f":"IF(C268=\"\",\"\",INDEX(Validatie!$Q$2:$Q$6,MATCH(MOD(E268,1),Validatie!$P$2:$P$6,1)))","v":"Laat"},{"$f":"IF(C268=\"\",\"\",IFERROR(VLOOKUP(D268,DataMijnAfdeling,2,0),\"?\"))","v":"-"},"Gebrehiwet Schouten"]
[null,null,"2019-12-04","SCHM HAS",43803.697916666664,43803.9375,"Paul","van Dongen",null,{"$f":"IF(C269=\"\",\"\",INDEX(Validatie!$Q$2:$Q$6,MATCH(MOD(E269,1),Validatie!$P$2:$P$6,1)))","v":"Laat"},{"$f":"IF(C269=\"\",\"\",IFERROR(VLOOKUP(D269,DataMijnAfdeling,2,0),\"?\"))","v":"HAS"},"Paul van Dongen"]
[null,null,"2019-12-04","SCHM",43803.916666666664,43804.28125,"Patrick","Bosch",null,{"$f":"IF(C270=\"\",\"\",INDEX(Validatie!$Q$2:$Q$6,MATCH(MOD(E270,1),Validatie!$P$2:$P$6,1)))","v":"Nacht"},{"$f":"IF(C270=\"\",\"\",IFERROR(VLOOKUP(D270,DataMijnAfdeling,2,0),\"?\"))","v":"SCHM"},"Patrick Bosch"]
[null,null,"2019-12-04","SCHM",43803.916666666664,43804.28125,"Rolinka","van den Bosch",null,{"$f":"IF(C271=\"\",\"\",INDEX(Validatie!$Q$2:$Q$6,MATCH(MOD(E271,1),Validatie!$P$2:$P$6,1)))","v":"Nacht"},{"$f":"IF(C271=\"\",\"\",IFERROR(VLOOKUP(D271,DataMijnAfdeling,2,0),\"?\"))","v":"SCHM"},"Rolinka van den Bosch"]
[null,null,"2019-12-04","SCHM",43803.916666666664,43804.28125,"Erik","de Haan",null,{"$f":"IF(C272=\"\",\"\",INDEX(Validatie!$Q$2:$Q$6,MATCH(MOD(E272,1),Validatie!$P$2:$P$6,1)))","v":"Nacht"},{"$f":"IF(C272=\"\",\"\",IFERROR(VLOOKUP(D272,DataMijnAfdeling,2,0),\"?\"))","v":"SCHM"},"Erik de Haan"]
[null,null,"2019-12-05","ABB ochtend ",43804.25,43804.614583333336,"Flavi","van der Heyden",null,{"$f":"IF(C273=\"\",\"\",INDEX(Validatie!$Q$2:$Q$6,MATCH(MOD(E273,1),Validatie!$P$2:$P$6,1)))","v":"Vroeg"},{"$f":"IF(C273=\"\",\"\",IFERROR(VLOOKUP(D273,DataMijnAfdeling,2,0),\"?\"))","v":"ABB"},"Flavi van der Heyden"]
[null,null,"2019-12-05","AFV HAS",43804.25,43804.40625,"Norbert","de Lange",null,{"$f":"IF(C274=\"\",\"\",INDEX(Validatie!$Q$2:$Q$6,MATCH(MOD(E274,1),Validatie!$P$2:$P$6,1)))","v":"Vroeg"},{"$f":"IF(C274=\"\",\"\",IFERROR(VLOOKUP(D274,DataMijnAfdeling,2,0),\"?\"))","v":"HAS"},"Norbert de Lange"]
[null,null,"2019-12-05","AFV MEP",43804.25,43804.614583333336,"Houcin","Huisman",null,{"$f":"IF(C275=\"\",\"\",INDEX(Validatie!$Q$2:$Q$6,MATCH(MOD(E275,1),Validatie!$P$2:$P$6,1)))","v":"Vroeg"},{"$f":"IF(C275=\"\",\"\",IFERROR(VLOOKUP(D275,DataMijnAfdeling,2,0),\"?\"))","v":"MEP"},"Houcin Huisman"]
[null,null,"2019-12-05","LCR ochtend",43804.25,43804.614583333336,"Wolter","De bolder",null,{"$f":"IF(C276=\"\",\"\",INDEX(Validatie!$Q$2:$Q$6,MATCH(MOD(E276,1),Validatie!$P$2:$P$6,1)))","v":"Vroeg"},{"$f":"IF(C276=\"\",\"\",IFERROR(VLOOKUP(D276,DataMijnAfdeling,2,0),\"?\"))","v":"LCR"},"Wolter De bolder"]
[null,null,"2019-12-05","PALL HAS",43804.25,43804.614583333336,"Henk","Koster",null,{"$f":"IF(C277=\"\",\"\",INDEX(Validatie!$Q$2:$Q$6,MATCH(MOD(E277,1),Validatie!$P$2:$P$6,1)))","v":"Vroeg"},{"$f":"IF(C277=\"\",\"\",IFERROR(VLOOKUP(D277,DataMijnAfdeling,2,0),\"?\"))","v":"-"},"Henk Koster"]
[null,null,"2019-12-05","PALL MEP",43804.25,43804.614583333336,"Latie","van Wijk",null,{"$f":"IF(C278=\"\",\"\",INDEX(Validatie!$Q$2:$Q$6,MATCH(MOD(E278,1),Validatie!$P$2:$P$6,1)))","v":"Vroeg"},{"$f":"IF(C278=\"\",\"\",IFERROR(VLOOKUP(D278,DataMijnAfdeling,2,0),\"?\"))","v":"-"},"Latie van Wijk"]
[null,null,"2019-12-05","PALL MEP",43804.25,43804.614583333336,"Michael","Gerritsen",null,{"$f":"IF(C279=\"\",\"\",INDEX(Validatie!$Q$2:$Q$6,MATCH(MOD(E279,1),Validatie!$P$2:$P$6,1)))","v":"Vroeg"},{"$f":"IF(C279=\"\",\"\",IFERROR(VLOOKUP(D279,DataMijnAfdeling,2,0),\"?\"))","v":"-"},"Michael Gerritsen"]
[null,null,"2019-12-05","PALL MEP",43804.25,43804.614583333336,"Abdurahman Ibrahim","de Vries",null,{"$f":"IF(C280=\"\",\"\",INDEX(Validatie!$Q$2:$Q$6,MATCH(MOD(E280,1),Validatie!$P$2:$P$6,1)))","v":"Vroeg"},{"$f":"IF(C280=\"\",\"\",IFERROR(VLOOKUP(D280,DataMijnAfdeling,2,0),\"?\"))","v":"-"},"Abdurahman Ibrahim de Vries"]
[null,null,"2019-12-05","PALL MEP",43804.25,43804.614583333336,"Hans","van de Ven ",null,{"$f":"IF(C281=\"\",\"\",INDEX(Validatie!$Q$2:$Q$6,MATCH(MOD(E281,1),Validatie!$P$2:$P$6,1)))","v":"Vroeg"},{"$f":"IF(C281=\"\",\"\",IFERROR(VLOOKUP(D281,DataMijnAfdeling,2,0),\"?\"))","v":"-"},"Hans van de Ven "]
[null,null,"2019-12-05","PALL MEP",43804.25,43804.614583333336,"Jeroen","Post",null,{"$f":"IF(C282=\"\",\"\",INDEX(Validatie!$Q$2:$Q$6,MATCH(MOD(E282,1),Validatie!$P$2:$P$6,1)))","v":"Vroeg"},{"$f":"IF(C282=\"\",\"\",IFERROR(VLOOKUP(D282,DataMijnAfdeling,2,0),\"?\"))","v":"-"},"Jeroen Post"]
[null,null,"2019-12-05","PALL Rweg",43804.25,43804.614583333336,"Akela","van Dijk",null,{"$f":"IF(C283=\"\",\"\",INDEX(Validatie!$Q$2:$Q$6,MATCH(MOD(E283,1),Validatie!$P$2:$P$6,1)))","v":"Vroeg"},{"$f":"IF(C283=\"\",\"\",IFERROR(VLOOKUP(D283,DataMijnAfdeling,2,0),\"?\"))","v":"-"},"Akela van Dijk"]
[null,null,"2019-12-05","PALL Rweg",43804.25,43804.614583333336,"Karrar","Kuiper",null,{"$f":"IF(C284=\"\",\"\",INDEX(Validatie!$Q$2:$Q$6,MATCH(MOD(E284,1),Validatie!$P$2:$P$6,1)))","v":"Vroeg"},{"$f":"IF(C284=\"\",\"\",IFERROR(VLOOKUP(D284,DataMijnAfdeling,2,0),\"?\"))","v":"-"},"Karrar Kuiper"]
[null,null,"2019-12-05","PALL Rweg",43804.25,43804.614583333336,"Sebastian","Kuijpers",null,{"$f":"IF(C285=\"\",\"\",INDEX(Validatie!$Q$2:$Q$6,MATCH(MOD(E285,1),Validatie!$P$2:$P$6,1)))","v":"Vroeg"},{"$f":"IF(C285=\"\",\"\",IFERROR(VLOOKUP(D285,DataMijnAfdeling,2,0),\"?\"))","v":"-"},"Sebastian Kuijpers"]
[null,null,"2019-12-05","PALL Rweg",43804.25,43804.614583333336,"Harry","Maas",null,{"$f":"IF(C286=\"\",\"\",INDEX(Validatie!$Q$2:$Q$6,MATCH(MOD(E286,1),Validatie!$P$2:$P$6,1)))","v":"Vroeg"},{"$f":"IF(C286=\"\",\"\",IFERROR(VLOOKUP(D286,DataMijnAfdeling,2,0),\"?\"))","v":"-"},"Harry Maas"]
[null,null,"2019-12-05","PALL Rweg",43804.25,43804.614583333336,"Apollonia","Meijer",null,{"$f":"IF(C287=\"\",\"\",INDEX(Validatie!$Q$2:$Q$6,MATCH(MOD(E287,1),Validatie!$P$2:$P$6,1)))","v":"Vroeg"},{"$f":"IF(C287=\"\",\"\",IFERROR(VLOOKUP(D287,DataMijnAfdeling,2,0),\"?\"))","v":"-"},"Apollonia Meijer"]
[null,null,"2019-12-05","PALL Rweg",43804.25,43804.614583333336,"Naoufel","van de Velde ",null,{"$f":"IF(C288=\"\",\"\",INDEX(Validatie!$Q$2:$Q$6,MATCH(MOD(E288,1),Validatie!$P$2:$P$6,1)))","v":"Vroeg"},{"$f":"IF(C288=\"\",\"\",IFERROR(VLOOKUP(D288,DataMijnAfdeling,2,0),\"?\"))","v":"-"},"Naoufel van de Velde "]
[null,null,"2019-12-05","PALL Rweg",43804.25,43804.614583333336,"Dennis","de Graaf",null,{"$f":"IF(C289=\"\",\"\",INDEX(Validatie!$Q$2:$Q$6,MATCH(MOD(E289,1),Validatie!$P$2:$P$6,1)))","v":"Vroeg"},{"$f":"IF(C289=\"\",\"\",IFERROR(VLOOKUP(D289,DataMijnAfdeling,2,0),\"?\"))","v":"-"},"Dennis de Graaf"]
[null,null,"2019-12-05","PALL Rweg",43804.25,43804.614583333336,"Agathe","van de Berg ",null,{"$f":"IF(C290=\"\",\"\",INDEX(Validatie!$Q$2:$Q$6,MATCH(MOD(E290,1),Validatie!$P$2:$P$6,1)))","v":"Vroeg"},{"$f":"IF(C290=\"\",\"\",IFERROR(VLOOKUP(D290,DataMijnAfdeling,2,0),\"?\"))","v":"-"},"Agathe van de Berg "]
[null,null,"2019-12-05","PALL Rweg",43804.25,43804.614583333336,"Heruy","van de Wal ",null,{"$f":"IF(C291=\"\",\"\",INDEX(Validatie!$Q$2:$Q$6,MATCH(MOD(E291,1),Validatie!$P$2:$P$6,1)))","v":"Vroeg"},{"$f":"IF(C291=\"\",\"\",IFERROR(VLOOKUP(D291,DataMijnAfdeling,2,0),\"?\"))","v":"-"},"Heruy van de Wal "]
[null,null,"2019-12-05","PALL Rweg",43804.25,43804.614583333336,"Hassan","Verhoeven",null,{"$f":"IF(C292=\"\",\"\",INDEX(Validatie!$Q$2:$Q$6,MATCH(MOD(E292,1),Validatie!$P$2:$P$6,1)))","v":"Vroeg"},{"$f":"IF(C292=\"\",\"\",IFERROR(VLOOKUP(D292,DataMijnAfdeling,2,0),\"?\"))","v":"-"},"Hassan Verhoeven"]
[null,null,"2019-12-05","PALL Rweg",43804.25,43804.614583333336,"Samantha","Sanders",null,{"$f":"IF(C293=\"\",\"\",INDEX(Validatie!$Q$2:$Q$6,MATCH(MOD(E293,1),Validatie!$P$2:$P$6,1)))","v":"Vroeg"},{"$f":"IF(C293=\"\",\"\",IFERROR(VLOOKUP(D293,DataMijnAfdeling,2,0),\"?\"))","v":"-"},"Samantha Sanders"]
[null,null,"2019-12-05","PALL Rweg",43804.25,43804.614583333336,"Sied"," van der Pol",null,{"$f":"IF(C294=\"\",\"\",INDEX(Validatie!$Q$2:$Q$6,MATCH(MOD(E294,1),Validatie!$P$2:$P$6,1)))","v":"Vroeg"},{"$f":"IF(C294=\"\",\"\",IFERROR(VLOOKUP(D294,DataMijnAfdeling,2,0),\"?\"))","v":"-"},"Sied  van der Pol"]
[null,null,"2019-12-05","PALL Rweg",43804.25,43804.614583333336,"Filimon","de Bruin",null,{"$f":"IF(C295=\"\",\"\",INDEX(Validatie!$Q$2:$Q$6,MATCH(MOD(E295,1),Validatie!$P$2:$P$6,1)))","v":"Vroeg"},{"$f":"IF(C295=\"\",\"\",IFERROR(VLOOKUP(D295,DataMijnAfdeling,2,0),\"?\"))","v":"-"},"Filimon de Bruin"]
[null,null,"2019-12-05","PALL Rweg",43804.25,43804.614583333336,"Jarek","Kuipers",null,{"$f":"IF(C296=\"\",\"\",INDEX(Validatie!$Q$2:$Q$6,MATCH(MOD(E296,1),Validatie!$P$2:$P$6,1)))","v":"Vroeg"},{"$f":"IF(C296=\"\",\"\",IFERROR(VLOOKUP(D296,DataMijnAfdeling,2,0),\"?\"))","v":"-"},"Jarek Kuipers"]
[null,null,"2019-12-05","PALL Rweg",43804.25,43804.614583333336,"Mark","Vink",null,{"$f":"IF(C297=\"\",\"\",INDEX(Validatie!$Q$2:$Q$6,MATCH(MOD(E297,1),Validatie!$P$2:$P$6,1)))","v":"Vroeg"},{"$f":"IF(C297=\"\",\"\",IFERROR(VLOOKUP(D297,DataMijnAfdeling,2,0),\"?\"))","v":"-"},"Mark Vink"]
[null,null,"2019-12-05","PALL Rweg",43804.25,43804.614583333336,"Laszlo","Scholten",null,{"$f":"IF(C298=\"\",\"\",INDEX(Validatie!$Q$2:$Q$6,MATCH(MOD(E298,1),Validatie!$P$2:$P$6,1)))","v":"Vroeg"},{"$f":"IF(C298=\"\",\"\",IFERROR(VLOOKUP(D298,DataMijnAfdeling,2,0),\"?\"))","v":"-"},"Laszlo Scholten"]
[null,null,"2019-12-05","PALL Rweg",43804.25,43804.614583333336,"Abdiqadir","de Jong",null,{"$f":"IF(C299=\"\",\"\",INDEX(Validatie!$Q$2:$Q$6,MATCH(MOD(E299,1),Validatie!$P$2:$P$6,1)))","v":"Vroeg"},{"$f":"IF(C299=\"\",\"\",IFERROR(VLOOKUP(D299,DataMijnAfdeling,2,0),\"?\"))","v":"-"},"Abdiqadir de Jong"]
[null,null,"2019-12-05","PALL Rweg",43804.25,43804.614583333336,"Atobhran","de Groot",null,{"$f":"IF(C300=\"\",\"\",INDEX(Validatie!$Q$2:$Q$6,MATCH(MOD(E300,1),Validatie!$P$2:$P$6,1)))","v":"Vroeg"},{"$f":"IF(C300=\"\",\"\",IFERROR(VLOOKUP(D300,DataMijnAfdeling,2,0),\"?\"))","v":"-"},"Atobhran de Groot"]
[null,null,"2019-12-05","PALL Rweg",43804.25,43804.614583333336,"Nexhmedi","Willemsen",null,{"$f":"IF(C301=\"\",\"\",INDEX(Validatie!$Q$2:$Q$6,MATCH(MOD(E301,1),Validatie!$P$2:$P$6,1)))","v":"Vroeg"},{"$f":"IF(C301=\"\",\"\",IFERROR(VLOOKUP(D301,DataMijnAfdeling,2,0),\"?\"))","v":"-"},"Nexhmedi Willemsen"]
[null,null,"2019-12-05","PALL Rweg",43804.25,43804.291666666664,"Chevindio","Brouwer",null,{"$f":"IF(C302=\"\",\"\",INDEX(Validatie!$Q$2:$Q$6,MATCH(MOD(E302,1),Validatie!$P$2:$P$6,1)))","v":"Vroeg"},{"$f":"IF(C302=\"\",\"\",IFERROR(VLOOKUP(D302,DataMijnAfdeling,2,0),\"?\"))","v":"-"},"Chevindio Brouwer"]
[null,null,"2019-12-05","PALL Rweg",43804.25,43804.614583333336,"Martijn","de Ruiter",null,{"$f":"IF(C303=\"\",\"\",INDEX(Validatie!$Q$2:$Q$6,MATCH(MOD(E303,1),Validatie!$P$2:$P$6,1)))","v":"Vroeg"},{"$f":"IF(C303=\"\",\"\",IFERROR(VLOOKUP(D303,DataMijnAfdeling,2,0),\"?\"))","v":"-"},"Martijn de Ruiter"]
[null,null,"2019-12-05","SCHM",43804.25,43804.614583333336,"Rachid","van der Laan",null,{"$f":"IF(C304=\"\",\"\",INDEX(Validatie!$Q$2:$Q$6,MATCH(MOD(E304,1),Validatie!$P$2:$P$6,1)))","v":"Vroeg"},{"$f":"IF(C304=\"\",\"\",IFERROR(VLOOKUP(D304,DataMijnAfdeling,2,0),\"?\"))","v":"SCHM"},"Rachid van der Laan"]
[null,null,"2019-12-05","SCHM",43804.25,43804.614583333336,"Evans","Vermeulen",null,{"$f":"IF(C305=\"\",\"\",INDEX(Validatie!$Q$2:$Q$6,MATCH(MOD(E305,1),Validatie!$P$2:$P$6,1)))","v":"Vroeg"},{"$f":"IF(C305=\"\",\"\",IFERROR(VLOOKUP(D305,DataMijnAfdeling,2,0),\"?\"))","v":"SCHM"},"Evans Vermeulen"]
[null,null,"2019-12-05","SCHM",43804.25,43804.614583333336,"Kevin","Veenstra",null,{"$f":"IF(C306=\"\",\"\",INDEX(Validatie!$Q$2:$Q$6,MATCH(MOD(E306,1),Validatie!$P$2:$P$6,1)))","v":"Vroeg"},{"$f":"IF(C306=\"\",\"\",IFERROR(VLOOKUP(D306,DataMijnAfdeling,2,0),\"?\"))","v":"SCHM"},"Kevin Veenstra"]
[null,null,"2019-12-05","SCHM AFV",43804.25,43804.614583333336,"Baki","Bos",null,{"$f":"IF(C307=\"\",\"\",INDEX(Validatie!$Q$2:$Q$6,MATCH(MOD(E307,1),Validatie!$P$2:$P$6,1)))","v":"Vroeg"},{"$f":"IF(C307=\"\",\"\",IFERROR(VLOOKUP(D307,DataMijnAfdeling,2,0),\"?\"))","v":"AFV"},"Baki Bos"]
[null,null,"2019-12-05","SCHM AFV",43804.25,43804.614583333336,"Ilker","Peeters",null,{"$f":"IF(C308=\"\",\"\",INDEX(Validatie!$Q$2:$Q$6,MATCH(MOD(E308,1),Validatie!$P$2:$P$6,1)))","v":"Vroeg"},{"$f":"IF(C308=\"\",\"\",IFERROR(VLOOKUP(D308,DataMijnAfdeling,2,0),\"?\"))","v":"AFV"},"Ilker Peeters"]
[null,null,"2019-12-05","SCHM AFV",43804.25,43804.614583333336,"Miquel","van Loon",null,{"$f":"IF(C309=\"\",\"\",INDEX(Validatie!$Q$2:$Q$6,MATCH(MOD(E309,1),Validatie!$P$2:$P$6,1)))","v":"Vroeg"},{"$f":"IF(C309=\"\",\"\",IFERROR(VLOOKUP(D309,DataMijnAfdeling,2,0),\"?\"))","v":"AFV"},"Miquel van Loon"]
[null,null,"2019-12-05","SCHM AFV",43804.25,43804.614583333336,"Klaas","Kramer",null,{"$f":"IF(C310=\"\",\"\",INDEX(Validatie!$Q$2:$Q$6,MATCH(MOD(E310,1),Validatie!$P$2:$P$6,1)))","v":"Vroeg"},{"$f":"IF(C310=\"\",\"\",IFERROR(VLOOKUP(D310,DataMijnAfdeling,2,0),\"?\"))","v":"AFV"},"Klaas Kramer"]
[null,null,"2019-12-05","SCHM AFV",43804.25,43804.614583333336,"Sebastiaan","Mol",null,{"$f":"IF(C311=\"\",\"\",INDEX(Validatie!$Q$2:$Q$6,MATCH(MOD(E311,1),Validatie!$P$2:$P$6,1)))","v":"Vroeg"},{"$f":"IF(C311=\"\",\"\",IFERROR(VLOOKUP(D311,DataMijnAfdeling,2,0),\"?\"))","v":"AFV"},"Sebastiaan Mol"]
[null,null,"2019-12-05","TRSP",43804.25,43804.614583333336,"Emsud","Kok",null,{"$f":"IF(C312=\"\",\"\",INDEX(Validatie!$Q$2:$Q$6,MATCH(MOD(E312,1),Validatie!$P$2:$P$6,1)))","v":"Vroeg"},{"$f":"IF(C312=\"\",\"\",IFERROR(VLOOKUP(D312,DataMijnAfdeling,2,0),\"?\"))","v":"?"},"Emsud Kok"]
[null,null,"2019-12-05","TRSP",43804.25,43804.614583333336,"Reinder","Koning",null,{"$f":"IF(C313=\"\",\"\",INDEX(Validatie!$Q$2:$Q$6,MATCH(MOD(E313,1),Validatie!$P$2:$P$6,1)))","v":"Vroeg"},{"$f":"IF(C313=\"\",\"\",IFERROR(VLOOKUP(D313,DataMijnAfdeling,2,0),\"?\"))","v":"?"},"Reinder Koning"]
[null,null,"2019-12-05","AFV MEP",43804.291666666664,43804.65625,"Rudolf","Hofman",null,{"$f":"IF(C314=\"\",\"\",INDEX(Validatie!$Q$2:$Q$6,MATCH(MOD(E314,1),Validatie!$P$2:$P$6,1)))","v":"Vroeg"},{"$f":"IF(C314=\"\",\"\",IFERROR(VLOOKUP(D314,DataMijnAfdeling,2,0),\"?\"))","v":"MEP"},"Rudolf Hofman"]
[null,null,"2019-12-05","PALL Rweg",43804.3125,43804.677083333336,"Hilko","Prins",null,{"$f":"IF(C315=\"\",\"\",INDEX(Validatie!$Q$2:$Q$6,MATCH(MOD(E315,1),Validatie!$P$2:$P$6,1)))","v":"Vroeg"},{"$f":"IF(C315=\"\",\"\",IFERROR(VLOOKUP(D315,DataMijnAfdeling,2,0),\"?\"))","v":"-"},"Hilko Prins"]
[null,null,"2019-12-05","TRSP",43804.333333333336,43804.697916666664,"Harrie","Hoekstra",null,{"$f":"IF(C316=\"\",\"\",INDEX(Validatie!$Q$2:$Q$6,MATCH(MOD(E316,1),Validatie!$P$2:$P$6,1)))","v":"Vroeg"},{"$f":"IF(C316=\"\",\"\",IFERROR(VLOOKUP(D316,DataMijnAfdeling,2,0),\"?\"))","v":"?"},"Harrie Hoekstra"]
[null,null,"2019-12-05","SCHM HAS",43804.40625,43804.614583333336,"Norbert","de Lange",null,{"$f":"IF(C317=\"\",\"\",INDEX(Validatie!$Q$2:$Q$6,MATCH(MOD(E317,1),Validatie!$P$2:$P$6,1)))","v":"Vroeg"},{"$f":"IF(C317=\"\",\"\",IFERROR(VLOOKUP(D317,DataMijnAfdeling,2,0),\"?\"))","v":"HAS"},"Norbert de Lange"]
[null,null,"2019-12-05","ABB middag",43804.572916666664,43804.9375,"Trienko","Spooren",null,{"$f":"IF(C318=\"\",\"\",INDEX(Validatie!$Q$2:$Q$6,MATCH(MOD(E318,1),Validatie!$P$2:$P$6,1)))","v":"Laat"},{"$f":"IF(C318=\"\",\"\",IFERROR(VLOOKUP(D318,DataMijnAfdeling,2,0),\"?\"))","v":"ABB"},"Trienko Spooren"]
[null,null,"2019-12-05","AFV HAS",43804.572916666664,43804.697916666664,"Paul","van Dongen",null,{"$f":"IF(C319=\"\",\"\",INDEX(Validatie!$Q$2:$Q$6,MATCH(MOD(E319,1),Validatie!$P$2:$P$6,1)))","v":"Laat"},{"$f":"IF(C319=\"\",\"\",IFERROR(VLOOKUP(D319,DataMijnAfdeling,2,0),\"?\"))","v":"HAS"},"Paul van Dongen"]
[null,null,"2019-12-05","AFV MEP",43804.572916666664,43804.9375,"Rijk","van Doorn",null,{"$f":"IF(C320=\"\",\"\",INDEX(Validatie!$Q$2:$Q$6,MATCH(MOD(E320,1),Validatie!$P$2:$P$6,1)))","v":"Laat"},{"$f":"IF(C320=\"\",\"\",IFERROR(VLOOKUP(D320,DataMijnAfdeling,2,0),\"?\"))","v":"MEP"},"Rijk van Doorn"]
[null,null,"2019-12-05","LCR middag",43804.572916666664,43804.9375,"Christiaan","de Wit",null,{"$f":"IF(C321=\"\",\"\",INDEX(Validatie!$Q$2:$Q$6,MATCH(MOD(E321,1),Validatie!$P$2:$P$6,1)))","v":"Laat"},{"$f":"IF(C321=\"\",\"\",IFERROR(VLOOKUP(D321,DataMijnAfdeling,2,0),\"?\"))","v":"LCR"},"Christiaan de Wit"]
[null,null,"2019-12-05","PALL MEP",43804.614583333336,43804.979166666664,"Wenaron","Kurkema",null,{"$f":"IF(C322=\"\",\"\",INDEX(Validatie!$Q$2:$Q$6,MATCH(MOD(E322,1),Validatie!$P$2:$P$6,1)))","v":"Laat"},{"$f":"IF(C322=\"\",\"\",IFERROR(VLOOKUP(D322,DataMijnAfdeling,2,0),\"?\"))","v":"-"},"Wenaron Kurkema"]
[null,null,"2019-12-05","PALL MEP",43804.614583333336,43804.979166666664,"Engin","Jacobs",null,{"$f":"IF(C323=\"\",\"\",INDEX(Validatie!$Q$2:$Q$6,MATCH(MOD(E323,1),Validatie!$P$2:$P$6,1)))","v":"Laat"},{"$f":"IF(C323=\"\",\"\",IFERROR(VLOOKUP(D323,DataMijnAfdeling,2,0),\"?\"))","v":"-"},"Engin Jacobs"]
[null,null,"2019-12-05","PALL MEP",43804.614583333336,43804.979166666664,"Salahadin","Wolters",null,{"$f":"IF(C324=\"\",\"\",INDEX(Validatie!$Q$2:$Q$6,MATCH(MOD(E324,1),Validatie!$P$2:$P$6,1)))","v":"Laat"},{"$f":"IF(C324=\"\",\"\",IFERROR(VLOOKUP(D324,DataMijnAfdeling,2,0),\"?\"))","v":"-"},"Salahadin Wolters"]
[null,null,"2019-12-05","PALL MEP",43804.614583333336,43804.979166666664,"Dikkie","van der Meer",null,{"$f":"IF(C325=\"\",\"\",INDEX(Validatie!$Q$2:$Q$6,MATCH(MOD(E325,1),Validatie!$P$2:$P$6,1)))","v":"Laat"},{"$f":"IF(C325=\"\",\"\",IFERROR(VLOOKUP(D325,DataMijnAfdeling,2,0),\"?\"))","v":"-"},"Dikkie van der Meer"]
[null,null,"2019-12-05","PALL MEP",43804.614583333336,43804.979166666664,"Rene","van der Velden",null,{"$f":"IF(C326=\"\",\"\",INDEX(Validatie!$Q$2:$Q$6,MATCH(MOD(E326,1),Validatie!$P$2:$P$6,1)))","v":"Laat"},{"$f":"IF(C326=\"\",\"\",IFERROR(VLOOKUP(D326,DataMijnAfdeling,2,0),\"?\"))","v":"-"},"Rene van der Velden"]
[null,null,"2019-12-05","PALL MEP",43804.614583333336,43804.979166666664,"Richard","Driessen",null,{"$f":"IF(C327=\"\",\"\",INDEX(Validatie!$Q$2:$Q$6,MATCH(MOD(E327,1),Validatie!$P$2:$P$6,1)))","v":"Laat"},{"$f":"IF(C327=\"\",\"\",IFERROR(VLOOKUP(D327,DataMijnAfdeling,2,0),\"?\"))","v":"-"},{"$f":"IF(C327=\"\",\"\",CONCATENATE(G327,\" \",H327))","v":"Richard Driessen"}]
[null,null,"2019-12-05","PALL Rweg",43804.614583333336,43804.979166666664,"Merhawi","Groen",null,{"$f":"IF(C328=\"\",\"\",INDEX(Validatie!$Q$2:$Q$6,MATCH(MOD(E328,1),Validatie!$P$2:$P$6,1)))","v":"Laat"},{"$f":"IF(C328=\"\",\"\",IFERROR(VLOOKUP(D328,DataMijnAfdeling,2,0),\"?\"))","v":"-"},"Merhawi Groen"]
[null,null,"2019-12-05","PALL Rweg",43804.614583333336,43804.979166666664,"Gerrit","van Beek",null,{"$f":"IF(C329=\"\",\"\",INDEX(Validatie!$Q$2:$Q$6,MATCH(MOD(E329,1),Validatie!$P$2:$P$6,1)))","v":"Laat"},{"$f":"IF(C329=\"\",\"\",IFERROR(VLOOKUP(D329,DataMijnAfdeling,2,0),\"?\"))","v":"-"},"Gerrit van Beek"]
[null,null,"2019-12-05","PALL Rweg",43804.614583333336,43804.979166666664,"Shawn","Molenaar",null,{"$f":"IF(C330=\"\",\"\",INDEX(Validatie!$Q$2:$Q$6,MATCH(MOD(E330,1),Validatie!$P$2:$P$6,1)))","v":"Laat"},{"$f":"IF(C330=\"\",\"\",IFERROR(VLOOKUP(D330,DataMijnAfdeling,2,0),\"?\"))","v":"-"},"Shawn Molenaar"]
[null,null,"2019-12-05","PALL Rweg",43804.614583333336,43804.979166666664,"Elroy","van der Linden",null,{"$f":"IF(C331=\"\",\"\",INDEX(Validatie!$Q$2:$Q$6,MATCH(MOD(E331,1),Validatie!$P$2:$P$6,1)))","v":"Laat"},{"$f":"IF(C331=\"\",\"\",IFERROR(VLOOKUP(D331,DataMijnAfdeling,2,0),\"?\"))","v":"-"},"Elroy van der Linden"]
[null,null,"2019-12-05","PALL Rweg",43804.614583333336,43804.979166666664,"Tomas","Koolen",null,{"$f":"IF(C332=\"\",\"\",INDEX(Validatie!$Q$2:$Q$6,MATCH(MOD(E332,1),Validatie!$P$2:$P$6,1)))","v":"Laat"},{"$f":"IF(C332=\"\",\"\",IFERROR(VLOOKUP(D332,DataMijnAfdeling,2,0),\"?\"))","v":"-"},"Tomas Koolen"]
[null,null,"2019-12-05","PALL Rweg",43804.614583333336,43804.979166666664,"Everon","van den Heuvel",null,{"$f":"IF(C333=\"\",\"\",INDEX(Validatie!$Q$2:$Q$6,MATCH(MOD(E333,1),Validatie!$P$2:$P$6,1)))","v":"Laat"},{"$f":"IF(C333=\"\",\"\",IFERROR(VLOOKUP(D333,DataMijnAfdeling,2,0),\"?\"))","v":"-"},"Everon van den Heuvel"]
[null,null,"2019-12-05","PALL Rweg",43804.614583333336,43804.979166666664,"Hagos","van Vliet",null,{"$f":"IF(C334=\"\",\"\",INDEX(Validatie!$Q$2:$Q$6,MATCH(MOD(E334,1),Validatie!$P$2:$P$6,1)))","v":"Laat"},{"$f":"IF(C334=\"\",\"\",IFERROR(VLOOKUP(D334,DataMijnAfdeling,2,0),\"?\"))","v":"-"},"Hagos van Vliet"]
[null,null,"2019-12-05","PALL Rweg",43804.614583333336,43804.979166666664,"Davood","Smits",null,{"$f":"IF(C335=\"\",\"\",INDEX(Validatie!$Q$2:$Q$6,MATCH(MOD(E335,1),Validatie!$P$2:$P$6,1)))","v":"Laat"},{"$f":"IF(C335=\"\",\"\",IFERROR(VLOOKUP(D335,DataMijnAfdeling,2,0),\"?\"))","v":"-"},"Davood Smits"]
[null,null,"2019-12-05","PALL Rweg",43804.614583333336,43804.979166666664,"Arsenio","Mulder",null,{"$f":"IF(C336=\"\",\"\",INDEX(Validatie!$Q$2:$Q$6,MATCH(MOD(E336,1),Validatie!$P$2:$P$6,1)))","v":"Laat"},{"$f":"IF(C336=\"\",\"\",IFERROR(VLOOKUP(D336,DataMijnAfdeling,2,0),\"?\"))","v":"-"},"Arsenio Mulder"]
[null,null,"2019-12-05","PALL Rweg",43804.614583333336,43804.979166666664,"Saidou","Bosman",null,{"$f":"IF(C337=\"\",\"\",INDEX(Validatie!$Q$2:$Q$6,MATCH(MOD(E337,1),Validatie!$P$2:$P$6,1)))","v":"Laat"},{"$f":"IF(C337=\"\",\"\",IFERROR(VLOOKUP(D337,DataMijnAfdeling,2,0),\"?\"))","v":"-"},"Saidou Bosman"]
[null,null,"2019-12-05","PALL Rweg",43804.614583333336,43804.979166666664,"Olcay","de Vos",null,{"$f":"IF(C338=\"\",\"\",INDEX(Validatie!$Q$2:$Q$6,MATCH(MOD(E338,1),Validatie!$P$2:$P$6,1)))","v":"Laat"},{"$f":"IF(C338=\"\",\"\",IFERROR(VLOOKUP(D338,DataMijnAfdeling,2,0),\"?\"))","v":"-"},"Olcay de Vos"]
[null,null,"2019-12-05","PALL Rweg",43804.614583333336,43804.979166666664,"Wim","Vogel",null,{"$f":"IF(C339=\"\",\"\",INDEX(Validatie!$Q$2:$Q$6,MATCH(MOD(E339,1),Validatie!$P$2:$P$6,1)))","v":"Laat"},{"$f":"IF(C339=\"\",\"\",IFERROR(VLOOKUP(D339,DataMijnAfdeling,2,0),\"?\"))","v":"-"},"Wim Vogel"]
[null,null,"2019-12-05","PALL Rweg",43804.614583333336,43804.979166666664,"Sebastiaan","Mol",null,{"$f":"IF(C340=\"\",\"\",INDEX(Validatie!$Q$2:$Q$6,MATCH(MOD(E340,1),Validatie!$P$2:$P$6,1)))","v":"Laat"},{"$f":"IF(C340=\"\",\"\",IFERROR(VLOOKUP(D340,DataMijnAfdeling,2,0),\"?\"))","v":"-"},"Sebastiaan Mol"]
[null,null,"2019-12-05","PALL Rweg",43804.614583333336,43804.979166666664,"Amadou","Bakker",null,{"$f":"IF(C341=\"\",\"\",INDEX(Validatie!$Q$2:$Q$6,MATCH(MOD(E341,1),Validatie!$P$2:$P$6,1)))","v":"Laat"},{"$f":"IF(C341=\"\",\"\",IFERROR(VLOOKUP(D341,DataMijnAfdeling,2,0),\"?\"))","v":"-"},"Amadou Bakker"]
[null,null,"2019-12-05","PALL Rweg",43804.614583333336,43804.979166666664,"Bereket","Peters",null,{"$f":"IF(C342=\"\",\"\",INDEX(Validatie!$Q$2:$Q$6,MATCH(MOD(E342,1),Validatie!$P$2:$P$6,1)))","v":"Laat"},{"$f":"IF(C342=\"\",\"\",IFERROR(VLOOKUP(D342,DataMijnAfdeling,2,0),\"?\"))","v":"-"},"Bereket Peters"]
[null,null,"2019-12-05","PALL Rweg",43804.614583333336,43804.979166666664,"Quincy","de Koning",null,{"$f":"IF(C343=\"\",\"\",INDEX(Validatie!$Q$2:$Q$6,MATCH(MOD(E343,1),Validatie!$P$2:$P$6,1)))","v":"Laat"},{"$f":"IF(C343=\"\",\"\",IFERROR(VLOOKUP(D343,DataMijnAfdeling,2,0),\"?\"))","v":"-"},"Quincy de Koning"]
[null,null,"2019-12-05","PALL Rweg",43804.614583333336,43804.979166666664,"Wout","Van Goud",null,{"$f":"IF(C344=\"\",\"\",INDEX(Validatie!$Q$2:$Q$6,MATCH(MOD(E344,1),Validatie!$P$2:$P$6,1)))","v":"Laat"},{"$f":"IF(C344=\"\",\"\",IFERROR(VLOOKUP(D344,DataMijnAfdeling,2,0),\"?\"))","v":"-"},"Wout Van Goud"]
[null,null,"2019-12-05","PALL Rweg",43804.614583333336,43804.791666666664,"Fars","van de Veen",null,{"$f":"IF(C345=\"\",\"\",INDEX(Validatie!$Q$2:$Q$6,MATCH(MOD(E345,1),Validatie!$P$2:$P$6,1)))","v":"Laat"},{"$f":"IF(C345=\"\",\"\",IFERROR(VLOOKUP(D345,DataMijnAfdeling,2,0),\"?\"))","v":"-"},"Fars van de Veen"]
[null,null,"2019-12-05","PALL Rweg",43804.614583333336,43804.979166666664,"Charles","Dekker",null,{"$f":"IF(C346=\"\",\"\",INDEX(Validatie!$Q$2:$Q$6,MATCH(MOD(E346,1),Validatie!$P$2:$P$6,1)))","v":"Laat"},{"$f":"IF(C346=\"\",\"\",IFERROR(VLOOKUP(D346,DataMijnAfdeling,2,0),\"?\"))","v":"-"},"Charles Dekker"]
[null,null,"2019-12-05","PALL Rweg",43804.614583333336,43804.979166666664,"Henk","Koster",null,{"$f":"IF(C347=\"\",\"\",INDEX(Validatie!$Q$2:$Q$6,MATCH(MOD(E347,1),Validatie!$P$2:$P$6,1)))","v":"Laat"},{"$f":"IF(C347=\"\",\"\",IFERROR(VLOOKUP(D347,DataMijnAfdeling,2,0),\"?\"))","v":"-"},"Henk Koster"]
[null,null,"2019-12-05","PALL Rweg",43804.614583333336,43804.979166666664,"Ko","van de Brink",null,{"$f":"IF(C348=\"\",\"\",INDEX(Validatie!$Q$2:$Q$6,MATCH(MOD(E348,1),Validatie!$P$2:$P$6,1)))","v":"Laat"},{"$f":"IF(C348=\"\",\"\",IFERROR(VLOOKUP(D348,DataMijnAfdeling,2,0),\"?\"))","v":"-"},"Ko van de Brink"]
[null,null,"2019-12-05","PALL Rweg",43804.614583333336,43804.979166666664,"Haben","Willems",null,{"$f":"IF(C349=\"\",\"\",INDEX(Validatie!$Q$2:$Q$6,MATCH(MOD(E349,1),Validatie!$P$2:$P$6,1)))","v":"Laat"},{"$f":"IF(C349=\"\",\"\",IFERROR(VLOOKUP(D349,DataMijnAfdeling,2,0),\"?\"))","v":"-"},"Haben Willems"]
[null,null,"2019-12-05","PALL Rweg",43804.614583333336,43804.979166666664,"Moussa","Boer",null,{"$f":"IF(C350=\"\",\"\",INDEX(Validatie!$Q$2:$Q$6,MATCH(MOD(E350,1),Validatie!$P$2:$P$6,1)))","v":"Laat"},{"$f":"IF(C350=\"\",\"\",IFERROR(VLOOKUP(D350,DataMijnAfdeling,2,0),\"?\"))","v":"-"},"Moussa Boer"]
[null,null,"2019-12-05","PALL Rweg",43804.614583333336,43804.979166666664,"Viorel","Triest",null,{"$f":"IF(C351=\"\",\"\",INDEX(Validatie!$Q$2:$Q$6,MATCH(MOD(E351,1),Validatie!$P$2:$P$6,1)))","v":"Laat"},{"$f":"IF(C351=\"\",\"\",IFERROR(VLOOKUP(D351,DataMijnAfdeling,2,0),\"?\"))","v":"-"},"Viorel Triest"]
[null,null,"2019-12-05","PALL Rweg",43804.614583333336,43804.979166666664,"Robin","Evers",null,{"$f":"IF(C352=\"\",\"\",INDEX(Validatie!$Q$2:$Q$6,MATCH(MOD(E352,1),Validatie!$P$2:$P$6,1)))","v":"Laat"},{"$f":"IF(C352=\"\",\"\",IFERROR(VLOOKUP(D352,DataMijnAfdeling,2,0),\"?\"))","v":"-"},"Robin Evers"]
[null,null,"2019-12-05","SCHM",43804.614583333336,43804.979166666664,"Roy","van der Meulen",null,{"$f":"IF(C353=\"\",\"\",INDEX(Validatie!$Q$2:$Q$6,MATCH(MOD(E353,1),Validatie!$P$2:$P$6,1)))","v":"Laat"},{"$f":"IF(C353=\"\",\"\",IFERROR(VLOOKUP(D353,DataMijnAfdeling,2,0),\"?\"))","v":"SCHM"},"Roy van der Meulen"]
[null,null,"2019-12-05","SCHM AFV",43804.614583333336,43804.979166666664,"Jan","de Jonge",null,{"$f":"IF(C354=\"\",\"\",INDEX(Validatie!$Q$2:$Q$6,MATCH(MOD(E354,1),Validatie!$P$2:$P$6,1)))","v":"Laat"},{"$f":"IF(C354=\"\",\"\",IFERROR(VLOOKUP(D354,DataMijnAfdeling,2,0),\"?\"))","v":"AFV"},"Jan de Jonge"]
[null,null,"2019-12-05","SCHM AFV",43804.614583333336,43804.979166666664,"Boyan","van Leeuwen",null,{"$f":"IF(C355=\"\",\"\",INDEX(Validatie!$Q$2:$Q$6,MATCH(MOD(E355,1),Validatie!$P$2:$P$6,1)))","v":"Laat"},{"$f":"IF(C355=\"\",\"\",IFERROR(VLOOKUP(D355,DataMijnAfdeling,2,0),\"?\"))","v":"AFV"},"Boyan van Leeuwen"]
[null,null,"2019-12-05","SCHM AFV",43804.614583333336,43804.979166666664,"Sami","van der Horst",null,{"$f":"IF(C356=\"\",\"\",INDEX(Validatie!$Q$2:$Q$6,MATCH(MOD(E356,1),Validatie!$P$2:$P$6,1)))","v":"Laat"},{"$f":"IF(C356=\"\",\"\",IFERROR(VLOOKUP(D356,DataMijnAfdeling,2,0),\"?\"))","v":"AFV"},"Sami van der Horst"]
[null,null,"2019-12-05","SCHM AFV",43804.614583333336,43804.979166666664,"Henri","van Dam",null,{"$f":"IF(C357=\"\",\"\",INDEX(Validatie!$Q$2:$Q$6,MATCH(MOD(E357,1),Validatie!$P$2:$P$6,1)))","v":"Laat"},{"$f":"IF(C357=\"\",\"\",IFERROR(VLOOKUP(D357,DataMijnAfdeling,2,0),\"?\"))","v":"AFV"},"Henri van Dam"]
[null,null,"2019-12-05","SCHM AFV",43804.614583333336,43804.979166666664,"Michel","Jonker",null,{"$f":"IF(C358=\"\",\"\",INDEX(Validatie!$Q$2:$Q$6,MATCH(MOD(E358,1),Validatie!$P$2:$P$6,1)))","v":"Laat"},{"$f":"IF(C358=\"\",\"\",IFERROR(VLOOKUP(D358,DataMijnAfdeling,2,0),\"?\"))","v":"AFV"},"Michel Jonker"]
[null,null,"2019-12-05","TRSP",43804.614583333336,43804.979166666664,"Henk","Koster",null,{"$f":"IF(C359=\"\",\"\",INDEX(Validatie!$Q$2:$Q$6,MATCH(MOD(E359,1),Validatie!$P$2:$P$6,1)))","v":"Laat"},{"$f":"IF(C359=\"\",\"\",IFERROR(VLOOKUP(D359,DataMijnAfdeling,2,0),\"?\"))","v":"?"},"Henk Koster"]
[null,null,"2019-12-05","TRSP",43804.614583333336,43804.979166666664,"Anton","Smit",null,{"$f":"IF(C360=\"\",\"\",INDEX(Validatie!$Q$2:$Q$6,MATCH(MOD(E360,1),Validatie!$P$2:$P$6,1)))","v":"Laat"},{"$f":"IF(C360=\"\",\"\",IFERROR(VLOOKUP(D360,DataMijnAfdeling,2,0),\"?\"))","v":"?"},"Anton Smit"]
[null,null,"2019-12-05","PALL Rweg",43804.645833333336,43804.979166666664,"Yemane","Masout",null,{"$f":"IF(C361=\"\",\"\",INDEX(Validatie!$Q$2:$Q$6,MATCH(MOD(E361,1),Validatie!$P$2:$P$6,1)))","v":"Laat"},{"$f":"IF(C361=\"\",\"\",IFERROR(VLOOKUP(D361,DataMijnAfdeling,2,0),\"?\"))","v":"-"},"Yemane Masout"]
[null,null,"2019-12-05","SCHM HAS",43804.697916666664,43804.9375,"Paul","van Dongen",null,{"$f":"IF(C362=\"\",\"\",INDEX(Validatie!$Q$2:$Q$6,MATCH(MOD(E362,1),Validatie!$P$2:$P$6,1)))","v":"Laat"},{"$f":"IF(C362=\"\",\"\",IFERROR(VLOOKUP(D362,DataMijnAfdeling,2,0),\"?\"))","v":"HAS"},"Paul van Dongen"]
[null,null,"2019-12-05","SCHM",43804.916666666664,43805.28125,"Patrick","Bosch",null,{"$f":"IF(C363=\"\",\"\",INDEX(Validatie!$Q$2:$Q$6,MATCH(MOD(E363,1),Validatie!$P$2:$P$6,1)))","v":"Nacht"},{"$f":"IF(C363=\"\",\"\",IFERROR(VLOOKUP(D363,DataMijnAfdeling,2,0),\"?\"))","v":"SCHM"},"Patrick Bosch"]
[null,null,"2019-12-05","SCHM",43804.916666666664,43805.28125,"Rolinka","van den Bosch",null,{"$f":"IF(C364=\"\",\"\",INDEX(Validatie!$Q$2:$Q$6,MATCH(MOD(E364,1),Validatie!$P$2:$P$6,1)))","v":"Nacht"},{"$f":"IF(C364=\"\",\"\",IFERROR(VLOOKUP(D364,DataMijnAfdeling,2,0),\"?\"))","v":"SCHM"},"Rolinka van den Bosch"]
[null,null,"2019-12-05","SCHM",43804.916666666664,43805.28125,"Erik","de Haan",null,{"$f":"IF(C365=\"\",\"\",INDEX(Validatie!$Q$2:$Q$6,MATCH(MOD(E365,1),Validatie!$P$2:$P$6,1)))","v":"Nacht"},{"$f":"IF(C365=\"\",\"\",IFERROR(VLOOKUP(D365,DataMijnAfdeling,2,0),\"?\"))","v":"SCHM"},"Erik de Haan"]
[null,null,"2019-12-06","ABB ochtend ",43805.25,43805.614583333336,"Flavi","van der Heyden",null,{"$f":"IF(C366=\"\",\"\",INDEX(Validatie!$Q$2:$Q$6,MATCH(MOD(E366,1),Validatie!$P$2:$P$6,1)))","v":"Vroeg"},{"$f":"IF(C366=\"\",\"\",IFERROR(VLOOKUP(D366,DataMijnAfdeling,2,0),\"?\"))","v":"ABB"},"Flavi van der Heyden"]
[null,null,"2019-12-06","AFV HAS",43805.25,43805.40625,"Norbert","de Lange",null,{"$f":"IF(C367=\"\",\"\",INDEX(Validatie!$Q$2:$Q$6,MATCH(MOD(E367,1),Validatie!$P$2:$P$6,1)))","v":"Vroeg"},{"$f":"IF(C367=\"\",\"\",IFERROR(VLOOKUP(D367,DataMijnAfdeling,2,0),\"?\"))","v":"HAS"},"Norbert de Lange"]
[null,null,"2019-12-06","AFV MEP",43805.25,43805.614583333336,"Houcin","Huisman",null,{"$f":"IF(C368=\"\",\"\",INDEX(Validatie!$Q$2:$Q$6,MATCH(MOD(E368,1),Validatie!$P$2:$P$6,1)))","v":"Vroeg"},{"$f":"IF(C368=\"\",\"\",IFERROR(VLOOKUP(D368,DataMijnAfdeling,2,0),\"?\"))","v":"MEP"},"Houcin Huisman"]
[null,null,"2019-12-06","LCR ochtend",43805.25,43805.614583333336,"Wolter","De bolder",null,{"$f":"IF(C369=\"\",\"\",INDEX(Validatie!$Q$2:$Q$6,MATCH(MOD(E369,1),Validatie!$P$2:$P$6,1)))","v":"Vroeg"},{"$f":"IF(C369=\"\",\"\",IFERROR(VLOOKUP(D369,DataMijnAfdeling,2,0),\"?\"))","v":"LCR"},"Wolter De bolder"]
[null,null,"2019-12-06","PALL HAS",43805.25,43805.614583333336,"Henk","Koster",null,{"$f":"IF(C370=\"\",\"\",INDEX(Validatie!$Q$2:$Q$6,MATCH(MOD(E370,1),Validatie!$P$2:$P$6,1)))","v":"Vroeg"},{"$f":"IF(C370=\"\",\"\",IFERROR(VLOOKUP(D370,DataMijnAfdeling,2,0),\"?\"))","v":"-"},"Henk Koster"]
[null,null,"2019-12-06","PALL MEP",43805.25,43805.614583333336,"Latie","van Wijk",null,{"$f":"IF(C371=\"\",\"\",INDEX(Validatie!$Q$2:$Q$6,MATCH(MOD(E371,1),Validatie!$P$2:$P$6,1)))","v":"Vroeg"},{"$f":"IF(C371=\"\",\"\",IFERROR(VLOOKUP(D371,DataMijnAfdeling,2,0),\"?\"))","v":"-"},"Latie van Wijk"]
[null,null,"2019-12-06","PALL MEP",43805.25,43805.614583333336,"Michael","Gerritsen",null,{"$f":"IF(C372=\"\",\"\",INDEX(Validatie!$Q$2:$Q$6,MATCH(MOD(E372,1),Validatie!$P$2:$P$6,1)))","v":"Vroeg"},{"$f":"IF(C372=\"\",\"\",IFERROR(VLOOKUP(D372,DataMijnAfdeling,2,0),\"?\"))","v":"-"},"Michael Gerritsen"]
[null,null,"2019-12-06","PALL MEP",43805.25,43805.614583333336,"Abdurahman Ibrahim","de Vries",null,{"$f":"IF(C373=\"\",\"\",INDEX(Validatie!$Q$2:$Q$6,MATCH(MOD(E373,1),Validatie!$P$2:$P$6,1)))","v":"Vroeg"},{"$f":"IF(C373=\"\",\"\",IFERROR(VLOOKUP(D373,DataMijnAfdeling,2,0),\"?\"))","v":"-"},"Abdurahman Ibrahim de Vries"]
[null,null,"2019-12-06","PALL MEP",43805.25,43805.614583333336,"Hans","van de Ven ",null,{"$f":"IF(C374=\"\",\"\",INDEX(Validatie!$Q$2:$Q$6,MATCH(MOD(E374,1),Validatie!$P$2:$P$6,1)))","v":"Vroeg"},{"$f":"IF(C374=\"\",\"\",IFERROR(VLOOKUP(D374,DataMijnAfdeling,2,0),\"?\"))","v":"-"},"Hans van de Ven "]
[null,null,"2019-12-06","PALL MEP",43805.25,43805.614583333336,"Jeroen","Post",null,{"$f":"IF(C375=\"\",\"\",INDEX(Validatie!$Q$2:$Q$6,MATCH(MOD(E375,1),Validatie!$P$2:$P$6,1)))","v":"Vroeg"},{"$f":"IF(C375=\"\",\"\",IFERROR(VLOOKUP(D375,DataMijnAfdeling,2,0),\"?\"))","v":"-"},"Jeroen Post"]
[null,null,"2019-12-06","PALL Rweg",43805.25,43805.614583333336,"Akela","van Dijk",null,{"$f":"IF(C376=\"\",\"\",INDEX(Validatie!$Q$2:$Q$6,MATCH(MOD(E376,1),Validatie!$P$2:$P$6,1)))","v":"Vroeg"},{"$f":"IF(C376=\"\",\"\",IFERROR(VLOOKUP(D376,DataMijnAfdeling,2,0),\"?\"))","v":"-"},"Akela van Dijk"]
[null,null,"2019-12-06","PALL Rweg",43805.25,43805.614583333336,"Karrar","Kuiper",null,{"$f":"IF(C377=\"\",\"\",INDEX(Validatie!$Q$2:$Q$6,MATCH(MOD(E377,1),Validatie!$P$2:$P$6,1)))","v":"Vroeg"},{"$f":"IF(C377=\"\",\"\",IFERROR(VLOOKUP(D377,DataMijnAfdeling,2,0),\"?\"))","v":"-"},"Karrar Kuiper"]
[null,null,"2019-12-06","PALL Rweg",43805.25,43805.614583333336,"Sebastian","Kuijpers",null,{"$f":"IF(C378=\"\",\"\",INDEX(Validatie!$Q$2:$Q$6,MATCH(MOD(E378,1),Validatie!$P$2:$P$6,1)))","v":"Vroeg"},{"$f":"IF(C378=\"\",\"\",IFERROR(VLOOKUP(D378,DataMijnAfdeling,2,0),\"?\"))","v":"-"},"Sebastian Kuijpers"]
[null,null,"2019-12-06","PALL Rweg",43805.25,43805.614583333336,"Abdul","Jansen",null,{"$f":"IF(C379=\"\",\"\",INDEX(Validatie!$Q$2:$Q$6,MATCH(MOD(E379,1),Validatie!$P$2:$P$6,1)))","v":"Vroeg"},{"$f":"IF(C379=\"\",\"\",IFERROR(VLOOKUP(D379,DataMijnAfdeling,2,0),\"?\"))","v":"-"},"Abdul Jansen"]
[null,null,"2019-12-06","PALL Rweg",43805.25,43805.614583333336,"Apollonia","Meijer",null,{"$f":"IF(C380=\"\",\"\",INDEX(Validatie!$Q$2:$Q$6,MATCH(MOD(E380,1),Validatie!$P$2:$P$6,1)))","v":"Vroeg"},{"$f":"IF(C380=\"\",\"\",IFERROR(VLOOKUP(D380,DataMijnAfdeling,2,0),\"?\"))","v":"-"},"Apollonia Meijer"]
[null,null,"2019-12-06","PALL Rweg",43805.25,43805.614583333336,"Naoufel","van de Velde ",null,{"$f":"IF(C381=\"\",\"\",INDEX(Validatie!$Q$2:$Q$6,MATCH(MOD(E381,1),Validatie!$P$2:$P$6,1)))","v":"Vroeg"},{"$f":"IF(C381=\"\",\"\",IFERROR(VLOOKUP(D381,DataMijnAfdeling,2,0),\"?\"))","v":"-"},"Naoufel van de Velde "]
[null,null,"2019-12-06","PALL Rweg",43805.25,43805.614583333336,"Dennis","de Graaf",null,{"$f":"IF(C382=\"\",\"\",INDEX(Validatie!$Q$2:$Q$6,MATCH(MOD(E382,1),Validatie!$P$2:$P$6,1)))","v":"Vroeg"},{"$f":"IF(C382=\"\",\"\",IFERROR(VLOOKUP(D382,DataMijnAfdeling,2,0),\"?\"))","v":"-"},"Dennis de Graaf"]
[null,null,"2019-12-06","PALL Rweg",43805.25,43805.614583333336,"Jelte","van Veen",null,{"$f":"IF(C383=\"\",\"\",INDEX(Validatie!$Q$2:$Q$6,MATCH(MOD(E383,1),Validatie!$P$2:$P$6,1)))","v":"Vroeg"},{"$f":"IF(C383=\"\",\"\",IFERROR(VLOOKUP(D383,DataMijnAfdeling,2,0),\"?\"))","v":"-"},"Jelte van Veen"]
[null,null,"2019-12-06","PALL Rweg",43805.25,43805.614583333336,"Agathe","van de Berg ",null,{"$f":"IF(C384=\"\",\"\",INDEX(Validatie!$Q$2:$Q$6,MATCH(MOD(E384,1),Validatie!$P$2:$P$6,1)))","v":"Vroeg"},{"$f":"IF(C384=\"\",\"\",IFERROR(VLOOKUP(D384,DataMijnAfdeling,2,0),\"?\"))","v":"-"},"Agathe van de Berg "]
[null,null,"2019-12-06","PALL Rweg",43805.25,43805.614583333336,"Heruy","van de Wal ",null,{"$f":"IF(C385=\"\",\"\",INDEX(Validatie!$Q$2:$Q$6,MATCH(MOD(E385,1),Validatie!$P$2:$P$6,1)))","v":"Vroeg"},{"$f":"IF(C385=\"\",\"\",IFERROR(VLOOKUP(D385,DataMijnAfdeling,2,0),\"?\"))","v":"-"},"Heruy van de Wal "]
[null,null,"2019-12-06","PALL Rweg",43805.25,43805.614583333336,"Hassan","Verhoeven",null,{"$f":"IF(C386=\"\",\"\",INDEX(Validatie!$Q$2:$Q$6,MATCH(MOD(E386,1),Validatie!$P$2:$P$6,1)))","v":"Vroeg"},{"$f":"IF(C386=\"\",\"\",IFERROR(VLOOKUP(D386,DataMijnAfdeling,2,0),\"?\"))","v":"-"},"Hassan Verhoeven"]
[null,null,"2019-12-06","PALL Rweg",43805.25,43805.614583333336,"Samantha","Sanders",null,{"$f":"IF(C387=\"\",\"\",INDEX(Validatie!$Q$2:$Q$6,MATCH(MOD(E387,1),Validatie!$P$2:$P$6,1)))","v":"Vroeg"},{"$f":"IF(C387=\"\",\"\",IFERROR(VLOOKUP(D387,DataMijnAfdeling,2,0),\"?\"))","v":"-"},"Samantha Sanders"]
[null,null,"2019-12-06","PALL Rweg",43805.25,43805.614583333336,"Sied"," van der Pol",null,{"$f":"IF(C388=\"\",\"\",INDEX(Validatie!$Q$2:$Q$6,MATCH(MOD(E388,1),Validatie!$P$2:$P$6,1)))","v":"Vroeg"},{"$f":"IF(C388=\"\",\"\",IFERROR(VLOOKUP(D388,DataMijnAfdeling,2,0),\"?\"))","v":"-"},"Sied  van der Pol"]
[null,null,"2019-12-06","PALL Rweg",43805.25,43805.614583333336,"Jarek","Kuipers",null,{"$f":"IF(C389=\"\",\"\",INDEX(Validatie!$Q$2:$Q$6,MATCH(MOD(E389,1),Validatie!$P$2:$P$6,1)))","v":"Vroeg"},{"$f":"IF(C389=\"\",\"\",IFERROR(VLOOKUP(D389,DataMijnAfdeling,2,0),\"?\"))","v":"-"},"Jarek Kuipers"]
[null,null,"2019-12-06","PALL Rweg",43805.25,43805.614583333336,"Fars","van de Veen",null,{"$f":"IF(C390=\"\",\"\",INDEX(Validatie!$Q$2:$Q$6,MATCH(MOD(E390,1),Validatie!$P$2:$P$6,1)))","v":"Vroeg"},{"$f":"IF(C390=\"\",\"\",IFERROR(VLOOKUP(D390,DataMijnAfdeling,2,0),\"?\"))","v":"-"},"Fars van de Veen"]
[null,null,"2019-12-06","PALL Rweg",43805.25,43805.614583333336,"Mark","Vink",null,{"$f":"IF(C391=\"\",\"\",INDEX(Validatie!$Q$2:$Q$6,MATCH(MOD(E391,1),Validatie!$P$2:$P$6,1)))","v":"Vroeg"},{"$f":"IF(C391=\"\",\"\",IFERROR(VLOOKUP(D391,DataMijnAfdeling,2,0),\"?\"))","v":"-"},{"$f":"IF(C391=\"\",\"\",CONCATENATE(G391,\" \",H391))","v":"Mark Vink"}]
[null,null,"2019-12-06","PALL Rweg",43805.25,43805.614583333336,"Laszlo","Scholten",null,{"$f":"IF(C392=\"\",\"\",INDEX(Validatie!$Q$2:$Q$6,MATCH(MOD(E392,1),Validatie!$P$2:$P$6,1)))","v":"Vroeg"},{"$f":"IF(C392=\"\",\"\",IFERROR(VLOOKUP(D392,DataMijnAfdeling,2,0),\"?\"))","v":"-"},"Laszlo Scholten"]
[null,null,"2019-12-06","PALL Rweg",43805.25,43805.614583333336,"Abdiqadir","de Jong",null,{"$f":"IF(C393=\"\",\"\",INDEX(Validatie!$Q$2:$Q$6,MATCH(MOD(E393,1),Validatie!$P$2:$P$6,1)))","v":"Vroeg"},{"$f":"IF(C393=\"\",\"\",IFERROR(VLOOKUP(D393,DataMijnAfdeling,2,0),\"?\"))","v":"-"},"Abdiqadir de Jong"]
[null,null,"2019-12-06","PALL Rweg",43805.25,43805.614583333336,"Atobhran","de Groot",null,{"$f":"IF(C394=\"\",\"\",INDEX(Validatie!$Q$2:$Q$6,MATCH(MOD(E394,1),Validatie!$P$2:$P$6,1)))","v":"Vroeg"},{"$f":"IF(C394=\"\",\"\",IFERROR(VLOOKUP(D394,DataMijnAfdeling,2,0),\"?\"))","v":"-"},"Atobhran de Groot"]
[null,null,"2019-12-06","PALL Rweg",43805.25,43805.614583333336,"Mebrathu","Timmermans",null,{"$f":"IF(C395=\"\",\"\",INDEX(Validatie!$Q$2:$Q$6,MATCH(MOD(E395,1),Validatie!$P$2:$P$6,1)))","v":"Vroeg"},{"$f":"IF(C395=\"\",\"\",IFERROR(VLOOKUP(D395,DataMijnAfdeling,2,0),\"?\"))","v":"-"},"Mebrathu Timmermans"]
[null,null,"2019-12-06","PALL Rweg",43805.25,43805.614583333336,"Nexhmedi","Willemsen",null,{"$f":"IF(C396=\"\",\"\",INDEX(Validatie!$Q$2:$Q$6,MATCH(MOD(E396,1),Validatie!$P$2:$P$6,1)))","v":"Vroeg"},{"$f":"IF(C396=\"\",\"\",IFERROR(VLOOKUP(D396,DataMijnAfdeling,2,0),\"?\"))","v":"-"},"Nexhmedi Willemsen"]
[null,null,"2019-12-06","PALL Rweg",43805.25,43805.614583333336,"Swen","de Leeuw",null,{"$f":"IF(C397=\"\",\"\",INDEX(Validatie!$Q$2:$Q$6,MATCH(MOD(E397,1),Validatie!$P$2:$P$6,1)))","v":"Vroeg"},{"$f":"IF(C397=\"\",\"\",IFERROR(VLOOKUP(D397,DataMijnAfdeling,2,0),\"?\"))","v":"-"},"Swen de Leeuw"]
[null,null,"2019-12-06","PALL Rweg",43805.25,43805.614583333336,"Martijn","de Ruiter",null,{"$f":"IF(C398=\"\",\"\",INDEX(Validatie!$Q$2:$Q$6,MATCH(MOD(E398,1),Validatie!$P$2:$P$6,1)))","v":"Vroeg"},{"$f":"IF(C398=\"\",\"\",IFERROR(VLOOKUP(D398,DataMijnAfdeling,2,0),\"?\"))","v":"-"},"Martijn de Ruiter"]
[null,null,"2019-12-06","SCHM",43805.25,43805.614583333336,"Rachid","van der Laan",null,{"$f":"IF(C399=\"\",\"\",INDEX(Validatie!$Q$2:$Q$6,MATCH(MOD(E399,1),Validatie!$P$2:$P$6,1)))","v":"Vroeg"},{"$f":"IF(C399=\"\",\"\",IFERROR(VLOOKUP(D399,DataMijnAfdeling,2,0),\"?\"))","v":"SCHM"},"Rachid van der Laan"]
[null,null,"2019-12-06","SCHM",43805.25,43805.614583333336,"Evans","Vermeulen",null,{"$f":"IF(C400=\"\",\"\",INDEX(Validatie!$Q$2:$Q$6,MATCH(MOD(E400,1),Validatie!$P$2:$P$6,1)))","v":"Vroeg"},{"$f":"IF(C400=\"\",\"\",IFERROR(VLOOKUP(D400,DataMijnAfdeling,2,0),\"?\"))","v":"SCHM"},"Evans Vermeulen"]
[null,null,"2019-12-06","SCHM",43805.25,43805.614583333336,"Kevin","Veenstra",null,{"$f":"IF(C401=\"\",\"\",INDEX(Validatie!$Q$2:$Q$6,MATCH(MOD(E401,1),Validatie!$P$2:$P$6,1)))","v":"Vroeg"},{"$f":"IF(C401=\"\",\"\",IFERROR(VLOOKUP(D401,DataMijnAfdeling,2,0),\"?\"))","v":"SCHM"},"Kevin Veenstra"]
[null,null,"2019-12-06","SCHM AFV",43805.25,43805.614583333336,"Baki","Bos",null,{"$f":"IF(C402=\"\",\"\",INDEX(Validatie!$Q$2:$Q$6,MATCH(MOD(E402,1),Validatie!$P$2:$P$6,1)))","v":"Vroeg"},{"$f":"IF(C402=\"\",\"\",IFERROR(VLOOKUP(D402,DataMijnAfdeling,2,0),\"?\"))","v":"AFV"},"Baki Bos"]
[null,null,"2019-12-06","SCHM AFV",43805.25,43805.614583333336,"Ilker","Peeters",null,{"$f":"IF(C403=\"\",\"\",INDEX(Validatie!$Q$2:$Q$6,MATCH(MOD(E403,1),Validatie!$P$2:$P$6,1)))","v":"Vroeg"},{"$f":"IF(C403=\"\",\"\",IFERROR(VLOOKUP(D403,DataMijnAfdeling,2,0),\"?\"))","v":"AFV"},"Ilker Peeters"]
[null,null,"2019-12-06","SCHM AFV",43805.25,43805.614583333336,"Miquel","van Loon",null,{"$f":"IF(C404=\"\",\"\",INDEX(Validatie!$Q$2:$Q$6,MATCH(MOD(E404,1),Validatie!$P$2:$P$6,1)))","v":"Vroeg"},{"$f":"IF(C404=\"\",\"\",IFERROR(VLOOKUP(D404,DataMijnAfdeling,2,0),\"?\"))","v":"AFV"},"Miquel van Loon"]
[null,null,"2019-12-06","SCHM AFV",43805.25,43805.614583333336,"Klaas","Kramer",null,{"$f":"IF(C405=\"\",\"\",INDEX(Validatie!$Q$2:$Q$6,MATCH(MOD(E405,1),Validatie!$P$2:$P$6,1)))","v":"Vroeg"},{"$f":"IF(C405=\"\",\"\",IFERROR(VLOOKUP(D405,DataMijnAfdeling,2,0),\"?\"))","v":"AFV"},"Klaas Kramer"]
[null,null,"2019-12-06","SCHM AFV",43805.25,43805.614583333336,"Sebastiaan","Mol",null,{"$f":"IF(C406=\"\",\"\",INDEX(Validatie!$Q$2:$Q$6,MATCH(MOD(E406,1),Validatie!$P$2:$P$6,1)))","v":"Vroeg"},{"$f":"IF(C406=\"\",\"\",IFERROR(VLOOKUP(D406,DataMijnAfdeling,2,0),\"?\"))","v":"AFV"},"Sebastiaan Mol"]
[null,null,"2019-12-06","TRSP",43805.25,43805.614583333336,"Emsud","Kok",null,{"$f":"IF(C407=\"\",\"\",INDEX(Validatie!$Q$2:$Q$6,MATCH(MOD(E407,1),Validatie!$P$2:$P$6,1)))","v":"Vroeg"},{"$f":"IF(C407=\"\",\"\",IFERROR(VLOOKUP(D407,DataMijnAfdeling,2,0),\"?\"))","v":"?"},"Emsud Kok"]
[null,null,"2019-12-06","TRSP",43805.25,43805.614583333336,"Reinder","Koning",null,{"$f":"IF(C408=\"\",\"\",INDEX(Validatie!$Q$2:$Q$6,MATCH(MOD(E408,1),Validatie!$P$2:$P$6,1)))","v":"Vroeg"},{"$f":"IF(C408=\"\",\"\",IFERROR(VLOOKUP(D408,DataMijnAfdeling,2,0),\"?\"))","v":"?"},"Reinder Koning"]
[null,null,"2019-12-06","AFV MEP",43805.291666666664,43805.65625,"Rudolf","Hofman",null,{"$f":"IF(C409=\"\",\"\",INDEX(Validatie!$Q$2:$Q$6,MATCH(MOD(E409,1),Validatie!$P$2:$P$6,1)))","v":"Vroeg"},{"$f":"IF(C409=\"\",\"\",IFERROR(VLOOKUP(D409,DataMijnAfdeling,2,0),\"?\"))","v":"MEP"},"Rudolf Hofman"]
[null,null,"2019-12-06","PALL Rweg",43805.3125,43805.677083333336,"Hilko","Prins",null,{"$f":"IF(C410=\"\",\"\",INDEX(Validatie!$Q$2:$Q$6,MATCH(MOD(E410,1),Validatie!$P$2:$P$6,1)))","v":"Vroeg"},{"$f":"IF(C410=\"\",\"\",IFERROR(VLOOKUP(D410,DataMijnAfdeling,2,0),\"?\"))","v":"-"},"Hilko Prins"]
[null,null,"2019-12-06","TRSP",43805.333333333336,43805.697916666664,"Harrie","Hoekstra",null,{"$f":"IF(C411=\"\",\"\",INDEX(Validatie!$Q$2:$Q$6,MATCH(MOD(E411,1),Validatie!$P$2:$P$6,1)))","v":"Vroeg"},{"$f":"IF(C411=\"\",\"\",IFERROR(VLOOKUP(D411,DataMijnAfdeling,2,0),\"?\"))","v":"?"},"Harrie Hoekstra"]
[null,null,"2019-12-06","SCHM HAS",43805.40625,43805.614583333336,"Norbert","de Lange",null,{"$f":"IF(C412=\"\",\"\",INDEX(Validatie!$Q$2:$Q$6,MATCH(MOD(E412,1),Validatie!$P$2:$P$6,1)))","v":"Vroeg"},{"$f":"IF(C412=\"\",\"\",IFERROR(VLOOKUP(D412,DataMijnAfdeling,2,0),\"?\"))","v":"HAS"},"Norbert de Lange"]
[null,null,"2019-12-06","ABB middag",43805.572916666664,43805.9375,"Trienko","Spooren",null,{"$f":"IF(C413=\"\",\"\",INDEX(Validatie!$Q$2:$Q$6,MATCH(MOD(E413,1),Validatie!$P$2:$P$6,1)))","v":"Laat"},{"$f":"IF(C413=\"\",\"\",IFERROR(VLOOKUP(D413,DataMijnAfdeling,2,0),\"?\"))","v":"ABB"},"Trienko Spooren"]
[null,null,"2019-12-06","AFV HAS",43805.572916666664,43805.697916666664,"Paul","van Dongen",null,{"$f":"IF(C414=\"\",\"\",INDEX(Validatie!$Q$2:$Q$6,MATCH(MOD(E414,1),Validatie!$P$2:$P$6,1)))","v":"Laat"},{"$f":"IF(C414=\"\",\"\",IFERROR(VLOOKUP(D414,DataMijnAfdeling,2,0),\"?\"))","v":"HAS"},"Paul van Dongen"]
[null,null,"2019-12-06","AFV MEP",43805.572916666664,43805.9375,"Rijk","van Doorn",null,{"$f":"IF(C415=\"\",\"\",INDEX(Validatie!$Q$2:$Q$6,MATCH(MOD(E415,1),Validatie!$P$2:$P$6,1)))","v":"Laat"},{"$f":"IF(C415=\"\",\"\",IFERROR(VLOOKUP(D415,DataMijnAfdeling,2,0),\"?\"))","v":"MEP"},"Rijk van Doorn"]
[null,null,"2019-12-06","LCR middag",43805.572916666664,43805.9375,"Christiaan","de Wit",null,{"$f":"IF(C416=\"\",\"\",INDEX(Validatie!$Q$2:$Q$6,MATCH(MOD(E416,1),Validatie!$P$2:$P$6,1)))","v":"Laat"},{"$f":"IF(C416=\"\",\"\",IFERROR(VLOOKUP(D416,DataMijnAfdeling,2,0),\"?\"))","v":"LCR"},"Christiaan de Wit"]
[null,null,"2019-12-06","PALL MEP",43805.614583333336,43805.979166666664,"Wenaron","Kurkema",null,{"$f":"IF(C417=\"\",\"\",INDEX(Validatie!$Q$2:$Q$6,MATCH(MOD(E417,1),Validatie!$P$2:$P$6,1)))","v":"Laat"},{"$f":"IF(C417=\"\",\"\",IFERROR(VLOOKUP(D417,DataMijnAfdeling,2,0),\"?\"))","v":"-"},"Wenaron Kurkema"]
[null,null,"2019-12-06","PALL MEP",43805.614583333336,43805.979166666664,"Engin","Jacobs",null,{"$f":"IF(C418=\"\",\"\",INDEX(Validatie!$Q$2:$Q$6,MATCH(MOD(E418,1),Validatie!$P$2:$P$6,1)))","v":"Laat"},{"$f":"IF(C418=\"\",\"\",IFERROR(VLOOKUP(D418,DataMijnAfdeling,2,0),\"?\"))","v":"-"},"Engin Jacobs"]
[null,null,"2019-12-06","PALL MEP",43805.614583333336,43805.979166666664,"Salahadin","Wolters",null,{"$f":"IF(C419=\"\",\"\",INDEX(Validatie!$Q$2:$Q$6,MATCH(MOD(E419,1),Validatie!$P$2:$P$6,1)))","v":"Laat"},{"$f":"IF(C419=\"\",\"\",IFERROR(VLOOKUP(D419,DataMijnAfdeling,2,0),\"?\"))","v":"-"},"Salahadin Wolters"]
[null,null,"2019-12-06","PALL MEP",43805.614583333336,43805.979166666664,"Dikkie","van der Meer",null,{"$f":"IF(C420=\"\",\"\",INDEX(Validatie!$Q$2:$Q$6,MATCH(MOD(E420,1),Validatie!$P$2:$P$6,1)))","v":"Laat"},{"$f":"IF(C420=\"\",\"\",IFERROR(VLOOKUP(D420,DataMijnAfdeling,2,0),\"?\"))","v":"-"},"Dikkie van der Meer"]
[null,null,"2019-12-06","PALL MEP",43805.614583333336,43805.979166666664,"Rene","van der Velden",null,{"$f":"IF(C421=\"\",\"\",INDEX(Validatie!$Q$2:$Q$6,MATCH(MOD(E421,1),Validatie!$P$2:$P$6,1)))","v":"Laat"},{"$f":"IF(C421=\"\",\"\",IFERROR(VLOOKUP(D421,DataMijnAfdeling,2,0),\"?\"))","v":"-"},"Rene van der Velden"]
[null,null,"2019-12-06","PALL MEP",43805.614583333336,43805.979166666664,"Richard","Driessen",null,{"$f":"IF(C422=\"\",\"\",INDEX(Validatie!$Q$2:$Q$6,MATCH(MOD(E422,1),Validatie!$P$2:$P$6,1)))","v":"Laat"},{"$f":"IF(C422=\"\",\"\",IFERROR(VLOOKUP(D422,DataMijnAfdeling,2,0),\"?\"))","v":"-"},"Richard Driessen"]
[null,null,"2019-12-06","PALL Rweg",43805.614583333336,43805.979166666664,"Felicia","van den Broek",null,{"$f":"IF(C423=\"\",\"\",INDEX(Validatie!$Q$2:$Q$6,MATCH(MOD(E423,1),Validatie!$P$2:$P$6,1)))","v":"Laat"},{"$f":"IF(C423=\"\",\"\",IFERROR(VLOOKUP(D423,DataMijnAfdeling,2,0),\"?\"))","v":"-"},"Felicia van den Broek"]
[null,null,"2019-12-06","PALL Rweg",43805.614583333336,43805.979166666664,"Gerrit","van Beek",null,{"$f":"IF(C424=\"\",\"\",INDEX(Validatie!$Q$2:$Q$6,MATCH(MOD(E424,1),Validatie!$P$2:$P$6,1)))","v":"Laat"},{"$f":"IF(C424=\"\",\"\",IFERROR(VLOOKUP(D424,DataMijnAfdeling,2,0),\"?\"))","v":"-"},"Gerrit van Beek"]
[null,null,"2019-12-06","PALL Rweg",43805.614583333336,43805.979166666664,"Shawn","Molenaar",null,{"$f":"IF(C425=\"\",\"\",INDEX(Validatie!$Q$2:$Q$6,MATCH(MOD(E425,1),Validatie!$P$2:$P$6,1)))","v":"Laat"},{"$f":"IF(C425=\"\",\"\",IFERROR(VLOOKUP(D425,DataMijnAfdeling,2,0),\"?\"))","v":"-"},"Shawn Molenaar"]
[null,null,"2019-12-06","PALL Rweg",43805.614583333336,43805.979166666664,"Elroy","van der Linden",null,{"$f":"IF(C426=\"\",\"\",INDEX(Validatie!$Q$2:$Q$6,MATCH(MOD(E426,1),Validatie!$P$2:$P$6,1)))","v":"Laat"},{"$f":"IF(C426=\"\",\"\",IFERROR(VLOOKUP(D426,DataMijnAfdeling,2,0),\"?\"))","v":"-"},"Elroy van der Linden"]
[null,null,"2019-12-06","PALL Rweg",43805.614583333336,43805.979166666664,"Everon","van den Heuvel",null,{"$f":"IF(C427=\"\",\"\",INDEX(Validatie!$Q$2:$Q$6,MATCH(MOD(E427,1),Validatie!$P$2:$P$6,1)))","v":"Laat"},{"$f":"IF(C427=\"\",\"\",IFERROR(VLOOKUP(D427,DataMijnAfdeling,2,0),\"?\"))","v":"-"},"Everon van den Heuvel"]
[null,null,"2019-12-06","PALL Rweg",43805.614583333336,43805.979166666664,"Hagos","van Vliet",null,{"$f":"IF(C428=\"\",\"\",INDEX(Validatie!$Q$2:$Q$6,MATCH(MOD(E428,1),Validatie!$P$2:$P$6,1)))","v":"Laat"},{"$f":"IF(C428=\"\",\"\",IFERROR(VLOOKUP(D428,DataMijnAfdeling,2,0),\"?\"))","v":"-"},"Hagos van Vliet"]
[null,null,"2019-12-06","PALL Rweg",43805.614583333336,43805.979166666664,"Davood","Smits",null,{"$f":"IF(C429=\"\",\"\",INDEX(Validatie!$Q$2:$Q$6,MATCH(MOD(E429,1),Validatie!$P$2:$P$6,1)))","v":"Laat"},{"$f":"IF(C429=\"\",\"\",IFERROR(VLOOKUP(D429,DataMijnAfdeling,2,0),\"?\"))","v":"-"},"Davood Smits"]
[null,null,"2019-12-06","PALL Rweg",43805.614583333336,43805.979166666664,"Arsenio","Mulder",null,{"$f":"IF(C430=\"\",\"\",INDEX(Validatie!$Q$2:$Q$6,MATCH(MOD(E430,1),Validatie!$P$2:$P$6,1)))","v":"Laat"},{"$f":"IF(C430=\"\",\"\",IFERROR(VLOOKUP(D430,DataMijnAfdeling,2,0),\"?\"))","v":"-"},"Arsenio Mulder"]
[null,null,"2019-12-06","PALL Rweg",43805.614583333336,43805.979166666664,"Viorel","Triest",null,{"$f":"IF(C431=\"\",\"\",INDEX(Validatie!$Q$2:$Q$6,MATCH(MOD(E431,1),Validatie!$P$2:$P$6,1)))","v":"Laat"},{"$f":"IF(C431=\"\",\"\",IFERROR(VLOOKUP(D431,DataMijnAfdeling,2,0),\"?\"))","v":"-"},"Viorel Triest"]
[null,null,"2019-12-06","PALL Rweg",43805.614583333336,43805.979166666664,"Saidou","Bosman",null,{"$f":"IF(C432=\"\",\"\",INDEX(Validatie!$Q$2:$Q$6,MATCH(MOD(E432,1),Validatie!$P$2:$P$6,1)))","v":"Laat"},{"$f":"IF(C432=\"\",\"\",IFERROR(VLOOKUP(D432,DataMijnAfdeling,2,0),\"?\"))","v":"-"},"Saidou Bosman"]
[null,null,"2019-12-06","PALL Rweg",43805.614583333336,43805.979166666664,"Olcay","de Vos",null,{"$f":"IF(C433=\"\",\"\",INDEX(Validatie!$Q$2:$Q$6,MATCH(MOD(E433,1),Validatie!$P$2:$P$6,1)))","v":"Laat"},{"$f":"IF(C433=\"\",\"\",IFERROR(VLOOKUP(D433,DataMijnAfdeling,2,0),\"?\"))","v":"-"},"Olcay de Vos"]
[null,null,"2019-12-06","PALL Rweg",43805.614583333336,43805.979166666664,"Wim","Vogel",null,{"$f":"IF(C434=\"\",\"\",INDEX(Validatie!$Q$2:$Q$6,MATCH(MOD(E434,1),Validatie!$P$2:$P$6,1)))","v":"Laat"},{"$f":"IF(C434=\"\",\"\",IFERROR(VLOOKUP(D434,DataMijnAfdeling,2,0),\"?\"))","v":"-"},"Wim Vogel"]
[null,null,"2019-12-06","PALL Rweg",43805.614583333336,43805.979166666664,"Sebastiaan","Mol",null,{"$f":"IF(C435=\"\",\"\",INDEX(Validatie!$Q$2:$Q$6,MATCH(MOD(E435,1),Validatie!$P$2:$P$6,1)))","v":"Laat"},{"$f":"IF(C435=\"\",\"\",IFERROR(VLOOKUP(D435,DataMijnAfdeling,2,0),\"?\"))","v":"-"},"Sebastiaan Mol"]
[null,null,"2019-12-06","PALL Rweg",43805.614583333336,43805.979166666664,"Amadou","Bakker",null,{"$f":"IF(C436=\"\",\"\",INDEX(Validatie!$Q$2:$Q$6,MATCH(MOD(E436,1),Validatie!$P$2:$P$6,1)))","v":"Laat"},{"$f":"IF(C436=\"\",\"\",IFERROR(VLOOKUP(D436,DataMijnAfdeling,2,0),\"?\"))","v":"-"},"Amadou Bakker"]
[null,null,"2019-12-06","PALL Rweg",43805.614583333336,43805.979166666664,"Bereket","Peters",null,{"$f":"IF(C437=\"\",\"\",INDEX(Validatie!$Q$2:$Q$6,MATCH(MOD(E437,1),Validatie!$P$2:$P$6,1)))","v":"Laat"},{"$f":"IF(C437=\"\",\"\",IFERROR(VLOOKUP(D437,DataMijnAfdeling,2,0),\"?\"))","v":"-"},"Bereket Peters"]
[null,null,"2019-12-06","PALL Rweg",43805.614583333336,43805.979166666664,"Quincy","de Koning",null,{"$f":"IF(C438=\"\",\"\",INDEX(Validatie!$Q$2:$Q$6,MATCH(MOD(E438,1),Validatie!$P$2:$P$6,1)))","v":"Laat"},{"$f":"IF(C438=\"\",\"\",IFERROR(VLOOKUP(D438,DataMijnAfdeling,2,0),\"?\"))","v":"-"},"Quincy de Koning"]
[null,null,"2019-12-06","PALL Rweg",43805.614583333336,43805.979166666664,"Wout","Van Goud",null,{"$f":"IF(C439=\"\",\"\",INDEX(Validatie!$Q$2:$Q$6,MATCH(MOD(E439,1),Validatie!$P$2:$P$6,1)))","v":"Laat"},{"$f":"IF(C439=\"\",\"\",IFERROR(VLOOKUP(D439,DataMijnAfdeling,2,0),\"?\"))","v":"-"},"Wout Van Goud"]
[null,null,"2019-12-06","PALL Rweg",43805.614583333336,43805.979166666664,"Fetehawi","de Bruyn",null,{"$f":"IF(C440=\"\",\"\",INDEX(Validatie!$Q$2:$Q$6,MATCH(MOD(E440,1),Validatie!$P$2:$P$6,1)))","v":"Laat"},{"$f":"IF(C440=\"\",\"\",IFERROR(VLOOKUP(D440,DataMijnAfdeling,2,0),\"?\"))","v":"-"},"Fetehawi de Bruyn"]
[null,null,"2019-12-06","PALL Rweg",43805.614583333336,43805.979166666664,"Charles","Dekker",null,{"$f":"IF(C441=\"\",\"\",INDEX(Validatie!$Q$2:$Q$6,MATCH(MOD(E441,1),Validatie!$P$2:$P$6,1)))","v":"Laat"},{"$f":"IF(C441=\"\",\"\",IFERROR(VLOOKUP(D441,DataMijnAfdeling,2,0),\"?\"))","v":"-"},"Charles Dekker"]
[null,null,"2019-12-06","PALL Rweg",43805.614583333336,43805.979166666664,"Henk","Koster",null,{"$f":"IF(C442=\"\",\"\",INDEX(Validatie!$Q$2:$Q$6,MATCH(MOD(E442,1),Validatie!$P$2:$P$6,1)))","v":"Laat"},{"$f":"IF(C442=\"\",\"\",IFERROR(VLOOKUP(D442,DataMijnAfdeling,2,0),\"?\"))","v":"-"},"Henk Koster"]
[null,null,"2019-12-06","PALL Rweg",43805.614583333336,43805.979166666664,"Ko","van de Brink",null,{"$f":"IF(C443=\"\",\"\",INDEX(Validatie!$Q$2:$Q$6,MATCH(MOD(E443,1),Validatie!$P$2:$P$6,1)))","v":"Laat"},{"$f":"IF(C443=\"\",\"\",IFERROR(VLOOKUP(D443,DataMijnAfdeling,2,0),\"?\"))","v":"-"},"Ko van de Brink"]
[null,null,"2019-12-06","PALL Rweg",43805.614583333336,43805.979166666664,"Robin","Evers",null,{"$f":"IF(C444=\"\",\"\",INDEX(Validatie!$Q$2:$Q$6,MATCH(MOD(E444,1),Validatie!$P$2:$P$6,1)))","v":"Laat"},{"$f":"IF(C444=\"\",\"\",IFERROR(VLOOKUP(D444,DataMijnAfdeling,2,0),\"?\"))","v":"-"},"Robin Evers"]
[null,null,"2019-12-06","SCHM",43805.614583333336,43805.979166666664,"Roy","van der Meulen",null,{"$f":"IF(C445=\"\",\"\",INDEX(Validatie!$Q$2:$Q$6,MATCH(MOD(E445,1),Validatie!$P$2:$P$6,1)))","v":"Laat"},{"$f":"IF(C445=\"\",\"\",IFERROR(VLOOKUP(D445,DataMijnAfdeling,2,0),\"?\"))","v":"SCHM"},"Roy van der Meulen"]
[null,null,"2019-12-06","SCHM",43805.614583333336,43805.979166666664,"Piet","Schipper",null,{"$f":"IF(C446=\"\",\"\",INDEX(Validatie!$Q$2:$Q$6,MATCH(MOD(E446,1),Validatie!$P$2:$P$6,1)))","v":"Laat"},{"$f":"IF(C446=\"\",\"\",IFERROR(VLOOKUP(D446,DataMijnAfdeling,2,0),\"?\"))","v":"SCHM"},"Piet Schipper"]
[null,null,"2019-12-06","SCHM AFV",43805.614583333336,43805.979166666664,"Jan","de Jonge",null,{"$f":"IF(C447=\"\",\"\",INDEX(Validatie!$Q$2:$Q$6,MATCH(MOD(E447,1),Validatie!$P$2:$P$6,1)))","v":"Laat"},{"$f":"IF(C447=\"\",\"\",IFERROR(VLOOKUP(D447,DataMijnAfdeling,2,0),\"?\"))","v":"AFV"},"Jan de Jonge"]
[null,null,"2019-12-06","SCHM AFV",43805.614583333336,43805.979166666664,"Boyan","van Leeuwen",null,{"$f":"IF(C448=\"\",\"\",INDEX(Validatie!$Q$2:$Q$6,MATCH(MOD(E448,1),Validatie!$P$2:$P$6,1)))","v":"Laat"},{"$f":"IF(C448=\"\",\"\",IFERROR(VLOOKUP(D448,DataMijnAfdeling,2,0),\"?\"))","v":"AFV"},"Boyan van Leeuwen"]
[null,null,"2019-12-06","SCHM AFV",43805.614583333336,43805.979166666664,"Sami","van der Horst",null,{"$f":"IF(C449=\"\",\"\",INDEX(Validatie!$Q$2:$Q$6,MATCH(MOD(E449,1),Validatie!$P$2:$P$6,1)))","v":"Laat"},{"$f":"IF(C449=\"\",\"\",IFERROR(VLOOKUP(D449,DataMijnAfdeling,2,0),\"?\"))","v":"AFV"},"Sami van der Horst"]
[null,null,"2019-12-06","SCHM AFV",43805.614583333336,43805.979166666664,"Henri","van Dam",null,{"$f":"IF(C450=\"\",\"\",INDEX(Validatie!$Q$2:$Q$6,MATCH(MOD(E450,1),Validatie!$P$2:$P$6,1)))","v":"Laat"},{"$f":"IF(C450=\"\",\"\",IFERROR(VLOOKUP(D450,DataMijnAfdeling,2,0),\"?\"))","v":"AFV"},"Henri van Dam"]
[null,null,"2019-12-06","SCHM AFV",43805.614583333336,43805.979166666664,"Michel","Jonker",null,{"$f":"IF(C451=\"\",\"\",INDEX(Validatie!$Q$2:$Q$6,MATCH(MOD(E451,1),Validatie!$P$2:$P$6,1)))","v":"Laat"},{"$f":"IF(C451=\"\",\"\",IFERROR(VLOOKUP(D451,DataMijnAfdeling,2,0),\"?\"))","v":"AFV"},"Michel Jonker"]
[null,null,"2019-12-06","TRSP",43805.614583333336,43805.979166666664,"Henk","Koster",null,{"$f":"IF(C452=\"\",\"\",INDEX(Validatie!$Q$2:$Q$6,MATCH(MOD(E452,1),Validatie!$P$2:$P$6,1)))","v":"Laat"},{"$f":"IF(C452=\"\",\"\",IFERROR(VLOOKUP(D452,DataMijnAfdeling,2,0),\"?\"))","v":"?"},"Henk Koster"]
[null,null,"2019-12-06","TRSP",43805.614583333336,43805.979166666664,"Anton","Smit",null,{"$f":"IF(C453=\"\",\"\",INDEX(Validatie!$Q$2:$Q$6,MATCH(MOD(E453,1),Validatie!$P$2:$P$6,1)))","v":"Laat"},{"$f":"IF(C453=\"\",\"\",IFERROR(VLOOKUP(D453,DataMijnAfdeling,2,0),\"?\"))","v":"?"},"Anton Smit"]
[null,null,"2019-12-06","PALL Rweg",43805.666666666664,43805.979166666664,"Robel","Hermans",null,{"$f":"IF(C454=\"\",\"\",INDEX(Validatie!$Q$2:$Q$6,MATCH(MOD(E454,1),Validatie!$P$2:$P$6,1)))","v":"Laat"},{"$f":"IF(C454=\"\",\"\",IFERROR(VLOOKUP(D454,DataMijnAfdeling,2,0),\"?\"))","v":"-"},"Robel Hermans"]
[null,null,"2019-12-06","SCHM HAS",43805.697916666664,43805.9375,"Paul","van Dongen",null,{"$f":"IF(C455=\"\",\"\",INDEX(Validatie!$Q$2:$Q$6,MATCH(MOD(E455,1),Validatie!$P$2:$P$6,1)))","v":"Laat"},{"$f":"IF(C455=\"\",\"\",IFERROR(VLOOKUP(D455,DataMijnAfdeling,2,0),\"?\"))","v":"HAS"},{"$f":"IF(C455=\"\",\"\",CONCATENATE(G455,\" \",H455))","v":"Paul van Dongen"}]
[null,null,"2019-12-07","ABB weekenddienst",43806.333333333336,43806.875,"Arkan","de Boer",null,{"$f":"IF(C456=\"\",\"\",INDEX(Validatie!$Q$2:$Q$6,MATCH(MOD(E456,1),Validatie!$P$2:$P$6,1)))","v":"Vroeg"},{"$f":"IF(C456=\"\",\"\",IFERROR(VLOOKUP(D456,DataMijnAfdeling,2,0),\"?\"))","v":"ABB"},"Arkan de Boer"]
[null,null,"2019-12-08","ABB weekenddienst",43807.333333333336,43807.614583333336,"Baki","Bos",null,{"$f":"IF(C457=\"\",\"\",INDEX(Validatie!$Q$2:$Q$6,MATCH(MOD(E457,1),Validatie!$P$2:$P$6,1)))","v":"Vroeg"},{"$f":"IF(C457=\"\",\"\",IFERROR(VLOOKUP(D457,DataMijnAfdeling,2,0),\"?\"))","v":"ABB"},"Baki Bos"]
[null,null,"2019-12-08","ABB middag",43807.572916666664,43807.9375,"Flavi","van der Heyden",null,{"$f":"IF(C458=\"\",\"\",INDEX(Validatie!$Q$2:$Q$6,MATCH(MOD(E458,1),Validatie!$P$2:$P$6,1)))","v":"Laat"},{"$f":"IF(C458=\"\",\"\",IFERROR(VLOOKUP(D458,DataMijnAfdeling,2,0),\"?\"))","v":"ABB"},"Flavi van der Heyden"]
[null,null,"2019-12-08","SCHM",43807.999305555553,43808.364583333336,"Rachid","van der Laan",null,{"$f":"IF(C459=\"\",\"\",INDEX(Validatie!$Q$2:$Q$6,MATCH(MOD(E459,1),Validatie!$P$2:$P$6,1)))","v":"Nacht"},{"$f":"IF(C459=\"\",\"\",IFERROR(VLOOKUP(D459,DataMijnAfdeling,2,0),\"?\"))","v":"SCHM"},"Rachid van der Laan"]
[null,null,"2019-12-08","SCHM",43807.999305555553,43808.364583333336,"Evans","Vermeulen",null,{"$f":"IF(C460=\"\",\"\",INDEX(Validatie!$Q$2:$Q$6,MATCH(MOD(E460,1),Validatie!$P$2:$P$6,1)))","v":"Nacht"},{"$f":"IF(C460=\"\",\"\",IFERROR(VLOOKUP(D460,DataMijnAfdeling,2,0),\"?\"))","v":"SCHM"},"Evans Vermeulen"]
[null,null,"2019-12-08","SCHM",43807.999305555553,43808.364583333336,"Kevin","Veenstra",null,{"$f":"IF(C461=\"\",\"\",INDEX(Validatie!$Q$2:$Q$6,MATCH(MOD(E461,1),Validatie!$P$2:$P$6,1)))","v":"Nacht"},{"$f":"IF(C461=\"\",\"\",IFERROR(VLOOKUP(D461,DataMijnAfdeling,2,0),\"?\"))","v":"SCHM"},"Kevin Veenstra"]
[null,null,null,null,null,null,null,null,null,{"$f":"IF(C462=\"\",\"\",INDEX(Validatie!$Q$2:$Q$6,MATCH(MOD(E462,1),Validatie!$P$2:$P$6,1)))","v":""},{"$f":"IF(C462=\"\",\"\",IFERROR(VLOOKUP(D462,DataMijnAfdeling,2,0),\"?\"))","v":""},""]
[null,null,null,null,null,null,null,null,null,{"$f":"IF(C463=\"\",\"\",INDEX(Validatie!$Q$2:$Q$6,MATCH(MOD(E463,1),Validatie!$P$2:$P$6,1)))","v":""},{"$f":"IF(C463=\"\",\"\",IFERROR(VLOOKUP(D463,DataMijnAfdeling,2,0),\"?\"))","v":""},""]
[null,null,null,null,null,null,null,null,null,{"$f":"IF(C464=\"\",\"\",INDEX(Validatie!$Q$2:$Q$6,MATCH(MOD(E464,1),Validatie!$P$2:$P$6,1)))","v":""},{"$f":"IF(C464=\"\",\"\",IFERROR(VLOOKUP(D464,DataMijnAfdeling,2,0),\"?\"))","v":""},""]
[null,null,null,null,null,null,null,null,null,{"$f":"IF(C465=\"\",\"\",INDEX(Validatie!$Q$2:$Q$6,MATCH(MOD(E465,1),Validatie!$P$2:$P$6,1)))","v":""},{"$f":"IF(C465=\"\",\"\",IFERROR(VLOOKUP(D465,DataMijnAfdeling,2,0),\"?\"))","v":""},""]
[null,null,null,null,null,null,null,null,null,{"$f":"IF(C466=\"\",\"\",INDEX(Validatie!$Q$2:$Q$6,MATCH(MOD(E466,1),Validatie!$P$2:$P$6,1)))","v":""},{"$f":"IF(C466=\"\",\"\",IFERROR(VLOOKUP(D466,DataMijnAfdeling,2,0),\"?\"))","v":""},""]
[null,null,null,null,null,null,null,null,null,{"$f":"IF(C467=\"\",\"\",INDEX(Validatie!$Q$2:$Q$6,MATCH(MOD(E467,1),Validatie!$P$2:$P$6,1)))","v":""},{"$f":"IF(C467=\"\",\"\",IFERROR(VLOOKUP(D467,DataMijnAfdeling,2,0),\"?\"))","v":""},""]
[null,null,null,null,null,null,null,null,null,{"$f":"IF(C468=\"\",\"\",INDEX(Validatie!$Q$2:$Q$6,MATCH(MOD(E468,1),Validatie!$P$2:$P$6,1)))","v":""},{"$f":"IF(C468=\"\",\"\",IFERROR(VLOOKUP(D468,DataMijnAfdeling,2,0),\"?\"))","v":""},""]
[null,null,null,null,null,null,null,null,null,{"$f":"IF(C469=\"\",\"\",INDEX(Validatie!$Q$2:$Q$6,MATCH(MOD(E469,1),Validatie!$P$2:$P$6,1)))","v":""},{"$f":"IF(C469=\"\",\"\",IFERROR(VLOOKUP(D469,DataMijnAfdeling,2,0),\"?\"))","v":""},""]
[null,null,null,null,null,null,null,null,null,{"$f":"IF(C470=\"\",\"\",INDEX(Validatie!$Q$2:$Q$6,MATCH(MOD(E470,1),Validatie!$P$2:$P$6,1)))","v":""},{"$f":"IF(C470=\"\",\"\",IFERROR(VLOOKUP(D470,DataMijnAfdeling,2,0),\"?\"))","v":""},""]
[null,null,null,null,null,null,null,null,null,{"$f":"IF(C471=\"\",\"\",INDEX(Validatie!$Q$2:$Q$6,MATCH(MOD(E471,1),Validatie!$P$2:$P$6,1)))","v":""},{"$f":"IF(C471=\"\",\"\",IFERROR(VLOOKUP(D471,DataMijnAfdeling,2,0),\"?\"))","v":""},""]
[null,null,null,null,null,null,null,null,null,{"$f":"IF(C472=\"\",\"\",INDEX(Validatie!$Q$2:$Q$6,MATCH(MOD(E472,1),Validatie!$P$2:$P$6,1)))","v":""},{"$f":"IF(C472=\"\",\"\",IFERROR(VLOOKUP(D472,DataMijnAfdeling,2,0),\"?\"))","v":""},""]
[null,null,null,null,null,null,null,null,null,{"$f":"IF(C473=\"\",\"\",INDEX(Validatie!$Q$2:$Q$6,MATCH(MOD(E473,1),Validatie!$P$2:$P$6,1)))","v":""},{"$f":"IF(C473=\"\",\"\",IFERROR(VLOOKUP(D473,DataMijnAfdeling,2,0),\"?\"))","v":""},""]
[null,null,null,null,null,null,null,null,null,{"$f":"IF(C474=\"\",\"\",INDEX(Validatie!$Q$2:$Q$6,MATCH(MOD(E474,1),Validatie!$P$2:$P$6,1)))","v":""},{"$f":"IF(C474=\"\",\"\",IFERROR(VLOOKUP(D474,DataMijnAfdeling,2,0),\"?\"))","v":""},""]
[null,null,null,null,null,null,null,null,null,{"$f":"IF(C475=\"\",\"\",INDEX(Validatie!$Q$2:$Q$6,MATCH(MOD(E475,1),Validatie!$P$2:$P$6,1)))","v":""},{"$f":"IF(C475=\"\",\"\",IFERROR(VLOOKUP(D475,DataMijnAfdeling,2,0),\"?\"))","v":""},""]
[null,null,null,null,null,null,null,null,null,{"$f":"IF(C476=\"\",\"\",INDEX(Validatie!$Q$2:$Q$6,MATCH(MOD(E476,1),Validatie!$P$2:$P$6,1)))","v":""},{"$f":"IF(C476=\"\",\"\",IFERROR(VLOOKUP(D476,DataMijnAfdeling,2,0),\"?\"))","v":""},""]
[null,null,null,null,null,null,null,null,null,{"$f":"IF(C477=\"\",\"\",INDEX(Validatie!$Q$2:$Q$6,MATCH(MOD(E477,1),Validatie!$P$2:$P$6,1)))","v":""},{"$f":"IF(C477=\"\",\"\",IFERROR(VLOOKUP(D477,DataMijnAfdeling,2,0),\"?\"))","v":""},""]
[null,null,null,null,null,null,null,null,null,{"$f":"IF(C478=\"\",\"\",INDEX(Validatie!$Q$2:$Q$6,MATCH(MOD(E478,1),Validatie!$P$2:$P$6,1)))","v":""},{"$f":"IF(C478=\"\",\"\",IFERROR(VLOOKUP(D478,DataMijnAfdeling,2,0),\"?\"))","v":""},""]
[null,null,null,null,null,null,null,null,null,{"$f":"IF(C479=\"\",\"\",INDEX(Validatie!$Q$2:$Q$6,MATCH(MOD(E479,1),Validatie!$P$2:$P$6,1)))","v":""},{"$f":"IF(C479=\"\",\"\",IFERROR(VLOOKUP(D479,DataMijnAfdeling,2,0),\"?\"))","v":""},""]
[null,null,null,null,null,null,null,null,null,{"$f":"IF(C480=\"\",\"\",INDEX(Validatie!$Q$2:$Q$6,MATCH(MOD(E480,1),Validatie!$P$2:$P$6,1)))","v":""},{"$f":"IF(C480=\"\",\"\",IFERROR(VLOOKUP(D480,DataMijnAfdeling,2,0),\"?\"))","v":""},""]
[null,null,null,null,null,null,null,null,null,{"$f":"IF(C481=\"\",\"\",INDEX(Validatie!$Q$2:$Q$6,MATCH(MOD(E481,1),Validatie!$P$2:$P$6,1)))","v":""},{"$f":"IF(C481=\"\",\"\",IFERROR(VLOOKUP(D481,DataMijnAfdeling,2,0),\"?\"))","v":""},""]
[null,null,null,null,null,null,null,null,null,{"$f":"IF(C482=\"\",\"\",INDEX(Validatie!$Q$2:$Q$6,MATCH(MOD(E482,1),Validatie!$P$2:$P$6,1)))","v":""},{"$f":"IF(C482=\"\",\"\",IFERROR(VLOOKUP(D482,DataMijnAfdeling,2,0),\"?\"))","v":""},""]
[null,null,null,null,null,null,null,null,null,{"$f":"IF(C483=\"\",\"\",INDEX(Validatie!$Q$2:$Q$6,MATCH(MOD(E483,1),Validatie!$P$2:$P$6,1)))","v":""},{"$f":"IF(C483=\"\",\"\",IFERROR(VLOOKUP(D483,DataMijnAfdeling,2,0),\"?\"))","v":""},""]
[null,null,null,null,null,null,null,null,null,{"$f":"IF(C484=\"\",\"\",INDEX(Validatie!$Q$2:$Q$6,MATCH(MOD(E484,1),Validatie!$P$2:$P$6,1)))","v":""},{"$f":"IF(C484=\"\",\"\",IFERROR(VLOOKUP(D484,DataMijnAfdeling,2,0),\"?\"))","v":""},""]
[null,null,null,null,null,null,null,null,null,{"$f":"IF(C485=\"\",\"\",INDEX(Validatie!$Q$2:$Q$6,MATCH(MOD(E485,1),Validatie!$P$2:$P$6,1)))","v":""},{"$f":"IF(C485=\"\",\"\",IFERROR(VLOOKUP(D485,DataMijnAfdeling,2,0),\"?\"))","v":""},""]
[null,null,null,null,null,null,null,null,null,{"$f":"IF(C486=\"\",\"\",INDEX(Validatie!$Q$2:$Q$6,MATCH(MOD(E486,1),Validatie!$P$2:$P$6,1)))","v":""},{"$f":"IF(C486=\"\",\"\",IFERROR(VLOOKUP(D486,DataMijnAfdeling,2,0),\"?\"))","v":""},""]
[null,null,null,null,null,null,null,null,null,{"$f":"IF(C487=\"\",\"\",INDEX(Validatie!$Q$2:$Q$6,MATCH(MOD(E487,1),Validatie!$P$2:$P$6,1)))","v":""},{"$f":"IF(C487=\"\",\"\",IFERROR(VLOOKUP(D487,DataMijnAfdeling,2,0),\"?\"))","v":""},""]
[null,null,null,null,null,null,null,null,null,{"$f":"IF(C488=\"\",\"\",INDEX(Validatie!$Q$2:$Q$6,MATCH(MOD(E488,1),Validatie!$P$2:$P$6,1)))","v":""},{"$f":"IF(C488=\"\",\"\",IFERROR(VLOOKUP(D488,DataMijnAfdeling,2,0),\"?\"))","v":""},""]
[null,null,null,null,null,null,null,null,null,{"$f":"IF(C489=\"\",\"\",INDEX(Validatie!$Q$2:$Q$6,MATCH(MOD(E489,1),Validatie!$P$2:$P$6,1)))","v":""},{"$f":"IF(C489=\"\",\"\",IFERROR(VLOOKUP(D489,DataMijnAfdeling,2,0),\"?\"))","v":""},""]
[null,null,null,null,null,null,null,null,null,{"$f":"IF(C490=\"\",\"\",INDEX(Validatie!$Q$2:$Q$6,MATCH(MOD(E490,1),Validatie!$P$2:$P$6,1)))","v":""},{"$f":"IF(C490=\"\",\"\",IFERROR(VLOOKUP(D490,DataMijnAfdeling,2,0),\"?\"))","v":""},""]
[null,null,null,null,null,null,null,null,null,{"$f":"IF(C491=\"\",\"\",INDEX(Validatie!$Q$2:$Q$6,MATCH(MOD(E491,1),Validatie!$P$2:$P$6,1)))","v":""},{"$f":"IF(C491=\"\",\"\",IFERROR(VLOOKUP(D491,DataMijnAfdeling,2,0),\"?\"))","v":""},""]
[null,null,null,null,null,null,null,null,null,{"$f":"IF(C492=\"\",\"\",INDEX(Validatie!$Q$2:$Q$6,MATCH(MOD(E492,1),Validatie!$P$2:$P$6,1)))","v":""},{"$f":"IF(C492=\"\",\"\",IFERROR(VLOOKUP(D492,DataMijnAfdeling,2,0),\"?\"))","v":""},""]
[null,null,null,null,null,null,null,null,null,{"$f":"IF(C493=\"\",\"\",INDEX(Validatie!$Q$2:$Q$6,MATCH(MOD(E493,1),Validatie!$P$2:$P$6,1)))","v":""},{"$f":"IF(C493=\"\",\"\",IFERROR(VLOOKUP(D493,DataMijnAfdeling,2,0),\"?\"))","v":""},""]
[null,null,null,null,null,null,null,null,null,{"$f":"IF(C494=\"\",\"\",INDEX(Validatie!$Q$2:$Q$6,MATCH(MOD(E494,1),Validatie!$P$2:$P$6,1)))","v":""},{"$f":"IF(C494=\"\",\"\",IFERROR(VLOOKUP(D494,DataMijnAfdeling,2,0),\"?\"))","v":""},""]
[null,null,null,null,null,null,null,null,null,{"$f":"IF(C495=\"\",\"\",INDEX(Validatie!$Q$2:$Q$6,MATCH(MOD(E495,1),Validatie!$P$2:$P$6,1)))","v":""},{"$f":"IF(C495=\"\",\"\",IFERROR(VLOOKUP(D495,DataMijnAfdeling,2,0),\"?\"))","v":""},""]
[null,null,null,null,null,null,null,null,null,{"$f":"IF(C496=\"\",\"\",INDEX(Validatie!$Q$2:$Q$6,MATCH(MOD(E496,1),Validatie!$P$2:$P$6,1)))","v":""},{"$f":"IF(C496=\"\",\"\",IFERROR(VLOOKUP(D496,DataMijnAfdeling,2,0),\"?\"))","v":""},""]
[null,null,null,null,null,null,null,null,null,{"$f":"IF(C497=\"\",\"\",INDEX(Validatie!$Q$2:$Q$6,MATCH(MOD(E497,1),Validatie!$P$2:$P$6,1)))","v":""},{"$f":"IF(C497=\"\",\"\",IFERROR(VLOOKUP(D497,DataMijnAfdeling,2,0),\"?\"))","v":""},""]
[null,null,null,null,null,null,null,null,null,{"$f":"IF(C498=\"\",\"\",INDEX(Validatie!$Q$2:$Q$6,MATCH(MOD(E498,1),Validatie!$P$2:$P$6,1)))","v":""},{"$f":"IF(C498=\"\",\"\",IFERROR(VLOOKUP(D498,DataMijnAfdeling,2,0),\"?\"))","v":""},""]
[null,null,null,null,null,null,null,null,null,{"$f":"IF(C499=\"\",\"\",INDEX(Validatie!$Q$2:$Q$6,MATCH(MOD(E499,1),Validatie!$P$2:$P$6,1)))","v":""},{"$f":"IF(C499=\"\",\"\",IFERROR(VLOOKUP(D499,DataMijnAfdeling,2,0),\"?\"))","v":""},""]
[null,null,null,null,null,null,null,null,null,{"$f":"IF(C500=\"\",\"\",INDEX(Validatie!$Q$2:$Q$6,MATCH(MOD(E500,1),Validatie!$P$2:$P$6,1)))","v":""},{"$f":"IF(C500=\"\",\"\",IFERROR(VLOOKUP(D500,DataMijnAfdeling,2,0),\"?\"))","v":""},""]
[null,null,null,null,null,null,null,null,null,{"$f":"IF(C501=\"\",\"\",INDEX(Validatie!$Q$2:$Q$6,MATCH(MOD(E501,1),Validatie!$P$2:$P$6,1)))","v":""},{"$f":"IF(C501=\"\",\"\",IFERROR(VLOOKUP(D501,DataMijnAfdeling,2,0),\"?\"))","v":""},""]
[null,null,null,null,null,null,null,null,null,{"$f":"IF(C502=\"\",\"\",INDEX(Validatie!$Q$2:$Q$6,MATCH(MOD(E502,1),Validatie!$P$2:$P$6,1)))","v":""},{"$f":"IF(C502=\"\",\"\",IFERROR(VLOOKUP(D502,DataMijnAfdeling,2,0),\"?\"))","v":""},""]
[null,null,null,null,null,null,null,null,null,{"$f":"IF(C503=\"\",\"\",INDEX(Validatie!$Q$2:$Q$6,MATCH(MOD(E503,1),Validatie!$P$2:$P$6,1)))","v":""},{"$f":"IF(C503=\"\",\"\",IFERROR(VLOOKUP(D503,DataMijnAfdeling,2,0),\"?\"))","v":""},""]
[null,null,null,null,null,null,null,null,null,{"$f":"IF(C504=\"\",\"\",INDEX(Validatie!$Q$2:$Q$6,MATCH(MOD(E504,1),Validatie!$P$2:$P$6,1)))","v":""},{"$f":"IF(C504=\"\",\"\",IFERROR(VLOOKUP(D504,DataMijnAfdeling,2,0),\"?\"))","v":""},""]
[null,null,null,null,null,null,null,null,null,{"$f":"IF(C505=\"\",\"\",INDEX(Validatie!$Q$2:$Q$6,MATCH(MOD(E505,1),Validatie!$P$2:$P$6,1)))","v":""},{"$f":"IF(C505=\"\",\"\",IFERROR(VLOOKUP(D505,DataMijnAfdeling,2,0),\"?\"))","v":""},""]
[null,null,null,null,null,null,null,null,null,{"$f":"IF(C506=\"\",\"\",INDEX(Validatie!$Q$2:$Q$6,MATCH(MOD(E506,1),Validatie!$P$2:$P$6,1)))","v":""},{"$f":"IF(C506=\"\",\"\",IFERROR(VLOOKUP(D506,DataMijnAfdeling,2,0),\"?\"))","v":""},""]
[null,null,null,null,null,null,null,null,null,{"$f":"IF(C507=\"\",\"\",INDEX(Validatie!$Q$2:$Q$6,MATCH(MOD(E507,1),Validatie!$P$2:$P$6,1)))","v":""},{"$f":"IF(C507=\"\",\"\",IFERROR(VLOOKUP(D507,DataMijnAfdeling,2,0),\"?\"))","v":""},""]
[null,null,null,null,null,null,null,null,null,{"$f":"IF(C508=\"\",\"\",INDEX(Validatie!$Q$2:$Q$6,MATCH(MOD(E508,1),Validatie!$P$2:$P$6,1)))","v":""},{"$f":"IF(C508=\"\",\"\",IFERROR(VLOOKUP(D508,DataMijnAfdeling,2,0),\"?\"))","v":""},""]
[null,null,null,null,null,null,null,null,null,{"$f":"IF(C509=\"\",\"\",INDEX(Validatie!$Q$2:$Q$6,MATCH(MOD(E509,1),Validatie!$P$2:$P$6,1)))","v":""},{"$f":"IF(C509=\"\",\"\",IFERROR(VLOOKUP(D509,DataMijnAfdeling,2,0),\"?\"))","v":""},""]
[null,null,null,null,null,null,null,null,null,{"$f":"IF(C510=\"\",\"\",INDEX(Validatie!$Q$2:$Q$6,MATCH(MOD(E510,1),Validatie!$P$2:$P$6,1)))","v":""},{"$f":"IF(C510=\"\",\"\",IFERROR(VLOOKUP(D510,DataMijnAfdeling,2,0),\"?\"))","v":""},""]
[null,null,null,null,null,null,null,null,null,{"$f":"IF(C511=\"\",\"\",INDEX(Validatie!$Q$2:$Q$6,MATCH(MOD(E511,1),Validatie!$P$2:$P$6,1)))","v":""},{"$f":"IF(C511=\"\",\"\",IFERROR(VLOOKUP(D511,DataMijnAfdeling,2,0),\"?\"))","v":""},""]
[null,null,null,null,null,null,null,null,null,{"$f":"IF(C512=\"\",\"\",INDEX(Validatie!$Q$2:$Q$6,MATCH(MOD(E512,1),Validatie!$P$2:$P$6,1)))","v":""},{"$f":"IF(C512=\"\",\"\",IFERROR(VLOOKUP(D512,DataMijnAfdeling,2,0),\"?\"))","v":""},""]
[null,null,null,null,null,null,null,null,null,{"$f":"IF(C513=\"\",\"\",INDEX(Validatie!$Q$2:$Q$6,MATCH(MOD(E513,1),Validatie!$P$2:$P$6,1)))","v":""},{"$f":"IF(C513=\"\",\"\",IFERROR(VLOOKUP(D513,DataMijnAfdeling,2,0),\"?\"))","v":""},""]
[null,null,null,null,null,null,null,null,null,{"$f":"IF(C514=\"\",\"\",INDEX(Validatie!$Q$2:$Q$6,MATCH(MOD(E514,1),Validatie!$P$2:$P$6,1)))","v":""},{"$f":"IF(C514=\"\",\"\",IFERROR(VLOOKUP(D514,DataMijnAfdeling,2,0),\"?\"))","v":""},""]
[null,null,null,null,null,null,null,null,null,{"$f":"IF(C515=\"\",\"\",INDEX(Validatie!$Q$2:$Q$6,MATCH(MOD(E515,1),Validatie!$P$2:$P$6,1)))","v":""},{"$f":"IF(C515=\"\",\"\",IFERROR(VLOOKUP(D515,DataMijnAfdeling,2,0),\"?\"))","v":""},""]
[null,null,null,null,null,null,null,null,null,{"$f":"IF(C516=\"\",\"\",INDEX(Validatie!$Q$2:$Q$6,MATCH(MOD(E516,1),Validatie!$P$2:$P$6,1)))","v":""},{"$f":"IF(C516=\"\",\"\",IFERROR(VLOOKUP(D516,DataMijnAfdeling,2,0),\"?\"))","v":""},""]
[null,null,null,null,null,null,null,null,null,{"$f":"IF(C517=\"\",\"\",INDEX(Validatie!$Q$2:$Q$6,MATCH(MOD(E517,1),Validatie!$P$2:$P$6,1)))","v":""},{"$f":"IF(C517=\"\",\"\",IFERROR(VLOOKUP(D517,DataMijnAfdeling,2,0),\"?\"))","v":""},""]
[null,null,null,null,null,null,null,null,null,{"$f":"IF(C518=\"\",\"\",INDEX(Validatie!$Q$2:$Q$6,MATCH(MOD(E518,1),Validatie!$P$2:$P$6,1)))","v":""},{"$f":"IF(C518=\"\",\"\",IFERROR(VLOOKUP(D518,DataMijnAfdeling,2,0),\"?\"))","v":""},""]
[null,null,null,null,null,null,null,null,null,{"$f":"IF(C519=\"\",\"\",INDEX(Validatie!$Q$2:$Q$6,MATCH(MOD(E519,1),Validatie!$P$2:$P$6,1)))","v":""},{"$f":"IF(C519=\"\",\"\",IFERROR(VLOOKUP(D519,DataMijnAfdeling,2,0),\"?\"))","v":""},{"$f":"IF(C519=\"\",\"\",CONCATENATE(G519,\" \",H519))","v":""}]
[null,null,null,null,null,null,null,null,null,{"$f":"IF(C520=\"\",\"\",INDEX(Validatie!$Q$2:$Q$6,MATCH(MOD(E520,1),Validatie!$P$2:$P$6,1)))","v":""},{"$f":"IF(C520=\"\",\"\",IFERROR(VLOOKUP(D520,DataMijnAfdeling,2,0),\"?\"))","v":""},""]
[null,null,null,null,null,null,null,null,null,{"$f":"IF(C521=\"\",\"\",INDEX(Validatie!$Q$2:$Q$6,MATCH(MOD(E521,1),Validatie!$P$2:$P$6,1)))","v":""},{"$f":"IF(C521=\"\",\"\",IFERROR(VLOOKUP(D521,DataMijnAfdeling,2,0),\"?\"))","v":""},""]
[null,null,null,null,null,null,null,null,null,{"$f":"IF(C522=\"\",\"\",INDEX(Validatie!$Q$2:$Q$6,MATCH(MOD(E522,1),Validatie!$P$2:$P$6,1)))","v":""},{"$f":"IF(C522=\"\",\"\",IFERROR(VLOOKUP(D522,DataMijnAfdeling,2,0),\"?\"))","v":""},""]
[null,null,null,null,null,null,null,null,null,{"$f":"IF(C523=\"\",\"\",INDEX(Validatie!$Q$2:$Q$6,MATCH(MOD(E523,1),Validatie!$P$2:$P$6,1)))","v":""},{"$f":"IF(C523=\"\",\"\",IFERROR(VLOOKUP(D523,DataMijnAfdeling,2,0),\"?\"))","v":""},""]
[null,null,null,null,null,null,null,null,null,{"$f":"IF(C524=\"\",\"\",INDEX(Validatie!$Q$2:$Q$6,MATCH(MOD(E524,1),Validatie!$P$2:$P$6,1)))","v":""},{"$f":"IF(C524=\"\",\"\",IFERROR(VLOOKUP(D524,DataMijnAfdeling,2,0),\"?\"))","v":""},""]
[null,null,null,null,null,null,null,null,null,{"$f":"IF(C525=\"\",\"\",INDEX(Validatie!$Q$2:$Q$6,MATCH(MOD(E525,1),Validatie!$P$2:$P$6,1)))","v":""},{"$f":"IF(C525=\"\",\"\",IFERROR(VLOOKUP(D525,DataMijnAfdeling,2,0),\"?\"))","v":""},""]
[null,null,null,null,null,null,null,null,null,{"$f":"IF(C526=\"\",\"\",INDEX(Validatie!$Q$2:$Q$6,MATCH(MOD(E526,1),Validatie!$P$2:$P$6,1)))","v":""},{"$f":"IF(C526=\"\",\"\",IFERROR(VLOOKUP(D526,DataMijnAfdeling,2,0),\"?\"))","v":""},""]
[null,null,null,null,null,null,null,null,null,{"$f":"IF(C527=\"\",\"\",INDEX(Validatie!$Q$2:$Q$6,MATCH(MOD(E527,1),Validatie!$P$2:$P$6,1)))","v":""},{"$f":"IF(C527=\"\",\"\",IFERROR(VLOOKUP(D527,DataMijnAfdeling,2,0),\"?\"))","v":""},""]
[null,null,null,null,null,null,null,null,null,{"$f":"IF(C528=\"\",\"\",INDEX(Validatie!$Q$2:$Q$6,MATCH(MOD(E528,1),Validatie!$P$2:$P$6,1)))","v":""},{"$f":"IF(C528=\"\",\"\",IFERROR(VLOOKUP(D528,DataMijnAfdeling,2,0),\"?\"))","v":""},""]
[null,null,null,null,null,null,null,null,null,{"$f":"IF(C529=\"\",\"\",INDEX(Validatie!$Q$2:$Q$6,MATCH(MOD(E529,1),Validatie!$P$2:$P$6,1)))","v":""},{"$f":"IF(C529=\"\",\"\",IFERROR(VLOOKUP(D529,DataMijnAfdeling,2,0),\"?\"))","v":""},""]
[null,null,null,null,null,null,null,null,null,{"$f":"IF(C530=\"\",\"\",INDEX(Validatie!$Q$2:$Q$6,MATCH(MOD(E530,1),Validatie!$P$2:$P$6,1)))","v":""},{"$f":"IF(C530=\"\",\"\",IFERROR(VLOOKUP(D530,DataMijnAfdeling,2,0),\"?\"))","v":""},""]
[null,null,null,null,null,null,null,null,null,{"$f":"IF(C531=\"\",\"\",INDEX(Validatie!$Q$2:$Q$6,MATCH(MOD(E531,1),Validatie!$P$2:$P$6,1)))","v":""},{"$f":"IF(C531=\"\",\"\",IFERROR(VLOOKUP(D531,DataMijnAfdeling,2,0),\"?\"))","v":""},""]
[null,null,null,null,null,null,null,null,null,{"$f":"IF(C532=\"\",\"\",INDEX(Validatie!$Q$2:$Q$6,MATCH(MOD(E532,1),Validatie!$P$2:$P$6,1)))","v":""},{"$f":"IF(C532=\"\",\"\",IFERROR(VLOOKUP(D532,DataMijnAfdeling,2,0),\"?\"))","v":""},""]
[null,null,null,null,null,null,null,null,null,{"$f":"IF(C533=\"\",\"\",INDEX(Validatie!$Q$2:$Q$6,MATCH(MOD(E533,1),Validatie!$P$2:$P$6,1)))","v":""},{"$f":"IF(C533=\"\",\"\",IFERROR(VLOOKUP(D533,DataMijnAfdeling,2,0),\"?\"))","v":""},""]
[null,null,null,null,null,null,null,null,null,{"$f":"IF(C534=\"\",\"\",INDEX(Validatie!$Q$2:$Q$6,MATCH(MOD(E534,1),Validatie!$P$2:$P$6,1)))","v":""},{"$f":"IF(C534=\"\",\"\",IFERROR(VLOOKUP(D534,DataMijnAfdeling,2,0),\"?\"))","v":""},""]
[null,null,null,null,null,null,null,null,null,{"$f":"IF(C535=\"\",\"\",INDEX(Validatie!$Q$2:$Q$6,MATCH(MOD(E535,1),Validatie!$P$2:$P$6,1)))","v":""},{"$f":"IF(C535=\"\",\"\",IFERROR(VLOOKUP(D535,DataMijnAfdeling,2,0),\"?\"))","v":""},""]
[null,null,null,null,null,null,null,null,null,{"$f":"IF(C536=\"\",\"\",INDEX(Validatie!$Q$2:$Q$6,MATCH(MOD(E536,1),Validatie!$P$2:$P$6,1)))","v":""},{"$f":"IF(C536=\"\",\"\",IFERROR(VLOOKUP(D536,DataMijnAfdeling,2,0),\"?\"))","v":""},""]
[null,null,null,null,null,null,null,null,null,{"$f":"IF(C537=\"\",\"\",INDEX(Validatie!$Q$2:$Q$6,MATCH(MOD(E537,1),Validatie!$P$2:$P$6,1)))","v":""},{"$f":"IF(C537=\"\",\"\",IFERROR(VLOOKUP(D537,DataMijnAfdeling,2,0),\"?\"))","v":""},""]
[null,null,null,null,null,null,null,null,null,{"$f":"IF(C538=\"\",\"\",INDEX(Validatie!$Q$2:$Q$6,MATCH(MOD(E538,1),Validatie!$P$2:$P$6,1)))","v":""},{"$f":"IF(C538=\"\",\"\",IFERROR(VLOOKUP(D538,DataMijnAfdeling,2,0),\"?\"))","v":""},""]
[null,null,null,null,null,null,null,null,null,{"$f":"IF(C539=\"\",\"\",INDEX(Validatie!$Q$2:$Q$6,MATCH(MOD(E539,1),Validatie!$P$2:$P$6,1)))","v":""},{"$f":"IF(C539=\"\",\"\",IFERROR(VLOOKUP(D539,DataMijnAfdeling,2,0),\"?\"))","v":""},""]
[null,null,null,null,null,null,null,null,null,{"$f":"IF(C540=\"\",\"\",INDEX(Validatie!$Q$2:$Q$6,MATCH(MOD(E540,1),Validatie!$P$2:$P$6,1)))","v":""},{"$f":"IF(C540=\"\",\"\",IFERROR(VLOOKUP(D540,DataMijnAfdeling,2,0),\"?\"))","v":""},""]
[null,null,null,null,null,null,null,null,null,{"$f":"IF(C541=\"\",\"\",INDEX(Validatie!$Q$2:$Q$6,MATCH(MOD(E541,1),Validatie!$P$2:$P$6,1)))","v":""},{"$f":"IF(C541=\"\",\"\",IFERROR(VLOOKUP(D541,DataMijnAfdeling,2,0),\"?\"))","v":""},""]
[null,null,null,null,null,null,null,null,null,{"$f":"IF(C542=\"\",\"\",INDEX(Validatie!$Q$2:$Q$6,MATCH(MOD(E542,1),Validatie!$P$2:$P$6,1)))","v":""},{"$f":"IF(C542=\"\",\"\",IFERROR(VLOOKUP(D542,DataMijnAfdeling,2,0),\"?\"))","v":""},""]
[null,null,null,null,null,null,null,null,null,{"$f":"IF(C543=\"\",\"\",INDEX(Validatie!$Q$2:$Q$6,MATCH(MOD(E543,1),Validatie!$P$2:$P$6,1)))","v":""},{"$f":"IF(C543=\"\",\"\",IFERROR(VLOOKUP(D543,DataMijnAfdeling,2,0),\"?\"))","v":""},""]
[null,null,null,null,null,null,null,null,null,{"$f":"IF(C544=\"\",\"\",INDEX(Validatie!$Q$2:$Q$6,MATCH(MOD(E544,1),Validatie!$P$2:$P$6,1)))","v":""},{"$f":"IF(C544=\"\",\"\",IFERROR(VLOOKUP(D544,DataMijnAfdeling,2,0),\"?\"))","v":""},""]
[null,null,null,null,null,null,null,null,null,{"$f":"IF(C545=\"\",\"\",INDEX(Validatie!$Q$2:$Q$6,MATCH(MOD(E545,1),Validatie!$P$2:$P$6,1)))","v":""},{"$f":"IF(C545=\"\",\"\",IFERROR(VLOOKUP(D545,DataMijnAfdeling,2,0),\"?\"))","v":""},""]
[null,null,null,null,null,null,null,null,null,{"$f":"IF(C546=\"\",\"\",INDEX(Validatie!$Q$2:$Q$6,MATCH(MOD(E546,1),Validatie!$P$2:$P$6,1)))","v":""},{"$f":"IF(C546=\"\",\"\",IFERROR(VLOOKUP(D546,DataMijnAfdeling,2,0),\"?\"))","v":""},""]
[null,null,null,null,null,null,null,null,null,{"$f":"IF(C547=\"\",\"\",INDEX(Validatie!$Q$2:$Q$6,MATCH(MOD(E547,1),Validatie!$P$2:$P$6,1)))","v":""},{"$f":"IF(C547=\"\",\"\",IFERROR(VLOOKUP(D547,DataMijnAfdeling,2,0),\"?\"))","v":""},""]
[null,null,null,null,null,null,null,null,null,{"$f":"IF(C548=\"\",\"\",INDEX(Validatie!$Q$2:$Q$6,MATCH(MOD(E548,1),Validatie!$P$2:$P$6,1)))","v":""},{"$f":"IF(C548=\"\",\"\",IFERROR(VLOOKUP(D548,DataMijnAfdeling,2,0),\"?\"))","v":""},""]
[null,null,null,null,null,null,null,null,null,{"$f":"IF(C549=\"\",\"\",INDEX(Validatie!$Q$2:$Q$6,MATCH(MOD(E549,1),Validatie!$P$2:$P$6,1)))","v":""},{"$f":"IF(C549=\"\",\"\",IFERROR(VLOOKUP(D549,DataMijnAfdeling,2,0),\"?\"))","v":""},""]
[null,null,null,null,null,null,null,null,null,{"$f":"IF(C550=\"\",\"\",INDEX(Validatie!$Q$2:$Q$6,MATCH(MOD(E550,1),Validatie!$P$2:$P$6,1)))","v":""},{"$f":"IF(C550=\"\",\"\",IFERROR(VLOOKUP(D550,DataMijnAfdeling,2,0),\"?\"))","v":""},""]
[null,null,null,null,null,null,null,null,null,{"$f":"IF(C551=\"\",\"\",INDEX(Validatie!$Q$2:$Q$6,MATCH(MOD(E551,1),Validatie!$P$2:$P$6,1)))","v":""},{"$f":"IF(C551=\"\",\"\",IFERROR(VLOOKUP(D551,DataMijnAfdeling,2,0),\"?\"))","v":""},""]
[null,null,null,null,null,null,null,null,null,{"$f":"IF(C552=\"\",\"\",INDEX(Validatie!$Q$2:$Q$6,MATCH(MOD(E552,1),Validatie!$P$2:$P$6,1)))","v":""},{"$f":"IF(C552=\"\",\"\",IFERROR(VLOOKUP(D552,DataMijnAfdeling,2,0),\"?\"))","v":""},""]
[null,null,null,null,null,null,null,null,null,{"$f":"IF(C553=\"\",\"\",INDEX(Validatie!$Q$2:$Q$6,MATCH(MOD(E553,1),Validatie!$P$2:$P$6,1)))","v":""},{"$f":"IF(C553=\"\",\"\",IFERROR(VLOOKUP(D553,DataMijnAfdeling,2,0),\"?\"))","v":""},""]
[null,null,null,null,null,null,null,null,null,{"$f":"IF(C554=\"\",\"\",INDEX(Validatie!$Q$2:$Q$6,MATCH(MOD(E554,1),Validatie!$P$2:$P$6,1)))","v":""},{"$f":"IF(C554=\"\",\"\",IFERROR(VLOOKUP(D554,DataMijnAfdeling,2,0),\"?\"))","v":""},""]
[null,null,null,null,null,null,null,null,null,{"$f":"IF(C555=\"\",\"\",INDEX(Validatie!$Q$2:$Q$6,MATCH(MOD(E555,1),Validatie!$P$2:$P$6,1)))","v":""},{"$f":"IF(C555=\"\",\"\",IFERROR(VLOOKUP(D555,DataMijnAfdeling,2,0),\"?\"))","v":""},""]
[null,null,null,null,null,null,null,null,null,{"$f":"IF(C556=\"\",\"\",INDEX(Validatie!$Q$2:$Q$6,MATCH(MOD(E556,1),Validatie!$P$2:$P$6,1)))","v":""},{"$f":"IF(C556=\"\",\"\",IFERROR(VLOOKUP(D556,DataMijnAfdeling,2,0),\"?\"))","v":""},""]
[null,null,null,null,null,null,null,null,null,{"$f":"IF(C557=\"\",\"\",INDEX(Validatie!$Q$2:$Q$6,MATCH(MOD(E557,1),Validatie!$P$2:$P$6,1)))","v":""},{"$f":"IF(C557=\"\",\"\",IFERROR(VLOOKUP(D557,DataMijnAfdeling,2,0),\"?\"))","v":""},""]
[null,null,null,null,null,null,null,null,null,{"$f":"IF(C558=\"\",\"\",INDEX(Validatie!$Q$2:$Q$6,MATCH(MOD(E558,1),Validatie!$P$2:$P$6,1)))","v":""},{"$f":"IF(C558=\"\",\"\",IFERROR(VLOOKUP(D558,DataMijnAfdeling,2,0),\"?\"))","v":""},""]
[null,null,null,null,null,null,null,null,null,{"$f":"IF(C559=\"\",\"\",INDEX(Validatie!$Q$2:$Q$6,MATCH(MOD(E559,1),Validatie!$P$2:$P$6,1)))","v":""},{"$f":"IF(C559=\"\",\"\",IFERROR(VLOOKUP(D559,DataMijnAfdeling,2,0),\"?\"))","v":""},""]
[null,null,null,null,null,null,null,null,null,{"$f":"IF(C560=\"\",\"\",INDEX(Validatie!$Q$2:$Q$6,MATCH(MOD(E560,1),Validatie!$P$2:$P$6,1)))","v":""},{"$f":"IF(C560=\"\",\"\",IFERROR(VLOOKUP(D560,DataMijnAfdeling,2,0),\"?\"))","v":""},""]
[null,null,null,null,null,null,null,null,null,{"$f":"IF(C561=\"\",\"\",INDEX(Validatie!$Q$2:$Q$6,MATCH(MOD(E561,1),Validatie!$P$2:$P$6,1)))","v":""},{"$f":"IF(C561=\"\",\"\",IFERROR(VLOOKUP(D561,DataMijnAfdeling,2,0),\"?\"))","v":""},""]
[null,null,null,null,null,null,null,null,null,{"$f":"IF(C562=\"\",\"\",INDEX(Validatie!$Q$2:$Q$6,MATCH(MOD(E562,1),Validatie!$P$2:$P$6,1)))","v":""},{"$f":"IF(C562=\"\",\"\",IFERROR(VLOOKUP(D562,DataMijnAfdeling,2,0),\"?\"))","v":""},""]
[null,null,null,null,null,null,null,null,null,{"$f":"IF(C563=\"\",\"\",INDEX(Validatie!$Q$2:$Q$6,MATCH(MOD(E563,1),Validatie!$P$2:$P$6,1)))","v":""},{"$f":"IF(C563=\"\",\"\",IFERROR(VLOOKUP(D563,DataMijnAfdeling,2,0),\"?\"))","v":""},""]
[null,null,null,null,null,null,null,null,null,{"$f":"IF(C564=\"\",\"\",INDEX(Validatie!$Q$2:$Q$6,MATCH(MOD(E564,1),Validatie!$P$2:$P$6,1)))","v":""},{"$f":"IF(C564=\"\",\"\",IFERROR(VLOOKUP(D564,DataMijnAfdeling,2,0),\"?\"))","v":""},""]
[null,null,null,null,null,null,null,null,null,{"$f":"IF(C565=\"\",\"\",INDEX(Validatie!$Q$2:$Q$6,MATCH(MOD(E565,1),Validatie!$P$2:$P$6,1)))","v":""},{"$f":"IF(C565=\"\",\"\",IFERROR(VLOOKUP(D565,DataMijnAfdeling,2,0),\"?\"))","v":""},""]
[null,null,null,null,null,null,null,null,null,{"$f":"IF(C566=\"\",\"\",INDEX(Validatie!$Q$2:$Q$6,MATCH(MOD(E566,1),Validatie!$P$2:$P$6,1)))","v":""},{"$f":"IF(C566=\"\",\"\",IFERROR(VLOOKUP(D566,DataMijnAfdeling,2,0),\"?\"))","v":""},""]
[null,null,null,null,null,null,null,null,null,{"$f":"IF(C567=\"\",\"\",INDEX(Validatie!$Q$2:$Q$6,MATCH(MOD(E567,1),Validatie!$P$2:$P$6,1)))","v":""},{"$f":"IF(C567=\"\",\"\",IFERROR(VLOOKUP(D567,DataMijnAfdeling,2,0),\"?\"))","v":""},""]
[null,null,null,null,null,null,null,null,null,{"$f":"IF(C568=\"\",\"\",INDEX(Validatie!$Q$2:$Q$6,MATCH(MOD(E568,1),Validatie!$P$2:$P$6,1)))","v":""},{"$f":"IF(C568=\"\",\"\",IFERROR(VLOOKUP(D568,DataMijnAfdeling,2,0),\"?\"))","v":""},""]
[null,null,null,null,null,null,null,null,null,{"$f":"IF(C569=\"\",\"\",INDEX(Validatie!$Q$2:$Q$6,MATCH(MOD(E569,1),Validatie!$P$2:$P$6,1)))","v":""},{"$f":"IF(C569=\"\",\"\",IFERROR(VLOOKUP(D569,DataMijnAfdeling,2,0),\"?\"))","v":""},""]
[null,null,null,null,null,null,null,null,null,{"$f":"IF(C570=\"\",\"\",INDEX(Validatie!$Q$2:$Q$6,MATCH(MOD(E570,1),Validatie!$P$2:$P$6,1)))","v":""},{"$f":"IF(C570=\"\",\"\",IFERROR(VLOOKUP(D570,DataMijnAfdeling,2,0),\"?\"))","v":""},""]
[null,null,null,null,null,null,null,null,null,{"$f":"IF(C571=\"\",\"\",INDEX(Validatie!$Q$2:$Q$6,MATCH(MOD(E571,1),Validatie!$P$2:$P$6,1)))","v":""},{"$f":"IF(C571=\"\",\"\",IFERROR(VLOOKUP(D571,DataMijnAfdeling,2,0),\"?\"))","v":""},""]
[null,null,null,null,null,null,null,null,null,{"$f":"IF(C572=\"\",\"\",INDEX(Validatie!$Q$2:$Q$6,MATCH(MOD(E572,1),Validatie!$P$2:$P$6,1)))","v":""},{"$f":"IF(C572=\"\",\"\",IFERROR(VLOOKUP(D572,DataMijnAfdeling,2,0),\"?\"))","v":""},""]
[null,null,null,null,null,null,null,null,null,{"$f":"IF(C573=\"\",\"\",INDEX(Validatie!$Q$2:$Q$6,MATCH(MOD(E573,1),Validatie!$P$2:$P$6,1)))","v":""},{"$f":"IF(C573=\"\",\"\",IFERROR(VLOOKUP(D573,DataMijnAfdeling,2,0),\"?\"))","v":""},""]
[null,null,null,null,null,null,null,null,null,{"$f":"IF(C574=\"\",\"\",INDEX(Validatie!$Q$2:$Q$6,MATCH(MOD(E574,1),Validatie!$P$2:$P$6,1)))","v":""},{"$f":"IF(C574=\"\",\"\",IFERROR(VLOOKUP(D574,DataMijnAfdeling,2,0),\"?\"))","v":""},""]
[null,null,null,null,null,null,null,null,null,{"$f":"IF(C575=\"\",\"\",INDEX(Validatie!$Q$2:$Q$6,MATCH(MOD(E575,1),Validatie!$P$2:$P$6,1)))","v":""},{"$f":"IF(C575=\"\",\"\",IFERROR(VLOOKUP(D575,DataMijnAfdeling,2,0),\"?\"))","v":""},""]
[null,null,null,null,null,null,null,null,null,{"$f":"IF(C576=\"\",\"\",INDEX(Validatie!$Q$2:$Q$6,MATCH(MOD(E576,1),Validatie!$P$2:$P$6,1)))","v":""},{"$f":"IF(C576=\"\",\"\",IFERROR(VLOOKUP(D576,DataMijnAfdeling,2,0),\"?\"))","v":""},""]
[null,null,null,null,null,null,null,null,null,{"$f":"IF(C577=\"\",\"\",INDEX(Validatie!$Q$2:$Q$6,MATCH(MOD(E577,1),Validatie!$P$2:$P$6,1)))","v":""},{"$f":"IF(C577=\"\",\"\",IFERROR(VLOOKUP(D577,DataMijnAfdeling,2,0),\"?\"))","v":""},""]
[null,null,null,null,null,null,null,null,null,{"$f":"IF(C578=\"\",\"\",INDEX(Validatie!$Q$2:$Q$6,MATCH(MOD(E578,1),Validatie!$P$2:$P$6,1)))","v":""},{"$f":"IF(C578=\"\",\"\",IFERROR(VLOOKUP(D578,DataMijnAfdeling,2,0),\"?\"))","v":""},""]
[null,null,null,null,null,null,null,null,null,{"$f":"IF(C579=\"\",\"\",INDEX(Validatie!$Q$2:$Q$6,MATCH(MOD(E579,1),Validatie!$P$2:$P$6,1)))","v":""},{"$f":"IF(C579=\"\",\"\",IFERROR(VLOOKUP(D579,DataMijnAfdeling,2,0),\"?\"))","v":""},""]
[null,null,null,null,null,null,null,null,null,{"$f":"IF(C580=\"\",\"\",INDEX(Validatie!$Q$2:$Q$6,MATCH(MOD(E580,1),Validatie!$P$2:$P$6,1)))","v":""},{"$f":"IF(C580=\"\",\"\",IFERROR(VLOOKUP(D580,DataMijnAfdeling,2,0),\"?\"))","v":""},""]
[null,null,null,null,null,null,null,null,null,{"$f":"IF(C581=\"\",\"\",INDEX(Validatie!$Q$2:$Q$6,MATCH(MOD(E581,1),Validatie!$P$2:$P$6,1)))","v":""},{"$f":"IF(C581=\"\",\"\",IFERROR(VLOOKUP(D581,DataMijnAfdeling,2,0),\"?\"))","v":""},""]
[null,null,null,null,null,null,null,null,null,{"$f":"IF(C582=\"\",\"\",INDEX(Validatie!$Q$2:$Q$6,MATCH(MOD(E582,1),Validatie!$P$2:$P$6,1)))","v":""},{"$f":"IF(C582=\"\",\"\",IFERROR(VLOOKUP(D582,DataMijnAfdeling,2,0),\"?\"))","v":""},""]
[null,null,null,null,null,null,null,null,null,{"$f":"IF(C583=\"\",\"\",INDEX(Validatie!$Q$2:$Q$6,MATCH(MOD(E583,1),Validatie!$P$2:$P$6,1)))","v":""},{"$f":"IF(C583=\"\",\"\",IFERROR(VLOOKUP(D583,DataMijnAfdeling,2,0),\"?\"))","v":""},{"$f":"IF(C583=\"\",\"\",CONCATENATE(G583,\" \",H583))","v":""}]
[null,null,null,null,null,null,null,null,null,{"$f":"IF(C584=\"\",\"\",INDEX(Validatie!$Q$2:$Q$6,MATCH(MOD(E584,1),Validatie!$P$2:$P$6,1)))","v":""},{"$f":"IF(C584=\"\",\"\",IFERROR(VLOOKUP(D584,DataMijnAfdeling,2,0),\"?\"))","v":""},""]
[null,null,null,null,null,null,null,null,null,{"$f":"IF(C585=\"\",\"\",INDEX(Validatie!$Q$2:$Q$6,MATCH(MOD(E585,1),Validatie!$P$2:$P$6,1)))","v":""},{"$f":"IF(C585=\"\",\"\",IFERROR(VLOOKUP(D585,DataMijnAfdeling,2,0),\"?\"))","v":""},""]
[null,null,null,null,null,null,null,null,null,{"$f":"IF(C586=\"\",\"\",INDEX(Validatie!$Q$2:$Q$6,MATCH(MOD(E586,1),Validatie!$P$2:$P$6,1)))","v":""},{"$f":"IF(C586=\"\",\"\",IFERROR(VLOOKUP(D586,DataMijnAfdeling,2,0),\"?\"))","v":""},""]
[null,null,null,null,null,null,null,null,null,{"$f":"IF(C587=\"\",\"\",INDEX(Validatie!$Q$2:$Q$6,MATCH(MOD(E587,1),Validatie!$P$2:$P$6,1)))","v":""},{"$f":"IF(C587=\"\",\"\",IFERROR(VLOOKUP(D587,DataMijnAfdeling,2,0),\"?\"))","v":""},""]
[null,null,null,null,null,null,null,null,null,{"$f":"IF(C588=\"\",\"\",INDEX(Validatie!$Q$2:$Q$6,MATCH(MOD(E588,1),Validatie!$P$2:$P$6,1)))","v":""},{"$f":"IF(C588=\"\",\"\",IFERROR(VLOOKUP(D588,DataMijnAfdeling,2,0),\"?\"))","v":""},""]
[null,null,null,null,null,null,null,null,null,{"$f":"IF(C589=\"\",\"\",INDEX(Validatie!$Q$2:$Q$6,MATCH(MOD(E589,1),Validatie!$P$2:$P$6,1)))","v":""},{"$f":"IF(C589=\"\",\"\",IFERROR(VLOOKUP(D589,DataMijnAfdeling,2,0),\"?\"))","v":""},""]
[null,null,null,null,null,null,null,null,null,{"$f":"IF(C590=\"\",\"\",INDEX(Validatie!$Q$2:$Q$6,MATCH(MOD(E590,1),Validatie!$P$2:$P$6,1)))","v":""},{"$f":"IF(C590=\"\",\"\",IFERROR(VLOOKUP(D590,DataMijnAfdeling,2,0),\"?\"))","v":""},""]
[null,null,null,null,null,null,null,null,null,{"$f":"IF(C591=\"\",\"\",INDEX(Validatie!$Q$2:$Q$6,MATCH(MOD(E591,1),Validatie!$P$2:$P$6,1)))","v":""},{"$f":"IF(C591=\"\",\"\",IFERROR(VLOOKUP(D591,DataMijnAfdeling,2,0),\"?\"))","v":""},""]
[null,null,null,null,null,null,null,null,null,{"$f":"IF(C592=\"\",\"\",INDEX(Validatie!$Q$2:$Q$6,MATCH(MOD(E592,1),Validatie!$P$2:$P$6,1)))","v":""},{"$f":"IF(C592=\"\",\"\",IFERROR(VLOOKUP(D592,DataMijnAfdeling,2,0),\"?\"))","v":""},""]
[null,null,null,null,null,null,null,null,null,{"$f":"IF(C593=\"\",\"\",INDEX(Validatie!$Q$2:$Q$6,MATCH(MOD(E593,1),Validatie!$P$2:$P$6,1)))","v":""},{"$f":"IF(C593=\"\",\"\",IFERROR(VLOOKUP(D593,DataMijnAfdeling,2,0),\"?\"))","v":""},""]
[null,null,null,null,null,null,null,null,null,{"$f":"IF(C594=\"\",\"\",INDEX(Validatie!$Q$2:$Q$6,MATCH(MOD(E594,1),Validatie!$P$2:$P$6,1)))","v":""},{"$f":"IF(C594=\"\",\"\",IFERROR(VLOOKUP(D594,DataMijnAfdeling,2,0),\"?\"))","v":""},""]
[null,null,null,null,null,null,null,null,null,{"$f":"IF(C595=\"\",\"\",INDEX(Validatie!$Q$2:$Q$6,MATCH(MOD(E595,1),Validatie!$P$2:$P$6,1)))","v":""},{"$f":"IF(C595=\"\",\"\",IFERROR(VLOOKUP(D595,DataMijnAfdeling,2,0),\"?\"))","v":""},""]
[null,null,null,null,null,null,null,null,null,{"$f":"IF(C596=\"\",\"\",INDEX(Validatie!$Q$2:$Q$6,MATCH(MOD(E596,1),Validatie!$P$2:$P$6,1)))","v":""},{"$f":"IF(C596=\"\",\"\",IFERROR(VLOOKUP(D596,DataMijnAfdeling,2,0),\"?\"))","v":""},""]
[null,null,null,null,null,null,null,null,null,{"$f":"IF(C597=\"\",\"\",INDEX(Validatie!$Q$2:$Q$6,MATCH(MOD(E597,1),Validatie!$P$2:$P$6,1)))","v":""},{"$f":"IF(C597=\"\",\"\",IFERROR(VLOOKUP(D597,DataMijnAfdeling,2,0),\"?\"))","v":""},""]
[null,null,null,null,null,null,null,null,null,{"$f":"IF(C598=\"\",\"\",INDEX(Validatie!$Q$2:$Q$6,MATCH(MOD(E598,1),Validatie!$P$2:$P$6,1)))","v":""},{"$f":"IF(C598=\"\",\"\",IFERROR(VLOOKUP(D598,DataMijnAfdeling,2,0),\"?\"))","v":""},""]
[null,null,null,null,null,null,null,null,null,{"$f":"IF(C599=\"\",\"\",INDEX(Validatie!$Q$2:$Q$6,MATCH(MOD(E599,1),Validatie!$P$2:$P$6,1)))","v":""},{"$f":"IF(C599=\"\",\"\",IFERROR(VLOOKUP(D599,DataMijnAfdeling,2,0),\"?\"))","v":""},""]
[null,null,null,null,null,null,null,null,null,{"$f":"IF(C600=\"\",\"\",INDEX(Validatie!$Q$2:$Q$6,MATCH(MOD(E600,1),Validatie!$P$2:$P$6,1)))","v":""},{"$f":"IF(C600=\"\",\"\",IFERROR(VLOOKUP(D600,DataMijnAfdeling,2,0),\"?\"))","v":""},""]

{"sheet":"Validatie","index":4,"n_rows":108,"n_cols":17,"rows_kept":108,"cut":false,"hidden":false,"merged":[]}
["Weken",null,"Jaren",null,"Namen",null,null,"Mijn afdelingen","Planning afdeling ",null,null,null,"Abdiqadir","de Jong",null,"Post",0]
[1,null,2018,null,"evron",null,null,"ABB weekenddienst","ABB",null,null,null,"Abdul","Jansen",null,0]
[2,null,2019,null,"Fien",null,null,"ABB middag","ABB",null,null,null,"Abdurahman Ibrahim","de Vries",null,0.24,"Vroeg"]
[3,null,2020,null,"Flore",null,null,"ABB ochtend ","ABB",null,null,null,"Agathe","van de Berg ",null,0.5,"Laat"]
[4,null,2021,null,"Fons",null,null,"AFV MEP","MEP",null,null,null,"Akela","van Dijk",null,0.83333333333333337,"Nacht"]
[5,null,2022,null,"Ida",null,null,"SCHM AFV","AFV",null,null,null,"Amadou","Bakker",null,0.99930555555555556,"Nacht"]
[6,null,2023,null,"Jan",null,null,"SCHM","SCHM",null,null,null,"Amanuel","Janssen"]
[7,null,2024,null,"jannie",null,null,"AFV HAS","HAS",null,null,null,"Ambroise","Visser"]
[8,null,2025,null,"Joop",null,null,"SCHM HAS","HAS",null,null,null,"Anton","Smit"]
[9,null,null,null,"JOP",null,null,"LCR middag","LCR",null,null,null,"Apollonia","Meijer"]
[10,null,null,null,"Jos",null,null,"LCR ochtend","LCR",null,null,null,"Arkan","de Boer"]
[11,null,null,null,"Josau",null,null,null,null,null,null,null,"Arsenio","Mulder"]
[12,null,null,null,"jules",null,null,null,null,null,null,null,"Atobhran","de Groot"]
[13,null,null,null,"Klaas",null,null,null,null,null,null,null,"Baki","Bos"]
[14,null,null,null,"Klaasjan",null,null,"NIET mijn afdelingen","-",null,null,null,"Barend","Vos"]
[15,null,null,null,"Lot",null,null,"PALL HAS","-",null,null,null,"Bereket","Peters"]
[16,null,null,null,"Marjan",null,null,"PALL MEP","-",null,null,null,"Bile","Hendriks"]
[17,null,null,null,"Mohamed",null,null,"PALL Rweg","-",null,null,null,"Boyan","van Leeuwen"]
[18,null,null,null,"Peter",null,null,"Reserve ochtend","-",null,null,null,"Charles","Dekker"]
[19,null,null,null,"Piet",null,null,"Reserve middag","-",null,null,null,"Chevindio","Brouwer"]
[20,null,null,null,"Pieter",null,null,null,null,null,null,null,"Christiaan","de Wit"]
[21,null,null,null,"Roy",null,null,null,null,null,null,null,"Daniel","Dijkstra"]
[22,null,null,null,"Sanne",null,null,null,null,null,null,null,"Davood","Smits"]
[23,null,null,null,"Tuur",null,null,null,null,null,null,null,"Dennis","de Graaf"]
[24,null,null,null,"Udo",null,null,null,null,null,null,null,"Dikkie","van der Meer"]
[25,null,null,null,"Wilhelm",null,null,null,null,null,null,null,"Elroy","van der Linden"]
[26,null,null,null,"Willem",null,null,null,null,null,null,null,"Emsud","Kok"]
[27,null,null,null,"Willemein",null,null,null,null,null,null,null,"Engin","Jacobs"]
[28,null,null,null,null,null,null,null,null,null,null,null,"Erik","de Haan"]
[29,null,null,null,null,null,null,null,null,null,null,null,"Evans","Vermeulen"]
[30,null,null,null,null,null,null,null,null,null,null,null,"Everon","van den Heuvel"]
[31,null,null,null,null,null,null,null,null,null,null,null,"Fars","van de Veen"]
[32,null,null,null,null,null,null,null,null,null,null,null,"Felicia","van den Broek"]
[33,null,null,null,null,null,null,null,null,null,null,null,"Fetehawi","de Bruyn"]
[34,null,null,null,null,null,null,null,null,null,null,null,"Filimon","de Bruin"]
[35,null,null,null,null,null,null,null,null,null,null,null,"Flavi","van der Heyden"]
[36,null,null,null,null,null,null,null,null,null,null,null,"Gebrehiwet","Schouten"]
[37,null,null,null,null,null,null,null,null,null,null,null,"Gerrit","van Beek"]
[38,null,null,null,null,null,null,null,null,null,null,null,"Haben","Willems"]
[39,null,null,null,null,null,null,null,null,null,null,null,"Hagos","van Vliet"]
[40,null,null,null,null,null,null,null,null,null,null,null,"Hans","van de Ven "]
[41,null,null,null,null,null,null,null,null,null,null,null,"Harrie","Hoekstra"]
[42,null,null,null,null,null,null,null,null,null,null,null,"Harry","Maas"]
[43,null,null,null,null,null,null,null,null,null,null,null,"Hassan","Verhoeven"]
[44,null,null,null,null,null,null,null,null,null,null,null,"Henk","Koster"]
[45,null,null,null,null,null,null,null,null,null,null,null,"Henri","van Dam"]
[46,null,null,null,null,null,null,null,null,null,null,null,"Heruy","van de Wal "]
[47,null,null,null,null,null,null,null,null,null,null,null,"Hilko","Prins"]
[48,null,null,null,null,null,null,null,null,null,null,null,"Hishelu","Blom"]
[49,null,null,null,null,null,null,null,null,null,null,null,"Houcin","Huisman"]
[50,null,null,null,null,null,null,null,null,null,null,null,"Ilker","Peeters"]
[51,null,null,null,null,null,null,null,null,null,null,null,"Jan","de Jonge"]
[52,null,null,null,null,null,null,null,null,null,null,null,"Jarek","Kuipers"]
[53,null,null,null,null,null,null,null,null,null,null,null,"Jelte","van Veen"]
[null,null,null,null,null,null,null,null,null,null,null,null,"Jeroen","Post"]
[null,null,null,null,null,null,null,null,null,null,null,null,"Karrar","Kuiper"]
[null,null,null,null,null,null,null,null,null,null,null,null,"Kevin","Veenstra"]
[null,null,null,null,null,null,null,null,null,null,null,null,"Klaas","Kramer"]
[null,null,null,null,null,null,null,null,null,null,null,null,"Ko","van de Brink"]
[null,null,null,null,null,null,null,null,null,null,null,null,"Laszlo","Scholten"]
[null,null,null,null,null,null,null,null,null,null,null,null,"Latie","van Wijk"]
[null,null,null,null,null,null,null,null,null,null,null,null,"Magdalena","Postma"]
[null,null,null,null,null,null,null,null,null,null,null,null,"Marjolein","Martens"]
[null,null,null,null,null,null,null,null,null,null,null,null,"Mark","Vink"]
[null,null,null,null,null,null,null,null,null,null,null,null,"Martijn","de Ruiter"]
[null,null,null,null,null,null,null,null,null,null,null,null,"Mebrathu","Timmermans"]
[null,null,null,null,null,null,null,null,null,null,null,null,"Merhawi","Groen"]
[null,null,null,null,null,null,null,null,null,null,null,null,"Michael","Gerritsen"]
[null,null,null,null,null,null,null,null,null,null,null,null,"Michel","Jonker"]
[null,null,null,null,null,null,null,null,null,null,null,null,"Miquel","van Loon"]
[null,null,null,null,null,null,null,null,null,null,null,null,"Moussa","Boer"]
[null,null,null,null,null,null,null,null,null,null,null,null,"Naoufel","van de Velde "]
[null,null,null,null,null,null,null,null,null,null,null,null,"Nexhmedi","Willemsen"]
[null,null,null,null,null,null,null,null,null,null,null,null,"Niek","Smeets"]
[null,null,null,null,null,null,null,null,null,null,null,null,"Norbert","de Lange"]
[null,null,null,null,null,null,null,null,null,null,null,null,"Olcay","de Vos"]
[null,null,null,null,null,null,null,null,null,null,null,null,"Patrick","Bosch"]
[null,null,null,null,null,null,null,null,null,null,null,null,"Paul","van Dongen"]
[null,null,null,null,null,null,null,null,null,null,null,null,"Piet","Schipper"]
[null,null,null,null,null,null,null,null,null,null,null,null,"Quincy","de Koning"]
[null,null,null,null,null,null,null,null,null,null,null,null,"Rachid","van der Laan"]
[null,null,null,null,null,null,null,null,null,null,null,null,"Reinder","Koning"]
[null,null,null,null,null,null,null,null,null,null,null,null,"Rene","van der Velden"]
[null,null,null,null,null,null,null,null,null,null,null,null,"Richard","Driessen"]
[null,null,null,null,null,null,null,null,null,null,null,null,"Rijk","van Doorn"]
[null,null,null,null,null,null,null,null,null,null,null,null,"Robel","Hermans"]
[null,null,null,null,null,null,null,null,null,null,null,null,"Robin","Evers"]
[null,null,null,null,null,null,null,null,null,null,null,null,"Rolinka","van den Bosch"]
[null,null,null,null,null,null,null,null,null,null,null,null,"Roy","van der Meulen"]
[null,null,null,null,null,null,null,null,null,null,null,null,"Rudolf","Hofman"]
[null,null,null,null,null,null,null,null,null,null,null,null,"Saidou","Bosman"]
[null,null,null,null,null,null,null,null,null,null,null,null,"Salahadin","Wolters"]
[null,null,null,null,null,null,null,null,null,null,null,null,"Samantha","Sanders"]
[null,null,null,null,null,null,null,null,null,null,null,null,"Sami","van der Horst"]
[null,null,null,null,null,null,null,null,null,null,null,null,"Sebastiaan","Mol"]
[null,null,null,null,null,null,null,null,null,null,null,null,"Sebastian","Kuijpers"]
[null,null,null,null,null,null,null,null,null,null,null,null,"Shawn","Molenaar"]
[null,null,null,null,null,null,null,null,null,null,null,null,"Sied"," van der Pol"]
[null,null,null,null,null,null,null,null,null,null,null,null,"Swen","de Leeuw"]
[null,null,null,null,null,null,null,null,null,null,null,null,"Tesfaldet","Verbeek"]
[null,null,null,null,null,null,null,null,null,null,null,null,"Tomas","Koolen"]
[null,null,null,null,null,null,null,null,null,null,null,null,"Trienko","Spooren"]
[null,null,null,null,null,null,null,null,null,null,null,null,"Viorel","Triest"]
[null,null,null,null,null,null,null,null,null,null,null,null,"Wenaron","Kurkema"]
[null,null,null,null,null,null,null,null,null,null,null,null,"Wim","Vogel"]
[null,null,null,null,null,null,null,null,null,null,null,null,"Wolter","De bolder"]
[null,null,null,null,null,null,null,null,null,null,null,null,"Wout","Van Goud"]
[null,null,null,null,null,null,null,null,null,null,null,null,"Yemane","Masout"]