{"text_format":"1","workbook":"xlsx","n_sheets":5,"sheets":["Verlof","InfoUitzendburo","WEEKPLANNING","PlanningsFilter","Validatie"],"not_rendered":{"charts":0,"images":0,"macros":1,"external_links":0,"defined_names":10,"comments":0,"pivot_tables":0},"unopened":[],"bounds":{"document_bytes":16777216,"sheet_cells":100000,"rows_first":2000,"rows_last":500,"rows_between":2000,"halvings":0,"cell_chars":16384,"cell_head_chars":4096},"cells_cut":0,"cells_raw":0,"read":"whole","date_system":"1900"}

{"sheet":"Verlof","index":0,"n_rows":7,"n_cols":4,"rows_kept":7,"cut":false,"hidden":false,"merged":[]}
[]
[null,"Vul hier de afwezige dagen (periode) in"]
[null,"Afwezig ","van","tot en met"]
[null,"Peter","2019-12-28","2020-01-02"]
[null,"Pieter","2019-12-27","2020-01-01"]
[null,"Klaas","2019-12-30","2019-12-30"]
[null,"Mohamed","2020-01-09","2020-01-09"]

{"sheet":"InfoUitzendburo","index":1,"n_rows":939,"n_cols":15,"rows_kept":939,"cut":false,"hidden":false,"merged":[]}
[null,null,null,null,null,null,null,null,null,null,"Mijn afdelingen","Planning afdeling ",null,"NIET mijn afdelingen"]
["Info","Functie","Starttijd","Eindtijd","Voornaam","Achternaam",null,null,null,null,"ABB weekenddienst","ABB",null,"PALL HAS"]
["2019-12-01","ABB middag",43800.604166666664,43800.875,"Baki","Bos",null,null,null,null,"ABB middag","ABB",null,"PALL MEP"]
["2019-12-01","SCHM",43800.999305555553,43801.364583333336,"Rolinka","van den Bosch",null,null,null,null,"ABB ochtend ","ABB",null,"PALL Rweg"]
["2019-12-01","SCHM",43800.999305555553,43801.364583333336,"Erik","de Haan",null,null,null,null,null,null,null,"Reserve ochtend"]
["2019-12-02","ABB ochtend ",43801.25,43801.614583333336,"Flavi","van der Heyden",null,null,null,null,"AFV MEP","MEP",null,"Reserve middag"]
["2019-12-02","AFV HAS",43801.25,43801.40625,"Norbert","de Lange"]
["2019-12-02","AFV MEP",43801.25,43801.614583333336,"Houcin","Huisman",null,null,null,null,"SCHM AFV","AFV"]
{"$rows_left_out":932}
{"sheet":"WEEKPLANNING","index":2,"n_rows":38,"n_cols":24,"rows_kept":38,"cut":false,"hidden":false,"merged":[[2,21,2,23],[2,3,2,5],[2,6,2,8],[2,9,2,11],[2,12,2,14],[2,15,2,17],[2,18,2,20]]}
[null,null,null,null,null,"Planning"]
["Jaar","WEEK",null,{"$f":"D3","v":"2019-12-02"},{"$f":"D2","v":43801},{"$f":"D2","v":43801},{"$f":"G3","v":43802},{"$f":"G2","v":43802},{"$f":"G2","v":43802},{"$f":"J3","v":43803},{"$f":"J2","v":43803},{"$f":"J2","v":43803},{"$f":"M3","v":43804},{"$f":"M2","v":43804},{"$f":"M2","v":43804},{"$f":"P3","v":43805},{"$f":"P2","v":43805},{"$f":"P2","v":43805},{"$f":"S3","v":43806},{"$f":"S2","v":43806},{"$f":"S2","v":43806},{"$f":"V3","v":43807},{"$f":"V2","v":43807},{"$f":"V2","v":43807}]
[2019,49,null,{"$f":"DATE($A$3,1,4)-WEEKDAY(DATE($A$3,1,4),2)+1+(($B$3-1)*7)","v":"2019-12-02"},null,null,{"$f":"D3+1","v":"2019-12-03"},null,null,{"$f":"G3+1","v":"2019-12-04"},null,null,{"$f":"J3+1","v":"2019-12-05"},null,null,{"$f":"M3+1","v":"2019-12-06"},null,null,{"$f":"P3+1","v":"2019-12-07"},null,null,{"$f":"S3+1","v":"2019-12-08"}]
["Afdeling",null,"FTE","Vroeg","Laat","Nacht","Vroeg","Laat","Nacht","Vroeg","Laat","Nacht","Vroeg","Laat","Nacht","Vroeg","Laat","Nacht","Vroeg","Laat","Nacht","Vroeg","Laat","Nacht"]
["WERKTIJDEN",null,null,"06:00/14:45","14:45/23:30",null,"06:00/14:45","14:45/23:30",null,"06:00/14:45","14:45/23:30",null,"06:00/14:45","14:45/23:30",null,"06:00/14:45","14:45/23:30",null,"06:00/14:45","14:45/23:30",null,"06:00/14:45","14:45/23:30"]
["AFV",null,1,{"$f":"IFERROR(INDEX(PlanningsFilter!$L$6:$L$1000,SMALL(IF(PlanningsFilter!$K$6:$K$1000=$A6,IF(PlanningsFilter!$C$6:$C$1000=D$2,IF(PlanningsFilter!$J$6:$J$1000=D$4,IF(PlanningsFilter!$I$6:$I$1000=\"\",ROW(PlanningsFilter!$I$6:$I$1000)-ROW($I$6)+1)))),$C6)),\"\")","v":"Baki Bos"},{"$f":"IFERROR(INDEX(PlanningsFilter!$L$6:$L$1000,SMALL(IF(PlanningsFilter!$K$6:$K$1000=$A6,IF(PlanningsFilter!$C$6:$C$1000=E$2,IF(PlanningsFilter!$J$6:$J$1000=E$4,IF(PlanningsFilter!$I$6:$I$1000=\"\",ROW(PlanningsFilter!$I$6:$I$1000)-ROW($I$6)+1)))),$C6)),\"\")","v":"Jan de Jonge"},{"$f":"IFERROR(INDEX(PlanningsFilter!$L$6:$L$1000,SMALL(IF(PlanningsFilter!$K$6:$K$1000=$A6,IF(PlanningsFilter!$C$6:$C$1000=F$2,IF(PlanningsFilter!$J$6:$J$1000=F$4,IF(PlanningsFilter!$I$6:$I$1000=\"\",ROW(PlanningsFilter!$I$6:$I$1000)-ROW($I$6)+1)))),$C6)),\"\")","v":""},{"$f":"IFERROR(INDEX(PlanningsFilter!$L$6:$L$1000,SMALL(IF(PlanningsFilter!$K$6:$K$1000=$A6,IF(PlanningsFilter!$C$6:$C$1000=G$2,IF(PlanningsFilter!$J$6:$J$1000=G$4,IF(PlanningsFilter!$I$6:$I$1000=\"\",ROW(PlanningsFilter!$I$6:$I$1000)-ROW($I$6)+1)))),$C6)),\"\")","v":"Baki Bos"},{"$f":"IFERROR(INDEX(PlanningsFilter!$L$6:$L$1000,SMALL(IF(PlanningsFilter!$K$6:$K$1000=$A6,IF(PlanningsFilter!$C$6:$C$1000=H$2,IF(PlanningsFilter!$J$6:$J$1000=H$4,IF(PlanningsFilter!$I$6:$I$1000=\"\",ROW(PlanningsFilter!$I$6:$I$1000)-ROW($I$6)+1)))),$C6)),\"\")","v":"Jan de Jonge"},{"$f":"IFERROR(INDEX(PlanningsFilter!$L$6:$L$1000,SMALL(IF(PlanningsFilter!$K$6:$K$1000=$A6,IF(PlanningsFilter!$C$6:$C$1000=I$2,IF(PlanningsFilter!$J$6:$J$1000=I$4,IF(PlanningsFilter!$I$6:$I$1000=\"\",ROW(PlanningsFilter!$I$6:$I$1000)-ROW($I$6)+1)))),$C6)),\"\")","v":""},{"$f":"IFERROR(INDEX(PlanningsFilter!$L$6:$L$1000,SMALL(IF(PlanningsFilter!$K$6:$K$1000=$A6,IF(PlanningsFilter!$C$6:$C$1000=J$2,IF(PlanningsFilter!$J$6:$J$1000=J$4,IF(PlanningsFilter!$I$6:$I$1000=\"\",ROW(PlanningsFilter!$I$6:$I$1000)-ROW($I$6)+1)))),$C6)),\"\")","v":"Baki Bos"},{"$f":"IFERROR(INDEX(PlanningsFilter!$L$6:$L$1000,SMALL(IF(PlanningsFilter!$K$6:$K$1000=$A6,IF(PlanningsFilter!$C$6:$C$1000=K$2,IF(PlanningsFilter!$J$6:$J$1000=K$4,IF(PlanningsFilter!$I$6:$I$1000=\"\",ROW(PlanningsFilter!$I$6:$I$1000)-ROW($I$6)+1)))),$C6)),\"\")","v":"Jan de Jonge"},{"$f":"IFERROR(INDEX(PlanningsFilter!$L$6:$L$1000,SMALL(IF(PlanningsFilter!$K$6:$K$1000=$A6,IF(PlanningsFilter!$C$6:$C$1000=L$2,IF(PlanningsFilter!$J$6:$J$1000=L$4,IF(PlanningsFilter!$I$6:$I$1000=\"\",ROW(PlanningsFilter!$I$6:$I$1000)-ROW($I$6)+1)))),$C6)),\"\")","v":""},{"$f":"IFERROR(INDEX(PlanningsFilter!$L$6:$L$1000,SMALL(IF(PlanningsFilter!$K$6:$K$1000=$A6,IF(PlanningsFilter!$C$6:$C$1000=M$2,IF(PlanningsFilter!$J$6:$J$1000=M$4,IF(PlanningsFilter!$I$6:$I$1000=\"\",ROW(PlanningsFilter!$I$6:$I$1000)-ROW($I$6)+1)))),$C6)),\"\")","v":"Baki Bos"},{"$f":"IFERROR(INDEX(PlanningsFilter!$L$6:$L$1000,SMALL(IF(PlanningsFilter!$K$6:$K$1000=$A6,IF(PlanningsFilter!$C$6:$C$1000=N$2,IF(PlanningsFilter!$J$6:$J$1000=N$4,IF(PlanningsFilter!$I$6:$I$1000=\"\",ROW(PlanningsFilter!$I$6:$I$1000)-ROW($I$6)+1)))),$C6)),\"\")","v":"Jan de Jonge"},{"$f":"IFERROR(INDEX(PlanningsFilter!$L$6:$L$1000,SMALL(IF(PlanningsFilter!$K$6:$K$1000=$A6,IF(PlanningsFilter!$C$6:$C$1000=O$2,IF(PlanningsFilter!$J$6:$J$1000=O$4,IF(PlanningsFilter!$I$6:$I$1000=\"\",ROW(PlanningsFilter!$I$6:$I$1000)-ROW($I$6)+1)))),$C6)),\"\")","v":""},{"$f":"IFERROR(INDEX(PlanningsFilter!$L$6:$L$1000,SMALL(IF(PlanningsFilter!$K$6:$K$1000=$A6,IF(PlanningsFilter!$C$6:$C$1000=P$2,IF(PlanningsFilter!$J$6:$J$1000=P$4,IF(PlanningsFilter!$I$6:$I$1000=\"\",ROW(PlanningsFilter!$I$6:$I$1000)-ROW($I$6)+1)))),$C6)),\"\")","v":"Baki Bos"},{"$f":"IFERROR(INDEX(PlanningsFilter!$L$6:$L$1000,SMALL(IF(PlanningsFilter!$K$6:$K$1000=$A6,IF(PlanningsFilter!$C$6:$C$1000=Q$2,IF(PlanningsFilter!$J$6:$J$1000=Q$4,IF(PlanningsFilter!$I$6:$I$1000=\"\",ROW(PlanningsFilter!$I$6:$I$1000)-ROW($I$6)+1)))),$C6)),\"\")","v":"Jan de Jonge"},{"$f":"IFERROR(INDEX(PlanningsFilter!$L$6:$L$1000,SMALL(IF(PlanningsFilter!$K$6:$K$1000=$A6,IF(PlanningsFilter!$C$6:$C$1000=R$2,IF(PlanningsFilter!$J$6:$J$1000=R$4,IF(PlanningsFilter!$I$6:$I$1000=\"\",ROW(PlanningsFilter!$I$6:$I$1000)-ROW($I$6)+1)))),$C6)),\"\")","v":""},{"$f":"IFERROR(INDEX(PlanningsFilter!$L$6:$L$1000,SMALL(IF(PlanningsFilter!$K$6:$K$1000=$A6,IF(PlanningsFilter!$C$6:$C$1000=S$2,IF(PlanningsFilter!$J$6:$J$1000=S$4,IF(PlanningsFilter!$I$6:$I$1000=\"\",ROW(PlanningsFilter!$I$6:$I$1000)-ROW($I$6)+1)))),$C6)),\"\")","v":""},{"$f":"IFERROR(INDEX(PlanningsFilter!$L$6:$L$1000,SMALL(IF(PlanningsFilter!$K$6:$K$1000=$A6,IF(PlanningsFilter!$C$6:$C$1000=T$2,IF(PlanningsFilter!$J$6:$J$1000=T$4,IF(PlanningsFilter!$I$6:$I$1000=\"\",ROW(PlanningsFilter!$I$6:$I$1000)-ROW($I$6)+1)))),$C6)),\"\")","v":""},{"$f":"IFERROR(INDEX(PlanningsFilter!$L$6:$L$1000,SMALL(IF(PlanningsFilter!$K$6:$K$1000=$A6,IF(PlanningsFilter!$C$6:$C$1000=U$2,IF(PlanningsFilter!$J$6:$J$1000=U$4,IF(PlanningsFilter!$I$6:$I$1000=\"\",ROW(PlanningsFilter!$I$6:$I$1000)-ROW($I$6)+1)))),$C6)),\"\")","v":""},{"$f":"IFERROR(INDEX(PlanningsFilter!$L$6:$L$1000,SMALL(IF(PlanningsFilter!$K$6:$K$1000=$A6,IF(PlanningsFilter!$C$6:$C$1000=V$2,IF(PlanningsFilter!$J$6:$J$1000=V$4,IF(PlanningsFilter!$I$6:$I$1000=\"\",ROW(PlanningsFilter!$I$6:$I$1000)-ROW($I$6)+1)))),$C6)),\"\")","v":""},{"$f":"IFERROR(INDEX(PlanningsFilter!$L$6:$L$1000,SMALL(IF(PlanningsFilter!$K$6:$K$1000=$A6,IF(PlanningsFilter!$C$6:$C$1000=W$2,IF(PlanningsFilter!$J$6:$J$1000=W$4,IF(PlanningsFilter!$I$6:$I$1000=\"\",ROW(PlanningsFilter!$I$6:$I$1000)-ROW($I$6)+1)))),$C6)),\"\")","v":""},{"$f":"IFERROR(INDEX(PlanningsFilter!$L$6:$L$1000,SMALL(IF(PlanningsFilter!$K$6:$K$1000=$A6,IF(PlanningsFilter!$C$6:$C$1000=X$2,IF(PlanningsFilter!$J$6:$J$1000=X$4,IF(PlanningsFilter!$I$6:$I$1000=\"\",ROW(PlanningsFilter!$I$6:$I$1000)-ROW($I$6)+1)))),$C6)),\"\")","v":""}]
["AFV",null,2,{"$f":"IFERROR(INDEX(PlanningsFilter!$L$6:$L$1000,SMALL(IF(PlanningsFilter!$K$6:$K$1000=$A7,IF(PlanningsFilter!$C$6:$C$1000=D$2,IF(PlanningsFilter!$J$6:$J$1000=D$4,IF(PlanningsFilter!$I$6:$I$1000=\"\",ROW(PlanningsFilter!$I$6:$I$1000)-ROW($I$6)+1)))),$C7)),\"\")","v":"Ilker Peeters"},{"$f":"IFERROR(INDEX(PlanningsFilter!$L$6:$L$1000,SMALL(IF(PlanningsFilter!$K$6:$K$1000=$A7,IF(PlanningsFilter!$C$6:$C$1000=E$2,IF(PlanningsFilter!$J$6:$J$1000=E$4,IF(PlanningsFilter!$I$6:$I$1000=\"\",ROW(PlanningsFilter!$I$6:$I$1000)-ROW($I$6)+1)))),$C7)),\"\")","v":"Boyan van Leeuwen"},{"$f":"IFERROR(INDEX(PlanningsFilter!$L$6:$L$1000,SMALL(IF(PlanningsFilter!$K$6:$K$1000=$A7,IF(PlanningsFilter!$C$6:$C$1000=F$2,IF(PlanningsFilter!$J$6:$J$1000=F$4,IF(PlanningsFilter!$I$6:$I$1000=\"\",ROW(PlanningsFilter!$I$6:$I$1000)-ROW($I$6)+1)))),$C7)),\"\")","v":""},{"$f":"IFERROR(INDEX(PlanningsFilter!$L$6:$L$1000,SMALL(IF(PlanningsFilter!$K$6:$K$1000=$A7,IF(PlanningsFilter!$C$6:$C$1000=G$2,IF(PlanningsFilter!$J$6:$J$1000=G$4,IF(PlanningsFilter!$I$6:$I$1000=\"\",ROW(PlanningsFilter!$I$6:$I$1000)-ROW($I$6)+1)))),$C7)),\"\")","v":"Ilker Peeters"},{"$f":"IFERROR(INDEX(PlanningsFilter!$L$6:$L$1000,SMALL(IF(PlanningsFilter!$K$6:$K$1000=$A7,IF(PlanningsFilter!$C$6:$C$1000=H$2,IF(PlanningsFilter!$J$6:$J$1000=H$4,IF(PlanningsFilter!$I$6:$I$1000=\"\",ROW(PlanningsFilter!$I$6:$I$1000)-ROW($I$6)+1)))),$C7)),\"\")","v":"Boyan van Leeuwen"},{"$f":"IFERROR(INDEX(PlanningsFilter!$L$6:$L$1000,SMALL(IF(PlanningsFilter!$K$6:$K$1000=$A7,IF(PlanningsFilter!$C$6:$C$1000=I$2,IF(PlanningsFilter!$J$6:$J$1000=I$4,IF(PlanningsFilter!$I$6:$I$1000=\"\",ROW(PlanningsFilter!$I$6:$I$1000)-ROW($I$6)+1)))),$C7)),\"\")","v":""},{"$f":"IFERROR(INDEX(PlanningsFilter!$L$6:$L$1000,SMALL(IF(PlanningsFilter!$K$6:$K$1000=$A7,IF(PlanningsFilter!$C$6:$C$1000=J$2,IF(PlanningsFilter!$J$6:$J$1000=J$4,IF(PlanningsFilter!$I$6:$I$1000=\"\",ROW(PlanningsFilter!$I$6:$I$1000)-ROW($I$6)+1)))),$C7)),\"\")","v":"Ilker Peeters"},{"$f":"IFERROR(INDEX(PlanningsFilter!$L$6:$L$1000,SMALL(IF(PlanningsFilter!$K$6:$K$1000=$A7,IF(PlanningsFilter!$C$6:$C$1000=K$2,IF(PlanningsFilter!$J$6:$J$1000=K$4,IF(PlanningsFilter!$I$6:$I$1000=\"\",ROW(PlanningsFilter!$I$6:$I$1000)-ROW($I$6)+1)))),$C7)),\"\")","v":"Boyan van Leeuwen"},{"$f":"IFERROR(INDEX(PlanningsFilter!$L$6:$L$1000,SMALL(IF(PlanningsFilter!$K$6:$K$1000=$A7,IF(PlanningsFilter!$C$6:$C$1000=L$2,IF(PlanningsFilter!$J$6:$J$1000=L$4,IF(PlanningsFilter!$I$6:$I$1000=\"\",ROW(PlanningsFilter!$I$6:$I$1000)-ROW($I$6)+1)))),$C7)),\"\")","v":""},{"$f":"IFERROR(INDEX(PlanningsFilter!$L$6:$L$1000,SMALL(IF(PlanningsFilter!$K$6:$K$1000=$A7,IF(PlanningsFilter!$C$6:$C$1000=M$2,IF(PlanningsFilter!$J$6:$J$1000=M$4,IF(PlanningsFilter!$I$6:$I$1000=\"\",ROW(PlanningsFilter!$I$6:$I$1000)-ROW($I$6)+1)))),$C7)),\"\")","v":"Ilker Peeters"},{"$f":"IFERROR(INDEX(PlanningsFilter!$L$6:$L$1000,SMALL(IF(PlanningsFilter!$K$6:$K$1000=$A7,IF(PlanningsFilter!$C$6:$C$1000=N$2,IF(PlanningsFilter!$J$6:$J$1000=N$4,IF(PlanningsFilter!$I$6:$I$1000=\"\",ROW(PlanningsFilter!$I$6:$I$1000)-ROW($I$6)+1)))),$C7)),\"\")","v":"Boyan van Leeuwen"},{"$f":"IFERROR(INDEX(PlanningsFilter!$L$6:$L$1000,SMALL(IF(PlanningsFilter!$K$6:$K$1000=$A7,IF(PlanningsFilter!$C$6:$C$1000=O$2,IF(PlanningsFilter!$J$6:$J$1000=O$4,IF(PlanningsFilter!$I$6:$I$1000=\"\",ROW(PlanningsFilter!$I$6:$I$1000)-ROW($I$6)+1)))),$C7)),\"\")","v":""},{"$f":"IFERROR(INDEX(PlanningsFilter!$L$6:$L$1000,SMALL(IF(PlanningsFilter!$K$6:$K$1000=$A7,IF(PlanningsFilter!$C$6:$C$1000=P$2,IF(PlanningsFilter!$J$6:$J$1000=P$4,IF(PlanningsFilter!$I$6:$I$1000=\"\",ROW(PlanningsFilter!$I$6:$I$1000)-ROW($I$6)+1)))),$C7)),\"\")","v":"Ilker Peeters"},{"$f":"IFERROR(INDEX(PlanningsFilter!$L$6:$L$1000,SMALL(IF(PlanningsFilter!$K$6:$K$1000=$A7,IF(PlanningsFilter!$C$6:$C$1000=Q$2,IF(PlanningsFilter!$J$6:$J$1000=Q$4,IF(PlanningsFilter!$I$6:$I$1000=\"\",ROW(PlanningsFilter!$I$6:$I$1000)-ROW($I$6)+1)))),$C7)),\"\")","v":"Boyan van Leeuwen"},{"$f":"IFERROR(INDEX(PlanningsFilter!$L$6:$L$1000,SMALL(IF(PlanningsFilter!$K$6:$K$1000=$A7,IF(PlanningsFilter!$C$6:$C$1000=R$2,IF(PlanningsFilter!$J$6:$J$1000=R$4,IF(PlanningsFilter!$I$6:$I$1000=\"\",ROW(PlanningsFilter!$I$6:$I$1000)-ROW($I$6)+1)))),$C7)),\"\")","v":""},{"$f":"IFERROR(INDEX(PlanningsFilter!$L$6:$L$1000,SMALL(IF(PlanningsFilter!$K$6:$K$1000=$A7,IF(PlanningsFilter!$C$6:$C$1000=S$2,IF(PlanningsFilter!$J$6:$J$1000=S$4,IF(PlanningsFilter!$I$6:$I$1000=\"\",ROW(PlanningsFilter!$I$6:$I$1000)-ROW($I$6)+1)))),$C7)),\"\")","v":""},{"$f":"IFERROR(INDEX(PlanningsFilter!$L$6:$L$1000,SMALL(IF(PlanningsFilter!$K$6:$K$1000=$A7,IF(PlanningsFilter!$C$6:$C$1000=T$2,IF(PlanningsFilter!$J$6:$J$1000=T$4,IF(PlanningsFilter!$I$6:$I$1000=\"\",ROW(PlanningsFilter!$I$6:$I$1000)-ROW($I$6)+1)))),$C7)),\"\")","v":""},{"$f":"IFERROR(INDEX(PlanningsFilter!$L$6:$L$1000,SMALL(IF(PlanningsFilter!$K$6:$K$1000=$A7,IF(PlanningsFilter!$C$6:$C$1000=U$2,IF(PlanningsFilter!$J$6:$J$1000=U$4,IF(PlanningsFilter!$I$6:$I$1000=\"\",ROW(PlanningsFilter!$I$6:$I$1000)-ROW($I$6)+1)))),$C7)),\"\")","v":""},{"$f":"IFERROR(INDEX(PlanningsFilter!$L$6:$L$1000,SMALL(IF(PlanningsFilter!$K$6:$K$1000=$A7,IF(PlanningsFilter!$C$6:$C$1000=V$2,IF(PlanningsFilter!$J$6:$J$1000=V$4,IF(PlanningsFilter!$I$6:$I$1000=\"\",ROW(PlanningsFilter!$I$6:$I$1000)-ROW($I$6)+1)))),$C7)),\"\")","v":""},{"$f":"IFERROR(INDEX(PlanningsFilter!$L$6:$L$1000,SMALL(IF(PlanningsFilter!$K$6:$K$1000=$A7,IF(PlanningsFilter!$C$6:$C$1000=W$2,IF(PlanningsFilter!$J$6:$J$1000=W$4,IF(PlanningsFilter!$I$6:$I$1000=\"\",ROW(PlanningsFilter!$I$6:$I$1000)-ROW($I$6)+1)))),$C7)),\"\")","v":""},{"$f":"IFERROR(INDEX(PlanningsFilter!$L$6:$L$1000,SMALL(IF(PlanningsFilter!$K$6:$K$1000=$A7,IF(PlanningsFilter!$C$6:$C$1000=X$2,IF(PlanningsFilter!$J$6:$J$1000=X$4,IF(PlanningsFilter!$I$6:$I$1000=\"\",ROW(PlanningsFilter!$I$6:$I$1000)-ROW($I$6)+1)))),$C7)),\"\")","v":""}]
["AFV",null,3,{"$f":"IFERROR(INDEX(PlanningsFilter!$L$6:$L$1000,SMALL(IF(PlanningsFilter!$K$6:$K$1000=$A8,IF(PlanningsFilter!$C$6:$C$1000=D$2,IF(PlanningsFilter!$J$6:$J$1000=D$4,IF(PlanningsFilter!$I$6:$I$1000=\"\",ROW(PlanningsFilter!$I$6:$I$1000)-ROW($I$6)+1)))),$C8)),\"\")","v":"Miquel van Loon"},{"$f":"IFERROR(INDEX(PlanningsFilter!$L$6:$L$1000,SMALL(IF(PlanningsFilter!$K$6:$K$1000=$A8,IF(PlanningsFilter!$C$6:$C$1000=E$2,IF(PlanningsFilter!$J$6:$J$1000=E$4,IF(PlanningsFilter!$I$6:$I$1000=\"\",ROW(PlanningsFilter!$I$6:$I$1000)-ROW($I$6)+1)))),$C8)),\"\")","v":"Sami van der Horst"},{"$f":"IFERROR(INDEX(PlanningsFilter!$L$6:$L$1000,SMALL(IF(PlanningsFilter!$K$6:$K$1000=$A8,IF(PlanningsFilter!$C$6:$C$1000=F$2,IF(PlanningsFilter!$J$6:$J$1000=F$4,IF(PlanningsFilter!$I$6:$I$1000=\"\",ROW(PlanningsFilter!$I$6:$I$1000)-ROW($I$6)+1)))),$C8)),\"\")","v":""},{"$f":"IFERROR(INDEX(PlanningsFilter!$L$6:$L$1000,SMALL(IF(PlanningsFilter!$K$6:$K$1000=$A8,IF(PlanningsFilter!$C$6:$C$1000=G$2,IF(PlanningsFilter!$J$6:$J$1000=G$4,IF(PlanningsFilter!$I$6:$I$1000=\"\",ROW(PlanningsFilter!$I$6:$I$1000)-ROW($I$6)+1)))),$C8)),\"\")","v":"Miquel van Loon"},{"$f":"IFERROR(INDEX(PlanningsFilter!$L$6:$L$1000,SMALL(IF(PlanningsFilter!$K$6:$K$1000=$A8,IF(PlanningsFilter!$C$6:$C$1000=H$2,IF(PlanningsFilter!$J$6:$J$1000=H$4,IF(PlanningsFilter!$I$6:$I$1000=\"\",ROW(PlanningsFilter!$I$6:$I$1000)-ROW($I$6)+1)))),$C8)),\"\")","v":"Sami van der Horst"},{"$f":"IFERROR(INDEX(PlanningsFilter!$L$6:$L$1000,SMALL(IF(PlanningsFilter!$K$6:$K$1000=$A8,IF(PlanningsFilter!$C$6:$C$1000=I$2,IF(PlanningsFilter!$J$6:$J$1000=I$4,IF(PlanningsFilter!$I$6:$I$1000=\"\",ROW(PlanningsFilter!$I$6:$I$1000)-ROW($I$6)+1)))),$C8)),\"\")","v":""},{"$f":"IFERROR(INDEX(PlanningsFilter!$L$6:$L$1000,SMALL(IF(PlanningsFilter!$K$6:$K$1000=$A8,IF(PlanningsFilter!$C$6:$C$1000=J$2,IF(PlanningsFilter!$J$6:$J$1000=J$4,IF(PlanningsFilter!$I$6:$I$1000=\"\",ROW(PlanningsFilter!$I$6:$I$1000)-ROW($I$6)+1)))),$C8)),\"\")","v":"Miquel van Loon"},{"$f":"IFERROR(INDEX(PlanningsFilter!$L$6:$L$1000,SMALL(IF(PlanningsFilter!$K$6:$K$1000=$A8,IF(PlanningsFilter!$C$6:$C$1000=K$2,IF(PlanningsFilter!$J$6:$J$1000=K$4,IF(PlanningsFilter!$I$6:$I$1000=\"\",ROW(PlanningsFilter!$I$6:$I$1000)-ROW($I$6)+1)))),$C8)),\"\")","v":"Sami van der Horst"},{"$f":"IFERROR(INDEX(PlanningsFilter!$L$6:$L$1000,SMALL(IF(PlanningsFilter!$K$6:$K$1000=$A8,IF(PlanningsFilter!$C$6:$C$1000=L$2,IF(PlanningsFilter!$J$6:$J$1000=L$4,IF(PlanningsFilter!$I$6:$I$1000=\"\",ROW(PlanningsFilter!$I$6:$I$1000)-ROW($I$6)+1)))),$C8)),\"\")","v":""},{"$f":"IFERROR(INDEX(PlanningsFilter!$L$6:$L$1000,SMALL(IF(PlanningsFilter!$K$6:$K$1000=$A8,IF(PlanningsFilter!$C$6:$C$1000=M$2,IF(PlanningsFilter!$J$6:$J$1000=M$4,IF(PlanningsFilter!$I$6:$I$1000=\"\",ROW(PlanningsFilter!$I$6:$I$1000)-ROW($I$6)+1)))),$C8)),\"\")","v":"Miquel van Loon"},{"$f":"IFERROR(INDEX(PlanningsFilter!$L$6:$L$1000,SMALL(IF(PlanningsFilter!$K$6:$K$1000=$A8,IF(PlanningsFilter!$C$6:$C$1000=N$2,IF(PlanningsFilter!$J$6:$J$1000=N$4,IF(PlanningsFilter!$I$6:$I$1000=\"\",ROW(PlanningsFilter!$I$6:$I$1000)-ROW($I$6)+1)))),$C8)),\"\")","v":"Sami van der Horst"},{"$f":"IFERROR(INDEX(PlanningsFilter!$L$6:$L$1000,SMALL(IF(PlanningsFilter!$K$6:$K$1000=$A8,IF(PlanningsFilter!$C$6:$C$1000=O$2,IF(PlanningsFilter!$J$6:$J$1000=O$4,IF(PlanningsFilter!$I$6:$I$1000=\"\",ROW(PlanningsFilter!$I$6:$I$1000)-ROW($I$6)+1)))),$C8)),\"\")","v":""},{"$f":"IFERROR(INDEX(PlanningsFilter!$L$6:$L$1000,SMALL(IF(PlanningsFilter!$K$6:$K$1000=$A8,IF(PlanningsFilter!$C$6:$C$1000=P$2,IF(PlanningsFilter!$J$6:$J$1000=P$4,IF(PlanningsFilter!$I$6:$I$1000=\"\",ROW(PlanningsFilter!$I$6:$I$1000)-ROW($I$6)+1)))),$C8)),\"\")","v":"Miquel van Loon"},{"$f":"IFERROR(INDEX(PlanningsFilter!$L$6:$L$1000,SMALL(IF(PlanningsFilter!$K$6:$K$1000=$A8,IF(PlanningsFilter!$C$6:$C$1000=Q$2,IF(PlanningsFilter!$J$6:$J$1000=Q$4,IF(PlanningsFilter!$I$6:$I$1000=\"\",ROW(PlanningsFilter!$I$6:$I$1000)-ROW($I$6)+1)))),$C8)),\"\")","v":"Sami van der Horst"},{"$f":"IFERROR(INDEX(PlanningsFilter!$L$6:$L$1000,SMALL(IF(PlanningsFilter!$K$6:$K$1000=$A8,IF(PlanningsFilter!$C$6:$C$1000=R$2,IF(PlanningsFilter!$J$6:$J$1000=R$4,IF(PlanningsFilter!$I$6:$I$1000=\"\",ROW(PlanningsFilter!$I$6:$I$1000)-ROW($I$6)+1)))),$C8)),\"\")","v":""},{"$f":"IFERROR(INDEX(PlanningsFilter!$L$6:$L$1000,SMALL(IF(PlanningsFilter!$K$6:$K$1000=$A8,IF(PlanningsFilter!$C$6:$C$1000=S$2,IF(PlanningsFilter!$J$6:$J$1000=S$4,IF(PlanningsFilter!$I$6:$I$1000=\"\",ROW(PlanningsFilter!$I$6:$I$1000)-ROW($I$6)+1)))),$C8)),\"\")","v":""},{"$f":"IFERROR(INDEX(PlanningsFilter!$L$6:$L$1000,SMALL(IF(PlanningsFilter!$K$6:$K$1000=$A8,IF(PlanningsFilter!$C$6:$C$1000=T$2,IF(PlanningsFilter!$J$6:$J$1000=T$4,IF(PlanningsFilter!$I$6:$I$1000=\"\",ROW(PlanningsFilter!$I$6:$I$1000)-ROW($I$6)+1)))),$C8)),\"\")","v":""},{"$f":"IFERROR(INDEX(PlanningsFilter!$L$6:$L$1000,SMALL(IF(PlanningsFilter!$K$6:$K$1000=$A8,IF(PlanningsFilter!$C$6:$C$1000=U$2,IF(PlanningsFilter!$J$6:$J$1000=U$4,IF(PlanningsFilter!$I$6:$I$1000=\"\",ROW(PlanningsFilter!$I$6:$I$1000)-ROW($I$6)+1)))),$C8)),\"\")","v":""},{"$f":"IFERROR(INDEX(PlanningsFilter!$L$6:$L$1000,SMALL(IF(PlanningsFilter!$K$6:$K$1000=$A8,IF(PlanningsFilter!$C$6:$C$1000=V$2,IF(PlanningsFilter!$J$6:$J$1000=V$4,IF(PlanningsFilter!$I$6:$I$1000=\"\",ROW(PlanningsFilter!$I$6:$I$1000)-ROW($I$6)+1)))),$C8)),\"\")","v":""},{"$f":"IFERROR(INDEX(PlanningsFilter!$L$6:$L$1000,SMALL(IF(PlanningsFilter!$K$6:$K$1000=$A8,IF(PlanningsFilter!$C$6:$C$1000=W$2,IF(PlanningsFilter!$J$6:$J$1000=W$4,IF(PlanningsFilter!$I$6:$I$1000=\"\",ROW(PlanningsFilter!$I$6:$I$1000)-ROW($I$6)+1)))),$C8)),\"\")","v":""},{"$f":"IFERROR(INDEX(PlanningsFilter!$L$6:$L$1000,SMALL(IF(PlanningsFilter!$K$6:$K$1000=$A8,IF(PlanningsFilter!$C$6:$C$1000=X$2,IF(PlanningsFilter!$J$6:$J$1000=X$4,IF(PlanningsFilter!$I$6:$I$1000=\"\",ROW(PlanningsFilter!$I$6:$I$1000)-ROW($I$6)+1)))),$C8)),\"\")","v":""}]
{"$rows_left_out":31}
{"sheet":"PlanningsFilter","index":3,"n_rows":600,"n_cols":12,"rows_kept":600,"cut":false,"hidden":false,"merged":[]}
[null,"Info","Info","Functie","Starttijd","Eindtijd","Voornaam","Achternaam"]
[null,">43800","<43808"]
[]
[]
[null,null,"Info","Functie","Starttijd","Eindtijd","Voornaam","Achternaam","Verlof","Post","PA","Vn & A"]
[null,null,"2019-12-02","ABB ochtend ",43801.25,43801.614583333336,"Flavi","van der Heyden",{"$f":"IF(H6=\"\",\"\",IF(SUMPRODUCT(--(Tabel1[[Afwezig ]]=H6),--(Tabel1[van]<=C6),--(Tabel1[tot en met]>=C6)*(1))>0,\"V\",\"\"))","v":""},{"$f":"IF(C6=\"\",\"\",INDEX(Validatie!$Q$2:$Q$6,MATCH(MOD(E6,1),Validatie!$P$2:$P$6,1)))","v":"Vroeg"},{"$f":"IF(C6=\"\",\"\",IFERROR(VLOOKUP(D6,DataMijnAfdeling,2,0),\"?\"))","v":"ABB"},{"$f":"IF(C6=\"\",\"\",CONCATENATE(G6,\" \",H6))","v":"Flavi van der Heyden"}]
[null,null,"2019-12-02","AFV HAS",43801.25,43801.40625,"Norbert","de Lange",null,{"$f":"IF(C7=\"\",\"\",INDEX(Validatie!$Q$2:$Q$6,MATCH(MOD(E7,1),Validatie!$P$2:$P$6,1)))","v":"Vroeg"},{"$f":"IF(C7=\"\",\"\",IFERROR(VLOOKUP(D7,DataMijnAfdeling,2,0),\"?\"))","v":"HAS"},{"$f":"IF(C7=\"\",\"\",CONCATENATE(G7,\" \",H7))","v":"Norbert de Lange"}]
[null,null,"2019-12-02","AFV MEP",43801.25,43801.614583333336,"Houcin","Huisman",null,{"$f":"IF(C8=\"\",\"\",INDEX(Validatie!$Q$2:$Q$6,MATCH(MOD(E8,1),Validatie!$P$2:$P$6,1)))","v":"Vroeg"},{"$f":"IF(C8=\"\",\"\",IFERROR(VLOOKUP(D8,DataMijnAfdeling,2,0),\"?\"))","v":"MEP"},"Houcin Huisman"]
{"$rows_left_out":593}
{"sheet":"Validatie","index":4,"n_rows":108,"n_cols":17,"rows_kept":108,"cut":false,"hidden":false,"merged":[]}
["Weken",null,"Jaren",null,"Namen",null,null,"Mijn afdelingen","Planning afdeling ",null,null,null,"Abdiqadir","de Jong",null,"Post",0]
[1,null,2018,null,"evron",null,null,"ABB weekenddienst","ABB",null,null,null,"Abdul","Jansen",null,0]
[2,null,2019,null,"Fien",null,null,"ABB middag","ABB",null,null,null,"Abdurahman Ibrahim","de Vries",null,0.24,"Vroeg"]
[3,null,2020,null,"Flore",null,null,"ABB ochtend ","ABB",null,null,null,"Agathe","van de Berg ",null,0.5,"Laat"]
[4,null,2021,null,"Fons",null,null,"AFV MEP","MEP",null,null,null,"Akela","van Dijk",null,0.83333333333333337,"Nacht"]
[5,null,2022,null,"Ida",null,null,"SCHM AFV","AFV",null,null,null,"Amadou","Bakker",null,0.99930555555555556,"Nacht"]
[6,null,2023,null,"Jan",null,null,"SCHM","SCHM",null,null,null,"Amanuel","Janssen"]
[7,null,2024,null,"jannie",null,null,"AFV HAS","HAS",null,null,null,"Ambroise","Visser"]
{"$rows_left_out":100}