{"text_format":"1","workbook":"xlsx","n_sheets":6,"sheets":["Verlof","InfoUitzendburo","WEEKPLANNING","PlanningsFilter","Validatie","CalPopUp"],"not_rendered":{"charts":0,"images":2,"macros":1,"external_links":2,"defined_names":24,"comments":0,"pivot_tables":0},"unopened":[],"bounds":{"document_bytes":16777216,"sheet_cells":100000,"rows_first":2000,"rows_last":500,"rows_between":2000,"halvings":0,"cell_chars":16384,"cell_head_chars":4096},"cells_cut":0,"cells_raw":0,"read":"whole","date_system":"1900"}

{"sheet":"Verlof","index":0,"n_rows":8,"n_cols":5,"rows_kept":8,"cut":false,"hidden":false,"merged":[]}
[]
[null,"Vul hier de afwezige dagen (periode) in"]
[null,"VoorNaam","Naam","van","tot en met"]
[null,"Flavi","van der Heyden","2019-12-02","2019-12-02"]
[null,"Akela","van Dijk","2019-12-10","2019-12-08"]
[null,"Amadou","Bakker","2019-12-04","2019-12-05"]
[null,"Erik","de Haan","2019-12-10","2019-12-10"]
[null,"Trienko","Spooren","2019-12-09","2019-12-09"]

{"sheet":"InfoUitzendburo","index":1,"n_rows":939,"n_cols":15,"rows_kept":939,"cut":false,"hidden":false,"merged":[]}
[null,null,null,null,null,null,null,null,null,null,"Mijn afdelingen","Planning afdeling ",null,"NIET mijn afdelingen"]
["Info","Functie","Starttijd","Eindtijd","Voornaam","Achternaam",null,null,null,null,"ABB weekenddienst","ABB",null,"PALL HAS"]
["2019-12-01","ABB middag",43800.604166666664,43800.875,"Baki","Bos",null,null,null,null,"ABB middag","ABB",null,"PALL MEP"]
["2019-12-01","SCHM",43800.999305555553,43801.364583333336,"Rolinka","van den Bosch",null,null,null,null,"ABB ochtend ","ABB",null,"PALL Rweg"]
["2019-12-01","SCHM",43800.999305555553,43801.364583333336,"Erik","de Haan",null,null,null,null,null,null,null,"Reserve ochtend"]
["2019-12-02","ABB ochtend ",43801.25,43801.614583333336,"Flavi","van der Heyden",null,null,null,null,"AFV MEP","MEP",null,"Reserve middag"]
["2019-12-02","AFV HAS",43801.25,43801.40625,"Norbert","de Lange"]
["2019-12-02","AFV MEP",43801.25,43801.614583333336,"Houcin","Huisman",null,null,null,null,"SCHM AFV","AFV"]
["2019-12-02","LCR ochtend",43801.25,43801.614583333336,"Wolter","De bolder"]
["2019-12-02","PALL HAS",43801.25,43801.614583333336,"Henk","Koster",null,null,null,null,"SCHM","SCHM",null,"In de planning "]
["2019-12-02","PALL MEP",43801.25,43801.614583333336,"Latie","van Wijk",null,null,null,null,null,null,null,"06:00/14:45","14:45/23:30"]
["2019-12-02","PALL MEP",43801.25,43801.614583333336,"Michael","Gerritsen",null,null,null,null,"AFV HAS","HAS",null,"Voornaam + achternaam","Voornaam + achternaam"]
["2019-12-02","PALL MEP",43801.25,43801.614583333336,"Abdurahman Ibrahim","de Vries",null,null,null,null,"SCHM HAS","HAS"]
["2019-12-02","PALL MEP",43801.25,43801.614583333336,"Hans","van de Ven "]
["2019-12-02","PALL MEP",43801.25,43801.614583333336,"Jeroen","Post",null,null,null,null,"LCR middag","LCR"]
["2019-12-02","PALL Rweg",43801.25,43801.614583333336,"Akela","van Dijk",null,null,null,null,"LCR ochtend","LCR"]
["2019-12-02","PALL Rweg",43801.25,43801.614583333336,"Karrar","Kuiper"]
["2019-12-02","PALL Rweg",43801.25,43801.614583333336,"Sebastian","Kuijpers"]
["2019-12-02","PALL Rweg",43801.25,43801.614583333336,"Abdul","Jansen"]
["2019-12-02","PALL Rweg",43801.25,43801.614583333336,"Apollonia","Meijer"]
["2019-12-02","PALL Rweg",43801.25,43801.614583333336,"Naoufel","van de Velde "]
["2019-12-02","PALL Rweg",43801.25,43801.614583333336,"Jelte","van Veen"]
["2019-12-02","PALL Rweg",43801.25,43801.614583333336,"Agathe","van de Berg "]
["2019-12-02","PALL Rweg",43801.25,43801.614583333336,"Heruy","van de Wal "]
["2019-12-02","PALL Rweg",43801.25,43801.614583333336,"Hassan","Verhoeven"]
["2019-12-02","PALL Rweg",43801.25,43801.614583333336,"Sied"," van der Pol"]
["2019-12-02","PALL Rweg",43801.25,43801.614583333336,"Jarek","Kuipers"]
["2019-12-02","PALL Rweg",43801.25,43801.614583333336,"Martijn","de Ruiter"]
["2019-12-02","PALL Rweg",43801.25,43801.614583333336,"Mark","Vink"]
["2019-12-02","PALL Rweg",43801.25,43801.614583333336,"Laszlo","Scholten"]
["2019-12-02","PALL Rweg",43801.25,43801.614583333336,"Abdiqadir","de Jong"]
["2019-12-02","PALL Rweg",43801.25,43801.614583333336,"Atobhran","de Groot"]
["2019-12-02","PALL Rweg",43801.25,43801.614583333336,"Barend","Vos"]
["2019-12-02","PALL Rweg",43801.25,43801.614583333336,"Nexhmedi","Willemsen"]
["2019-12-02","SCHM",43801.25,43801.614583333336,"Rachid","van der Laan"]
["2019-12-02","SCHM",43801.25,43801.614583333336,"Evans","Vermeulen"]
["2019-12-02","SCHM",43801.25,43801.614583333336,"Kevin","Veenstra"]
["2019-12-02","SCHM AFV",43801.25,43801.614583333336,"Baki","Bos"]
["2019-12-02","SCHM AFV",43801.25,43801.614583333336,"Ilker","Peeters"]
["2019-12-02","SCHM AFV",43801.25,43801.614583333336,"Miquel","van Loon"]
["2019-12-02","SCHM AFV",43801.25,43801.614583333336,"Klaas","Kramer"]
["2019-12-02","SCHM AFV",43801.25,43801.614583333336,"Sebastiaan","Mol"]
["2019-12-02","TRSP",43801.25,43801.614583333336,"Emsud","Kok"]
["2019-12-02","TRSP",43801.25,43801.614583333336,"Reinder","Koning"]
["2019-12-02","AFV MEP",43801.291666666664,43801.65625,"Rudolf","Hofman"]
["2019-12-02","PALL Rweg",43801.3125,43801.677083333336,"Hilko","Prins"]
["2019-12-02","TRSP",43801.333333333336,43801.697916666664,"Harrie","Hoekstra"]
["2019-12-02","SCHM HAS",43801.40625,43801.614583333336,"Norbert","de Lange"]
["2019-12-02","ABB middag",43801.572916666664,43801.9375,"Trienko","Spooren"]
["2019-12-02","AFV HAS",43801.572916666664,43801.697916666664,"Paul","van Dongen"]
["2019-12-02","AFV MEP",43801.572916666664,43801.9375,"Rijk","van Doorn"]
["2019-12-02","LCR middag",43801.572916666664,43801.9375,"Christiaan","de Wit"]
["2019-12-02","PALL MEP",43801.614583333336,43801.979166666664,"Wenaron","Kurkema"]
["2019-12-02","PALL MEP",43801.614583333336,43801.979166666664,"Engin","Jacobs"]
["2019-12-02","PALL MEP",43801.614583333336,43801.979166666664,"Salahadin","Wolters"]
["2019-12-02","PALL MEP",43801.614583333336,43801.979166666664,"Dikkie","van der Meer"]
["2019-12-02","PALL MEP",43801.614583333336,43801.979166666664,"Rene","van der Velden"]
["2019-12-02","PALL MEP",43801.614583333336,43801.979166666664,"Richard","Driessen"]
["2019-12-02","PALL Rweg",43801.614583333336,43801.979166666664,"Felicia","van den Broek"]
["2019-12-02","PALL Rweg",43801.614583333336,43801.979166666664,"Gerrit","van Beek"]
["2019-12-02","PALL Rweg",43801.614583333336,43801.979166666664,"Shawn","Molenaar"]
["2019-12-02","PALL Rweg",43801.614583333336,43801.979166666664,"Elroy","van der Linden"]
["2019-12-02","PALL Rweg",43801.614583333336,43801.979166666664,"Everon","van den Heuvel"]
["2019-12-02","PALL Rweg",43801.614583333336,43801.979166666664,"Davood","Smits"]
["2019-12-02","PALL Rweg",43801.614583333336,43801.979166666664,"Arsenio","Mulder"]
["2019-12-02","PALL Rweg",43801.614583333336,43801.979166666664,"Viorel","Triest"]
["2019-12-02","PALL Rweg",43801.614583333336,43801.979166666664,"Saidou","Bosman"]
["2019-12-02","PALL Rweg",43801.614583333336,43801.979166666664,"Wim","Vogel"]
["2019-12-02","PALL Rweg",43801.614583333336,43801.979166666664,"Sebastiaan","Mol"]
["2019-12-02","PALL Rweg",43801.614583333336,43801.979166666664,"Amadou","Bakker"]
["2019-12-02","PALL Rweg",43801.614583333336,43801.979166666664,"Wout","Van Goud"]
["2019-12-02","PALL Rweg",43801.614583333336,43801.979166666664,"Fars","van de Veen"]
["2019-12-02","PALL Rweg",43801.614583333336,43801.979166666664,"Charles","Dekker"]
["2019-12-02","PALL Rweg",43801.614583333336,43801.979166666664,"Henk","Koster"]
["2019-12-02","PALL Rweg",43801.614583333336,43801.979166666664,"Ko","van de Brink"]
["2019-12-02","PALL Rweg",43801.614583333336,43801.979166666664,"Robin","Evers"]
["2019-12-02","SCHM",43801.614583333336,43801.979166666664,"Marjolein","Martens"]
["2019-12-02","SCHM",43801.614583333336,43801.979166666664,"Roy","van der Meulen"]
["2019-12-02","SCHM",43801.614583333336,43801.979166666664,"Piet","Schipper"]
["2019-12-02","SCHM AFV",43801.614583333336,43801.979166666664,"Jan","de Jonge"]
["2019-12-02","SCHM AFV",43801.614583333336,43801.979166666664,"Boyan","van Leeuwen"]
["2019-12-02","SCHM AFV",43801.614583333336,43801.979166666664,"Sami","van der Horst"]
["2019-12-02","SCHM AFV",43801.614583333336,43801.979166666664,"Henri","van Dam"]
["2019-12-02","SCHM AFV",43801.614583333336,43801.979166666664,"Michel","Jonker"]
["2019-12-02","TRSP",43801.614583333336,43801.979166666664,"Henk","Koster"]
["2019-12-02","PALL Rweg",43801.645833333336,43801.979166666664,"Amanuel","Janssen"]
["2019-12-02","SCHM HAS",43801.697916666664,43801.9375,"Paul","van Dongen"]
["2019-12-02","PALL Rweg",43801.708333333336,43801.979166666664,"Merhawi","Groen"]
["2019-12-02","SCHM",43801.916666666664,43802.28125,"Patrick","Bosch"]
["2019-12-02","SCHM",43801.916666666664,43802.28125,"Rolinka","van den Bosch"]
["2019-12-02","SCHM",43801.916666666664,43802.28125,"Erik","de Haan"]
["2019-12-03","ABB ochtend ",43802.25,43802.614583333336,"Flavi","van der Heyden"]
["2019-12-03","AFV HAS",43802.25,43802.40625,"Norbert","de Lange"]
["2019-12-03","AFV MEP",43802.25,43802.614583333336,"Houcin","Huisman"]
["2019-12-03","LCR ochtend",43802.25,43802.614583333336,"Wolter","De bolder"]
["2019-12-03","PALL HAS",43802.25,43802.614583333336,"Henk","Koster"]
["2019-12-03","PALL MEP",43802.25,43802.614583333336,"Latie","van Wijk"]
["2019-12-03","PALL MEP",43802.25,43802.614583333336,"Michael","Gerritsen"]
["2019-12-03","PALL MEP",43802.25,43802.614583333336,"Abdurahman Ibrahim","de Vries"]
["2019-12-03","PALL MEP",43802.25,43802.614583333336,"Hans","van de Ven "]
["2019-12-03","PALL MEP",43802.25,43802.614583333336,"Jeroen","Post"]
["2019-12-03","PALL Rweg",43802.25,43802.614583333336,"Akela","van Dijk"]
["2019-12-03","PALL Rweg",43802.25,43802.614583333336,"Karrar","Kuiper"]
["2019-12-03","PALL Rweg",43802.25,43802.614583333336,"Harry","Maas"]
["2019-12-03","PALL Rweg",43802.25,43802.614583333336,"Apollonia","Meijer"]
["2019-12-03","PALL Rweg",43802.25,43802.614583333336,"Naoufel","van de Velde "]
["2019-12-03","PALL Rweg",43802.25,43802.614583333336,"Dennis","de Graaf"]
["2019-12-03","PALL Rweg",43802.25,43802.614583333336,"Agathe","van de Berg "]
["2019-12-03","PALL Rweg",43802.25,43802.614583333336,"Heruy","van de Wal "]
["2019-12-03","PALL Rweg",43802.25,43802.614583333336,"Hassan","Verhoeven"]
["2019-12-03","PALL Rweg",43802.25,43802.614583333336,"Samantha","Sanders"]
["2019-12-03","PALL Rweg",43802.25,43802.614583333336,"Jarek","Kuipers"]
["2019-12-03","PALL Rweg",43802.25,43802.614583333336,"Martijn","de Ruiter"]
["2019-12-03","PALL Rweg",43802.25,43802.614583333336,"Mark","Vink"]
["2019-12-03","PALL Rweg",43802.25,43802.614583333336,"Laszlo","Scholten"]
["2019-12-03","PALL Rweg",43802.25,43802.614583333336,"Abdiqadir","de Jong"]
["2019-12-03","PALL Rweg",43802.25,43802.614583333336,"Atobhran","de Groot"]
["2019-12-03","PALL Rweg",43802.25,43802.614583333336,"Nexhmedi","Willemsen"]
["2019-12-03","PALL Rweg",43802.25,43802.614583333336,"Chevindio","Brouwer"]
["2019-12-03","PALL Rweg",43802.25,43802.614583333336,"Sied"," van der Pol"]
["2019-12-03","SCHM",43802.25,43802.614583333336,"Rachid","van der Laan"]
["2019-12-03","SCHM",43802.25,43802.614583333336,"Evans","Vermeulen"]
["2019-12-03","SCHM",43802.25,43802.614583333336,"Kevin","Veenstra"]
["2019-12-03","SCHM AFV",43802.25,43802.614583333336,"Baki","Bos"]
["2019-12-03","SCHM AFV",43802.25,43802.614583333336,"Ilker","Peeters"]
["2019-12-03","SCHM AFV",43802.25,43802.614583333336,"Miquel","van Loon"]
["2019-12-03","SCHM AFV",43802.25,43802.614583333336,"Klaas","Kramer"]
["2019-12-03","SCHM AFV",43802.25,43802.614583333336,"Sebastiaan","Mol"]
["2019-12-03","TRSP",43802.25,43802.614583333336,"Emsud","Kok"]
["2019-12-03","TRSP",43802.25,43802.614583333336,"Reinder","Koning"]
["2019-12-03","AFV MEP",43802.291666666664,43802.65625,"Rudolf","Hofman"]
["2019-12-03","PALL Rweg",43802.3125,43802.677083333336,"Hilko","Prins"]
["2019-12-03","TRSP",43802.333333333336,43802.697916666664,"Harrie","Hoekstra"]
["2019-12-03","SCHM HAS",43802.40625,43802.614583333336,"Norbert","de Lange"]
["2019-12-03","ABB middag",43802.572916666664,43802.9375,"Trienko","Spooren"]
["2019-12-03","AFV HAS",43802.572916666664,43802.697916666664,"Paul","van Dongen"]
["2019-12-03","AFV MEP",43802.572916666664,43802.9375,"Rijk","van Doorn"]
["2019-12-03","LCR middag",43802.572916666664,43802.9375,"Christiaan","de Wit"]
["2019-12-03","PALL MEP",43802.614583333336,43802.979166666664,"Wenaron","Kurkema"]
["2019-12-03","PALL MEP",43802.614583333336,43802.979166666664,"Engin","Jacobs"]
["2019-12-03","PALL MEP",43802.614583333336,43802.979166666664,"Salahadin","Wolters"]
["2019-12-03","PALL MEP",43802.614583333336,43802.979166666664,"Dikkie","van der Meer"]
["2019-12-03","PALL MEP",43802.614583333336,43802.979166666664,"Rene","van der Velden"]
["2019-12-03","PALL MEP",43802.614583333336,43802.979166666664,"Richard","Driessen"]
["2019-12-03","PALL Rweg",43802.614583333336,43802.979166666664,"Merhawi","Groen"]
["2019-12-03","PALL Rweg",43802.614583333336,43802.979166666664,"Gerrit","van Beek"]
["2019-12-03","PALL Rweg",43802.614583333336,43802.979166666664,"Shawn","Molenaar"]
["2019-12-03","PALL Rweg",43802.614583333336,43802.979166666664,"Elroy","van der Linden"]
["2019-12-03","PALL Rweg",43802.614583333336,43802.979166666664,"Everon","van den Heuvel"]
["2019-12-03","PALL Rweg",43802.614583333336,43802.979166666664,"Davood","Smits"]
["2019-12-03","PALL Rweg",43802.614583333336,43802.979166666664,"Arsenio","Mulder"]
["2019-12-03","PALL Rweg",43802.614583333336,43802.979166666664,"Viorel","Triest"]
["2019-12-03","PALL Rweg",43802.614583333336,43802.979166666664,"Saidou","Bosman"]
["2019-12-03","PALL Rweg",43802.614583333336,43802.979166666664,"Wim","Vogel"]
["2019-12-03","PALL Rweg",43802.614583333336,43802.979166666664,"Sebastiaan","Mol"]
["2019-12-03","PALL Rweg",43802.614583333336,43802.979166666664,"Amadou","Bakker"]
["2019-12-03","PALL Rweg",43802.614583333336,43802.979166666664,"Quincy","de Koning"]
["2019-12-03","PALL Rweg",43802.614583333336,43802.979166666664,"Wout","Van Goud"]
["2019-12-03","PALL Rweg",43802.614583333336,43802.979166666664,"Fetehawi","de Bruyn"]
["2019-12-03","PALL Rweg",43802.614583333336,43802.979166666664,"Charles","Dekker"]
["2019-12-03","PALL Rweg",43802.614583333336,43802.979166666664,"Henk","Koster"]
["2019-12-03","PALL Rweg",43802.614583333336,43802.979166666664,"Ko","van de Brink"]
["2019-12-03","PALL Rweg",43802.614583333336,43802.979166666664,"Robin","Evers"]
["2019-12-03","PALL Rweg",43802.614583333336,43802.979166666664,"Olcay","de Vos"]
["2019-12-03","SCHM",43802.614583333336,43802.979166666664,"Marjolein","Martens"]
["2019-12-03","SCHM",43802.614583333336,43802.979166666664,"Roy","van der Meulen"]
["2019-12-03","SCHM",43802.614583333336,43802.979166666664,"Piet","Schipper"]
["2019-12-03","SCHM AFV",43802.614583333336,43802.979166666664,"Jan","de Jonge"]
["2019-12-03","SCHM AFV",43802.614583333336,43802.979166666664,"Boyan","van Leeuwen"]
["2019-12-03","SCHM AFV",43802.614583333336,43802.979166666664,"Sami","van der Horst"]
["2019-12-03","SCHM AFV",43802.614583333336,43802.979166666664,"Henri","van Dam"]
["2019-12-03","SCHM AFV",43802.614583333336,43802.979166666664,"Michel","Jonker"]
["2019-12-03","TRSP",43802.614583333336,43802.979166666664,"Henk","Koster"]
["2019-12-03","TRSP",43802.614583333336,43802.979166666664,"Anton","Smit"]
["2019-12-03","PALL Rweg",43802.645833333336,43802.979166666664,"Amanuel","Janssen"]
["2019-12-03","PALL Rweg",43802.645833333336,43802.979166666664,"Yemane","Masout"]
["2019-12-03","PALL Rweg",43802.666666666664,43802.979166666664,"Hishelu","Blom"]
["2019-12-03","SCHM HAS",43802.697916666664,43802.9375,"Paul","van Dongen"]
["2019-12-03","SCHM",43802.916666666664,43803.28125,"Patrick","Bosch"]
["2019-12-03","SCHM",43802.916666666664,43803.28125,"Rolinka","van den Bosch"]
["2019-12-03","SCHM",43802.916666666664,43803.28125,"Erik","de Haan"]
["2019-12-04","ABB ochtend ",43803.25,43803.614583333336,"Flavi","van der Heyden"]
["2019-12-04","AFV HAS",43803.25,43803.40625,"Norbert","de Lange"]
["2019-12-04","AFV MEP",43803.25,43803.614583333336,"Houcin","Huisman"]
["2019-12-04","LCR ochtend",43803.25,43803.614583333336,"Wolter","De bolder"]
["2019-12-04","PALL HAS",43803.25,43803.614583333336,"Henk","Koster"]
["2019-12-04","PALL MEP",43803.25,43803.614583333336,"Latie","van Wijk"]
["2019-12-04","PALL MEP",43803.25,43803.614583333336,"Michael","Gerritsen"]
["2019-12-04","PALL MEP",43803.25,43803.614583333336,"Abdurahman Ibrahim","de Vries"]
["2019-12-04","PALL MEP",43803.25,43803.614583333336,"Hans","van de Ven "]
["2019-12-04","PALL MEP",43803.25,43803.614583333336,"Jeroen","Post"]
["2019-12-04","PALL Rweg",43803.25,43803.614583333336,"Akela","van Dijk"]
["2019-12-04","PALL Rweg",43803.25,43803.614583333336,"Karrar","Kuiper"]
["2019-12-04","PALL Rweg",43803.25,43803.614583333336,"Sebastian","Kuijpers"]
["2019-12-04","PALL Rweg",43803.25,43803.614583333336,"Abdul","Jansen"]
["2019-12-04","PALL Rweg",43803.25,43803.614583333336,"Harry","Maas"]
["2019-12-04","PALL Rweg",43803.25,43803.614583333336,"Naoufel","van de Velde "]
["2019-12-04","PALL Rweg",43803.25,43803.614583333336,"Dennis","de Graaf"]
["2019-12-04","PALL Rweg",43803.25,43803.614583333336,"Jelte","van Veen"]
["2019-12-04","PALL Rweg",43803.25,43803.614583333336,"Agathe","van de Berg "]
["2019-12-04","PALL Rweg",43803.25,43803.614583333336,"Heruy","van de Wal "]
["2019-12-04","PALL Rweg",43803.25,43803.614583333336,"Hassan","Verhoeven"]
["2019-12-04","PALL Rweg",43803.25,43803.614583333336,"Samantha","Sanders"]
["2019-12-04","PALL Rweg",43803.25,43803.614583333336,"Sied"," van der Pol"]
["2019-12-04","PALL Rweg",43803.25,43803.614583333336,"Jarek","Kuipers"]
["2019-12-04","PALL Rweg",43803.25,43803.614583333336,"Martijn","de Ruiter"]
["2019-12-04","PALL Rweg",43803.25,43803.614583333336,"Mark","Vink"]
["2019-12-04","PALL Rweg",43803.25,43803.614583333336,"Abdiqadir","de Jong"]
["2019-12-04","PALL Rweg",43803.25,43803.614583333336,"Mebrathu","Timmermans"]
["2019-12-04","PALL Rweg",43803.25,43803.614583333336,"Nexhmedi","Willemsen"]
["2019-12-04","SCHM",43803.25,43803.614583333336,"Rachid","van der Laan"]
["2019-12-04","SCHM",43803.25,43803.614583333336,"Evans","Vermeulen"]
["2019-12-04","SCHM",43803.25,43803.614583333336,"Kevin","Veenstra"]
["2019-12-04","SCHM AFV",43803.25,43803.614583333336,"Baki","Bos"]
["2019-12-04","SCHM AFV",43803.25,43803.614583333336,"Ilker","Peeters"]
["2019-12-04","SCHM AFV",43803.25,43803.614583333336,"Miquel","van Loon"]
["2019-12-04","SCHM AFV",43803.25,43803.614583333336,"Klaas","Kramer"]
["2019-12-04","SCHM AFV",43803.25,43803.614583333336,"Sebastiaan","Mol"]
["2019-12-04","TRSP",43803.25,43803.614583333336,"Emsud","Kok"]
["2019-12-04","TRSP",43803.25,43803.614583333336,"Reinder","Koning"]
["2019-12-04","AFV MEP",43803.291666666664,43803.65625,"Rudolf","Hofman"]
["2019-12-04","PALL Rweg",43803.3125,43803.677083333336,"Hilko","Prins"]
["2019-12-04","TRSP",43803.333333333336,43803.697916666664,"Harrie","Hoekstra"]
["2019-12-04","SCHM HAS",43803.40625,43803.614583333336,"Norbert","de Lange"]
["2019-12-04","ABB middag",43803.572916666664,43803.9375,"Trienko","Spooren"]
["2019-12-04","AFV HAS",43803.572916666664,43803.697916666664,"Paul","van Dongen"]
["2019-12-04","AFV MEP",43803.572916666664,43803.9375,"Rijk","van Doorn"]
["2019-12-04","LCR middag",43803.572916666664,43803.9375,"Christiaan","de Wit"]
["2019-12-04","PALL MEP",43803.614583333336,43803.979166666664,"Wenaron","Kurkema"]
["2019-12-04","PALL MEP",43803.614583333336,43803.979166666664,"Engin","Jacobs"]
["2019-12-04","PALL MEP",43803.614583333336,43803.979166666664,"Salahadin","Wolters"]
["2019-12-04","PALL MEP",43803.614583333336,43803.979166666664,"Dikkie","van der Meer"]
["2019-12-04","PALL MEP",43803.614583333336,43803.979166666664,"Rene","van der Velden"]
["2019-12-04","PALL MEP",43803.614583333336,43803.979166666664,"Richard","Driessen"]
["2019-12-04","PALL Rweg",43803.614583333336,43803.979166666664,"Felicia","van den Broek"]
["2019-12-04","PALL Rweg",43803.614583333336,43803.979166666664,"Merhawi","Groen"]
["2019-12-04","PALL Rweg",43803.614583333336,43803.979166666664,"Gerrit","van Beek"]
["2019-12-04","PALL Rweg",43803.614583333336,43803.979166666664,"Shawn","Molenaar"]
["2019-12-04","PALL Rweg",43803.614583333336,43803.979166666664,"Elroy","van der Linden"]
["2019-12-04","PALL Rweg",43803.614583333336,43803.979166666664,"Everon","van den Heuvel"]
["2019-12-04","PALL Rweg",43803.614583333336,43803.979166666664,"Davood","Smits"]
["2019-12-04","PALL Rweg",43803.614583333336,43803.979166666664,"Arsenio","Mulder"]
["2019-12-04","PALL Rweg",43803.614583333336,43803.979166666664,"Viorel","Triest"]
["2019-12-04","PALL Rweg",43803.614583333336,43803.979166666664,"Saidou","Bosman"]
["2019-12-04","PALL Rweg",43803.614583333336,43803.979166666664,"Wim","Vogel"]
["2019-12-04","PALL Rweg",43803.614583333336,43803.979166666664,"Sebastiaan","Mol"]
["2019-12-04","PALL Rweg",43803.614583333336,43803.979166666664,"Amadou","Bakker"]
["2019-12-04","PALL Rweg",43803.614583333336,43803.979166666664,"Wout","Van Goud"]
["2019-12-04","PALL Rweg",43803.614583333336,43803.979166666664,"Fars","van de Veen"]
["2019-12-04","PALL Rweg",43803.614583333336,43803.979166666664,"Fetehawi","de Bruyn"]
["2019-12-04","PALL Rweg",43803.614583333336,43803.979166666664,"Charles","Dekker"]
["2019-12-04","PALL Rweg",43803.614583333336,43803.979166666664,"Henk","Koster"]
["2019-12-04","PALL Rweg",43803.614583333336,43803.979166666664,"Ko","van de Brink"]
["2019-12-04","PALL Rweg",43803.614583333336,43803.979166666664,"Haben","Willems"]
["2019-12-04","PALL Rweg",43803.614583333336,43803.979166666664,"Robel","Hermans"]
["2019-12-04","PALL Rweg",43803.614583333336,43803.979166666664,"Quincy","de Koning"]
["2019-12-04","PALL Rweg",43803.614583333336,43803.979166666664,"Robin","Evers"]
["2019-12-04","SCHM",43803.614583333336,43803.979166666664,"Marjolein","Martens"]
["2019-12-04","SCHM",43803.614583333336,43803.979166666664,"Roy","van der Meulen"]
["2019-12-04","SCHM",43803.614583333336,43803.979166666664,"Piet","Schipper"]
["2019-12-04","SCHM AFV",43803.614583333336,43803.979166666664,"Jan","de Jonge"]
["2019-12-04","SCHM AFV",43803.614583333336,43803.979166666664,"Boyan","van Leeuwen"]
["2019-12-04","SCHM AFV",43803.614583333336,43803.979166666664,"Sami","van der Horst"]
["2019-12-04","SCHM AFV",43803.614583333336,43803.979166666664,"Henri","van Dam"]
["2019-12-04","SCHM AFV",43803.614583333336,43803.979166666664,"Michel","Jonker"]
["2019-12-04","TRSP",43803.614583333336,43803.979166666664,"Henk","Koster"]
["2019-12-04","TRSP",43803.614583333336,43803.979166666664,"Anton","Smit"]
["2019-12-04","PALL Rweg",43803.677083333336,43803.979166666664,"Gebrehiwet","Schouten"]
["2019-12-04","SCHM HAS",43803.697916666664,43803.9375,"Paul","van Dongen"]
["2019-12-04","SCHM",43803.916666666664,43804.28125,"Patrick","Bosch"]
["2019-12-04","SCHM",43803.916666666664,43804.28125,"Rolinka","van den Bosch"]
["2019-12-04","SCHM",43803.916666666664,43804.28125,"Erik","de Haan"]
["2019-12-05","ABB ochtend ",43804.25,43804.614583333336,"Flavi","van der Heyden"]
["2019-12-05","AFV HAS",43804.25,43804.40625,"Norbert","de Lange"]
["2019-12-05","AFV MEP",43804.25,43804.614583333336,"Houcin","Huisman"]
["2019-12-05","LCR ochtend",43804.25,43804.614583333336,"Wolter","De bolder"]
["2019-12-05","PALL HAS",43804.25,43804.614583333336,"Henk","Koster"]
["2019-12-05","PALL MEP",43804.25,43804.614583333336,"Latie","van Wijk"]
["2019-12-05","PALL MEP",43804.25,43804.614583333336,"Michael","Gerritsen"]
["2019-12-05","PALL MEP",43804.25,43804.614583333336,"Abdurahman Ibrahim","de Vries"]
["2019-12-05","PALL MEP",43804.25,43804.614583333336,"Hans","van de Ven "]
["2019-12-05","PALL MEP",43804.25,43804.614583333336,"Jeroen","Post"]
["2019-12-05","PALL Rweg",43804.25,43804.614583333336,"Akela","van Dijk"]
["2019-12-05","PALL Rweg",43804.25,43804.614583333336,"Karrar","Kuiper"]
["2019-12-05","PALL Rweg",43804.25,43804.614583333336,"Sebastian","Kuijpers"]
["2019-12-05","PALL Rweg",43804.25,43804.614583333336,"Harry","Maas"]
["2019-12-05","PALL Rweg",43804.25,43804.614583333336,"Apollonia","Meijer"]
["2019-12-05","PALL Rweg",43804.25,43804.614583333336,"Naoufel","van de Velde "]
["2019-12-05","PALL Rweg",43804.25,43804.614583333336,"Dennis","de Graaf"]
["2019-12-05","PALL Rweg",43804.25,43804.614583333336,"Agathe","van de Berg "]
["2019-12-05","PALL Rweg",43804.25,43804.614583333336,"Heruy","van de Wal "]
["2019-12-05","PALL Rweg",43804.25,43804.614583333336,"Hassan","Verhoeven"]
["2019-12-05","PALL Rweg",43804.25,43804.614583333336,"Samantha","Sanders"]
["2019-12-05","PALL Rweg",43804.25,43804.614583333336,"Sied"," van der Pol"]
["2019-12-05","PALL Rweg",43804.25,43804.614583333336,"Filimon","de Bruin"]
["2019-12-05","PALL Rweg",43804.25,43804.614583333336,"Jarek","Kuipers"]
["2019-12-05","PALL Rweg",43804.25,43804.614583333336,"Mark","Vink"]
["2019-12-05","PALL Rweg",43804.25,43804.614583333336,"Laszlo","Scholten"]
["2019-12-05","PALL Rweg",43804.25,43804.614583333336,"Abdiqadir","de Jong"]
["2019-12-05","PALL Rweg",43804.25,43804.614583333336,"Atobhran","de Groot"]
["2019-12-05","PALL Rweg",43804.25,43804.614583333336,"Nexhmedi","Willemsen"]
["2019-12-05","PALL Rweg",43804.25,43804.291666666664,"Chevindio","Brouwer"]
["2019-12-05","PALL Rweg",43804.25,43804.614583333336,"Martijn","de Ruiter"]
["2019-12-05","SCHM",43804.25,43804.614583333336,"Rachid","van der Laan"]
["2019-12-05","SCHM",43804.25,43804.614583333336,"Evans","Vermeulen"]
["2019-12-05","SCHM",43804.25,43804.614583333336,"Kevin","Veenstra"]
["2019-12-05","SCHM AFV",43804.25,43804.614583333336,"Baki","Bos"]
["2019-12-05","SCHM AFV",43804.25,43804.614583333336,"Ilker","Peeters"]
["2019-12-05","SCHM AFV",43804.25,43804.614583333336,"Miquel","van Loon"]
["2019-12-05","SCHM AFV",43804.25,43804.614583333336,"Klaas","Kramer"]
["2019-12-05","SCHM AFV",43804.25,43804.614583333336,"Sebastiaan","Mol"]
["2019-12-05","TRSP",43804.25,43804.614583333336,"Emsud","Kok"]
["2019-12-05","TRSP",43804.25,43804.614583333336,"Reinder","Koning"]
["2019-12-05","AFV MEP",43804.291666666664,43804.65625,"Rudolf","Hofman"]
["2019-12-05","PALL Rweg",43804.3125,43804.677083333336,"Hilko","Prins"]
["2019-12-05","TRSP",43804.333333333336,43804.697916666664,"Harrie","Hoekstra"]
["2019-12-05","SCHM HAS",43804.40625,43804.614583333336,"Norbert","de Lange"]
["2019-12-05","ABB middag",43804.572916666664,43804.9375,"Trienko","Spooren"]
["2019-12-05","AFV HAS",43804.572916666664,43804.697916666664,"Paul","van Dongen"]
["2019-12-05","AFV MEP",43804.572916666664,43804.9375,"Rijk","van Doorn"]
["2019-12-05","LCR middag",43804.572916666664,43804.9375,"Christiaan","de Wit"]
["2019-12-05","PALL MEP",43804.614583333336,43804.979166666664,"Wenaron","Kurkema"]
["2019-12-05","PALL MEP",43804.614583333336,43804.979166666664,"Engin","Jacobs"]
["2019-12-05","PALL MEP",43804.614583333336,43804.979166666664,"Salahadin","Wolters"]
["2019-12-05","PALL MEP",43804.614583333336,43804.979166666664,"Dikkie","van der Meer"]
["2019-12-05","PALL MEP",43804.614583333336,43804.979166666664,"Rene","van der Velden"]
["2019-12-05","PALL MEP",43804.614583333336,43804.979166666664,"Richard","Driessen"]
["2019-12-05","PALL Rweg",43804.614583333336,43804.979166666664,"Merhawi","Groen"]
["2019-12-05","PALL Rweg",43804.614583333336,43804.979166666664,"Gerrit","van Beek"]
["2019-12-05","PALL Rweg",43804.614583333336,43804.979166666664,"Shawn","Molenaar"]
["2019-12-05","PALL Rweg",43804.614583333336,43804.979166666664,"Elroy","van der Linden"]
["2019-12-05","PALL Rweg",43804.614583333336,43804.979166666664,"Tomas","Koolen"]
["2019-12-05","PALL Rweg",43804.614583333336,43804.979166666664,"Everon","van den Heuvel"]
["2019-12-05","PALL Rweg",43804.614583333336,43804.979166666664,"Hagos","van Vliet"]
["2019-12-05","PALL Rweg",43804.614583333336,43804.979166666664,"Davood","Smits"]
["2019-12-05","PALL Rweg",43804.614583333336,43804.979166666664,"Arsenio","Mulder"]
["2019-12-05","PALL Rweg",43804.614583333336,43804.979166666664,"Saidou","Bosman"]
["2019-12-05","PALL Rweg",43804.614583333336,43804.979166666664,"Olcay","de Vos"]
["2019-12-05","PALL Rweg",43804.614583333336,43804.979166666664,"Wim","Vogel"]
["2019-12-05","PALL Rweg",43804.614583333336,43804.979166666664,"Sebastiaan","Mol"]
["2019-12-05","PALL Rweg",43804.614583333336,43804.979166666664,"Amadou","Bakker"]
["2019-12-05","PALL Rweg",43804.614583333336,43804.979166666664,"Bereket","Peters"]
["2019-12-05","PALL Rweg",43804.614583333336,43804.979166666664,"Quincy","de Koning"]
["2019-12-05","PALL Rweg",43804.614583333336,43804.979166666664,"Wout","Van Goud"]
["2019-12-05","PALL Rweg",43804.614583333336,43804.791666666664,"Fars","van de Veen"]
["2019-12-05","PALL Rweg",43804.614583333336,43804.979166666664,"Charles","Dekker"]
["2019-12-05","PALL Rweg",43804.614583333336,43804.979166666664,"Henk","Koster"]
["2019-12-05","PALL Rweg",43804.614583333336,43804.979166666664,"Ko","van de Brink"]
["2019-12-05","PALL Rweg",43804.614583333336,43804.979166666664,"Haben","Willems"]
["2019-12-05","PALL Rweg",43804.614583333336,43804.979166666664,"Moussa","Boer"]
["2019-12-05","PALL Rweg",43804.614583333336,43804.979166666664,"Viorel","Triest"]
["2019-12-05","PALL Rweg",43804.614583333336,43804.979166666664,"Robin","Evers"]
["2019-12-05","SCHM",43804.614583333336,43804.979166666664,"Roy","van der Meulen"]
["2019-12-05","SCHM AFV",43804.614583333336,43804.979166666664,"Jan","de Jonge"]
["2019-12-05","SCHM AFV",43804.614583333336,43804.979166666664,"Boyan","van Leeuwen"]
["2019-12-05","SCHM AFV",43804.614583333336,43804.979166666664,"Sami","van der Horst"]
["2019-12-05","SCHM AFV",43804.614583333336,43804.979166666664,"Henri","van Dam"]
["2019-12-05","SCHM AFV",43804.614583333336,43804.979166666664,"Michel","Jonker"]
["2019-12-05","TRSP",43804.614583333336,43804.979166666664,"Henk","Koster"]
["2019-12-05","TRSP",43804.614583333336,43804.979166666664,"Anton","Smit"]
["2019-12-05","PALL Rweg",43804.645833333336,43804.979166666664,"Yemane","Masout"]
["2019-12-05","SCHM HAS",43804.697916666664,43804.9375,"Paul","van Dongen"]
["2019-12-05","SCHM",43804.916666666664,43805.28125,"Patrick","Bosch"]
["2019-12-05","SCHM",43804.916666666664,43805.28125,"Rolinka","van den Bosch"]
["2019-12-05","SCHM",43804.916666666664,43805.28125,"Erik","de Haan"]
["2019-12-06","ABB ochtend ",43805.25,43805.614583333336,"Flavi","van der Heyden"]
["2019-12-06","AFV HAS",43805.25,43805.40625,"Norbert","de Lange"]
["2019-12-06","AFV MEP",43805.25,43805.614583333336,"Houcin","Huisman"]
["2019-12-06","LCR ochtend",43805.25,43805.614583333336,"Wolter","De bolder"]
["2019-12-06","PALL HAS",43805.25,43805.614583333336,"Henk","Koster"]
["2019-12-06","PALL MEP",43805.25,43805.614583333336,"Latie","van Wijk"]
["2019-12-06","PALL MEP",43805.25,43805.614583333336,"Michael","Gerritsen"]
["2019-12-06","PALL MEP",43805.25,43805.614583333336,"Abdurahman Ibrahim","de Vries"]
["2019-12-06","PALL MEP",43805.25,43805.614583333336,"Hans","van de Ven "]
["2019-12-06","PALL MEP",43805.25,43805.614583333336,"Jeroen","Post"]
["2019-12-06","PALL Rweg",43805.25,43805.614583333336,"Akela","van Dijk"]
["2019-12-06","PALL Rweg",43805.25,43805.614583333336,"Karrar","Kuiper"]
["2019-12-06","PALL Rweg",43805.25,43805.614583333336,"Sebastian","Kuijpers"]
["2019-12-06","PALL Rweg",43805.25,43805.614583333336,"Abdul","Jansen"]
["2019-12-06","PALL Rweg",43805.25,43805.614583333336,"Apollonia","Meijer"]
["2019-12-06","PALL Rweg",43805.25,43805.614583333336,"Naoufel","van de Velde "]
["2019-12-06","PALL Rweg",43805.25,43805.614583333336,"Dennis","de Graaf"]
["2019-12-06","PALL Rweg",43805.25,43805.614583333336,"Jelte","van Veen"]
["2019-12-06","PALL Rweg",43805.25,43805.614583333336,"Agathe","van de Berg "]
["2019-12-06","PALL Rweg",43805.25,43805.614583333336,"Heruy","van de Wal "]
["2019-12-06","PALL Rweg",43805.25,43805.614583333336,"Hassan","Verhoeven"]
["2019-12-06","PALL Rweg",43805.25,43805.614583333336,"Samantha","Sanders"]
["2019-12-06","PALL Rweg",43805.25,43805.614583333336,"Sied"," van der Pol"]
["2019-12-06","PALL Rweg",43805.25,43805.614583333336,"Jarek","Kuipers"]
["2019-12-06","PALL Rweg",43805.25,43805.614583333336,"Fars","van de Veen"]
["2019-12-06","PALL Rweg",43805.25,43805.614583333336,"Mark","Vink"]
["2019-12-06","PALL Rweg",43805.25,43805.614583333336,"Laszlo","Scholten"]
["2019-12-06","PALL Rweg",43805.25,43805.614583333336,"Abdiqadir","de Jong"]
["2019-12-06","PALL Rweg",43805.25,43805.614583333336,"Atobhran","de Groot"]
["2019-12-06","PALL Rweg",43805.25,43805.614583333336,"Mebrathu","Timmermans"]
["2019-12-06","PALL Rweg",43805.25,43805.614583333336,"Nexhmedi","Willemsen"]
["2019-12-06","PALL Rweg",43805.25,43805.614583333336,"Swen","de Leeuw"]
["2019-12-06","PALL Rweg",43805.25,43805.614583333336,"Martijn","de Ruiter"]
["2019-12-06","SCHM",43805.25,43805.614583333336,"Rachid","van der Laan"]
["2019-12-06","SCHM",43805.25,43805.614583333336,"Evans","Vermeulen"]
["2019-12-06","SCHM",43805.25,43805.614583333336,"Kevin","Veenstra"]
["2019-12-06","SCHM AFV",43805.25,43805.614583333336,"Baki","Bos"]
["2019-12-06","SCHM AFV",43805.25,43805.614583333336,"Ilker","Peeters"]
["2019-12-06","SCHM AFV",43805.25,43805.614583333336,"Miquel","van Loon"]
["2019-12-06","SCHM AFV",43805.25,43805.614583333336,"Klaas","Kramer"]
["2019-12-06","SCHM AFV",43805.25,43805.614583333336,"Sebastiaan","Mol"]
["2019-12-06","TRSP",43805.25,43805.614583333336,"Emsud","Kok"]
["2019-12-06","TRSP",43805.25,43805.614583333336,"Reinder","Koning"]
["2019-12-06","AFV MEP",43805.291666666664,43805.65625,"Rudolf","Hofman"]
["2019-12-06","PALL Rweg",43805.3125,43805.677083333336,"Hilko","Prins"]
["2019-12-06","TRSP",43805.333333333336,43805.697916666664,"Harrie","Hoekstra"]
["2019-12-06","SCHM HAS",43805.40625,43805.614583333336,"Norbert","de Lange"]
["2019-12-06","ABB middag",43805.572916666664,43805.9375,"Trienko","Spooren"]
["2019-12-06","AFV HAS",43805.572916666664,43805.697916666664,"Paul","van Dongen"]
["2019-12-06","AFV MEP",43805.572916666664,43805.9375,"Rijk","van Doorn"]
["2019-12-06","LCR middag",43805.572916666664,43805.9375,"Christiaan","de Wit"]
["2019-12-06","PALL MEP",43805.614583333336,43805.979166666664,"Wenaron","Kurkema"]
["2019-12-06","PALL MEP",43805.614583333336,43805.979166666664,"Engin","Jacobs"]
["2019-12-06","PALL MEP",43805.614583333336,43805.979166666664,"Salahadin","Wolters"]
["2019-12-06","PALL MEP",43805.614583333336,43805.979166666664,"Dikkie","van der Meer"]
["2019-12-06","PALL MEP",43805.614583333336,43805.979166666664,"Rene","van der Velden"]
["2019-12-06","PALL MEP",43805.614583333336,43805.979166666664,"Richard","Driessen"]
["2019-12-06","PALL Rweg",43805.614583333336,43805.979166666664,"Felicia","van den Broek"]
["2019-12-06","PALL Rweg",43805.614583333336,43805.979166666664,"Gerrit","van Beek"]
["2019-12-06","PALL Rweg",43805.614583333336,43805.979166666664,"Shawn","Molenaar"]
["2019-12-06","PALL Rweg",43805.614583333336,43805.979166666664,"Elroy","van der Linden"]
["2019-12-06","PALL Rweg",43805.614583333336,43805.979166666664,"Everon","van den Heuvel"]
["2019-12-06","PALL Rweg",43805.614583333336,43805.979166666664,"Hagos","van Vliet"]
["2019-12-06","PALL Rweg",43805.614583333336,43805.979166666664,"Davood","Smits"]
["2019-12-06","PALL Rweg",43805.614583333336,43805.979166666664,"Arsenio","Mulder"]
["2019-12-06","PALL Rweg",43805.614583333336,43805.979166666664,"Viorel","Triest"]
["2019-12-06","PALL Rweg",43805.614583333336,43805.979166666664,"Saidou","Bosman"]
["2019-12-06","PALL Rweg",43805.614583333336,43805.979166666664,"Olcay","de Vos"]
["2019-12-06","PALL Rweg",43805.614583333336,43805.979166666664,"Wim","Vogel"]
["2019-12-06","PALL Rweg",43805.614583333336,43805.979166666664,"Sebastiaan","Mol"]
["2019-12-06","PALL Rweg",43805.614583333336,43805.979166666664,"Amadou","Bakker"]
["2019-12-06","PALL Rweg",43805.614583333336,43805.979166666664,"Bereket","Peters"]
["2019-12-06","PALL Rweg",43805.614583333336,43805.979166666664,"Quincy","de Koning"]
["2019-12-06","PALL Rweg",43805.614583333336,43805.979166666664,"Wout","Van Goud"]
["2019-12-06","PALL Rweg",43805.614583333336,43805.979166666664,"Fetehawi","de Bruyn"]
["2019-12-06","PALL Rweg",43805.614583333336,43805.979166666664,"Charles","Dekker"]
["2019-12-06","PALL Rweg",43805.614583333336,43805.979166666664,"Henk","Koster"]
["2019-12-06","PALL Rweg",43805.614583333336,43805.979166666664,"Ko","van de Brink"]
["2019-12-06","PALL Rweg",43805.614583333336,43805.979166666664,"Robin","Evers"]
["2019-12-06","SCHM",43805.614583333336,43805.979166666664,"Roy","van der Meulen"]
["2019-12-06","SCHM",43805.614583333336,43805.979166666664,"Piet","Schipper"]
["2019-12-06","SCHM AFV",43805.614583333336,43805.979166666664,"Jan","de Jonge"]
["2019-12-06","SCHM AFV",43805.614583333336,43805.979166666664,"Boyan","van Leeuwen"]
["2019-12-06","SCHM AFV",43805.614583333336,43805.979166666664,"Sami","van der Horst"]
["2019-12-06","SCHM AFV",43805.614583333336,43805.979166666664,"Henri","van Dam"]
["2019-12-06","SCHM AFV",43805.614583333336,43805.979166666664,"Michel","Jonker"]
["2019-12-06","TRSP",43805.614583333336,43805.979166666664,"Henk","Koster"]
["2019-12-06","TRSP",43805.614583333336,43805.979166666664,"Anton","Smit"]
["2019-12-06","PALL Rweg",43805.666666666664,43805.979166666664,"Robel","Hermans"]
["2019-12-06","SCHM HAS",43805.697916666664,43805.9375,"Paul","van Dongen"]
["2019-12-07","ABB weekenddienst",43806.333333333336,43806.875,"Arkan","de Boer"]
["2019-12-08","ABB weekenddienst",43807.333333333336,43807.614583333336,"Baki","Bos"]
["2019-12-08","ABB middag",43807.572916666664,43807.9375,"Flavi","van der Heyden"]
["2019-12-08","SCHM",43807.999305555553,43808.364583333336,"Rachid","van der Laan"]
["2019-12-08","SCHM",43807.999305555553,43808.364583333336,"Evans","Vermeulen"]
["2019-12-08","SCHM",43807.999305555553,43808.364583333336,"Kevin","Veenstra"]
["2019-12-09","ABB ochtend ",43808.25,43808.614583333336,"Trienko","Spooren"]
["2019-12-09","AFV HAS",43808.25,43808.40625,"Paul","van Dongen"]
["2019-12-09","AFV MEP",43808.25,43808.614583333336,"Rudolf","Hofman"]
["2019-12-09","LCR ochtend",43808.25,43808.614583333336,"Sami","van der Horst"]
["2019-12-09","LCR ochtend",43808.25,43808.614583333336,"Wolter","De bolder"]
["2019-12-09","PALL HAS",43808.25,43808.614583333336,"Henk","Koster"]
["2019-12-09","PALL MEP",43808.25,43808.614583333336,"Wenaron","Kurkema"]
["2019-12-09","PALL MEP",43808.25,43808.614583333336,"Salahadin","Wolters"]
["2019-12-09","PALL MEP",43808.25,43808.614583333336,"Dikkie","van der Meer"]
["2019-12-09","PALL MEP",43808.25,43808.614583333336,"Rene","van der Velden"]
["2019-12-09","PALL MEP",43808.25,43808.614583333336,"Richard","Driessen"]
["2019-12-09","PALL Rweg",43808.25,43808.614583333336,"Felicia","van den Broek"]
["2019-12-09","PALL Rweg",43808.25,43808.614583333336,"Shawn","Molenaar"]
["2019-12-09","PALL Rweg",43808.25,43808.614583333336,"Elroy","van der Linden"]
["2019-12-09","PALL Rweg",43808.25,43808.614583333336,"Swen","de Leeuw"]
["2019-12-09","PALL Rweg",43808.25,43808.614583333336,"Arsenio","Mulder"]
["2019-12-09","PALL Rweg",43808.25,43808.614583333336,"Viorel","Triest"]
["2019-12-09","PALL Rweg",43808.25,43808.614583333336,"Olcay","de Vos"]
["2019-12-09","PALL Rweg",43808.25,43808.614583333336,"Sebastiaan","Mol"]
["2019-12-09","PALL Rweg",43808.25,43808.614583333336,"Amadou","Bakker"]
["2019-12-09","PALL Rweg",43808.25,43808.614583333336,"Wout","Van Goud"]
["2019-12-09","PALL Rweg",43808.25,43808.614583333336,"Fars","van de Veen"]
["2019-12-09","PALL Rweg",43808.25,43808.614583333336,"Magdalena","Postma"]
["2019-12-09","PALL Rweg",43808.25,43808.614583333336,"Charles","Dekker"]
["2019-12-09","PALL Rweg",43808.25,43808.614583333336,"Ko","van de Brink"]
["2019-12-09","PALL Rweg",43808.25,43808.614583333336,"Gerrit","van Beek"]
["2019-12-09","PALL Rweg",43808.25,43808.614583333336,"Everon","van den Heuvel"]
["2019-12-09","PALL Rweg",43808.25,43808.614583333336,"Davood","Smits"]
["2019-12-09","PALL Rweg",43808.25,43808.614583333336,"Saidou","Bosman"]
["2019-12-09","PALL Rweg",43808.25,43808.614583333336,"Wim","Vogel"]
["2019-12-09","PALL Rweg",43808.25,43808.614583333336,"Quincy","de Koning"]
["2019-12-09","PALL Rweg",43808.25,43808.614583333336,"Henk","Koster"]
["2019-12-09","Reserve ochtend",43808.25,43808.614583333336,"Robin","Evers"]
["2019-12-09","SCHM",43808.25,43808.614583333336,"Marjolein","Martens"]
["2019-12-09","SCHM",43808.25,43808.614583333336,"Piet","Schipper"]
["2019-12-09","SCHM",43808.25,43808.614583333336,"Roy","van der Meulen"]
["2019-12-09","SCHM AFV",43808.25,43808.614583333336,"Christiaan","de Wit"]
["2019-12-09","SCHM AFV",43808.25,43808.614583333336,"Henri","van Dam"]
["2019-12-09","SCHM AFV",43808.25,43808.614583333336,"Jan","de Jonge"]
["2019-12-09","SCHM AFV",43808.25,43808.614583333336,"Boyan","van Leeuwen"]
["2019-12-09","SCHM AFV",43808.25,43808.614583333336,"Michel","Jonker"]
["2019-12-09","TRSP",43808.25,43808.614583333336,"Anton","Smit"]
["2019-12-09","TRSP",43808.25,43808.614583333336,"Henk","Koster"]
["2019-12-09","AFV MEP",43808.291666666664,43808.65625,"Rijk","van Doorn"]
["2019-12-09","Teamleider PALL",43808.3125,43808.677083333336,"Hilko","Prins"]
["2019-12-09","TRSP",43808.333333333336,43808.697916666664,"Harrie","Hoekstra"]
["2019-12-09","SCHM HAS",43808.40625,43808.614583333336,"Paul","van Dongen"]
["2019-12-09","ABB middag",43808.572916666664,43808.9375,"Bile","Hendriks"]
["2019-12-09","ABB middag",43808.572916666664,43808.9375,"Flavi","van der Heyden"]
["2019-12-09","AFV HAS",43808.572916666664,43808.697916666664,"Norbert","de Lange"]
["2019-12-09","AFV MEP",43808.572916666664,43808.9375,"Houcin","Huisman"]
["2019-12-09","LCR middag",43808.572916666664,43808.9375,"Klaas","Kramer"]
["2019-12-09","PALL MEP",43808.614583333336,43808.979166666664,"Latie","van Wijk"]
["2019-12-09","PALL MEP",43808.614583333336,43808.979166666664,"Abdurahman Ibrahim","de Vries"]
["2019-12-09","PALL MEP",43808.614583333336,43808.979166666664,"Michael","Gerritsen"]
["2019-12-09","PALL MEP",43808.614583333336,43808.979166666664,"Hans","van de Ven "]
["2019-12-09","PALL MEP",43808.614583333336,43808.979166666664,"Jeroen","Post"]
["2019-12-09","PALL Rweg",43808.614583333336,43808.979166666664,"Akela","van Dijk"]
["2019-12-09","PALL Rweg",43808.614583333336,43808.979166666664,"Karrar","Kuiper"]
["2019-12-09","PALL Rweg",43808.614583333336,43808.979166666664,"Sebastian","Kuijpers"]
["2019-12-09","PALL Rweg",43808.614583333336,43808.979166666664,"Harry","Maas"]
["2019-12-09","PALL Rweg",43808.614583333336,43808.979166666664,"Apollonia","Meijer"]
["2019-12-09","PALL Rweg",43808.614583333336,43808.979166666664,"Agathe","van de Berg "]
["2019-12-09","PALL Rweg",43808.614583333336,43808.979166666664,"Heruy","van de Wal "]
["2019-12-09","PALL Rweg",43808.614583333336,43808.979166666664,"Hassan","Verhoeven"]
["2019-12-09","PALL Rweg",43808.614583333336,43808.979166666664,"Samantha","Sanders"]
["2019-12-09","PALL Rweg",43808.614583333336,43808.979166666664,"Sied"," van der Pol"]
["2019-12-09","PALL Rweg",43808.614583333336,43808.979166666664,"Laszlo","Scholten"]
["2019-12-09","PALL Rweg",43808.614583333336,43808.979166666664,"Atobhran","de Groot"]
["2019-12-09","PALL Rweg",43808.614583333336,43808.979166666664,"Abdul","Jansen"]
["2019-12-09","PALL Rweg",43808.614583333336,43808.979166666664,"Naoufel","van de Velde "]
["2019-12-09","PALL Rweg",43808.614583333336,43808.979166666664,"Niek","Smeets"]
["2019-12-09","PALL Rweg",43808.614583333336,43808.979166666664,"Jarek","Kuipers"]
["2019-12-09","PALL Rweg",43808.614583333336,43808.979166666664,"Martijn","de Ruiter"]
["2019-12-09","PALL Rweg",43808.614583333336,43808.979166666664,"Mark","Vink"]
["2019-12-09","PALL Rweg",43808.614583333336,43808.979166666664,"Abdiqadir","de Jong"]
["2019-12-09","PALL Rweg",43808.614583333336,43808.979166666664,"Nexhmedi","Willemsen"]
["2019-12-09","SCHM",43808.614583333336,43808.979166666664,"Erik","de Haan"]
["2019-12-09","SCHM",43808.614583333336,43808.979166666664,"Patrick","Bosch"]
["2019-12-09","SCHM",43808.614583333336,43808.979166666664,"Rolinka","van den Bosch"]
["2019-12-09","SCHM AFV",43808.614583333336,43808.979166666664,"Miquel","van Loon"]
["2019-12-09","SCHM AFV",43808.614583333336,43808.979166666664,"Paul","van Dongen"]
["2019-12-09","SCHM AFV",43808.614583333336,43808.979166666664,"Sebastiaan","Mol"]
["2019-12-09","SCHM AFV",43808.614583333336,43808.979166666664,"Baki","Bos"]
["2019-12-09","SCHM AFV",43808.614583333336,43808.979166666664,"Ilker","Peeters"]
["2019-12-09","TRSP",43808.614583333336,43808.979166666664,"Emsud","Kok"]
["2019-12-09","TRSP",43808.614583333336,43808.979166666664,"Reinder","Koning"]
["2019-12-09","PALL Rweg",43808.645833333336,43808.979166666664,"Amanuel","Janssen"]
["2019-12-09","PALL Rweg",43808.666666666664,43808.979166666664,"Gebrehiwet","Schouten"]
["2019-12-09","Reserve middag",43808.666666666664,43808.979166666664,"Bereket","Peters"]
["2019-12-09","SCHM HAS",43808.697916666664,43808.9375,"Norbert","de Lange"]
["2019-12-09","SCHM",43808.916666666664,43809.28125,"Rachid","van der Laan"]
["2019-12-09","SCHM",43808.916666666664,43809.28125,"Evans","Vermeulen"]
["2019-12-09","SCHM",43808.916666666664,43809.28125,"Kevin","Veenstra"]
["2019-12-10","ABB ochtend ",43809.25,43809.614583333336,"Trienko","Spooren"]
["2019-12-10","AFV HAS",43809.25,43809.40625,"Paul","van Dongen"]
["2019-12-10","AFV MEP",43809.25,43809.614583333336,"Rudolf","Hofman"]
["2019-12-10","LCR ochtend",43809.25,43809.614583333336,"Sami","van der Horst"]
["2019-12-10","LCR ochtend",43809.25,43809.614583333336,"Wolter","De bolder"]
["2019-12-10","PALL HAS",43809.25,43809.614583333336,"Henk","Koster"]
["2019-12-10","PALL MEP",43809.25,43809.614583333336,"Wenaron","Kurkema"]
["2019-12-10","PALL MEP",43809.25,43809.614583333336,"Salahadin","Wolters"]
["2019-12-10","PALL MEP",43809.25,43809.614583333336,"Dikkie","van der Meer"]
["2019-12-10","PALL MEP",43809.25,43809.614583333336,"Rene","van der Velden"]
["2019-12-10","PALL MEP",43809.25,43809.614583333336,"Richard","Driessen"]
["2019-12-10","PALL Rweg",43809.25,43809.614583333336,"Shawn","Molenaar"]
["2019-12-10","PALL Rweg",43809.25,43809.614583333336,"Elroy","van der Linden"]
["2019-12-10","PALL Rweg",43809.25,43809.614583333336,"Arsenio","Mulder"]
["2019-12-10","PALL Rweg",43809.25,43809.614583333336,"Viorel","Triest"]
["2019-12-10","PALL Rweg",43809.25,43809.614583333336,"Olcay","de Vos"]
["2019-12-10","PALL Rweg",43809.25,43809.614583333336,"Amadou","Bakker"]
["2019-12-10","PALL Rweg",43809.25,43809.614583333336,"Wout","Van Goud"]
["2019-12-10","PALL Rweg",43809.25,43809.614583333336,"Magdalena","Postma"]
["2019-12-10","PALL Rweg",43809.25,43809.614583333336,"Charles","Dekker"]
["2019-12-10","PALL Rweg",43809.25,43809.614583333336,"Ko","van de Brink"]
["2019-12-10","PALL Rweg",43809.25,43809.614583333336,"Robin","Evers"]
["2019-12-10","PALL Rweg",43809.25,43809.614583333336,"Gerrit","van Beek"]
["2019-12-10","PALL Rweg",43809.25,43809.614583333336,"Everon","van den Heuvel"]
["2019-12-10","PALL Rweg",43809.25,43809.614583333336,"Davood","Smits"]
["2019-12-10","PALL Rweg",43809.25,43809.614583333336,"Swen","de Leeuw"]
["2019-12-10","PALL Rweg",43809.25,43809.614583333336,"Saidou","Bosman"]
["2019-12-10","PALL Rweg",43809.25,43809.614583333336,"Wim","Vogel"]
["2019-12-10","PALL Rweg",43809.25,43809.614583333336,"Quincy","de Koning"]
["2019-12-10","PALL Rweg",43809.25,43809.614583333336,"Henk","Koster"]
["2019-12-10","SCHM",43809.25,43809.614583333336,"Marjolein","Martens"]
["2019-12-10","SCHM",43809.25,43809.614583333336,"Piet","Schipper"]
["2019-12-10","SCHM",43809.25,43809.614583333336,"Roy","van der Meulen"]
["2019-12-10","SCHM AFV",43809.25,43809.614583333336,"Christiaan","de Wit"]
["2019-12-10","SCHM AFV",43809.25,43809.614583333336,"Henri","van Dam"]
["2019-12-10","SCHM AFV",43809.25,43809.614583333336,"Jan","de Jonge"]
["2019-12-10","SCHM AFV",43809.25,43809.614583333336,"Boyan","van Leeuwen"]
["2019-12-10","SCHM AFV",43809.25,43809.614583333336,"Michel","Jonker"]
["2019-12-10","TRSP",43809.25,43809.614583333336,"Anton","Smit"]
["2019-12-10","TRSP",43809.25,43809.614583333336,"Henk","Koster"]
["2019-12-10","AFV MEP",43809.291666666664,43809.65625,"Rijk","van Doorn"]
["2019-12-10","Teamleider PALL",43809.3125,43809.677083333336,"Hilko","Prins"]
["2019-12-10","TRSP",43809.333333333336,43809.697916666664,"Harrie","Hoekstra"]
["2019-12-10","SCHM HAS",43809.40625,43809.614583333336,"Paul","van Dongen"]
["2019-12-10","Reserve ochtend",43809.458333333336,43809.614583333336,"Fars","van de Veen"]
["2019-12-10","ABB middag",43809.572916666664,43809.9375,"Bile","Hendriks"]
["2019-12-10","ABB middag",43809.572916666664,43809.9375,"Flavi","van der Heyden"]
["2019-12-10","AFV HAS",43809.572916666664,43809.697916666664,"Norbert","de Lange"]
["2019-12-10","AFV MEP",43809.572916666664,43809.9375,"Houcin","Huisman"]
["2019-12-10","LCR middag",43809.572916666664,43809.9375,"Klaas","Kramer"]
["2019-12-10","PALL MEP",43809.614583333336,43809.979166666664,"Latie","van Wijk"]
["2019-12-10","PALL MEP",43809.614583333336,43809.979166666664,"Abdurahman Ibrahim","de Vries"]
["2019-12-10","PALL MEP",43809.614583333336,43809.979166666664,"Michael","Gerritsen"]
["2019-12-10","PALL MEP",43809.614583333336,43809.979166666664,"Hans","van de Ven "]
["2019-12-10","PALL MEP",43809.614583333336,43809.979166666664,"Jeroen","Post"]
["2019-12-10","PALL Rweg",43809.614583333336,43809.979166666664,"Akela","van Dijk"]
["2019-12-10","PALL Rweg",43809.614583333336,43809.979166666664,"Karrar","Kuiper"]
["2019-12-10","PALL Rweg",43809.614583333336,43809.979166666664,"Sebastian","Kuijpers"]
["2019-12-10","PALL Rweg",43809.614583333336,43809.979166666664,"Chevindio","Brouwer"]
["2019-12-10","PALL Rweg",43809.614583333336,43809.979166666664,"Harry","Maas"]
["2019-12-10","PALL Rweg",43809.614583333336,43809.979166666664,"Apollonia","Meijer"]
["2019-12-10","PALL Rweg",43809.614583333336,43809.979166666664,"Dennis","de Graaf"]
["2019-12-10","PALL Rweg",43809.614583333336,43809.979166666664,"Agathe","van de Berg "]
["2019-12-10","PALL Rweg",43809.614583333336,43809.979166666664,"Heruy","van de Wal "]
["2019-12-10","PALL Rweg",43809.614583333336,43809.979166666664,"Hassan","Verhoeven"]
["2019-12-10","PALL Rweg",43809.614583333336,43809.979166666664,"Samantha","Sanders"]
["2019-12-10","PALL Rweg",43809.614583333336,43809.979166666664,"Sied"," van der Pol"]
["2019-12-10","PALL Rweg",43809.614583333336,43809.979166666664,"Atobhran","de Groot"]
["2019-12-10","PALL Rweg",43809.614583333336,43809.979166666664,"Abdul","Jansen"]
["2019-12-10","PALL Rweg",43809.614583333336,43809.979166666664,"Naoufel","van de Velde "]
["2019-12-10","PALL Rweg",43809.614583333336,43809.979166666664,"Niek","Smeets"]
["2019-12-10","PALL Rweg",43809.614583333336,43809.979166666664,"Jarek","Kuipers"]
["2019-12-10","PALL Rweg",43809.614583333336,43809.979166666664,"Martijn","de Ruiter"]
["2019-12-10","PALL Rweg",43809.614583333336,43809.979166666664,"Mark","Vink"]
["2019-12-10","PALL Rweg",43809.614583333336,43809.979166666664,"Abdiqadir","de Jong"]
["2019-12-10","PALL Rweg",43809.614583333336,43809.979166666664,"Nexhmedi","Willemsen"]
["2019-12-10","SCHM",43809.614583333336,43809.979166666664,"Erik","de Haan"]
["2019-12-10","SCHM",43809.614583333336,43809.979166666664,"Patrick","Bosch"]
["2019-12-10","SCHM",43809.614583333336,43809.979166666664,"Rolinka","van den Bosch"]
["2019-12-10","SCHM AFV",43809.614583333336,43809.979166666664,"Miquel","van Loon"]
["2019-12-10","SCHM AFV",43809.614583333336,43809.979166666664,"Paul","van Dongen"]
["2019-12-10","SCHM AFV",43809.614583333336,43809.979166666664,"Sebastiaan","Mol"]
["2019-12-10","SCHM AFV",43809.614583333336,43809.979166666664,"Baki","Bos"]
["2019-12-10","SCHM AFV",43809.614583333336,43809.979166666664,"Ilker","Peeters"]
["2019-12-10","TRSP",43809.614583333336,43809.979166666664,"Emsud","Kok"]
["2019-12-10","TRSP",43809.614583333336,43809.979166666664,"Reinder","Koning"]
["2019-12-10","PALL Rweg",43809.645833333336,43809.979166666664,"Amanuel","Janssen"]
["2019-12-10","Reserve middag",43809.666666666664,43809.979166666664,"Haben","Willems"]
["2019-12-10","Reserve middag",43809.666666666664,43809.979166666664,"Bereket","Peters"]
["2019-12-10","Reserve middag",43809.666666666664,43809.979166666664,"Gebrehiwet","Schouten"]
["2019-12-10","Reserve middag",43809.666666666664,43809.979166666664,"Robel","Hermans"]
["2019-12-10","SCHM HAS",43809.697916666664,43809.9375,"Norbert","de Lange"]
["2019-12-10","SCHM",43809.916666666664,43810.28125,"Rachid","van der Laan"]
["2019-12-10","SCHM",43809.916666666664,43810.28125,"Evans","Vermeulen"]
["2019-12-10","SCHM",43809.916666666664,43810.28125,"Kevin","Veenstra"]
["2019-12-11","ABB ochtend ",43810.25,43810.614583333336,"Trienko","Spooren"]
["2019-12-11","AFV HAS",43810.25,43810.40625,"Paul","van Dongen"]
["2019-12-11","AFV MEP",43810.25,43810.614583333336,"Rudolf","Hofman"]
["2019-12-11","LCR ochtend",43810.25,43810.614583333336,"Sami","van der Horst"]
["2019-12-11","LCR ochtend",43810.25,43810.614583333336,"Wolter","De bolder"]
["2019-12-11","PALL HAS",43810.25,43810.614583333336,"Henk","Koster"]
["2019-12-11","PALL MEP",43810.25,43810.614583333336,"Wenaron","Kurkema"]
["2019-12-11","PALL MEP",43810.25,43810.614583333336,"Salahadin","Wolters"]
["2019-12-11","PALL MEP",43810.25,43810.614583333336,"Dikkie","van der Meer"]
["2019-12-11","PALL MEP",43810.25,43810.614583333336,"Rene","van der Velden"]
["2019-12-11","PALL MEP",43810.25,43810.614583333336,"Richard","Driessen"]
["2019-12-11","PALL Rweg",43810.25,43810.614583333336,"Felicia","van den Broek"]
["2019-12-11","PALL Rweg",43810.25,43810.614583333336,"Elroy","van der Linden"]
["2019-12-11","PALL Rweg",43810.25,43810.614583333336,"Arsenio","Mulder"]
["2019-12-11","PALL Rweg",43810.25,43810.614583333336,"Viorel","Triest"]
["2019-12-11","PALL Rweg",43810.25,43810.614583333336,"Olcay","de Vos"]
["2019-12-11","PALL Rweg",43810.25,43810.614583333336,"Sebastiaan","Mol"]
["2019-12-11","PALL Rweg",43810.25,43810.614583333336,"Amadou","Bakker"]
["2019-12-11","PALL Rweg",43810.25,43810.614583333336,"Wout","Van Goud"]
["2019-12-11","PALL Rweg",43810.25,43810.614583333336,"Magdalena","Postma"]
["2019-12-11","PALL Rweg",43810.25,43810.614583333336,"Charles","Dekker"]
["2019-12-11","PALL Rweg",43810.25,43810.614583333336,"Ko","van de Brink"]
["2019-12-11","PALL Rweg",43810.25,43810.614583333336,"Robin","Evers"]
["2019-12-11","PALL Rweg",43810.25,43810.614583333336,"Gerrit","van Beek"]
["2019-12-11","PALL Rweg",43810.25,43810.614583333336,"Everon","van den Heuvel"]
["2019-12-11","PALL Rweg",43810.25,43810.614583333336,"Davood","Smits"]
["2019-12-11","PALL Rweg",43810.25,43810.614583333336,"Swen","de Leeuw"]
["2019-12-11","PALL Rweg",43810.25,43810.614583333336,"Saidou","Bosman"]
["2019-12-11","PALL Rweg",43810.25,43810.614583333336,"Wim","Vogel"]
["2019-12-11","PALL Rweg",43810.25,43810.614583333336,"Quincy","de Koning"]
["2019-12-11","PALL Rweg",43810.25,43810.614583333336,"Daniel","Dijkstra"]
["2019-12-11","PALL Rweg",43810.25,43810.614583333336,"Henk","Koster"]
["2019-12-11","Reserve ochtend",43810.25,43810.614583333336,"Shawn","Molenaar"]
["2019-12-11","Reserve ochtend",43810.25,43810.614583333336,"Fars","van de Veen"]
["2019-12-11","Reserve ochtend",43810.25,43810.614583333336,"Mebrathu","Timmermans"]
["2019-12-11","SCHM",43810.25,43810.614583333336,"Marjolein","Martens"]
["2019-12-11","SCHM",43810.25,43810.614583333336,"Piet","Schipper"]
["2019-12-11","SCHM",43810.25,43810.614583333336,"Roy","van der Meulen"]
["2019-12-11","SCHM AFV",43810.25,43810.614583333336,"Christiaan","de Wit"]
["2019-12-11","SCHM AFV",43810.25,43810.614583333336,"Henri","van Dam"]
["2019-12-11","SCHM AFV",43810.25,43810.614583333336,"Jan","de Jonge"]
["2019-12-11","SCHM AFV",43810.25,43810.614583333336,"Boyan","van Leeuwen"]
["2019-12-11","SCHM AFV",43810.25,43810.614583333336,"Michel","Jonker"]
["2019-12-11","TRSP",43810.25,43810.614583333336,"Anton","Smit"]
["2019-12-11","TRSP",43810.25,43810.614583333336,"Henk","Koster"]
["2019-12-11","AFV MEP",43810.291666666664,43810.65625,"Rijk","van Doorn"]
["2019-12-11","Teamleider PALL",43810.3125,43810.677083333336,"Hilko","Prins"]
["2019-12-11","TRSP",43810.333333333336,43810.697916666664,"Harrie","Hoekstra"]
["2019-12-11","SCHM HAS",43810.40625,43810.614583333336,"Paul","van Dongen"]
["2019-12-11","ABB middag",43810.572916666664,43810.9375,"Bile","Hendriks"]
["2019-12-11","AFV HAS",43810.572916666664,43810.697916666664,"Norbert","de Lange"]
["2019-12-11","AFV MEP",43810.572916666664,43810.9375,"Houcin","Huisman"]
["2019-12-11","LCR middag",43810.572916666664,43810.9375,"Sebastiaan","Mol"]
["2019-12-11","PALL MEP",43810.614583333336,43810.979166666664,"Latie","van Wijk"]
["2019-12-11","PALL MEP",43810.614583333336,43810.979166666664,"Abdurahman Ibrahim","de Vries"]
["2019-12-11","PALL MEP",43810.614583333336,43810.979166666664,"Michael","Gerritsen"]
["2019-12-11","PALL MEP",43810.614583333336,43810.979166666664,"Hans","van de Ven "]
["2019-12-11","PALL MEP",43810.614583333336,43810.979166666664,"Jeroen","Post"]
["2019-12-11","PALL Rweg",43810.614583333336,43810.979166666664,"Akela","van Dijk"]
["2019-12-11","PALL Rweg",43810.614583333336,43810.979166666664,"Karrar","Kuiper"]
["2019-12-11","PALL Rweg",43810.614583333336,43810.979166666664,"Sebastian","Kuijpers"]
["2019-12-11","PALL Rweg",43810.614583333336,43810.979166666664,"Chevindio","Brouwer"]
["2019-12-11","PALL Rweg",43810.614583333336,43810.979166666664,"Harry","Maas"]
["2019-12-11","PALL Rweg",43810.614583333336,43810.979166666664,"Dennis","de Graaf"]
["2019-12-11","PALL Rweg",43810.614583333336,43810.979166666664,"Jelte","van Veen"]
["2019-12-11","PALL Rweg",43810.614583333336,43810.979166666664,"Agathe","van de Berg "]
["2019-12-11","PALL Rweg",43810.614583333336,43810.979166666664,"Amanuel","Janssen"]
["2019-12-11","PALL Rweg",43810.614583333336,43810.979166666664,"Hassan","Verhoeven"]
["2019-12-11","PALL Rweg",43810.614583333336,43810.979166666664,"Samantha","Sanders"]
["2019-12-11","PALL Rweg",43810.614583333336,43810.979166666664,"Sied"," van der Pol"]
["2019-12-11","PALL Rweg",43810.614583333336,43810.979166666664,"Ambroise","Visser"]
["2019-12-11","PALL Rweg",43810.614583333336,43810.979166666664,"Atobhran","de Groot"]
["2019-12-11","PALL Rweg",43810.614583333336,43810.979166666664,"Abdul","Jansen"]
["2019-12-11","PALL Rweg",43810.614583333336,43810.979166666664,"Naoufel","van de Velde "]
["2019-12-11","PALL Rweg",43810.614583333336,43810.979166666664,"Niek","Smeets"]
["2019-12-11","PALL Rweg",43810.614583333336,43810.979166666664,"Jarek","Kuipers"]
["2019-12-11","PALL Rweg",43810.614583333336,43810.979166666664,"Martijn","de Ruiter"]
["2019-12-11","PALL Rweg",43810.614583333336,43810.979166666664,"Mark","Vink"]
["2019-12-11","PALL Rweg",43810.614583333336,43810.979166666664,"Abdiqadir","de Jong"]
["2019-12-11","PALL Rweg",43810.614583333336,43810.979166666664,"Nexhmedi","Willemsen"]
["2019-12-11","Reserve middag",43810.614583333336,43810.979166666664,"Tomas","Koolen"]
["2019-12-11","Reserve middag",43810.614583333336,43810.979166666664,"Heruy","van de Wal "]
["2019-12-11","Reserve middag",43810.614583333336,43810.979166666664,"Tesfaldet","Verbeek"]
["2019-12-11","Reserve middag",43810.614583333336,43810.979166666664,"Laszlo","Scholten"]
["2019-12-11","Reserve middag",43810.614583333336,43810.979166666664,"Gebrehiwet","Schouten"]
["2019-12-11","SCHM",43810.614583333336,43810.979166666664,"Erik","de Haan"]
["2019-12-11","SCHM",43810.614583333336,43810.979166666664,"Patrick","Bosch"]
["2019-12-11","SCHM",43810.614583333336,43810.979166666664,"Rolinka","van den Bosch"]
["2019-12-11","SCHM AFV",43810.614583333336,43810.979166666664,"Paul","van Dongen"]
["2019-12-11","SCHM AFV",43810.614583333336,43810.979166666664,"Baki","Bos"]
["2019-12-11","SCHM AFV",43810.614583333336,43810.979166666664,"Ilker","Peeters"]
["2019-12-11","SCHM AFV",43810.614583333336,43810.979166666664,"Flavi","van der Heyden"]
["2019-12-11","TRSP",43810.614583333336,43810.979166666664,"Emsud","Kok"]
["2019-12-11","TRSP",43810.614583333336,43810.979166666664,"Reinder","Koning"]
["2019-12-11","SCHM HAS",43810.697916666664,43810.9375,"Norbert","de Lange"]
["2019-12-11","SCHM",43810.916666666664,43811.28125,"Rachid","van der Laan"]
["2019-12-11","SCHM",43810.916666666664,43811.28125,"Evans","Vermeulen"]
["2019-12-11","SCHM",43810.916666666664,43811.28125,"Kevin","Veenstra"]
["2019-12-12","ABB ochtend ",43811.25,43811.614583333336,"Trienko","Spooren"]
["2019-12-12","AFV HAS",43811.25,43811.40625,"Paul","van Dongen"]
["2019-12-12","AFV MEP",43811.25,43811.614583333336,"Rudolf","Hofman"]
["2019-12-12","LCR ochtend",43811.25,43811.614583333336,"Sami","van der Horst"]
["2019-12-12","PALL HAS",43811.25,43811.614583333336,"Henk","Koster"]
["2019-12-12","PALL MEP",43811.25,43811.614583333336,"Wenaron","Kurkema"]
["2019-12-12","PALL MEP",43811.25,43811.614583333336,"Salahadin","Wolters"]
["2019-12-12","PALL MEP",43811.25,43811.614583333336,"Dikkie","van der Meer"]
["2019-12-12","PALL MEP",43811.25,43811.614583333336,"Rene","van der Velden"]
["2019-12-12","PALL MEP",43811.25,43811.614583333336,"Richard","Driessen"]
["2019-12-12","PALL Rweg",43811.25,43811.614583333336,"Elroy","van der Linden"]
["2019-12-12","PALL Rweg",43811.25,43811.614583333336,"Arsenio","Mulder"]
["2019-12-12","PALL Rweg",43811.25,43811.614583333336,"Viorel","Triest"]
["2019-12-12","PALL Rweg",43811.25,43811.614583333336,"Olcay","de Vos"]
["2019-12-12","PALL Rweg",43811.25,43811.614583333336,"Sebastiaan","Mol"]
["2019-12-12","PALL Rweg",43811.25,43811.614583333336,"Amadou","Bakker"]
["2019-12-12","PALL Rweg",43811.25,43811.614583333336,"Wout","Van Goud"]
["2019-12-12","PALL Rweg",43811.25,43811.614583333336,"Fars","van de Veen"]
["2019-12-12","PALL Rweg",43811.25,43811.614583333336,"Magdalena","Postma"]
["2019-12-12","PALL Rweg",43811.25,43811.614583333336,"Charles","Dekker"]
["2019-12-12","PALL Rweg",43811.25,43811.614583333336,"Ko","van de Brink"]
["2019-12-12","PALL Rweg",43811.25,43811.614583333336,"Robin","Evers"]
["2019-12-12","PALL Rweg",43811.25,43811.614583333336,"Gerrit","van Beek"]
["2019-12-12","PALL Rweg",43811.25,43811.614583333336,"Everon","van den Heuvel"]
["2019-12-12","PALL Rweg",43811.25,43811.614583333336,"Davood","Smits"]
["2019-12-12","PALL Rweg",43811.25,43811.614583333336,"Swen","de Leeuw"]
["2019-12-12","PALL Rweg",43811.25,43811.614583333336,"Saidou","Bosman"]
["2019-12-12","PALL Rweg",43811.25,43811.614583333336,"Wim","Vogel"]
["2019-12-12","PALL Rweg",43811.25,43811.614583333336,"Quincy","de Koning"]
["2019-12-12","PALL Rweg",43811.25,43811.614583333336,"Daniel","Dijkstra"]
["2019-12-12","PALL Rweg",43811.25,43811.614583333336,"Henk","Koster"]
["2019-12-12","SCHM",43811.25,43811.614583333336,"Marjolein","Martens"]
["2019-12-12","SCHM",43811.25,43811.614583333336,"Piet","Schipper"]
["2019-12-12","SCHM",43811.25,43811.614583333336,"Roy","van der Meulen"]
["2019-12-12","SCHM AFV",43811.25,43811.614583333336,"Christiaan","de Wit"]
["2019-12-12","SCHM AFV",43811.25,43811.614583333336,"Henri","van Dam"]
["2019-12-12","SCHM AFV",43811.25,43811.614583333336,"Jan","de Jonge"]
["2019-12-12","SCHM AFV",43811.25,43811.614583333336,"Boyan","van Leeuwen"]
["2019-12-12","SCHM AFV",43811.25,43811.614583333336,"Michel","Jonker"]
["2019-12-12","TRSP",43811.25,43811.614583333336,"Anton","Smit"]
["2019-12-12","TRSP",43811.25,43811.614583333336,"Henk","Koster"]
["2019-12-12","AFV MEP",43811.291666666664,43811.65625,"Rijk","van Doorn"]
["2019-12-12","Teamleider PALL",43811.3125,43811.677083333336,"Hilko","Prins"]
["2019-12-12","TRSP",43811.333333333336,43811.697916666664,"Harrie","Hoekstra"]
["2019-12-12","SCHM HAS",43811.40625,43811.614583333336,"Paul","van Dongen"]
["2019-12-12","ABB middag",43811.572916666664,43811.9375,"Bile","Hendriks"]
["2019-12-12","AFV HAS",43811.572916666664,43811.697916666664,"Norbert","de Lange"]
["2019-12-12","AFV MEP",43811.572916666664,43811.9375,"Houcin","Huisman"]
["2019-12-12","LCR middag",43811.572916666664,43811.9375,"Klaas","Kramer"]
["2019-12-12","PALL MEP",43811.614583333336,43811.979166666664,"Latie","van Wijk"]
["2019-12-12","PALL MEP",43811.614583333336,43811.979166666664,"Abdurahman Ibrahim","de Vries"]
["2019-12-12","PALL MEP",43811.614583333336,43811.979166666664,"Michael","Gerritsen"]
["2019-12-12","PALL MEP",43811.614583333336,43811.979166666664,"Hans","van de Ven "]
["2019-12-12","PALL MEP",43811.614583333336,43811.979166666664,"Jeroen","Post"]
["2019-12-12","PALL Rweg",43811.614583333336,43811.979166666664,"Akela","van Dijk"]
["2019-12-12","PALL Rweg",43811.614583333336,43811.979166666664,"Karrar","Kuiper"]
["2019-12-12","PALL Rweg",43811.614583333336,43811.979166666664,"Chevindio","Brouwer"]
["2019-12-12","PALL Rweg",43811.614583333336,43811.979166666664,"Haben","Willems"]
["2019-12-12","PALL Rweg",43811.614583333336,43811.979166666664,"Harry","Maas"]
["2019-12-12","PALL Rweg",43811.614583333336,43811.979166666664,"Apollonia","Meijer"]
["2019-12-12","PALL Rweg",43811.614583333336,43811.979166666664,"Dennis","de Graaf"]
["2019-12-12","PALL Rweg",43811.614583333336,43811.979166666664,"Agathe","van de Berg "]
["2019-12-12","PALL Rweg",43811.614583333336,43811.979166666664,"Tomas","Koolen"]
["2019-12-12","PALL Rweg",43811.614583333336,43811.979166666664,"Heruy","van de Wal "]
["2019-12-12","PALL Rweg",43811.614583333336,43811.979166666664,"Hassan","Verhoeven"]
["2019-12-12","PALL Rweg",43811.614583333336,43811.979166666664,"Samantha","Sanders"]
["2019-12-12","PALL Rweg",43811.614583333336,43811.979166666664,"Sied"," van der Pol"]
["2019-12-12","PALL Rweg",43811.614583333336,43811.979166666664,"Laszlo","Scholten"]
["2019-12-12","PALL Rweg",43811.614583333336,43811.979166666664,"Atobhran","de Groot"]
["2019-12-12","PALL Rweg",43811.614583333336,43811.979166666664,"Abdul","Jansen"]
["2019-12-12","PALL Rweg",43811.614583333336,43811.979166666664,"Naoufel","van de Velde "]
["2019-12-12","PALL Rweg",43811.614583333336,43811.979166666664,"Jarek","Kuipers"]
["2019-12-12","PALL Rweg",43811.614583333336,43811.979166666664,"Martijn","de Ruiter"]
["2019-12-12","PALL Rweg",43811.614583333336,43811.979166666664,"Mark","Vink"]
["2019-12-12","PALL Rweg",43811.614583333336,43811.979166666664,"Abdiqadir","de Jong"]
["2019-12-12","PALL Rweg",43811.614583333336,43811.979166666664,"Nexhmedi","Willemsen"]
["2019-12-12","Reserve middag",43811.614583333336,43811.979166666664,"Sebastian","Kuijpers"]
["2019-12-12","Reserve middag",43811.614583333336,43811.979166666664,"Amanuel","Janssen"]
["2019-12-12","SCHM",43811.614583333336,43811.979166666664,"Erik","de Haan"]
["2019-12-12","SCHM",43811.614583333336,43811.979166666664,"Patrick","Bosch"]
["2019-12-12","SCHM",43811.614583333336,43811.979166666664,"Rolinka","van den Bosch"]
["2019-12-12","SCHM AFV",43811.614583333336,43811.979166666664,"Miquel","van Loon"]
["2019-12-12","SCHM AFV",43811.614583333336,43811.979166666664,"Paul","van Dongen"]
["2019-12-12","SCHM AFV",43811.614583333336,43811.979166666664,"Sebastiaan","Mol"]
["2019-12-12","SCHM AFV",43811.614583333336,43811.979166666664,"Baki","Bos"]
["2019-12-12","SCHM AFV",43811.614583333336,43811.979166666664,"Ilker","Peeters"]
["2019-12-12","SCHM AFV",43811.614583333336,43811.979166666664,"Flavi","van der Heyden"]
["2019-12-12","TRSP",43811.614583333336,43811.979166666664,"Emsud","Kok"]
["2019-12-12","TRSP",43811.614583333336,43811.979166666664,"Reinder","Koning"]
["2019-12-12","SCHM HAS",43811.697916666664,43811.9375,"Norbert","de Lange"]
["2019-12-12","SCHM",43811.916666666664,43812.28125,"Rachid","van der Laan"]
["2019-12-12","SCHM",43811.916666666664,43812.28125,"Evans","Vermeulen"]
["2019-12-12","SCHM",43811.916666666664,43812.28125,"Kevin","Veenstra"]
["2019-12-13","ABB ochtend ",43812.25,43812.614583333336,"Trienko","Spooren"]
["2019-12-13","AFV HAS",43812.25,43812.40625,"Paul","van Dongen"]
["2019-12-13","AFV MEP",43812.25,43812.614583333336,"Rudolf","Hofman"]
["2019-12-13","LCR ochtend",43812.25,43812.614583333336,"Sami","van der Horst"]
["2019-12-13","LCR ochtend",43812.25,43812.614583333336,"Wolter","De bolder"]
["2019-12-13","PALL HAS",43812.25,43812.614583333336,"Henk","Koster"]
["2019-12-13","PALL MEP",43812.25,43812.614583333336,"Wenaron","Kurkema"]
["2019-12-13","PALL MEP",43812.25,43812.614583333336,"Salahadin","Wolters"]
["2019-12-13","PALL MEP",43812.25,43812.614583333336,"Dikkie","van der Meer"]
["2019-12-13","PALL MEP",43812.25,43812.614583333336,"Rene","van der Velden"]
["2019-12-13","PALL MEP",43812.25,43812.614583333336,"Richard","Driessen"]
["2019-12-13","PALL Rweg",43812.25,43812.614583333336,"Felicia","van den Broek"]
["2019-12-13","PALL Rweg",43812.25,43812.614583333336,"Jelte","van Veen"]
["2019-12-13","PALL Rweg",43812.25,43812.614583333336,"Shawn","Molenaar"]
["2019-12-13","PALL Rweg",43812.25,43812.614583333336,"Elroy","van der Linden"]
["2019-12-13","PALL Rweg",43812.25,43812.614583333336,"Arsenio","Mulder"]
["2019-12-13","PALL Rweg",43812.25,43812.614583333336,"Viorel","Triest"]
["2019-12-13","PALL Rweg",43812.25,43812.614583333336,"Sebastiaan","Mol"]
["2019-12-13","PALL Rweg",43812.25,43812.614583333336,"Amadou","Bakker"]
["2019-12-13","PALL Rweg",43812.25,43812.614583333336,"Wout","Van Goud"]
["2019-12-13","PALL Rweg",43812.25,43812.614583333336,"Fars","van de Veen"]
["2019-12-13","PALL Rweg",43812.25,43812.614583333336,"Magdalena","Postma"]
["2019-12-13","PALL Rweg",43812.25,43812.614583333336,"Charles","Dekker"]
["2019-12-13","PALL Rweg",43812.25,43812.614583333336,"Ko","van de Brink"]
["2019-12-13","PALL Rweg",43812.25,43812.614583333336,"Robin","Evers"]
["2019-12-13","PALL Rweg",43812.25,43812.614583333336,"Gerrit","van Beek"]
["2019-12-13","PALL Rweg",43812.25,43812.614583333336,"Everon","van den Heuvel"]
["2019-12-13","PALL Rweg",43812.25,43812.614583333336,"Davood","Smits"]
["2019-12-13","PALL Rweg",43812.25,43812.614583333336,"Swen","de Leeuw"]
["2019-12-13","PALL Rweg",43812.25,43812.614583333336,"Saidou","Bosman"]
["2019-12-13","PALL Rweg",43812.25,43812.614583333336,"Wim","Vogel"]
["2019-12-13","PALL Rweg",43812.25,43812.614583333336,"Quincy","de Koning"]
["2019-12-13","PALL Rweg",43812.25,43812.614583333336,"Henk","Koster"]
["2019-12-13","Reserve ochtend",43812.25,43812.614583333336,"Olcay","de Vos"]
["2019-12-13","Reserve ochtend",43812.25,43812.614583333336,"Mebrathu","Timmermans"]
["2019-12-13","Reserve ochtend",43812.25,43812.614583333336,"Daniel","Dijkstra"]
["2019-12-13","SCHM",43812.25,43812.614583333336,"Marjolein","Martens"]
["2019-12-13","SCHM",43812.25,43812.614583333336,"Piet","Schipper"]
["2019-12-13","SCHM",43812.25,43812.614583333336,"Roy","van der Meulen"]
["2019-12-13","SCHM AFV",43812.25,43812.614583333336,"Christiaan","de Wit"]
["2019-12-13","SCHM AFV",43812.25,43812.614583333336,"Henri","van Dam"]
["2019-12-13","SCHM AFV",43812.25,43812.614583333336,"Jan","de Jonge"]
["2019-12-13","SCHM AFV",43812.25,43812.614583333336,"Boyan","van Leeuwen"]
["2019-12-13","SCHM AFV",43812.25,43812.614583333336,"Michel","Jonker"]
["2019-12-13","TRSP",43812.25,43812.614583333336,"Anton","Smit"]
["2019-12-13","TRSP",43812.25,43812.614583333336,"Henk","Koster"]
["2019-12-13","AFV MEP",43812.291666666664,43812.65625,"Rijk","van Doorn"]
["2019-12-13","Teamleider PALL",43812.3125,43812.677083333336,"Hilko","Prins"]
["2019-12-13","TRSP",43812.333333333336,43812.697916666664,"Harrie","Hoekstra"]
["2019-12-13","SCHM HAS",43812.40625,43812.614583333336,"Paul","van Dongen"]
["2019-12-13","ABB middag",43812.572916666664,43812.9375,"Bile","Hendriks"]
["2019-12-13","AFV HAS",43812.572916666664,43812.697916666664,"Norbert","de Lange"]
["2019-12-13","AFV MEP",43812.572916666664,43812.9375,"Houcin","Huisman"]
["2019-12-13","LCR middag",43812.572916666664,43812.9375,"Klaas","Kramer"]
["2019-12-13","PALL MEP",43812.614583333336,43812.979166666664,"Latie","van Wijk"]
["2019-12-13","PALL MEP",43812.614583333336,43812.979166666664,"Abdurahman Ibrahim","de Vries"]
["2019-12-13","PALL MEP",43812.614583333336,43812.979166666664,"Michael","Gerritsen"]
["2019-12-13","PALL MEP",43812.614583333336,43812.979166666664,"Hans","van de Ven "]
["2019-12-13","PALL MEP",43812.614583333336,43812.979166666664,"Jeroen","Post"]
["2019-12-13","PALL Rweg",43812.614583333336,43812.979166666664,"Akela","van Dijk"]
["2019-12-13","PALL Rweg",43812.614583333336,43812.979166666664,"Karrar","Kuiper"]
["2019-12-13","PALL Rweg",43812.614583333336,43812.979166666664,"Sebastian","Kuijpers"]
["2019-12-13","PALL Rweg",43812.614583333336,43812.979166666664,"Harry","Maas"]
["2019-12-13","PALL Rweg",43812.614583333336,43812.979166666664,"Apollonia","Meijer"]
["2019-12-13","PALL Rweg",43812.614583333336,43812.979166666664,"Dennis","de Graaf"]
["2019-12-13","PALL Rweg",43812.614583333336,43812.979166666664,"Agathe","van de Berg "]
["2019-12-13","PALL Rweg",43812.614583333336,43812.979166666664,"Hagos","van Vliet"]
["2019-12-13","PALL Rweg",43812.614583333336,43812.979166666664,"Heruy","van de Wal "]
["2019-12-13","PALL Rweg",43812.614583333336,43812.979166666664,"Hassan","Verhoeven"]
["2019-12-13","PALL Rweg",43812.614583333336,43812.979166666664,"Samantha","Sanders"]
["2019-12-13","PALL Rweg",43812.614583333336,43812.979166666664,"Sied"," van der Pol"]
["2019-12-13","PALL Rweg",43812.614583333336,43812.979166666664,"Laszlo","Scholten"]
["2019-12-13","PALL Rweg",43812.614583333336,43812.979166666664,"Atobhran","de Groot"]
["2019-12-13","PALL Rweg",43812.614583333336,43812.979166666664,"Abdul","Jansen"]
["2019-12-13","PALL Rweg",43812.614583333336,43812.979166666664,"Naoufel","van de Velde "]
["2019-12-13","PALL Rweg",43812.614583333336,43812.979166666664,"Jarek","Kuipers"]
["2019-12-13","PALL Rweg",43812.614583333336,43812.979166666664,"Martijn","de Ruiter"]
["2019-12-13","PALL Rweg",43812.614583333336,43812.979166666664,"Mark","Vink"]
["2019-12-13","PALL Rweg",43812.614583333336,43812.979166666664,"Abdiqadir","de Jong"]
["2019-12-13","PALL Rweg",43812.614583333336,43812.979166666664,"Nexhmedi","Willemsen"]
["2019-12-13","SCHM",43812.614583333336,43812.979166666664,"Erik","de Haan"]
["2019-12-13","SCHM",43812.614583333336,43812.979166666664,"Patrick","Bosch"]
["2019-12-13","SCHM",43812.614583333336,43812.979166666664,"Rolinka","van den Bosch"]
["2019-12-13","SCHM AFV",43812.614583333336,43812.979166666664,"Miquel","van Loon"]
["2019-12-13","SCHM AFV",43812.614583333336,43812.979166666664,"Paul","van Dongen"]
["2019-12-13","SCHM AFV",43812.614583333336,43812.979166666664,"Sebastiaan","Mol"]
["2019-12-13","SCHM AFV",43812.614583333336,43812.979166666664,"Baki","Bos"]
["2019-12-13","SCHM AFV",43812.614583333336,43812.979166666664,"Ilker","Peeters"]
["2019-12-13","SCHM AFV",43812.614583333336,43812.979166666664,"Flavi","van der Heyden"]
["2019-12-13","TRSP",43812.614583333336,43812.979166666664,"Emsud","Kok"]
["2019-12-13","TRSP",43812.614583333336,43812.979166666664,"Reinder","Koning"]
["2019-12-13","PALL Rweg",43812.645833333336,43812.979166666664,"Amanuel","Janssen"]
["2019-12-13","Reserve middag",43812.666666666664,43812.979166666664,"Bereket","Peters"]
["2019-12-13","Reserve middag",43812.666666666664,43812.979166666664,"Gebrehiwet","Schouten"]
["2019-12-13","Reserve middag",43812.666666666664,43812.979166666664,"Robel","Hermans"]
["2019-12-13","SCHM HAS",43812.697916666664,43812.9375,"Norbert","de Lange"]
["2019-12-14","ABB weekenddienst",43813.333333333336,43813.875,"Niek","Smeets"]
["2019-12-01","ABB weekenddienst",43800.333333333336,43800.614583333336,"Flavi","van der Heyden"]

{"sheet":"WEEKPLANNING","index":2,"n_rows":38,"n_cols":24,"rows_kept":38,"cut":false,"hidden":false,"merged":[[2,21,2,23],[2,3,2,5],[2,6,2,8],[2,9,2,11],[2,12,2,14],[2,15,2,17],[2,18,2,20]]}
[null,null,null,null,null,"Planning"]
["Jaar","WEEK",null,{"$f":"D3","v":"2019-12-09"},{"$f":"D2","v":43808},{"$f":"D2","v":43808},{"$f":"G3","v":43809},{"$f":"G2","v":43809},{"$f":"G2","v":43809},{"$f":"J3","v":43810},{"$f":"J2","v":43810},{"$f":"J2","v":43810},{"$f":"M3","v":43811},{"$f":"M2","v":43811},{"$f":"M2","v":43811},{"$f":"P3","v":43812},{"$f":"P2","v":43812},{"$f":"P2","v":43812},{"$f":"S3","v":43813},{"$f":"S2","v":43813},{"$f":"S2","v":43813},{"$f":"V3","v":43814},{"$f":"V2","v":43814},{"$f":"V2","v":43814}]
[2019,50,null,{"$f":"DATE($A$3,1,4)-WEEKDAY(DATE($A$3,1,4),2)+1+(($B$3-1)*7)","v":"2019-12-09"},null,null,{"$f":"D3+1","v":"2019-12-10"},null,null,{"$f":"G3+1","v":"2019-12-11"},null,null,{"$f":"J3+1","v":"2019-12-12"},null,null,{"$f":"M3+1","v":"2019-12-13"},null,null,{"$f":"P3+1","v":"2019-12-14"},null,null,{"$f":"S3+1","v":"2019-12-15"}]
["Afdeling",null,"FTE","Vroeg","Laat","Nacht","Vroeg","Laat","Nacht","Vroeg","Laat","Nacht","Vroeg","Laat","Nacht","Vroeg","Laat","Nacht","Vroeg","Laat","Nacht","Vroeg","Laat","Nacht"]
["WERKTIJDEN",null,null,"06:00/14:45","14:45/23:30",null,"06:00/14:45","14:45/23:30",null,"06:00/14:45","14:45/23:30",null,"06:00/14:45","14:45/23:30",null,"06:00/14:45","14:45/23:30",null,"06:00/14:45","14:45/23:30",null,"06:00/14:45","14:45/23:30"]
["AFV",null,1,{"$f":"IFERROR(INDEX(PlanningsFilter!$L$6:$L$1000,SMALL(IF(PlanningsFilter!$K$6:$K$1000=$A6,IF(PlanningsFilter!$C$6:$C$1000=D$2,IF(PlanningsFilter!$J$6:$J$1000=D$4,IF(PlanningsFilter!$I$6:$I$1000=\"\",ROW(PlanningsFilter!$I$6:$I$1000)-ROW($I$6)+1)))),$C6)),\"\")","v":"Christiaan de Wit"},{"$f":"IFERROR(INDEX(PlanningsFilter!$L$6:$L$1000,SMALL(IF(PlanningsFilter!$K$6:$K$1000=$A6,IF(PlanningsFilter!$C$6:$C$1000=E$2,IF(PlanningsFilter!$J$6:$J$1000=E$4,IF(PlanningsFilter!$I$6:$I$1000=\"\",ROW(PlanningsFilter!$I$6:$I$1000)-ROW($I$6)+1)))),$C6)),\"\")","v":"Miquel van Loon"},{"$f":"IFERROR(INDEX(PlanningsFilter!$L$6:$L$1000,SMALL(IF(PlanningsFilter!$K$6:$K$1000=$A6,IF(PlanningsFilter!$C$6:$C$1000=F$2,IF(PlanningsFilter!$J$6:$J$1000=F$4,IF(PlanningsFilter!$I$6:$I$1000=\"\",ROW(PlanningsFilter!$I$6:$I$1000)-ROW($I$6)+1)))),$C6)),\"\")","v":""},{"$f":"IFERROR(INDEX(PlanningsFilter!$L$6:$L$1000,SMALL(IF(PlanningsFilter!$K$6:$K$1000=$A6,IF(PlanningsFilter!$C$6:$C$1000=G$2,IF(PlanningsFilter!$J$6:$J$1000=G$4,IF(PlanningsFilter!$I$6:$I$1000=\"\",ROW(PlanningsFilter!$I$6:$I$1000)-ROW($I$6)+1)))),$C6)),\"\")","v":"Christiaan de Wit"},{"$f":"IFERROR(INDEX(PlanningsFilter!$L$6:$L$1000,SMALL(IF(PlanningsFilter!$K$6:$K$1000=$A6,IF(PlanningsFilter!$C$6:$C$1000=H$2,IF(PlanningsFilter!$J$6:$J$1000=H$4,IF(PlanningsFilter!$I$6:$I$1000=\"\",ROW(PlanningsFilter!$I$6:$I$1000)-ROW($I$6)+1)))),$C6)),\"\")","v":"Miquel van Loon"},{"$f":"IFERROR(INDEX(PlanningsFilter!$L$6:$L$1000,SMALL(IF(PlanningsFilter!$K$6:$K$1000=$A6,IF(PlanningsFilter!$C$6:$C$1000=I$2,IF(PlanningsFilter!$J$6:$J$1000=I$4,IF(PlanningsFilter!$I$6:$I$1000=\"\",ROW(PlanningsFilter!$I$6:$I$1000)-ROW($I$6)+1)))),$C6)),\"\")","v":""},{"$f":"IFERROR(INDEX(PlanningsFilter!$L$6:$L$1000,SMALL(IF(PlanningsFilter!$K$6:$K$1000=$A6,IF(PlanningsFilter!$C$6:$C$1000=J$2,IF(PlanningsFilter!$J$6:$J$1000=J$4,IF(PlanningsFilter!$I$6:$I$1000=\"\",ROW(PlanningsFilter!$I$6:$I$1000)-ROW($I$6)+1)))),$C6)),\"\")","v":"Christiaan de Wit"},{"$f":"IFERROR(INDEX(PlanningsFilter!$L$6:$L$1000,SMALL(IF(PlanningsFilter!$K$6:$K$1000=$A6,IF(PlanningsFilter!$C$6:$C$1000=K$2,IF(PlanningsFilter!$J$6:$J$1000=K$4,IF(PlanningsFilter!$I$6:$I$1000=\"\",ROW(PlanningsFilter!$I$6:$I$1000)-ROW($I$6)+1)))),$C6)),\"\")","v":"Paul van Dongen"},{"$f":"IFERROR(INDEX(PlanningsFilter!$L$6:$L$1000,SMALL(IF(PlanningsFilter!$K$6:$K$1000=$A6,IF(PlanningsFilter!$C$6:$C$1000=L$2,IF(PlanningsFilter!$J$6:$J$1000=L$4,IF(PlanningsFilter!$I$6:$I$1000=\"\",ROW(PlanningsFilter!$I$6:$I$1000)-ROW($I$6)+1)))),$C6)),\"\")","v":""},{"$f":"IFERROR(INDEX(PlanningsFilter!$L$6:$L$1000,SMALL(IF(PlanningsFilter!$K$6:$K$1000=$A6,IF(PlanningsFilter!$C$6:$C$1000=M$2,IF(PlanningsFilter!$J$6:$J$1000=M$4,IF(PlanningsFilter!$I$6:$I$1000=\"\",ROW(PlanningsFilter!$I$6:$I$1000)-ROW($I$6)+1)))),$C6)),\"\")","v":"Christiaan de Wit"},{"$f":"IFERROR(INDEX(PlanningsFilter!$L$6:$L$1000,SMALL(IF(PlanningsFilter!$K$6:$K$1000=$A6,IF(PlanningsFilter!$C$6:$C$1000=N$2,IF(PlanningsFilter!$J$6:$J$1000=N$4,IF(PlanningsFilter!$I$6:$I$1000=\"\",ROW(PlanningsFilter!$I$6:$I$1000)-ROW($I$6)+1)))),$C6)),\"\")","v":"Miquel van Loon"},{"$f":"IFERROR(INDEX(PlanningsFilter!$L$6:$L$1000,SMALL(IF(PlanningsFilter!$K$6:$K$1000=$A6,IF(PlanningsFilter!$C$6:$C$1000=O$2,IF(PlanningsFilter!$J$6:$J$1000=O$4,IF(PlanningsFilter!$I$6:$I$1000=\"\",ROW(PlanningsFilter!$I$6:$I$1000)-ROW($I$6)+1)))),$C6)),\"\")","v":""},{"$f":"IFERROR(INDEX(PlanningsFilter!$L$6:$L$1000,SMALL(IF(PlanningsFilter!$K$6:$K$1000=$A6,IF(PlanningsFilter!$C$6:$C$1000=P$2,IF(PlanningsFilter!$J$6:$J$1000=P$4,IF(PlanningsFilter!$I$6:$I$1000=\"\",ROW(PlanningsFilter!$I$6:$I$1000)-ROW($I$6)+1)))),$C6)),\"\")","v":"Christiaan de Wit"},{"$f":"IFERROR(INDEX(PlanningsFilter!$L$6:$L$1000,SMALL(IF(PlanningsFilter!$K$6:$K$1000=$A6,IF(PlanningsFilter!$C$6:$C$1000=Q$2,IF(PlanningsFilter!$J$6:$J$1000=Q$4,IF(PlanningsFilter!$I$6:$I$1000=\"\",ROW(PlanningsFilter!$I$6:$I$1000)-ROW($I$6)+1)))),$C6)),\"\")","v":"Miquel van Loon"},{"$f":"IFERROR(INDEX(PlanningsFilter!$L$6:$L$1000,SMALL(IF(PlanningsFilter!$K$6:$K$1000=$A6,IF(PlanningsFilter!$C$6:$C$1000=R$2,IF(PlanningsFilter!$J$6:$J$1000=R$4,IF(PlanningsFilter!$I$6:$I$1000=\"\",ROW(PlanningsFilter!$I$6:$I$1000)-ROW($I$6)+1)))),$C6)),\"\")","v":""},{"$f":"IFERROR(INDEX(PlanningsFilter!$L$6:$L$1000,SMALL(IF(PlanningsFilter!$K$6:$K$1000=$A6,IF(PlanningsFilter!$C$6:$C$1000=S$2,IF(PlanningsFilter!$J$6:$J$1000=S$4,IF(PlanningsFilter!$I$6:$I$1000=\"\",ROW(PlanningsFilter!$I$6:$I$1000)-ROW($I$6)+1)))),$C6)),\"\")","v":""},{"$f":"IFERROR(INDEX(PlanningsFilter!$L$6:$L$1000,SMALL(IF(PlanningsFilter!$K$6:$K$1000=$A6,IF(PlanningsFilter!$C$6:$C$1000=T$2,IF(PlanningsFilter!$J$6:$J$1000=T$4,IF(PlanningsFilter!$I$6:$I$1000=\"\",ROW(PlanningsFilter!$I$6:$I$1000)-ROW($I$6)+1)))),$C6)),\"\")","v":""},{"$f":"IFERROR(INDEX(PlanningsFilter!$L$6:$L$1000,SMALL(IF(PlanningsFilter!$K$6:$K$1000=$A6,IF(PlanningsFilter!$C$6:$C$1000=U$2,IF(PlanningsFilter!$J$6:$J$1000=U$4,IF(PlanningsFilter!$I$6:$I$1000=\"\",ROW(PlanningsFilter!$I$6:$I$1000)-ROW($I$6)+1)))),$C6)),\"\")","v":""},{"$f":"IFERROR(INDEX(PlanningsFilter!$L$6:$L$1000,SMALL(IF(PlanningsFilter!$K$6:$K$1000=$A6,IF(PlanningsFilter!$C$6:$C$1000=V$2,IF(PlanningsFilter!$J$6:$J$1000=V$4,IF(PlanningsFilter!$I$6:$I$1000=\"\",ROW(PlanningsFilter!$I$6:$I$1000)-ROW($I$6)+1)))),$C6)),\"\")","v":""},{"$f":"IFERROR(INDEX(PlanningsFilter!$L$6:$L$1000,SMALL(IF(PlanningsFilter!$K$6:$K$1000=$A6,IF(PlanningsFilter!$C$6:$C$1000=W$2,IF(PlanningsFilter!$J$6:$J$1000=W$4,IF(PlanningsFilter!$I$6:$I$1000=\"\",ROW(PlanningsFilter!$I$6:$I$1000)-ROW($I$6)+1)))),$C6)),\"\")","v":""},{"$f":"IFERROR(INDEX(PlanningsFilter!$L$6:$L$1000,SMALL(IF(PlanningsFilter!$K$6:$K$1000=$A6,IF(PlanningsFilter!$C$6:$C$1000=X$2,IF(PlanningsFilter!$J$6:$J$1000=X$4,IF(PlanningsFilter!$I$6:$I$1000=\"\",ROW(PlanningsFilter!$I$6:$I$1000)-ROW($I$6)+1)))),$C6)),\"\")","v":""}]
["AFV",null,2,{"$f":"IFERROR(INDEX(PlanningsFilter!$L$6:$L$1000,SMALL(IF(PlanningsFilter!$K$6:$K$1000=$A7,IF(PlanningsFilter!$C$6:$C$1000=D$2,IF(PlanningsFilter!$J$6:$J$1000=D$4,IF(PlanningsFilter!$I$6:$I$1000=\"\",ROW(PlanningsFilter!$I$6:$I$1000)-ROW($I$6)+1)))),$C7)),\"\")","v":"Henri van Dam"},{"$f":"IFERROR(INDEX(PlanningsFilter!$L$6:$L$1000,SMALL(IF(PlanningsFilter!$K$6:$K$1000=$A7,IF(PlanningsFilter!$C$6:$C$1000=E$2,IF(PlanningsFilter!$J$6:$J$1000=E$4,IF(PlanningsFilter!$I$6:$I$1000=\"\",ROW(PlanningsFilter!$I$6:$I$1000)-ROW($I$6)+1)))),$C7)),\"\")","v":"Paul van Dongen"},{"$f":"IFERROR(INDEX(PlanningsFilter!$L$6:$L$1000,SMALL(IF(PlanningsFilter!$K$6:$K$1000=$A7,IF(PlanningsFilter!$C$6:$C$1000=F$2,IF(PlanningsFilter!$J$6:$J$1000=F$4,IF(PlanningsFilter!$I$6:$I$1000=\"\",ROW(PlanningsFilter!$I$6:$I$1000)-ROW($I$6)+1)))),$C7)),\"\")","v":""},{"$f":"IFERROR(INDEX(PlanningsFilter!$L$6:$L$1000,SMALL(IF(PlanningsFilter!$K$6:$K$1000=$A7,IF(PlanningsFilter!$C$6:$C$1000=G$2,IF(PlanningsFilter!$J$6:$J$1000=G$4,IF(PlanningsFilter!$I$6:$I$1000=\"\",ROW(PlanningsFilter!$I$6:$I$1000)-ROW($I$6)+1)))),$C7)),\"\")","v":"Henri van Dam"},{"$f":"IFERROR(INDEX(PlanningsFilter!$L$6:$L$1000,SMALL(IF(PlanningsFilter!$K$6:$K$1000=$A7,IF(PlanningsFilter!$C$6:$C$1000=H$2,IF(PlanningsFilter!$J$6:$J$1000=H$4,IF(PlanningsFilter!$I$6:$I$1000=\"\",ROW(PlanningsFilter!$I$6:$I$1000)-ROW($I$6)+1)))),$C7)),\"\")","v":"Paul van Dongen"},{"$f":"IFERROR(INDEX(PlanningsFilter!$L$6:$L$1000,SMALL(IF(PlanningsFilter!$K$6:$K$1000=$A7,IF(PlanningsFilter!$C$6:$C$1000=I$2,IF(PlanningsFilter!$J$6:$J$1000=I$4,IF(PlanningsFilter!$I$6:$I$1000=\"\",ROW(PlanningsFilter!$I$6:$I$1000)-ROW($I$6)+1)))),$C7)),\"\")","v":""},{"$f":"IFERROR(INDEX(PlanningsFilter!$L$6:$L$1000,SMALL(IF(PlanningsFilter!$K$6:$K$1000=$A7,IF(PlanningsFilter!$C$6:$C$1000=J$2,IF(PlanningsFilter!$J$6:$J$1000=J$4,IF(PlanningsFilter!$I$6:$I$1000=\"\",ROW(PlanningsFilter!$I$6:$I$1000)-ROW($I$6)+1)))),$C7)),\"\")","v":"Henri van Dam"},{"$f":"IFERROR(INDEX(PlanningsFilter!$L$6:$L$1000,SMALL(IF(PlanningsFilter!$K$6:$K$1000=$A7,IF(PlanningsFilter!$C$6:$C$1000=K$2,IF(PlanningsFilter!$J$6:$J$1000=K$4,IF(PlanningsFilter!$I$6:$I$1000=\"\",ROW(PlanningsFilter!$I$6:$I$1000)-ROW($I$6)+1)))),$C7)),\"\")","v":"Baki Bos"},{"$f":"IFERROR(INDEX(PlanningsFilter!$L$6:$L$1000,SMALL(IF(PlanningsFilter!$K$6:$K$1000=$A7,IF(PlanningsFilter!$C$6:$C$1000=L$2,IF(PlanningsFilter!$J$6:$J$1000=L$4,IF(PlanningsFilter!$I$6:$I$1000=\"\",ROW(PlanningsFilter!$I$6:$I$1000)-ROW($I$6)+1)))),$C7)),\"\")","v":""},{"$f":"IFERROR(INDEX(PlanningsFilter!$L$6:$L$1000,SMALL(IF(PlanningsFilter!$K$6:$K$1000=$A7,IF(PlanningsFilter!$C$6:$C$1000=M$2,IF(PlanningsFilter!$J$6:$J$1000=M$4,IF(PlanningsFilter!$I$6:$I$1000=\"\",ROW(PlanningsFilter!$I$6:$I$1000)-ROW($I$6)+1)))),$C7)),\"\")","v":"Henri van Dam"},{"$f":"IFERROR(INDEX(PlanningsFilter!$L$6:$L$1000,SMALL(IF(PlanningsFilter!$K$6:$K$1000=$A7,IF(PlanningsFilter!$C$6:$C$1000=N$2,IF(PlanningsFilter!$J$6:$J$1000=N$4,IF(PlanningsFilter!$I$6:$I$1000=\"\",ROW(PlanningsFilter!$I$6:$I$1000)-ROW($I$6)+1)))),$C7)),\"\")","v":"Paul van Dongen"},{"$f":"IFERROR(INDEX(PlanningsFilter!$L$6:$L$1000,SMALL(IF(PlanningsFilter!$K$6:$K$1000=$A7,IF(PlanningsFilter!$C$6:$C$1000=O$2,IF(PlanningsFilter!$J$6:$J$1000=O$4,IF(PlanningsFilter!$I$6:$I$1000=\"\",ROW(PlanningsFilter!$I$6:$I$1000)-ROW($I$6)+1)))),$C7)),\"\")","v":""},{"$f":"IFERROR(INDEX(PlanningsFilter!$L$6:$L$1000,SMALL(IF(PlanningsFilter!$K$6:$K$1000=$A7,IF(PlanningsFilter!$C$6:$C$1000=P$2,IF(PlanningsFilter!$J$6:$J$1000=P$4,IF(PlanningsFilter!$I$6:$I$1000=\"\",ROW(PlanningsFilter!$I$6:$I$1000)-ROW($I$6)+1)))),$C7)),\"\")","v":"Henri van Dam"},{"$f":"IFERROR(INDEX(PlanningsFilter!$L$6:$L$1000,SMALL(IF(PlanningsFilter!$K$6:$K$1000=$A7,IF(PlanningsFilter!$C$6:$C$1000=Q$2,IF(PlanningsFilter!$J$6:$J$1000=Q$4,IF(PlanningsFilter!$I$6:$I$1000=\"\",ROW(PlanningsFilter!$I$6:$I$1000)-ROW($I$6)+1)))),$C7)),\"\")","v":"Paul van Dongen"},{"$f":"IFERROR(INDEX(PlanningsFilter!$L$6:$L$1000,SMALL(IF(PlanningsFilter!$K$6:$K$1000=$A7,IF(PlanningsFilter!$C$6:$C$1000=R$2,IF(PlanningsFilter!$J$6:$J$1000=R$4,IF(PlanningsFilter!$I$6:$I$1000=\"\",ROW(PlanningsFilter!$I$6:$I$1000)-ROW($I$6)+1)))),$C7)),\"\")","v":""},{"$f":"IFERROR(INDEX(PlanningsFilter!$L$6:$L$1000,SMALL(IF(PlanningsFilter!$K$6:$K$1000=$A7,IF(PlanningsFilter!$C$6:$C$1000=S$2,IF(PlanningsFilter!$J$6:$J$1000=S$4,IF(PlanningsFilter!$I$6:$I$1000=\"\",ROW(PlanningsFilter!$I$6:$I$1000)-ROW($I$6)+1)))),$C7)),\"\")","v":""},{"$f":"IFERROR(INDEX(PlanningsFilter!$L$6:$L$1000,SMALL(IF(PlanningsFilter!$K$6:$K$1000=$A7,IF(PlanningsFilter!$C$6:$C$1000=T$2,IF(PlanningsFilter!$J$6:$J$1000=T$4,IF(PlanningsFilter!$I$6:$I$1000=\"\",ROW(PlanningsFilter!$I$6:$I$1000)-ROW($I$6)+1)))),$C7)),\"\")","v":""},{"$f":"IFERROR(INDEX(PlanningsFilter!$L$6:$L$1000,SMALL(IF(PlanningsFilter!$K$6:$K$1000=$A7,IF(PlanningsFilter!$C$6:$C$1000=U$2,IF(PlanningsFilter!$J$6:$J$1000=U$4,IF(PlanningsFilter!$I$6:$I$1000=\"\",ROW(PlanningsFilter!$I$6:$I$1000)-ROW($I$6)+1)))),$C7)),\"\")","v":""},{"$f":"IFERROR(INDEX(PlanningsFilter!$L$6:$L$1000,SMALL(IF(PlanningsFilter!$K$6:$K$1000=$A7,IF(PlanningsFilter!$C$6:$C$1000=V$2,IF(PlanningsFilter!$J$6:$J$1000=V$4,IF(PlanningsFilter!$I$6:$I$1000=\"\",ROW(PlanningsFilter!$I$6:$I$1000)-ROW($I$6)+1)))),$C7)),\"\")","v":""},{"$f":"IFERROR(INDEX(PlanningsFilter!$L$6:$L$1000,SMALL(IF(PlanningsFilter!$K$6:$K$1000=$A7,IF(PlanningsFilter!$C$6:$C$1000=W$2,IF(PlanningsFilter!$J$6:$J$1000=W$4,IF(PlanningsFilter!$I$6:$I$1000=\"\",ROW(PlanningsFilter!$I$6:$I$1000)-ROW($I$6)+1)))),$C7)),\"\")","v":""},{"$f":"IFERROR(INDEX(PlanningsFilter!$L$6:$L$1000,SMALL(IF(PlanningsFilter!$K$6:$K$1000=$A7,IF(PlanningsFilter!$C$6:$C$1000=X$2,IF(PlanningsFilter!$J$6:$J$1000=X$4,IF(PlanningsFilter!$I$6:$I$1000=\"\",ROW(PlanningsFilter!$I$6:$I$1000)-ROW($I$6)+1)))),$C7)),\"\")","v":""}]
["AFV",null,3,{"$f":"IFERROR(INDEX(PlanningsFilter!$L$6:$L$1000,SMALL(IF(PlanningsFilter!$K$6:$K$1000=$A8,IF(PlanningsFilter!$C$6:$C$1000=D$2,IF(PlanningsFilter!$J$6:$J$1000=D$4,IF(PlanningsFilter!$I$6:$I$1000=\"\",ROW(PlanningsFilter!$I$6:$I$1000)-ROW($I$6)+1)))),$C8)),\"\")","v":"Jan de Jonge"},{"$f":"IFERROR(INDEX(PlanningsFilter!$L$6:$L$1000,SMALL(IF(PlanningsFilter!$K$6:$K$1000=$A8,IF(PlanningsFilter!$C$6:$C$1000=E$2,IF(PlanningsFilter!$J$6:$J$1000=E$4,IF(PlanningsFilter!$I$6:$I$1000=\"\",ROW(PlanningsFilter!$I$6:$I$1000)-ROW($I$6)+1)))),$C8)),\"\")","v":"Sebastiaan Mol"},{"$f":"IFERROR(INDEX(PlanningsFilter!$L$6:$L$1000,SMALL(IF(PlanningsFilter!$K$6:$K$1000=$A8,IF(PlanningsFilter!$C$6:$C$1000=F$2,IF(PlanningsFilter!$J$6:$J$1000=F$4,IF(PlanningsFilter!$I$6:$I$1000=\"\",ROW(PlanningsFilter!$I$6:$I$1000)-ROW($I$6)+1)))),$C8)),\"\")","v":""},{"$f":"IFERROR(INDEX(PlanningsFilter!$L$6:$L$1000,SMALL(IF(PlanningsFilter!$K$6:$K$1000=$A8,IF(PlanningsFilter!$C$6:$C$1000=G$2,IF(PlanningsFilter!$J$6:$J$1000=G$4,IF(PlanningsFilter!$I$6:$I$1000=\"\",ROW(PlanningsFilter!$I$6:$I$1000)-ROW($I$6)+1)))),$C8)),\"\")","v":"Jan de Jonge"},{"$f":"IFERROR(INDEX(PlanningsFilter!$L$6:$L$1000,SMALL(IF(PlanningsFilter!$K$6:$K$1000=$A8,IF(PlanningsFilter!$C$6:$C$1000=H$2,IF(PlanningsFilter!$J$6:$J$1000=H$4,IF(PlanningsFilter!$I$6:$I$1000=\"\",ROW(PlanningsFilter!$I$6:$I$1000)-ROW($I$6)+1)))),$C8)),\"\")","v":"Sebastiaan Mol"},{"$f":"IFERROR(INDEX(PlanningsFilter!$L$6:$L$1000,SMALL(IF(PlanningsFilter!$K$6:$K$1000=$A8,IF(PlanningsFilter!$C$6:$C$1000=I$2,IF(PlanningsFilter!$J$6:$J$1000=I$4,IF(PlanningsFilter!$I$6:$I$1000=\"\",ROW(PlanningsFilter!$I$6:$I$1000)-ROW($I$6)+1)))),$C8)),\"\")","v":""},{"$f":"IFERROR(INDEX(PlanningsFilter!$L$6:$L$1000,SMALL(IF(PlanningsFilter!$K$6:$K$1000=$A8,IF(PlanningsFilter!$C$6:$C$1000=J$2,IF(PlanningsFilter!$J$6:$J$1000=J$4,IF(PlanningsFilter!$I$6:$I$1000=\"\",ROW(PlanningsFilter!$I$6:$I$1000)-ROW($I$6)+1)))),$C8)),\"\")","v":"Jan de Jonge"},{"$f":"IFERROR(INDEX(PlanningsFilter!$L$6:$L$1000,SMALL(IF(PlanningsFilter!$K$6:$K$1000=$A8,IF(PlanningsFilter!$C$6:$C$1000=K$2,IF(PlanningsFilter!$J$6:$J$1000=K$4,IF(PlanningsFilter!$I$6:$I$1000=\"\",ROW(PlanningsFilter!$I$6:$I$1000)-ROW($I$6)+1)))),$C8)),\"\")","v":"Ilker Peeters"},{"$f":"IFERROR(INDEX(PlanningsFilter!$L$6:$L$1000,SMALL(IF(PlanningsFilter!$K$6:$K$1000=$A8,IF(PlanningsFilter!$C$6:$C$1000=L$2,IF(PlanningsFilter!$J$6:$J$1000=L$4,IF(PlanningsFilter!$I$6:$I$1000=\"\",ROW(PlanningsFilter!$I$6:$I$1000)-ROW($I$6)+1)))),$C8)),\"\")","v":""},{"$f":"IFERROR(INDEX(PlanningsFilter!$L$6:$L$1000,SMALL(IF(PlanningsFilter!$K$6:$K$1000=$A8,IF(PlanningsFilter!$C$6:$C$1000=M$2,IF(PlanningsFilter!$J$6:$J$1000=M$4,IF(PlanningsFilter!$I$6:$I$1000=\"\",ROW(PlanningsFilter!$I$6:$I$1000)-ROW($I$6)+1)))),$C8)),\"\")","v":"Jan de Jonge"},{"$f":"IFERROR(INDEX(PlanningsFilter!$L$6:$L$1000,SMALL(IF(PlanningsFilter!$K$6:$K$1000=$A8,IF(PlanningsFilter!$C$6:$C$1000=N$2,IF(PlanningsFilter!$J$6:$J$1000=N$4,IF(PlanningsFilter!$I$6:$I$1000=\"\",ROW(PlanningsFilter!$I$6:$I$1000)-ROW($I$6)+1)))),$C8)),\"\")","v":"Sebastiaan Mol"},{"$f":"IFERROR(INDEX(PlanningsFilter!$L$6:$L$1000,SMALL(IF(PlanningsFilter!$K$6:$K$1000=$A8,IF(PlanningsFilter!$C$6:$C$1000=O$2,IF(PlanningsFilter!$J$6:$J$1000=O$4,IF(PlanningsFilter!$I$6:$I$1000=\"\",ROW(PlanningsFilter!$I$6:$I$1000)-ROW($I$6)+1)))),$C8)),\"\")","v":""},{"$f":"IFERROR(INDEX(PlanningsFilter!$L$6:$L$1000,SMALL(IF(PlanningsFilter!$K$6:$K$1000=$A8,IF(PlanningsFilter!$C$6:$C$1000=P$2,IF(PlanningsFilter!$J$6:$J$1000=P$4,IF(PlanningsFilter!$I$6:$I$1000=\"\",ROW(PlanningsFilter!$I$6:$I$1000)-ROW($I$6)+1)))),$C8)),\"\")","v":"Jan de Jonge"},{"$f":"IFERROR(INDEX(PlanningsFilter!$L$6:$L$1000,SMALL(IF(PlanningsFilter!$K$6:$K$1000=$A8,IF(PlanningsFilter!$C$6:$C$1000=Q$2,IF(PlanningsFilter!$J$6:$J$1000=Q$4,IF(PlanningsFilter!$I$6:$I$1000=\"\",ROW(PlanningsFilter!$I$6:$I$1000)-ROW($I$6)+1)))),$C8)),\"\")","v":"Sebastiaan Mol"},{"$f":"IFERROR(INDEX(PlanningsFilter!$L$6:$L$1000,SMALL(IF(PlanningsFilter!$K$6:$K$1000=$A8,IF(PlanningsFilter!$C$6:$C$1000=R$2,IF(PlanningsFilter!$J$6:$J$1000=R$4,IF(PlanningsFilter!$I$6:$I$1000=\"\",ROW(PlanningsFilter!$I$6:$I$1000)-ROW($I$6)+1)))),$C8)),\"\")","v":""},{"$f":"IFERROR(INDEX(PlanningsFilter!$L$6:$L$1000,SMALL(IF(PlanningsFilter!$K$6:$K$1000=$A8,IF(PlanningsFilter!$C$6:$C$1000=S$2,IF(PlanningsFilter!$J$6:$J$1000=S$4,IF(PlanningsFilter!$I$6:$I$1000=\"\",ROW(PlanningsFilter!$I$6:$I$1000)-ROW($I$6)+1)))),$C8)),\"\")","v":""},{"$f":"IFERROR(INDEX(PlanningsFilter!$L$6:$L$1000,SMALL(IF(PlanningsFilter!$K$6:$K$1000=$A8,IF(PlanningsFilter!$C$6:$C$1000=T$2,IF(PlanningsFilter!$J$6:$J$1000=T$4,IF(PlanningsFilter!$I$6:$I$1000=\"\",ROW(PlanningsFilter!$I$6:$I$1000)-ROW($I$6)+1)))),$C8)),\"\")","v":""},{"$f":"IFERROR(INDEX(PlanningsFilter!$L$6:$L$1000,SMALL(IF(PlanningsFilter!$K$6:$K$1000=$A8,IF(PlanningsFilter!$C$6:$C$1000=U$2,IF(PlanningsFilter!$J$6:$J$1000=U$4,IF(PlanningsFilter!$I$6:$I$1000=\"\",ROW(PlanningsFilter!$I$6:$I$1000)-ROW($I$6)+1)))),$C8)),\"\")","v":""},{"$f":"IFERROR(INDEX(PlanningsFilter!$L$6:$L$1000,SMALL(IF(PlanningsFilter!$K$6:$K$1000=$A8,IF(PlanningsFilter!$C$6:$C$1000=V$2,IF(PlanningsFilter!$J$6:$J$1000=V$4,IF(PlanningsFilter!$I$6:$I$1000=\"\",ROW(PlanningsFilter!$I$6:$I$1000)-ROW($I$6)+1)))),$C8)),\"\")","v":""},{"$f":"IFERROR(INDEX(PlanningsFilter!$L$6:$L$1000,SMALL(IF(PlanningsFilter!$K$6:$K$1000=$A8,IF(PlanningsFilter!$C$6:$C$1000=W$2,IF(PlanningsFilter!$J$6:$J$1000=W$4,IF(PlanningsFilter!$I$6:$I$1000=\"\",ROW(PlanningsFilter!$I$6:$I$1000)-ROW($I$6)+1)))),$C8)),\"\")","v":""},{"$f":"IFERROR(INDEX(PlanningsFilter!$L$6:$L$1000,SMALL(IF(PlanningsFilter!$K$6:$K$1000=$A8,IF(PlanningsFilter!$C$6:$C$1000=X$2,IF(PlanningsFilter!$J$6:$J$1000=X$4,IF(PlanningsFilter!$I$6:$I$1000=\"\",ROW(PlanningsFilter!$I$6:$I$1000)-ROW($I$6)+1)))),$C8)),\"\")","v":""}]
["AFV",null,4,{"$f":"IFERROR(INDEX(PlanningsFilter!$L$6:$L$1000,SMALL(IF(PlanningsFilter!$K$6:$K$1000=$A9,IF(PlanningsFilter!$C$6:$C$1000=D$2,IF(PlanningsFilter!$J$6:$J$1000=D$4,IF(PlanningsFilter!$I$6:$I$1000=\"\",ROW(PlanningsFilter!$I$6:$I$1000)-ROW($I$6)+1)))),$C9)),\"\")","v":"Boyan van Leeuwen"},{"$f":"IFERROR(INDEX(PlanningsFilter!$L$6:$L$1000,SMALL(IF(PlanningsFilter!$K$6:$K$1000=$A9,IF(PlanningsFilter!$C$6:$C$1000=E$2,IF(PlanningsFilter!$J$6:$J$1000=E$4,IF(PlanningsFilter!$I$6:$I$1000=\"\",ROW(PlanningsFilter!$I$6:$I$1000)-ROW($I$6)+1)))),$C9)),\"\")","v":"Baki Bos"},{"$f":"IFERROR(INDEX(PlanningsFilter!$L$6:$L$1000,SMALL(IF(PlanningsFilter!$K$6:$K$1000=$A9,IF(PlanningsFilter!$C$6:$C$1000=F$2,IF(PlanningsFilter!$J$6:$J$1000=F$4,IF(PlanningsFilter!$I$6:$I$1000=\"\",ROW(PlanningsFilter!$I$6:$I$1000)-ROW($I$6)+1)))),$C9)),\"\")","v":""},{"$f":"IFERROR(INDEX(PlanningsFilter!$L$6:$L$1000,SMALL(IF(PlanningsFilter!$K$6:$K$1000=$A9,IF(PlanningsFilter!$C$6:$C$1000=G$2,IF(PlanningsFilter!$J$6:$J$1000=G$4,IF(PlanningsFilter!$I$6:$I$1000=\"\",ROW(PlanningsFilter!$I$6:$I$1000)-ROW($I$6)+1)))),$C9)),\"\")","v":"Boyan van Leeuwen"},{"$f":"IFERROR(INDEX(PlanningsFilter!$L$6:$L$1000,SMALL(IF(PlanningsFilter!$K$6:$K$1000=$A9,IF(PlanningsFilter!$C$6:$C$1000=H$2,IF(PlanningsFilter!$J$6:$J$1000=H$4,IF(PlanningsFilter!$I$6:$I$1000=\"\",ROW(PlanningsFilter!$I$6:$I$1000)-ROW($I$6)+1)))),$C9)),\"\")","v":"Baki Bos"},{"$f":"IFERROR(INDEX(PlanningsFilter!$L$6:$L$1000,SMALL(IF(PlanningsFilter!$K$6:$K$1000=$A9,IF(PlanningsFilter!$C$6:$C$1000=I$2,IF(PlanningsFilter!$J$6:$J$1000=I$4,IF(PlanningsFilter!$I$6:$I$1000=\"\",ROW(PlanningsFilter!$I$6:$I$1000)-ROW($I$6)+1)))),$C9)),\"\")","v":""},{"$f":"IFERROR(INDEX(PlanningsFilter!$L$6:$L$1000,SMALL(IF(PlanningsFilter!$K$6:$K$1000=$A9,IF(PlanningsFilter!$C$6:$C$1000=J$2,IF(PlanningsFilter!$J$6:$J$1000=J$4,IF(PlanningsFilter!$I$6:$I$1000=\"\",ROW(PlanningsFilter!$I$6:$I$1000)-ROW($I$6)+1)))),$C9)),\"\")","v":"Boyan van Leeuwen"},{"$f":"IFERROR(INDEX(PlanningsFilter!$L$6:$L$1000,SMALL(IF(PlanningsFilter!$K$6:$K$1000=$A9,IF(PlanningsFilter!$C$6:$C$1000=K$2,IF(PlanningsFilter!$J$6:$J$1000=K$4,IF(PlanningsFilter!$I$6:$I$1000=\"\",ROW(PlanningsFilter!$I$6:$I$1000)-ROW($I$6)+1)))),$C9)),\"\")","v":"Flavi van der Heyden"},{"$f":"IFERROR(INDEX(PlanningsFilter!$L$6:$L$1000,SMALL(IF(PlanningsFilter!$K$6:$K$1000=$A9,IF(PlanningsFilter!$C$6:$C$1000=L$2,IF(PlanningsFilter!$J$6:$J$1000=L$4,IF(PlanningsFilter!$I$6:$I$1000=\"\",ROW(PlanningsFilter!$I$6:$I$1000)-ROW($I$6)+1)))),$C9)),\"\")","v":""},{"$f":"IFERROR(INDEX(PlanningsFilter!$L$6:$L$1000,SMALL(IF(PlanningsFilter!$K$6:$K$1000=$A9,IF(PlanningsFilter!$C$6:$C$1000=M$2,IF(PlanningsFilter!$J$6:$J$1000=M$4,IF(PlanningsFilter!$I$6:$I$1000=\"\",ROW(PlanningsFilter!$I$6:$I$1000)-ROW($I$6)+1)))),$C9)),\"\")","v":"Boyan van Leeuwen"},{"$f":"IFERROR(INDEX(PlanningsFilter!$L$6:$L$1000,SMALL(IF(PlanningsFilter!$K$6:$K$1000=$A9,IF(PlanningsFilter!$C$6:$C$1000=N$2,IF(PlanningsFilter!$J$6:$J$1000=N$4,IF(PlanningsFilter!$I$6:$I$1000=\"\",ROW(PlanningsFilter!$I$6:$I$1000)-ROW($I$6)+1)))),$C9)),\"\")","v":"Baki Bos"},{"$f":"IFERROR(INDEX(PlanningsFilter!$L$6:$L$1000,SMALL(IF(PlanningsFilter!$K$6:$K$1000=$A9,IF(PlanningsFilter!$C$6:$C$1000=O$2,IF(PlanningsFilter!$J$6:$J$1000=O$4,IF(PlanningsFilter!$I$6:$I$1000=\"\",ROW(PlanningsFilter!$I$6:$I$1000)-ROW($I$6)+1)))),$C9)),\"\")","v":""},{"$f":"IFERROR(INDEX(PlanningsFilter!$L$6:$L$1000,SMALL(IF(PlanningsFilter!$K$6:$K$1000=$A9,IF(PlanningsFilter!$C$6:$C$1000=P$2,IF(PlanningsFilter!$J$6:$J$1000=P$4,IF(PlanningsFilter!$I$6:$I$1000=\"\",ROW(PlanningsFilter!$I$6:$I$1000)-ROW($I$6)+1)))),$C9)),\"\")","v":"Boyan van Leeuwen"},{"$f":"IFERROR(INDEX(PlanningsFilter!$L$6:$L$1000,SMALL(IF(PlanningsFilter!$K$6:$K$1000=$A9,IF(PlanningsFilter!$C$6:$C$1000=Q$2,IF(PlanningsFilter!$J$6:$J$1000=Q$4,IF(PlanningsFilter!$I$6:$I$1000=\"\",ROW(PlanningsFilter!$I$6:$I$1000)-ROW($I$6)+1)))),$C9)),\"\")","v":"Baki Bos"},{"$f":"IFERROR(INDEX(PlanningsFilter!$L$6:$L$1000,SMALL(IF(PlanningsFilter!$K$6:$K$1000=$A9,IF(PlanningsFilter!$C$6:$C$1000=R$2,IF(PlanningsFilter!$J$6:$J$1000=R$4,IF(PlanningsFilter!$I$6:$I$1000=\"\",ROW(PlanningsFilter!$I$6:$I$1000)-ROW($I$6)+1)))),$C9)),\"\")","v":""},{"$f":"IFERROR(INDEX(PlanningsFilter!$L$6:$L$1000,SMALL(IF(PlanningsFilter!$K$6:$K$1000=$A9,IF(PlanningsFilter!$C$6:$C$1000=S$2,IF(PlanningsFilter!$J$6:$J$1000=S$4,IF(PlanningsFilter!$I$6:$I$1000=\"\",ROW(PlanningsFilter!$I$6:$I$1000)-ROW($I$6)+1)))),$C9)),\"\")","v":""},{"$f":"IFERROR(INDEX(PlanningsFilter!$L$6:$L$1000,SMALL(IF(PlanningsFilter!$K$6:$K$1000=$A9,IF(PlanningsFilter!$C$6:$C$1000=T$2,IF(PlanningsFilter!$J$6:$J$1000=T$4,IF(PlanningsFilter!$I$6:$I$1000=\"\",ROW(PlanningsFilter!$I$6:$I$1000)-ROW($I$6)+1)))),$C9)),\"\")","v":""},{"$f":"IFERROR(INDEX(PlanningsFilter!$L$6:$L$1000,SMALL(IF(PlanningsFilter!$K$6:$K$1000=$A9,IF(PlanningsFilter!$C$6:$C$1000=U$2,IF(PlanningsFilter!$J$6:$J$1000=U$4,IF(PlanningsFilter!$I$6:$I$1000=\"\",ROW(PlanningsFilter!$I$6:$I$1000)-ROW($I$6)+1)))),$C9)),\"\")","v":""},{"$f":"IFERROR(INDEX(PlanningsFilter!$L$6:$L$1000,SMALL(IF(PlanningsFilter!$K$6:$K$1000=$A9,IF(PlanningsFilter!$C$6:$C$1000=V$2,IF(PlanningsFilter!$J$6:$J$1000=V$4,IF(PlanningsFilter!$I$6:$I$1000=\"\",ROW(PlanningsFilter!$I$6:$I$1000)-ROW($I$6)+1)))),$C9)),\"\")","v":""},{"$f":"IFERROR(INDEX(PlanningsFilter!$L$6:$L$1000,SMALL(IF(PlanningsFilter!$K$6:$K$1000=$A9,IF(PlanningsFilter!$C$6:$C$1000=W$2,IF(PlanningsFilter!$J$6:$J$1000=W$4,IF(PlanningsFilter!$I$6:$I$1000=\"\",ROW(PlanningsFilter!$I$6:$I$1000)-ROW($I$6)+1)))),$C9)),\"\")","v":""},{"$f":"IFERROR(INDEX(PlanningsFilter!$L$6:$L$1000,SMALL(IF(PlanningsFilter!$K$6:$K$1000=$A9,IF(PlanningsFilter!$C$6:$C$1000=X$2,IF(PlanningsFilter!$J$6:$J$1000=X$4,IF(PlanningsFilter!$I$6:$I$1000=\"\",ROW(PlanningsFilter!$I$6:$I$1000)-ROW($I$6)+1)))),$C9)),\"\")","v":""}]
["AFV",null,5,{"$f":"IFERROR(INDEX(PlanningsFilter!$L$6:$L$1000,SMALL(IF(PlanningsFilter!$K$6:$K$1000=$A10,IF(PlanningsFilter!$C$6:$C$1000=D$2,IF(PlanningsFilter!$J$6:$J$1000=D$4,IF(PlanningsFilter!$I$6:$I$1000=\"\",ROW(PlanningsFilter!$I$6:$I$1000)-ROW($I$6)+1)))),$C10)),\"\")","v":"Michel Jonker"},{"$f":"IFERROR(INDEX(PlanningsFilter!$L$6:$L$1000,SMALL(IF(PlanningsFilter!$K$6:$K$1000=$A10,IF(PlanningsFilter!$C$6:$C$1000=E$2,IF(PlanningsFilter!$J$6:$J$1000=E$4,IF(PlanningsFilter!$I$6:$I$1000=\"\",ROW(PlanningsFilter!$I$6:$I$1000)-ROW($I$6)+1)))),$C10)),\"\")","v":"Ilker Peeters"},{"$f":"IFERROR(INDEX(PlanningsFilter!$L$6:$L$1000,SMALL(IF(PlanningsFilter!$K$6:$K$1000=$A10,IF(PlanningsFilter!$C$6:$C$1000=F$2,IF(PlanningsFilter!$J$6:$J$1000=F$4,IF(PlanningsFilter!$I$6:$I$1000=\"\",ROW(PlanningsFilter!$I$6:$I$1000)-ROW($I$6)+1)))),$C10)),\"\")","v":""},{"$f":"IFERROR(INDEX(PlanningsFilter!$L$6:$L$1000,SMALL(IF(PlanningsFilter!$K$6:$K$1000=$A10,IF(PlanningsFilter!$C$6:$C$1000=G$2,IF(PlanningsFilter!$J$6:$J$1000=G$4,IF(PlanningsFilter!$I$6:$I$1000=\"\",ROW(PlanningsFilter!$I$6:$I$1000)-ROW($I$6)+1)))),$C10)),\"\")","v":"Michel Jonker"},{"$f":"IFERROR(INDEX(PlanningsFilter!$L$6:$L$1000,SMALL(IF(PlanningsFilter!$K$6:$K$1000=$A10,IF(PlanningsFilter!$C$6:$C$1000=H$2,IF(PlanningsFilter!$J$6:$J$1000=H$4,IF(PlanningsFilter!$I$6:$I$1000=\"\",ROW(PlanningsFilter!$I$6:$I$1000)-ROW($I$6)+1)))),$C10)),\"\")","v":"Ilker Peeters"},{"$f":"IFERROR(INDEX(PlanningsFilter!$L$6:$L$1000,SMALL(IF(PlanningsFilter!$K$6:$K$1000=$A10,IF(PlanningsFilter!$C$6:$C$1000=I$2,IF(PlanningsFilter!$J$6:$J$1000=I$4,IF(PlanningsFilter!$I$6:$I$1000=\"\",ROW(PlanningsFilter!$I$6:$I$1000)-ROW($I$6)+1)))),$C10)),\"\")","v":""},{"$f":"IFERROR(INDEX(PlanningsFilter!$L$6:$L$1000,SMALL(IF(PlanningsFilter!$K$6:$K$1000=$A10,IF(PlanningsFilter!$C$6:$C$1000=J$2,IF(PlanningsFilter!$J$6:$J$1000=J$4,IF(PlanningsFilter!$I$6:$I$1000=\"\",ROW(PlanningsFilter!$I$6:$I$1000)-ROW($I$6)+1)))),$C10)),\"\")","v":"Michel Jonker"},{"$f":"IFERROR(INDEX(PlanningsFilter!$L$6:$L$1000,SMALL(IF(PlanningsFilter!$K$6:$K$1000=$A10,IF(PlanningsFilter!$C$6:$C$1000=K$2,IF(PlanningsFilter!$J$6:$J$1000=K$4,IF(PlanningsFilter!$I$6:$I$1000=\"\",ROW(PlanningsFilter!$I$6:$I$1000)-ROW($I$6)+1)))),$C10)),\"\")","v":""},{"$f":"IFERROR(INDEX(PlanningsFilter!$L$6:$L$1000,SMALL(IF(PlanningsFilter!$K$6:$K$1000=$A10,IF(PlanningsFilter!$C$6:$C$1000=L$2,IF(PlanningsFilter!$J$6:$J$1000=L$4,IF(PlanningsFilter!$I$6:$I$1000=\"\",ROW(PlanningsFilter!$I$6:$I$1000)-ROW($I$6)+1)))),$C10)),\"\")","v":""},{"$f":"IFERROR(INDEX(PlanningsFilter!$L$6:$L$1000,SMALL(IF(PlanningsFilter!$K$6:$K$1000=$A10,IF(PlanningsFilter!$C$6:$C$1000=M$2,IF(PlanningsFilter!$J$6:$J$1000=M$4,IF(PlanningsFilter!$I$6:$I$1000=\"\",ROW(PlanningsFilter!$I$6:$I$1000)-ROW($I$6)+1)))),$C10)),\"\")","v":"Michel Jonker"},{"$f":"IFERROR(INDEX(PlanningsFilter!$L$6:$L$1000,SMALL(IF(PlanningsFilter!$K$6:$K$1000=$A10,IF(PlanningsFilter!$C$6:$C$1000=N$2,IF(PlanningsFilter!$J$6:$J$1000=N$4,IF(PlanningsFilter!$I$6:$I$1000=\"\",ROW(PlanningsFilter!$I$6:$I$1000)-ROW($I$6)+1)))),$C10)),\"\")","v":"Ilker Peeters"},{"$f":"IFERROR(INDEX(PlanningsFilter!$L$6:$L$1000,SMALL(IF(PlanningsFilter!$K$6:$K$1000=$A10,IF(PlanningsFilter!$C$6:$C$1000=O$2,IF(PlanningsFilter!$J$6:$J$1000=O$4,IF(PlanningsFilter!$I$6:$I$1000=\"\",ROW(PlanningsFilter!$I$6:$I$1000)-ROW($I$6)+1)))),$C10)),\"\")","v":""},{"$f":"IFERROR(INDEX(PlanningsFilter!$L$6:$L$1000,SMALL(IF(PlanningsFilter!$K$6:$K$1000=$A10,IF(PlanningsFilter!$C$6:$C$1000=P$2,IF(PlanningsFilter!$J$6:$J$1000=P$4,IF(PlanningsFilter!$I$6:$I$1000=\"\",ROW(PlanningsFilter!$I$6:$I$1000)-ROW($I$6)+1)))),$C10)),\"\")","v":"Michel Jonker"},{"$f":"IFERROR(INDEX(PlanningsFilter!$L$6:$L$1000,SMALL(IF(PlanningsFilter!$K$6:$K$1000=$A10,IF(PlanningsFilter!$C$6:$C$1000=Q$2,IF(PlanningsFilter!$J$6:$J$1000=Q$4,IF(PlanningsFilter!$I$6:$I$1000=\"\",ROW(PlanningsFilter!$I$6:$I$1000)-ROW($I$6)+1)))),$C10)),\"\")","v":"Ilker Peeters"},{"$f":"IFERROR(INDEX(PlanningsFilter!$L$6:$L$1000,SMALL(IF(PlanningsFilter!$K$6:$K$1000=$A10,IF(PlanningsFilter!$C$6:$C$1000=R$2,IF(PlanningsFilter!$J$6:$J$1000=R$4,IF(PlanningsFilter!$I$6:$I$1000=\"\",ROW(PlanningsFilter!$I$6:$I$1000)-ROW($I$6)+1)))),$C10)),\"\")","v":""},{"$f":"IFERROR(INDEX(PlanningsFilter!$L$6:$L$1000,SMALL(IF(PlanningsFilter!$K$6:$K$1000=$A10,IF(PlanningsFilter!$C$6:$C$1000=S$2,IF(PlanningsFilter!$J$6:$J$1000=S$4,IF(PlanningsFilter!$I$6:$I$1000=\"\",ROW(PlanningsFilter!$I$6:$I$1000)-ROW($I$6)+1)))),$C10)),\"\")","v":""},{"$f":"IFERROR(INDEX(PlanningsFilter!$L$6:$L$1000,SMALL(IF(PlanningsFilter!$K$6:$K$1000=$A10,IF(PlanningsFilter!$C$6:$C$1000=T$2,IF(PlanningsFilter!$J$6:$J$1000=T$4,IF(PlanningsFilter!$I$6:$I$1000=\"\",ROW(PlanningsFilter!$I$6:$I$1000)-ROW($I$6)+1)))),$C10)),\"\")","v":""},{"$f":"IFERROR(INDEX(PlanningsFilter!$L$6:$L$1000,SMALL(IF(PlanningsFilter!$K$6:$K$1000=$A10,IF(PlanningsFilter!$C$6:$C$1000=U$2,IF(PlanningsFilter!$J$6:$J$1000=U$4,IF(PlanningsFilter!$I$6:$I$1000=\"\",ROW(PlanningsFilter!$I$6:$I$1000)-ROW($I$6)+1)))),$C10)),\"\")","v":""},{"$f":"IFERROR(INDEX(PlanningsFilter!$L$6:$L$1000,SMALL(IF(PlanningsFilter!$K$6:$K$1000=$A10,IF(PlanningsFilter!$C$6:$C$1000=V$2,IF(PlanningsFilter!$J$6:$J$1000=V$4,IF(PlanningsFilter!$I$6:$I$1000=\"\",ROW(PlanningsFilter!$I$6:$I$1000)-ROW($I$6)+1)))),$C10)),\"\")","v":""},{"$f":"IFERROR(INDEX(PlanningsFilter!$L$6:$L$1000,SMALL(IF(PlanningsFilter!$K$6:$K$1000=$A10,IF(PlanningsFilter!$C$6:$C$1000=W$2,IF(PlanningsFilter!$J$6:$J$1000=W$4,IF(PlanningsFilter!$I$6:$I$1000=\"\",ROW(PlanningsFilter!$I$6:$I$1000)-ROW($I$6)+1)))),$C10)),\"\")","v":""},{"$f":"IFERROR(INDEX(PlanningsFilter!$L$6:$L$1000,SMALL(IF(PlanningsFilter!$K$6:$K$1000=$A10,IF(PlanningsFilter!$C$6:$C$1000=X$2,IF(PlanningsFilter!$J$6:$J$1000=X$4,IF(PlanningsFilter!$I$6:$I$1000=\"\",ROW(PlanningsFilter!$I$6:$I$1000)-ROW($I$6)+1)))),$C10)),\"\")","v":""}]
["AFV",null,6,{"$f":"IFERROR(INDEX(PlanningsFilter!$L$6:$L$1000,SMALL(IF(PlanningsFilter!$K$6:$K$1000=$A11,IF(PlanningsFilter!$C$6:$C$1000=D$2,IF(PlanningsFilter!$J$6:$J$1000=D$4,IF(PlanningsFilter!$I$6:$I$1000=\"\",ROW(PlanningsFilter!$I$6:$I$1000)-ROW($I$6)+1)))),$C11)),\"\")","v":""},{"$f":"IFERROR(INDEX(PlanningsFilter!$L$6:$L$1000,SMALL(IF(PlanningsFilter!$K$6:$K$1000=$A11,IF(PlanningsFilter!$C$6:$C$1000=E$2,IF(PlanningsFilter!$J$6:$J$1000=E$4,IF(PlanningsFilter!$I$6:$I$1000=\"\",ROW(PlanningsFilter!$I$6:$I$1000)-ROW($I$6)+1)))),$C11)),\"\")","v":""},{"$f":"IFERROR(INDEX(PlanningsFilter!$L$6:$L$1000,SMALL(IF(PlanningsFilter!$K$6:$K$1000=$A11,IF(PlanningsFilter!$C$6:$C$1000=F$2,IF(PlanningsFilter!$J$6:$J$1000=F$4,IF(PlanningsFilter!$I$6:$I$1000=\"\",ROW(PlanningsFilter!$I$6:$I$1000)-ROW($I$6)+1)))),$C11)),\"\")","v":""},{"$f":"IFERROR(INDEX(PlanningsFilter!$L$6:$L$1000,SMALL(IF(PlanningsFilter!$K$6:$K$1000=$A11,IF(PlanningsFilter!$C$6:$C$1000=G$2,IF(PlanningsFilter!$J$6:$J$1000=G$4,IF(PlanningsFilter!$I$6:$I$1000=\"\",ROW(PlanningsFilter!$I$6:$I$1000)-ROW($I$6)+1)))),$C11)),\"\")","v":""},{"$f":"IFERROR(INDEX(PlanningsFilter!$L$6:$L$1000,SMALL(IF(PlanningsFilter!$K$6:$K$1000=$A11,IF(PlanningsFilter!$C$6:$C$1000=H$2,IF(PlanningsFilter!$J$6:$J$1000=H$4,IF(PlanningsFilter!$I$6:$I$1000=\"\",ROW(PlanningsFilter!$I$6:$I$1000)-ROW($I$6)+1)))),$C11)),\"\")","v":""},{"$f":"IFERROR(INDEX(PlanningsFilter!$L$6:$L$1000,SMALL(IF(PlanningsFilter!$K$6:$K$1000=$A11,IF(PlanningsFilter!$C$6:$C$1000=I$2,IF(PlanningsFilter!$J$6:$J$1000=I$4,IF(PlanningsFilter!$I$6:$I$1000=\"\",ROW(PlanningsFilter!$I$6:$I$1000)-ROW($I$6)+1)))),$C11)),\"\")","v":""},{"$f":"IFERROR(INDEX(PlanningsFilter!$L$6:$L$1000,SMALL(IF(PlanningsFilter!$K$6:$K$1000=$A11,IF(PlanningsFilter!$C$6:$C$1000=J$2,IF(PlanningsFilter!$J$6:$J$1000=J$4,IF(PlanningsFilter!$I$6:$I$1000=\"\",ROW(PlanningsFilter!$I$6:$I$1000)-ROW($I$6)+1)))),$C11)),\"\")","v":""},{"$f":"IFERROR(INDEX(PlanningsFilter!$L$6:$L$1000,SMALL(IF(PlanningsFilter!$K$6:$K$1000=$A11,IF(PlanningsFilter!$C$6:$C$1000=K$2,IF(PlanningsFilter!$J$6:$J$1000=K$4,IF(PlanningsFilter!$I$6:$I$1000=\"\",ROW(PlanningsFilter!$I$6:$I$1000)-ROW($I$6)+1)))),$C11)),\"\")","v":""},{"$f":"IFERROR(INDEX(PlanningsFilter!$L$6:$L$1000,SMALL(IF(PlanningsFilter!$K$6:$K$1000=$A11,IF(PlanningsFilter!$C$6:$C$1000=L$2,IF(PlanningsFilter!$J$6:$J$1000=L$4,IF(PlanningsFilter!$I$6:$I$1000=\"\",ROW(PlanningsFilter!$I$6:$I$1000)-ROW($I$6)+1)))),$C11)),\"\")","v":""},{"$f":"IFERROR(INDEX(PlanningsFilter!$L$6:$L$1000,SMALL(IF(PlanningsFilter!$K$6:$K$1000=$A11,IF(PlanningsFilter!$C$6:$C$1000=M$2,IF(PlanningsFilter!$J$6:$J$1000=M$4,IF(PlanningsFilter!$I$6:$I$1000=\"\",ROW(PlanningsFilter!$I$6:$I$1000)-ROW($I$6)+1)))),$C11)),\"\")","v":""},{"$f":"IFERROR(INDEX(PlanningsFilter!$L$6:$L$1000,SMALL(IF(PlanningsFilter!$K$6:$K$1000=$A11,IF(PlanningsFilter!$C$6:$C$1000=N$2,IF(PlanningsFilter!$J$6:$J$1000=N$4,IF(PlanningsFilter!$I$6:$I$1000=\"\",ROW(PlanningsFilter!$I$6:$I$1000)-ROW($I$6)+1)))),$C11)),\"\")","v":"Flavi van der Heyden"},{"$f":"IFERROR(INDEX(PlanningsFilter!$L$6:$L$1000,SMALL(IF(PlanningsFilter!$K$6:$K$1000=$A11,IF(PlanningsFilter!$C$6:$C$1000=O$2,IF(PlanningsFilter!$J$6:$J$1000=O$4,IF(PlanningsFilter!$I$6:$I$1000=\"\",ROW(PlanningsFilter!$I$6:$I$1000)-ROW($I$6)+1)))),$C11)),\"\")","v":""},{"$f":"IFERROR(INDEX(PlanningsFilter!$L$6:$L$1000,SMALL(IF(PlanningsFilter!$K$6:$K$1000=$A11,IF(PlanningsFilter!$C$6:$C$1000=P$2,IF(PlanningsFilter!$J$6:$J$1000=P$4,IF(PlanningsFilter!$I$6:$I$1000=\"\",ROW(PlanningsFilter!$I$6:$I$1000)-ROW($I$6)+1)))),$C11)),\"\")","v":""},{"$f":"IFERROR(INDEX(PlanningsFilter!$L$6:$L$1000,SMALL(IF(PlanningsFilter!$K$6:$K$1000=$A11,IF(PlanningsFilter!$C$6:$C$1000=Q$2,IF(PlanningsFilter!$J$6:$J$1000=Q$4,IF(PlanningsFilter!$I$6:$I$1000=\"\",ROW(PlanningsFilter!$I$6:$I$1000)-ROW($I$6)+1)))),$C11)),\"\")","v":"Flavi van der Heyden"},{"$f":"IFERROR(INDEX(PlanningsFilter!$L$6:$L$1000,SMALL(IF(PlanningsFilter!$K$6:$K$1000=$A11,IF(PlanningsFilter!$C$6:$C$1000=R$2,IF(PlanningsFilter!$J$6:$J$1000=R$4,IF(PlanningsFilter!$I$6:$I$1000=\"\",ROW(PlanningsFilter!$I$6:$I$1000)-ROW($I$6)+1)))),$C11)),\"\")","v":""},{"$f":"IFERROR(INDEX(PlanningsFilter!$L$6:$L$1000,SMALL(IF(PlanningsFilter!$K$6:$K$1000=$A11,IF(PlanningsFilter!$C$6:$C$1000=S$2,IF(PlanningsFilter!$J$6:$J$1000=S$4,IF(PlanningsFilter!$I$6:$I$1000=\"\",ROW(PlanningsFilter!$I$6:$I$1000)-ROW($I$6)+1)))),$C11)),\"\")","v":""},{"$f":"IFERROR(INDEX(PlanningsFilter!$L$6:$L$1000,SMALL(IF(PlanningsFilter!$K$6:$K$1000=$A11,IF(PlanningsFilter!$C$6:$C$1000=T$2,IF(PlanningsFilter!$J$6:$J$1000=T$4,IF(PlanningsFilter!$I$6:$I$1000=\"\",ROW(PlanningsFilter!$I$6:$I$1000)-ROW($I$6)+1)))),$C11)),\"\")","v":""},{"$f":"IFERROR(INDEX(PlanningsFilter!$L$6:$L$1000,SMALL(IF(PlanningsFilter!$K$6:$K$1000=$A11,IF(PlanningsFilter!$C$6:$C$1000=U$2,IF(PlanningsFilter!$J$6:$J$1000=U$4,IF(PlanningsFilter!$I$6:$I$1000=\"\",ROW(PlanningsFilter!$I$6:$I$1000)-ROW($I$6)+1)))),$C11)),\"\")","v":""},{"$f":"IFERROR(INDEX(PlanningsFilter!$L$6:$L$1000,SMALL(IF(PlanningsFilter!$K$6:$K$1000=$A11,IF(PlanningsFilter!$C$6:$C$1000=V$2,IF(PlanningsFilter!$J$6:$J$1000=V$4,IF(PlanningsFilter!$I$6:$I$1000=\"\",ROW(PlanningsFilter!$I$6:$I$1000)-ROW($I$6)+1)))),$C11)),\"\")","v":""},{"$f":"IFERROR(INDEX(PlanningsFilter!$L$6:$L$1000,SMALL(IF(PlanningsFilter!$K$6:$K$1000=$A11,IF(PlanningsFilter!$C$6:$C$1000=W$2,IF(PlanningsFilter!$J$6:$J$1000=W$4,IF(PlanningsFilter!$I$6:$I$1000=\"\",ROW(PlanningsFilter!$I$6:$I$1000)-ROW($I$6)+1)))),$C11)),\"\")","v":""},{"$f":"IFERROR(INDEX(PlanningsFilter!$L$6:$L$1000,SMALL(IF(PlanningsFilter!$K$6:$K$1000=$A11,IF(PlanningsFilter!$C$6:$C$1000=X$2,IF(PlanningsFilter!$J$6:$J$1000=X$4,IF(PlanningsFilter!$I$6:$I$1000=\"\",ROW(PlanningsFilter!$I$6:$I$1000)-ROW($I$6)+1)))),$C11)),\"\")","v":""}]
["AFV",null,7,{"$f":"IFERROR(INDEX(PlanningsFilter!$L$6:$L$1000,SMALL(IF(PlanningsFilter!$K$6:$K$1000=$A12,IF(PlanningsFilter!$C$6:$C$1000=D$2,IF(PlanningsFilter!$J$6:$J$1000=D$4,IF(PlanningsFilter!$I$6:$I$1000=\"\",ROW(PlanningsFilter!$I$6:$I$1000)-ROW($I$6)+1)))),$C12)),\"\")","v":""},{"$f":"IFERROR(INDEX(PlanningsFilter!$L$6:$L$1000,SMALL(IF(PlanningsFilter!$K$6:$K$1000=$A12,IF(PlanningsFilter!$C$6:$C$1000=E$2,IF(PlanningsFilter!$J$6:$J$1000=E$4,IF(PlanningsFilter!$I$6:$I$1000=\"\",ROW(PlanningsFilter!$I$6:$I$1000)-ROW($I$6)+1)))),$C12)),\"\")","v":""},{"$f":"IFERROR(INDEX(PlanningsFilter!$L$6:$L$1000,SMALL(IF(PlanningsFilter!$K$6:$K$1000=$A12,IF(PlanningsFilter!$C$6:$C$1000=F$2,IF(PlanningsFilter!$J$6:$J$1000=F$4,IF(PlanningsFilter!$I$6:$I$1000=\"\",ROW(PlanningsFilter!$I$6:$I$1000)-ROW($I$6)+1)))),$C12)),\"\")","v":""},{"$f":"IFERROR(INDEX(PlanningsFilter!$L$6:$L$1000,SMALL(IF(PlanningsFilter!$K$6:$K$1000=$A12,IF(PlanningsFilter!$C$6:$C$1000=G$2,IF(PlanningsFilter!$J$6:$J$1000=G$4,IF(PlanningsFilter!$I$6:$I$1000=\"\",ROW(PlanningsFilter!$I$6:$I$1000)-ROW($I$6)+1)))),$C12)),\"\")","v":""},{"$f":"IFERROR(INDEX(PlanningsFilter!$L$6:$L$1000,SMALL(IF(PlanningsFilter!$K$6:$K$1000=$A12,IF(PlanningsFilter!$C$6:$C$1000=H$2,IF(PlanningsFilter!$J$6:$J$1000=H$4,IF(PlanningsFilter!$I$6:$I$1000=\"\",ROW(PlanningsFilter!$I$6:$I$1000)-ROW($I$6)+1)))),$C12)),\"\")","v":""},{"$f":"IFERROR(INDEX(PlanningsFilter!$L$6:$L$1000,SMALL(IF(PlanningsFilter!$K$6:$K$1000=$A12,IF(PlanningsFilter!$C$6:$C$1000=I$2,IF(PlanningsFilter!$J$6:$J$1000=I$4,IF(PlanningsFilter!$I$6:$I$1000=\"\",ROW(PlanningsFilter!$I$6:$I$1000)-ROW($I$6)+1)))),$C12)),\"\")","v":""},{"$f":"IFERROR(INDEX(PlanningsFilter!$L$6:$L$1000,SMALL(IF(PlanningsFilter!$K$6:$K$1000=$A12,IF(PlanningsFilter!$C$6:$C$1000=J$2,IF(PlanningsFilter!$J$6:$J$1000=J$4,IF(PlanningsFilter!$I$6:$I$1000=\"\",ROW(PlanningsFilter!$I$6:$I$1000)-ROW($I$6)+1)))),$C12)),\"\")","v":""},{"$f":"IFERROR(INDEX(PlanningsFilter!$L$6:$L$1000,SMALL(IF(PlanningsFilter!$K$6:$K$1000=$A12,IF(PlanningsFilter!$C$6:$C$1000=K$2,IF(PlanningsFilter!$J$6:$J$1000=K$4,IF(PlanningsFilter!$I$6:$I$1000=\"\",ROW(PlanningsFilter!$I$6:$I$1000)-ROW($I$6)+1)))),$C12)),\"\")","v":""},{"$f":"IFERROR(INDEX(PlanningsFilter!$L$6:$L$1000,SMALL(IF(PlanningsFilter!$K$6:$K$1000=$A12,IF(PlanningsFilter!$C$6:$C$1000=L$2,IF(PlanningsFilter!$J$6:$J$1000=L$4,IF(PlanningsFilter!$I$6:$I$1000=\"\",ROW(PlanningsFilter!$I$6:$I$1000)-ROW($I$6)+1)))),$C12)),\"\")","v":""},{"$f":"IFERROR(INDEX(PlanningsFilter!$L$6:$L$1000,SMALL(IF(PlanningsFilter!$K$6:$K$1000=$A12,IF(PlanningsFilter!$C$6:$C$1000=M$2,IF(PlanningsFilter!$J$6:$J$1000=M$4,IF(PlanningsFilter!$I$6:$I$1000=\"\",ROW(PlanningsFilter!$I$6:$I$1000)-ROW($I$6)+1)))),$C12)),\"\")","v":""},{"$f":"IFERROR(INDEX(PlanningsFilter!$L$6:$L$1000,SMALL(IF(PlanningsFilter!$K$6:$K$1000=$A12,IF(PlanningsFilter!$C$6:$C$1000=N$2,IF(PlanningsFilter!$J$6:$J$1000=N$4,IF(PlanningsFilter!$I$6:$I$1000=\"\",ROW(PlanningsFilter!$I$6:$I$1000)-ROW($I$6)+1)))),$C12)),\"\")","v":""},{"$f":"IFERROR(INDEX(PlanningsFilter!$L$6:$L$1000,SMALL(IF(PlanningsFilter!$K$6:$K$1000=$A12,IF(PlanningsFilter!$C$6:$C$1000=O$2,IF(PlanningsFilter!$J$6:$J$1000=O$4,IF(PlanningsFilter!$I$6:$I$1000=\"\",ROW(PlanningsFilter!$I$6:$I$1000)-ROW($I$6)+1)))),$C12)),\"\")","v":""},{"$f":"IFERROR(INDEX(PlanningsFilter!$L$6:$L$1000,SMALL(IF(PlanningsFilter!$K$6:$K$1000=$A12,IF(PlanningsFilter!$C$6:$C$1000=P$2,IF(PlanningsFilter!$J$6:$J$1000=P$4,IF(PlanningsFilter!$I$6:$I$1000=\"\",ROW(PlanningsFilter!$I$6:$I$1000)-ROW($I$6)+1)))),$C12)),\"\")","v":""},{"$f":"IFERROR(INDEX(PlanningsFilter!$L$6:$L$1000,SMALL(IF(PlanningsFilter!$K$6:$K$1000=$A12,IF(PlanningsFilter!$C$6:$C$1000=Q$2,IF(PlanningsFilter!$J$6:$J$1000=Q$4,IF(PlanningsFilter!$I$6:$I$1000=\"\",ROW(PlanningsFilter!$I$6:$I$1000)-ROW($I$6)+1)))),$C12)),\"\")","v":""},{"$f":"IFERROR(INDEX(PlanningsFilter!$L$6:$L$1000,SMALL(IF(PlanningsFilter!$K$6:$K$1000=$A12,IF(PlanningsFilter!$C$6:$C$1000=R$2,IF(PlanningsFilter!$J$6:$J$1000=R$4,IF(PlanningsFilter!$I$6:$I$1000=\"\",ROW(PlanningsFilter!$I$6:$I$1000)-ROW($I$6)+1)))),$C12)),\"\")","v":""},{"$f":"IFERROR(INDEX(PlanningsFilter!$L$6:$L$1000,SMALL(IF(PlanningsFilter!$K$6:$K$1000=$A12,IF(PlanningsFilter!$C$6:$C$1000=S$2,IF(PlanningsFilter!$J$6:$J$1000=S$4,IF(PlanningsFilter!$I$6:$I$1000=\"\",ROW(PlanningsFilter!$I$6:$I$1000)-ROW($I$6)+1)))),$C12)),\"\")","v":""},{"$f":"IFERROR(INDEX(PlanningsFilter!$L$6:$L$1000,SMALL(IF(PlanningsFilter!$K$6:$K$1000=$A12,IF(PlanningsFilter!$C$6:$C$1000=T$2,IF(PlanningsFilter!$J$6:$J$1000=T$4,IF(PlanningsFilter!$I$6:$I$1000=\"\",ROW(PlanningsFilter!$I$6:$I$1000)-ROW($I$6)+1)))),$C12)),\"\")","v":""},{"$f":"IFERROR(INDEX(PlanningsFilter!$L$6:$L$1000,SMALL(IF(PlanningsFilter!$K$6:$K$1000=$A12,IF(PlanningsFilter!$C$6:$C$1000=U$2,IF(PlanningsFilter!$J$6:$J$1000=U$4,IF(PlanningsFilter!$I$6:$I$1000=\"\",ROW(PlanningsFilter!$I$6:$I$1000)-ROW($I$6)+1)))),$C12)),\"\")","v":""},{"$f":"IFERROR(INDEX(PlanningsFilter!$L$6:$L$1000,SMALL(IF(PlanningsFilter!$K$6:$K$1000=$A12,IF(PlanningsFilter!$C$6:$C$1000=V$2,IF(PlanningsFilter!$J$6:$J$1000=V$4,IF(PlanningsFilter!$I$6:$I$1000=\"\",ROW(PlanningsFilter!$I$6:$I$1000)-ROW($I$6)+1)))),$C12)),\"\")","v":""},{"$f":"IFERROR(INDEX(PlanningsFilter!$L$6:$L$1000,SMALL(IF(PlanningsFilter!$K$6:$K$1000=$A12,IF(PlanningsFilter!$C$6:$C$1000=W$2,IF(PlanningsFilter!$J$6:$J$1000=W$4,IF(PlanningsFilter!$I$6:$I$1000=\"\",ROW(PlanningsFilter!$I$6:$I$1000)-ROW($I$6)+1)))),$C12)),\"\")","v":""},{"$f":"IFERROR(INDEX(PlanningsFilter!$L$6:$L$1000,SMALL(IF(PlanningsFilter!$K$6:$K$1000=$A12,IF(PlanningsFilter!$C$6:$C$1000=X$2,IF(PlanningsFilter!$J$6:$J$1000=X$4,IF(PlanningsFilter!$I$6:$I$1000=\"\",ROW(PlanningsFilter!$I$6:$I$1000)-ROW($I$6)+1)))),$C12)),\"\")","v":""}]
["AFV",null,8,{"$f":"IFERROR(INDEX(PlanningsFilter!$L$6:$L$1000,SMALL(IF(PlanningsFilter!$K$6:$K$1000=$A13,IF(PlanningsFilter!$C$6:$C$1000=D$2,IF(PlanningsFilter!$J$6:$J$1000=D$4,IF(PlanningsFilter!$I$6:$I$1000=\"\",ROW(PlanningsFilter!$I$6:$I$1000)-ROW($I$6)+1)))),$C13)),\"\")","v":""},{"$f":"IFERROR(INDEX(PlanningsFilter!$L$6:$L$1000,SMALL(IF(PlanningsFilter!$K$6:$K$1000=$A13,IF(PlanningsFilter!$C$6:$C$1000=E$2,IF(PlanningsFilter!$J$6:$J$1000=E$4,IF(PlanningsFilter!$I$6:$I$1000=\"\",ROW(PlanningsFilter!$I$6:$I$1000)-ROW($I$6)+1)))),$C13)),\"\")","v":""},{"$f":"IFERROR(INDEX(PlanningsFilter!$L$6:$L$1000,SMALL(IF(PlanningsFilter!$K$6:$K$1000=$A13,IF(PlanningsFilter!$C$6:$C$1000=F$2,IF(PlanningsFilter!$J$6:$J$1000=F$4,IF(PlanningsFilter!$I$6:$I$1000=\"\",ROW(PlanningsFilter!$I$6:$I$1000)-ROW($I$6)+1)))),$C13)),\"\")","v":""},{"$f":"IFERROR(INDEX(PlanningsFilter!$L$6:$L$1000,SMALL(IF(PlanningsFilter!$K$6:$K$1000=$A13,IF(PlanningsFilter!$C$6:$C$1000=G$2,IF(PlanningsFilter!$J$6:$J$1000=G$4,IF(PlanningsFilter!$I$6:$I$1000=\"\",ROW(PlanningsFilter!$I$6:$I$1000)-ROW($I$6)+1)))),$C13)),\"\")","v":""},{"$f":"IFERROR(INDEX(PlanningsFilter!$L$6:$L$1000,SMALL(IF(PlanningsFilter!$K$6:$K$1000=$A13,IF(PlanningsFilter!$C$6:$C$1000=H$2,IF(PlanningsFilter!$J$6:$J$1000=H$4,IF(PlanningsFilter!$I$6:$I$1000=\"\",ROW(PlanningsFilter!$I$6:$I$1000)-ROW($I$6)+1)))),$C13)),\"\")","v":""},{"$f":"IFERROR(INDEX(PlanningsFilter!$L$6:$L$1000,SMALL(IF(PlanningsFilter!$K$6:$K$1000=$A13,IF(PlanningsFilter!$C$6:$C$1000=I$2,IF(PlanningsFilter!$J$6:$J$1000=I$4,IF(PlanningsFilter!$I$6:$I$1000=\"\",ROW(PlanningsFilter!$I$6:$I$1000)-ROW($I$6)+1)))),$C13)),\"\")","v":""},{"$f":"IFERROR(INDEX(PlanningsFilter!$L$6:$L$1000,SMALL(IF(PlanningsFilter!$K$6:$K$1000=$A13,IF(PlanningsFilter!$C$6:$C$1000=J$2,IF(PlanningsFilter!$J$6:$J$1000=J$4,IF(PlanningsFilter!$I$6:$I$1000=\"\",ROW(PlanningsFilter!$I$6:$I$1000)-ROW($I$6)+1)))),$C13)),\"\")","v":""},{"$f":"IFERROR(INDEX(PlanningsFilter!$L$6:$L$1000,SMALL(IF(PlanningsFilter!$K$6:$K$1000=$A13,IF(PlanningsFilter!$C$6:$C$1000=K$2,IF(PlanningsFilter!$J$6:$J$1000=K$4,IF(PlanningsFilter!$I$6:$I$1000=\"\",ROW(PlanningsFilter!$I$6:$I$1000)-ROW($I$6)+1)))),$C13)),\"\")","v":""},{"$f":"IFERROR(INDEX(PlanningsFilter!$L$6:$L$1000,SMALL(IF(PlanningsFilter!$K$6:$K$1000=$A13,IF(PlanningsFilter!$C$6:$C$1000=L$2,IF(PlanningsFilter!$J$6:$J$1000=L$4,IF(PlanningsFilter!$I$6:$I$1000=\"\",ROW(PlanningsFilter!$I$6:$I$1000)-ROW($I$6)+1)))),$C13)),\"\")","v":""},{"$f":"IFERROR(INDEX(PlanningsFilter!$L$6:$L$1000,SMALL(IF(PlanningsFilter!$K$6:$K$1000=$A13,IF(PlanningsFilter!$C$6:$C$1000=M$2,IF(PlanningsFilter!$J$6:$J$1000=M$4,IF(PlanningsFilter!$I$6:$I$1000=\"\",ROW(PlanningsFilter!$I$6:$I$1000)-ROW($I$6)+1)))),$C13)),\"\")","v":""},{"$f":"IFERROR(INDEX(PlanningsFilter!$L$6:$L$1000,SMALL(IF(PlanningsFilter!$K$6:$K$1000=$A13,IF(PlanningsFilter!$C$6:$C$1000=N$2,IF(PlanningsFilter!$J$6:$J$1000=N$4,IF(PlanningsFilter!$I$6:$I$1000=\"\",ROW(PlanningsFilter!$I$6:$I$1000)-ROW($I$6)+1)))),$C13)),\"\")","v":""},{"$f":"IFERROR(INDEX(PlanningsFilter!$L$6:$L$1000,SMALL(IF(PlanningsFilter!$K$6:$K$1000=$A13,IF(PlanningsFilter!$C$6:$C$1000=O$2,IF(PlanningsFilter!$J$6:$J$1000=O$4,IF(PlanningsFilter!$I$6:$I$1000=\"\",ROW(PlanningsFilter!$I$6:$I$1000)-ROW($I$6)+1)))),$C13)),\"\")","v":""},{"$f":"IFERROR(INDEX(PlanningsFilter!$L$6:$L$1000,SMALL(IF(PlanningsFilter!$K$6:$K$1000=$A13,IF(PlanningsFilter!$C$6:$C$1000=P$2,IF(PlanningsFilter!$J$6:$J$1000=P$4,IF(PlanningsFilter!$I$6:$I$1000=\"\",ROW(PlanningsFilter!$I$6:$I$1000)-ROW($I$6)+1)))),$C13)),\"\")","v":""},{"$f":"IFERROR(INDEX(PlanningsFilter!$L$6:$L$1000,SMALL(IF(PlanningsFilter!$K$6:$K$1000=$A13,IF(PlanningsFilter!$C$6:$C$1000=Q$2,IF(PlanningsFilter!$J$6:$J$1000=Q$4,IF(PlanningsFilter!$I$6:$I$1000=\"\",ROW(PlanningsFilter!$I$6:$I$1000)-ROW($I$6)+1)))),$C13)),\"\")","v":""},{"$f":"IFERROR(INDEX(PlanningsFilter!$L$6:$L$1000,SMALL(IF(PlanningsFilter!$K$6:$K$1000=$A13,IF(PlanningsFilter!$C$6:$C$1000=R$2,IF(PlanningsFilter!$J$6:$J$1000=R$4,IF(PlanningsFilter!$I$6:$I$1000=\"\",ROW(PlanningsFilter!$I$6:$I$1000)-ROW($I$6)+1)))),$C13)),\"\")","v":""},{"$f":"IFERROR(INDEX(PlanningsFilter!$L$6:$L$1000,SMALL(IF(PlanningsFilter!$K$6:$K$1000=$A13,IF(PlanningsFilter!$C$6:$C$1000=S$2,IF(PlanningsFilter!$J$6:$J$1000=S$4,IF(PlanningsFilter!$I$6:$I$1000=\"\",ROW(PlanningsFilter!$I$6:$I$1000)-ROW($I$6)+1)))),$C13)),\"\")","v":""},{"$f":"IFERROR(INDEX(PlanningsFilter!$L$6:$L$1000,SMALL(IF(PlanningsFilter!$K$6:$K$1000=$A13,IF(PlanningsFilter!$C$6:$C$1000=T$2,IF(PlanningsFilter!$J$6:$J$1000=T$4,IF(PlanningsFilter!$I$6:$I$1000=\"\",ROW(PlanningsFilter!$I$6:$I$1000)-ROW($I$6)+1)))),$C13)),\"\")","v":""},{"$f":"IFERROR(INDEX(PlanningsFilter!$L$6:$L$1000,SMALL(IF(PlanningsFilter!$K$6:$K$1000=$A13,IF(PlanningsFilter!$C$6:$C$1000=U$2,IF(PlanningsFilter!$J$6:$J$1000=U$4,IF(PlanningsFilter!$I$6:$I$1000=\"\",ROW(PlanningsFilter!$I$6:$I$1000)-ROW($I$6)+1)))),$C13)),\"\")","v":""},{"$f":"IFERROR(INDEX(PlanningsFilter!$L$6:$L$1000,SMALL(IF(PlanningsFilter!$K$6:$K$1000=$A13,IF(PlanningsFilter!$C$6:$C$1000=V$2,IF(PlanningsFilter!$J$6:$J$1000=V$4,IF(PlanningsFilter!$I$6:$I$1000=\"\",ROW(PlanningsFilter!$I$6:$I$1000)-ROW($I$6)+1)))),$C13)),\"\")","v":""},{"$f":"IFERROR(INDEX(PlanningsFilter!$L$6:$L$1000,SMALL(IF(PlanningsFilter!$K$6:$K$1000=$A13,IF(PlanningsFilter!$C$6:$C$1000=W$2,IF(PlanningsFilter!$J$6:$J$1000=W$4,IF(PlanningsFilter!$I$6:$I$1000=\"\",ROW(PlanningsFilter!$I$6:$I$1000)-ROW($I$6)+1)))),$C13)),\"\")","v":""},{"$f":"IFERROR(INDEX(PlanningsFilter!$L$6:$L$1000,SMALL(IF(PlanningsFilter!$K$6:$K$1000=$A13,IF(PlanningsFilter!$C$6:$C$1000=X$2,IF(PlanningsFilter!$J$6:$J$1000=X$4,IF(PlanningsFilter!$I$6:$I$1000=\"\",ROW(PlanningsFilter!$I$6:$I$1000)-ROW($I$6)+1)))),$C13)),\"\")","v":""}]
["WERKTIIJDEN",null,null,"06:00/14:45","14:45/23:30","22:00/06:45","06:00/14:45","14:45/23:30","22:00/06:45","06:00/14:45","14:45/23:30","22:00/06:45","06:00/14:45","14:45/23:30","22:00/06:45","06:00/14:45","14:45/23:30","22:00/06:45","06:00/14:45","14:45/23:30","22:00/06:45","06:00/14:45","14:45/23:30","23:59/08:45"]
["SCHM",null,1,{"$f":"IFERROR(INDEX(PlanningsFilter!$L$6:$L$1000,SMALL(IF(PlanningsFilter!$K$6:$K$1000=$A15,IF(PlanningsFilter!$C$6:$C$1000=D$2,IF(PlanningsFilter!$J$6:$J$1000=D$4,IF(PlanningsFilter!$I$6:$I$1000=\"\",ROW(PlanningsFilter!$I$6:$I$1000)-ROW($I$6)+1)))),$C15)),\"\")","v":"Marjolein Martens"},{"$f":"IFERROR(INDEX(PlanningsFilter!$L$6:$L$1000,SMALL(IF(PlanningsFilter!$K$6:$K$1000=$A15,IF(PlanningsFilter!$C$6:$C$1000=E$2,IF(PlanningsFilter!$J$6:$J$1000=E$4,IF(PlanningsFilter!$I$6:$I$1000=\"\",ROW(PlanningsFilter!$I$6:$I$1000)-ROW($I$6)+1)))),$C15)),\"\")","v":"Erik de Haan"},{"$f":"IFERROR(INDEX(PlanningsFilter!$L$6:$L$1000,SMALL(IF(PlanningsFilter!$K$6:$K$1000=$A15,IF(PlanningsFilter!$C$6:$C$1000=F$2,IF(PlanningsFilter!$J$6:$J$1000=F$4,IF(PlanningsFilter!$I$6:$I$1000=\"\",ROW(PlanningsFilter!$I$6:$I$1000)-ROW($I$6)+1)))),$C15)),\"\")","v":"Rachid van der Laan"},{"$f":"IFERROR(INDEX(PlanningsFilter!$L$6:$L$1000,SMALL(IF(PlanningsFilter!$K$6:$K$1000=$A15,IF(PlanningsFilter!$C$6:$C$1000=G$2,IF(PlanningsFilter!$J$6:$J$1000=G$4,IF(PlanningsFilter!$I$6:$I$1000=\"\",ROW(PlanningsFilter!$I$6:$I$1000)-ROW($I$6)+1)))),$C15)),\"\")","v":"Marjolein Martens"},{"$f":"IFERROR(INDEX(PlanningsFilter!$L$6:$L$1000,SMALL(IF(PlanningsFilter!$K$6:$K$1000=$A15,IF(PlanningsFilter!$C$6:$C$1000=H$2,IF(PlanningsFilter!$J$6:$J$1000=H$4,IF(PlanningsFilter!$I$6:$I$1000=\"\",ROW(PlanningsFilter!$I$6:$I$1000)-ROW($I$6)+1)))),$C15)),\"\")","v":"Patrick Bosch"},{"$f":"IFERROR(INDEX(PlanningsFilter!$L$6:$L$1000,SMALL(IF(PlanningsFilter!$K$6:$K$1000=$A15,IF(PlanningsFilter!$C$6:$C$1000=I$2,IF(PlanningsFilter!$J$6:$J$1000=I$4,IF(PlanningsFilter!$I$6:$I$1000=\"\",ROW(PlanningsFilter!$I$6:$I$1000)-ROW($I$6)+1)))),$C15)),\"\")","v":"Rachid van der Laan"},{"$f":"IFERROR(INDEX(PlanningsFilter!$L$6:$L$1000,SMALL(IF(PlanningsFilter!$K$6:$K$1000=$A15,IF(PlanningsFilter!$C$6:$C$1000=J$2,IF(PlanningsFilter!$J$6:$J$1000=J$4,IF(PlanningsFilter!$I$6:$I$1000=\"\",ROW(PlanningsFilter!$I$6:$I$1000)-ROW($I$6)+1)))),$C15)),\"\")","v":"Marjolein Martens"},{"$f":"IFERROR(INDEX(PlanningsFilter!$L$6:$L$1000,SMALL(IF(PlanningsFilter!$K$6:$K$1000=$A15,IF(PlanningsFilter!$C$6:$C$1000=K$2,IF(PlanningsFilter!$J$6:$J$1000=K$4,IF(PlanningsFilter!$I$6:$I$1000=\"\",ROW(PlanningsFilter!$I$6:$I$1000)-ROW($I$6)+1)))),$C15)),\"\")","v":"Erik de Haan"},{"$f":"IFERROR(INDEX(PlanningsFilter!$L$6:$L$1000,SMALL(IF(PlanningsFilter!$K$6:$K$1000=$A15,IF(PlanningsFilter!$C$6:$C$1000=L$2,IF(PlanningsFilter!$J$6:$J$1000=L$4,IF(PlanningsFilter!$I$6:$I$1000=\"\",ROW(PlanningsFilter!$I$6:$I$1000)-ROW($I$6)+1)))),$C15)),\"\")","v":"Rachid van der Laan"},{"$f":"IFERROR(INDEX(PlanningsFilter!$L$6:$L$1000,SMALL(IF(PlanningsFilter!$K$6:$K$1000=$A15,IF(PlanningsFilter!$C$6:$C$1000=M$2,IF(PlanningsFilter!$J$6:$J$1000=M$4,IF(PlanningsFilter!$I$6:$I$1000=\"\",ROW(PlanningsFilter!$I$6:$I$1000)-ROW($I$6)+1)))),$C15)),\"\")","v":"Marjolein Martens"},{"$f":"IFERROR(INDEX(PlanningsFilter!$L$6:$L$1000,SMALL(IF(PlanningsFilter!$K$6:$K$1000=$A15,IF(PlanningsFilter!$C$6:$C$1000=N$2,IF(PlanningsFilter!$J$6:$J$1000=N$4,IF(PlanningsFilter!$I$6:$I$1000=\"\",ROW(PlanningsFilter!$I$6:$I$1000)-ROW($I$6)+1)))),$C15)),\"\")","v":"Erik de Haan"},{"$f":"IFERROR(INDEX(PlanningsFilter!$L$6:$L$1000,SMALL(IF(PlanningsFilter!$K$6:$K$1000=$A15,IF(PlanningsFilter!$C$6:$C$1000=O$2,IF(PlanningsFilter!$J$6:$J$1000=O$4,IF(PlanningsFilter!$I$6:$I$1000=\"\",ROW(PlanningsFilter!$I$6:$I$1000)-ROW($I$6)+1)))),$C15)),\"\")","v":"Rachid van der Laan"},{"$f":"IFERROR(INDEX(PlanningsFilter!$L$6:$L$1000,SMALL(IF(PlanningsFilter!$K$6:$K$1000=$A15,IF(PlanningsFilter!$C$6:$C$1000=P$2,IF(PlanningsFilter!$J$6:$J$1000=P$4,IF(PlanningsFilter!$I$6:$I$1000=\"\",ROW(PlanningsFilter!$I$6:$I$1000)-ROW($I$6)+1)))),$C15)),\"\")","v":"Marjolein Martens"},{"$f":"IFERROR(INDEX(PlanningsFilter!$L$6:$L$1000,SMALL(IF(PlanningsFilter!$K$6:$K$1000=$A15,IF(PlanningsFilter!$C$6:$C$1000=Q$2,IF(PlanningsFilter!$J$6:$J$1000=Q$4,IF(PlanningsFilter!$I$6:$I$1000=\"\",ROW(PlanningsFilter!$I$6:$I$1000)-ROW($I$6)+1)))),$C15)),\"\")","v":"Erik de Haan"},{"$f":"IFERROR(INDEX(PlanningsFilter!$L$6:$L$1000,SMALL(IF(PlanningsFilter!$K$6:$K$1000=$A15,IF(PlanningsFilter!$C$6:$C$1000=R$2,IF(PlanningsFilter!$J$6:$J$1000=R$4,IF(PlanningsFilter!$I$6:$I$1000=\"\",ROW(PlanningsFilter!$I$6:$I$1000)-ROW($I$6)+1)))),$C15)),\"\")","v":""},{"$f":"IFERROR(INDEX(PlanningsFilter!$L$6:$L$1000,SMALL(IF(PlanningsFilter!$K$6:$K$1000=$A15,IF(PlanningsFilter!$C$6:$C$1000=S$2,IF(PlanningsFilter!$J$6:$J$1000=S$4,IF(PlanningsFilter!$I$6:$I$1000=\"\",ROW(PlanningsFilter!$I$6:$I$1000)-ROW($I$6)+1)))),$C15)),\"\")","v":""},{"$f":"IFERROR(INDEX(PlanningsFilter!$L$6:$L$1000,SMALL(IF(PlanningsFilter!$K$6:$K$1000=$A15,IF(PlanningsFilter!$C$6:$C$1000=T$2,IF(PlanningsFilter!$J$6:$J$1000=T$4,IF(PlanningsFilter!$I$6:$I$1000=\"\",ROW(PlanningsFilter!$I$6:$I$1000)-ROW($I$6)+1)))),$C15)),\"\")","v":""},{"$f":"IFERROR(INDEX(PlanningsFilter!$L$6:$L$1000,SMALL(IF(PlanningsFilter!$K$6:$K$1000=$A15,IF(PlanningsFilter!$C$6:$C$1000=U$2,IF(PlanningsFilter!$J$6:$J$1000=U$4,IF(PlanningsFilter!$I$6:$I$1000=\"\",ROW(PlanningsFilter!$I$6:$I$1000)-ROW($I$6)+1)))),$C15)),\"\")","v":""},{"$f":"IFERROR(INDEX(PlanningsFilter!$L$6:$L$1000,SMALL(IF(PlanningsFilter!$K$6:$K$1000=$A15,IF(PlanningsFilter!$C$6:$C$1000=V$2,IF(PlanningsFilter!$J$6:$J$1000=V$4,IF(PlanningsFilter!$I$6:$I$1000=\"\",ROW(PlanningsFilter!$I$6:$I$1000)-ROW($I$6)+1)))),$C15)),\"\")","v":""},{"$f":"IFERROR(INDEX(PlanningsFilter!$L$6:$L$1000,SMALL(IF(PlanningsFilter!$K$6:$K$1000=$A15,IF(PlanningsFilter!$C$6:$C$1000=W$2,IF(PlanningsFilter!$J$6:$J$1000=W$4,IF(PlanningsFilter!$I$6:$I$1000=\"\",ROW(PlanningsFilter!$I$6:$I$1000)-ROW($I$6)+1)))),$C15)),\"\")","v":""},{"$f":"IFERROR(INDEX(PlanningsFilter!$L$6:$L$1000,SMALL(IF(PlanningsFilter!$K$6:$K$1000=$A15,IF(PlanningsFilter!$C$6:$C$1000=X$2,IF(PlanningsFilter!$J$6:$J$1000=X$4,IF(PlanningsFilter!$I$6:$I$1000=\"\",ROW(PlanningsFilter!$I$6:$I$1000)-ROW($I$6)+1)))),$C15)),\"\")","v":""}]
["SCHM",null,2,{"$f":"IFERROR(INDEX(PlanningsFilter!$L$6:$L$1000,SMALL(IF(PlanningsFilter!$K$6:$K$1000=$A16,IF(PlanningsFilter!$C$6:$C$1000=D$2,IF(PlanningsFilter!$J$6:$J$1000=D$4,IF(PlanningsFilter!$I$6:$I$1000=\"\",ROW(PlanningsFilter!$I$6:$I$1000)-ROW($I$6)+1)))),$C16)),\"\")","v":"Piet Schipper"},{"$f":"IFERROR(INDEX(PlanningsFilter!$L$6:$L$1000,SMALL(IF(PlanningsFilter!$K$6:$K$1000=$A16,IF(PlanningsFilter!$C$6:$C$1000=E$2,IF(PlanningsFilter!$J$6:$J$1000=E$4,IF(PlanningsFilter!$I$6:$I$1000=\"\",ROW(PlanningsFilter!$I$6:$I$1000)-ROW($I$6)+1)))),$C16)),\"\")","v":"Patrick Bosch"},{"$f":"IFERROR(INDEX(PlanningsFilter!$L$6:$L$1000,SMALL(IF(PlanningsFilter!$K$6:$K$1000=$A16,IF(PlanningsFilter!$C$6:$C$1000=F$2,IF(PlanningsFilter!$J$6:$J$1000=F$4,IF(PlanningsFilter!$I$6:$I$1000=\"\",ROW(PlanningsFilter!$I$6:$I$1000)-ROW($I$6)+1)))),$C16)),\"\")","v":"Evans Vermeulen"},{"$f":"IFERROR(INDEX(PlanningsFilter!$L$6:$L$1000,SMALL(IF(PlanningsFilter!$K$6:$K$1000=$A16,IF(PlanningsFilter!$C$6:$C$1000=G$2,IF(PlanningsFilter!$J$6:$J$1000=G$4,IF(PlanningsFilter!$I$6:$I$1000=\"\",ROW(PlanningsFilter!$I$6:$I$1000)-ROW($I$6)+1)))),$C16)),\"\")","v":"Piet Schipper"},{"$f":"IFERROR(INDEX(PlanningsFilter!$L$6:$L$1000,SMALL(IF(PlanningsFilter!$K$6:$K$1000=$A16,IF(PlanningsFilter!$C$6:$C$1000=H$2,IF(PlanningsFilter!$J$6:$J$1000=H$4,IF(PlanningsFilter!$I$6:$I$1000=\"\",ROW(PlanningsFilter!$I$6:$I$1000)-ROW($I$6)+1)))),$C16)),\"\")","v":"Rolinka van den Bosch"},{"$f":"IFERROR(INDEX(PlanningsFilter!$L$6:$L$1000,SMALL(IF(PlanningsFilter!$K$6:$K$1000=$A16,IF(PlanningsFilter!$C$6:$C$1000=I$2,IF(PlanningsFilter!$J$6:$J$1000=I$4,IF(PlanningsFilter!$I$6:$I$1000=\"\",ROW(PlanningsFilter!$I$6:$I$1000)-ROW($I$6)+1)))),$C16)),\"\")","v":"Evans Vermeulen"},{"$f":"IFERROR(INDEX(PlanningsFilter!$L$6:$L$1000,SMALL(IF(PlanningsFilter!$K$6:$K$1000=$A16,IF(PlanningsFilter!$C$6:$C$1000=J$2,IF(PlanningsFilter!$J$6:$J$1000=J$4,IF(PlanningsFilter!$I$6:$I$1000=\"\",ROW(PlanningsFilter!$I$6:$I$1000)-ROW($I$6)+1)))),$C16)),\"\")","v":"Piet Schipper"},{"$f":"IFERROR(INDEX(PlanningsFilter!$L$6:$L$1000,SMALL(IF(PlanningsFilter!$K$6:$K$1000=$A16,IF(PlanningsFilter!$C$6:$C$1000=K$2,IF(PlanningsFilter!$J$6:$J$1000=K$4,IF(PlanningsFilter!$I$6:$I$1000=\"\",ROW(PlanningsFilter!$I$6:$I$1000)-ROW($I$6)+1)))),$C16)),\"\")","v":"Patrick Bosch"},{"$f":"IFERROR(INDEX(PlanningsFilter!$L$6:$L$1000,SMALL(IF(PlanningsFilter!$K$6:$K$1000=$A16,IF(PlanningsFilter!$C$6:$C$1000=L$2,IF(PlanningsFilter!$J$6:$J$1000=L$4,IF(PlanningsFilter!$I$6:$I$1000=\"\",ROW(PlanningsFilter!$I$6:$I$1000)-ROW($I$6)+1)))),$C16)),\"\")","v":"Evans Vermeulen"},{"$f":"IFERROR(INDEX(PlanningsFilter!$L$6:$L$1000,SMALL(IF(PlanningsFilter!$K$6:$K$1000=$A16,IF(PlanningsFilter!$C$6:$C$1000=M$2,IF(PlanningsFilter!$J$6:$J$1000=M$4,IF(PlanningsFilter!$I$6:$I$1000=\"\",ROW(PlanningsFilter!$I$6:$I$1000)-ROW($I$6)+1)))),$C16)),\"\")","v":"Piet Schipper"},{"$f":"IFERROR(INDEX(PlanningsFilter!$L$6:$L$1000,SMALL(IF(PlanningsFilter!$K$6:$K$1000=$A16,IF(PlanningsFilter!$C$6:$C$1000=N$2,IF(PlanningsFilter!$J$6:$J$1000=N$4,IF(PlanningsFilter!$I$6:$I$1000=\"\",ROW(PlanningsFilter!$I$6:$I$1000)-ROW($I$6)+1)))),$C16)),\"\")","v":"Patrick Bosch"},{"$f":"IFERROR(INDEX(PlanningsFilter!$L$6:$L$1000,SMALL(IF(PlanningsFilter!$K$6:$K$1000=$A16,IF(PlanningsFilter!$C$6:$C$1000=O$2,IF(PlanningsFilter!$J$6:$J$1000=O$4,IF(PlanningsFilter!$I$6:$I$1000=\"\",ROW(PlanningsFilter!$I$6:$I$1000)-ROW($I$6)+1)))),$C16)),\"\")","v":"Evans Vermeulen"},{"$f":"IFERROR(INDEX(PlanningsFilter!$L$6:$L$1000,SMALL(IF(PlanningsFilter!$K$6:$K$1000=$A16,IF(PlanningsFilter!$C$6:$C$1000=P$2,IF(PlanningsFilter!$J$6:$J$1000=P$4,IF(PlanningsFilter!$I$6:$I$1000=\"\",ROW(PlanningsFilter!$I$6:$I$1000)-ROW($I$6)+1)))),$C16)),\"\")","v":"Piet Schipper"},{"$f":"IFERROR(INDEX(PlanningsFilter!$L$6:$L$1000,SMALL(IF(PlanningsFilter!$K$6:$K$1000=$A16,IF(PlanningsFilter!$C$6:$C$1000=Q$2,IF(PlanningsFilter!$J$6:$J$1000=Q$4,IF(PlanningsFilter!$I$6:$I$1000=\"\",ROW(PlanningsFilter!$I$6:$I$1000)-ROW($I$6)+1)))),$C16)),\"\")","v":"Patrick Bosch"},{"$f":"IFERROR(INDEX(PlanningsFilter!$L$6:$L$1000,SMALL(IF(PlanningsFilter!$K$6:$K$1000=$A16,IF(PlanningsFilter!$C$6:$C$1000=R$2,IF(PlanningsFilter!$J$6:$J$1000=R$4,IF(PlanningsFilter!$I$6:$I$1000=\"\",ROW(PlanningsFilter!$I$6:$I$1000)-ROW($I$6)+1)))),$C16)),\"\")","v":""},{"$f":"IFERROR(INDEX(PlanningsFilter!$L$6:$L$1000,SMALL(IF(PlanningsFilter!$K$6:$K$1000=$A16,IF(PlanningsFilter!$C$6:$C$1000=S$2,IF(PlanningsFilter!$J$6:$J$1000=S$4,IF(PlanningsFilter!$I$6:$I$1000=\"\",ROW(PlanningsFilter!$I$6:$I$1000)-ROW($I$6)+1)))),$C16)),\"\")","v":""},{"$f":"IFERROR(INDEX(PlanningsFilter!$L$6:$L$1000,SMALL(IF(PlanningsFilter!$K$6:$K$1000=$A16,IF(PlanningsFilter!$C$6:$C$1000=T$2,IF(PlanningsFilter!$J$6:$J$1000=T$4,IF(PlanningsFilter!$I$6:$I$1000=\"\",ROW(PlanningsFilter!$I$6:$I$1000)-ROW($I$6)+1)))),$C16)),\"\")","v":""},{"$f":"IFERROR(INDEX(PlanningsFilter!$L$6:$L$1000,SMALL(IF(PlanningsFilter!$K$6:$K$1000=$A16,IF(PlanningsFilter!$C$6:$C$1000=U$2,IF(PlanningsFilter!$J$6:$J$1000=U$4,IF(PlanningsFilter!$I$6:$I$1000=\"\",ROW(PlanningsFilter!$I$6:$I$1000)-ROW($I$6)+1)))),$C16)),\"\")","v":""},{"$f":"IFERROR(INDEX(PlanningsFilter!$L$6:$L$1000,SMALL(IF(PlanningsFilter!$K$6:$K$1000=$A16,IF(PlanningsFilter!$C$6:$C$1000=V$2,IF(PlanningsFilter!$J$6:$J$1000=V$4,IF(PlanningsFilter!$I$6:$I$1000=\"\",ROW(PlanningsFilter!$I$6:$I$1000)-ROW($I$6)+1)))),$C16)),\"\")","v":""},{"$f":"IFERROR(INDEX(PlanningsFilter!$L$6:$L$1000,SMALL(IF(PlanningsFilter!$K$6:$K$1000=$A16,IF(PlanningsFilter!$C$6:$C$1000=W$2,IF(PlanningsFilter!$J$6:$J$1000=W$4,IF(PlanningsFilter!$I$6:$I$1000=\"\",ROW(PlanningsFilter!$I$6:$I$1000)-ROW($I$6)+1)))),$C16)),\"\")","v":""},{"$f":"IFERROR(INDEX(PlanningsFilter!$L$6:$L$1000,SMALL(IF(PlanningsFilter!$K$6:$K$1000=$A16,IF(PlanningsFilter!$C$6:$C$1000=X$2,IF(PlanningsFilter!$J$6:$J$1000=X$4,IF(PlanningsFilter!$I$6:$I$1000=\"\",ROW(PlanningsFilter!$I$6:$I$1000)-ROW($I$6)+1)))),$C16)),\"\")","v":""}]
["SCHM",null,3,{"$f":"IFERROR(INDEX(PlanningsFilter!$L$6:$L$1000,SMALL(IF(PlanningsFilter!$K$6:$K$1000=$A17,IF(PlanningsFilter!$C$6:$C$1000=D$2,IF(PlanningsFilter!$J$6:$J$1000=D$4,IF(PlanningsFilter!$I$6:$I$1000=\"\",ROW(PlanningsFilter!$I$6:$I$1000)-ROW($I$6)+1)))),$C17)),\"\")","v":"Roy van der Meulen"},{"$f":"IFERROR(INDEX(PlanningsFilter!$L$6:$L$1000,SMALL(IF(PlanningsFilter!$K$6:$K$1000=$A17,IF(PlanningsFilter!$C$6:$C$1000=E$2,IF(PlanningsFilter!$J$6:$J$1000=E$4,IF(PlanningsFilter!$I$6:$I$1000=\"\",ROW(PlanningsFilter!$I$6:$I$1000)-ROW($I$6)+1)))),$C17)),\"\")","v":"Rolinka van den Bosch"},{"$f":"IFERROR(INDEX(PlanningsFilter!$L$6:$L$1000,SMALL(IF(PlanningsFilter!$K$6:$K$1000=$A17,IF(PlanningsFilter!$C$6:$C$1000=F$2,IF(PlanningsFilter!$J$6:$J$1000=F$4,IF(PlanningsFilter!$I$6:$I$1000=\"\",ROW(PlanningsFilter!$I$6:$I$1000)-ROW($I$6)+1)))),$C17)),\"\")","v":"Kevin Veenstra"},{"$f":"IFERROR(INDEX(PlanningsFilter!$L$6:$L$1000,SMALL(IF(PlanningsFilter!$K$6:$K$1000=$A17,IF(PlanningsFilter!$C$6:$C$1000=G$2,IF(PlanningsFilter!$J$6:$J$1000=G$4,IF(PlanningsFilter!$I$6:$I$1000=\"\",ROW(PlanningsFilter!$I$6:$I$1000)-ROW($I$6)+1)))),$C17)),\"\")","v":"Roy van der Meulen"},{"$f":"IFERROR(INDEX(PlanningsFilter!$L$6:$L$1000,SMALL(IF(PlanningsFilter!$K$6:$K$1000=$A17,IF(PlanningsFilter!$C$6:$C$1000=H$2,IF(PlanningsFilter!$J$6:$J$1000=H$4,IF(PlanningsFilter!$I$6:$I$1000=\"\",ROW(PlanningsFilter!$I$6:$I$1000)-ROW($I$6)+1)))),$C17)),\"\")","v":""},{"$f":"IFERROR(INDEX(PlanningsFilter!$L$6:$L$1000,SMALL(IF(PlanningsFilter!$K$6:$K$1000=$A17,IF(PlanningsFilter!$C$6:$C$1000=I$2,IF(PlanningsFilter!$J$6:$J$1000=I$4,IF(PlanningsFilter!$I$6:$I$1000=\"\",ROW(PlanningsFilter!$I$6:$I$1000)-ROW($I$6)+1)))),$C17)),\"\")","v":"Kevin Veenstra"},{"$f":"IFERROR(INDEX(PlanningsFilter!$L$6:$L$1000,SMALL(IF(PlanningsFilter!$K$6:$K$1000=$A17,IF(PlanningsFilter!$C$6:$C$1000=J$2,IF(PlanningsFilter!$J$6:$J$1000=J$4,IF(PlanningsFilter!$I$6:$I$1000=\"\",ROW(PlanningsFilter!$I$6:$I$1000)-ROW($I$6)+1)))),$C17)),\"\")","v":"Roy van der Meulen"},{"$f":"IFERROR(INDEX(PlanningsFilter!$L$6:$L$1000,SMALL(IF(PlanningsFilter!$K$6:$K$1000=$A17,IF(PlanningsFilter!$C$6:$C$1000=K$2,IF(PlanningsFilter!$J$6:$J$1000=K$4,IF(PlanningsFilter!$I$6:$I$1000=\"\",ROW(PlanningsFilter!$I$6:$I$1000)-ROW($I$6)+1)))),$C17)),\"\")","v":"Rolinka van den Bosch"},{"$f":"IFERROR(INDEX(PlanningsFilter!$L$6:$L$1000,SMALL(IF(PlanningsFilter!$K$6:$K$1000=$A17,IF(PlanningsFilter!$C$6:$C$1000=L$2,IF(PlanningsFilter!$J$6:$J$1000=L$4,IF(PlanningsFilter!$I$6:$I$1000=\"\",ROW(PlanningsFilter!$I$6:$I$1000)-ROW($I$6)+1)))),$C17)),\"\")","v":"Kevin Veenstra"},{"$f":"IFERROR(INDEX(PlanningsFilter!$L$6:$L$1000,SMALL(IF(PlanningsFilter!$K$6:$K$1000=$A17,IF(PlanningsFilter!$C$6:$C$1000=M$2,IF(PlanningsFilter!$J$6:$J$1000=M$4,IF(PlanningsFilter!$I$6:$I$1000=\"\",ROW(PlanningsFilter!$I$6:$I$1000)-ROW($I$6)+1)))),$C17)),\"\")","v":"Roy van der Meulen"},{"$f":"IFERROR(INDEX(PlanningsFilter!$L$6:$L$1000,SMALL(IF(PlanningsFilter!$K$6:$K$1000=$A17,IF(PlanningsFilter!$C$6:$C$1000=N$2,IF(PlanningsFilter!$J$6:$J$1000=N$4,IF(PlanningsFilter!$I$6:$I$1000=\"\",ROW(PlanningsFilter!$I$6:$I$1000)-ROW($I$6)+1)))),$C17)),\"\")","v":"Rolinka van den Bosch"},{"$f":"IFERROR(INDEX(PlanningsFilter!$L$6:$L$1000,SMALL(IF(PlanningsFilter!$K$6:$K$1000=$A17,IF(PlanningsFilter!$C$6:$C$1000=O$2,IF(PlanningsFilter!$J$6:$J$1000=O$4,IF(PlanningsFilter!$I$6:$I$1000=\"\",ROW(PlanningsFilter!$I$6:$I$1000)-ROW($I$6)+1)))),$C17)),\"\")","v":"Kevin Veenstra"},{"$f":"IFERROR(INDEX(PlanningsFilter!$L$6:$L$1000,SMALL(IF(PlanningsFilter!$K$6:$K$1000=$A17,IF(PlanningsFilter!$C$6:$C$1000=P$2,IF(PlanningsFilter!$J$6:$J$1000=P$4,IF(PlanningsFilter!$I$6:$I$1000=\"\",ROW(PlanningsFilter!$I$6:$I$1000)-ROW($I$6)+1)))),$C17)),\"\")","v":"Roy van der Meulen"},{"$f":"IFERROR(INDEX(PlanningsFilter!$L$6:$L$1000,SMALL(IF(PlanningsFilter!$K$6:$K$1000=$A17,IF(PlanningsFilter!$C$6:$C$1000=Q$2,IF(PlanningsFilter!$J$6:$J$1000=Q$4,IF(PlanningsFilter!$I$6:$I$1000=\"\",ROW(PlanningsFilter!$I$6:$I$1000)-ROW($I$6)+1)))),$C17)),\"\")","v":"Rolinka van den Bosch"},{"$f":"IFERROR(INDEX(PlanningsFilter!$L$6:$L$1000,SMALL(IF(PlanningsFilter!$K$6:$K$1000=$A17,IF(PlanningsFilter!$C$6:$C$1000=R$2,IF(PlanningsFilter!$J$6:$J$1000=R$4,IF(PlanningsFilter!$I$6:$I$1000=\"\",ROW(PlanningsFilter!$I$6:$I$1000)-ROW($I$6)+1)))),$C17)),\"\")","v":""},{"$f":"IFERROR(INDEX(PlanningsFilter!$L$6:$L$1000,SMALL(IF(PlanningsFilter!$K$6:$K$1000=$A17,IF(PlanningsFilter!$C$6:$C$1000=S$2,IF(PlanningsFilter!$J$6:$J$1000=S$4,IF(PlanningsFilter!$I$6:$I$1000=\"\",ROW(PlanningsFilter!$I$6:$I$1000)-ROW($I$6)+1)))),$C17)),\"\")","v":""},{"$f":"IFERROR(INDEX(PlanningsFilter!$L$6:$L$1000,SMALL(IF(PlanningsFilter!$K$6:$K$1000=$A17,IF(PlanningsFilter!$C$6:$C$1000=T$2,IF(PlanningsFilter!$J$6:$J$1000=T$4,IF(PlanningsFilter!$I$6:$I$1000=\"\",ROW(PlanningsFilter!$I$6:$I$1000)-ROW($I$6)+1)))),$C17)),\"\")","v":""},{"$f":"IFERROR(INDEX(PlanningsFilter!$L$6:$L$1000,SMALL(IF(PlanningsFilter!$K$6:$K$1000=$A17,IF(PlanningsFilter!$C$6:$C$1000=U$2,IF(PlanningsFilter!$J$6:$J$1000=U$4,IF(PlanningsFilter!$I$6:$I$1000=\"\",ROW(PlanningsFilter!$I$6:$I$1000)-ROW($I$6)+1)))),$C17)),\"\")","v":""},{"$f":"IFERROR(INDEX(PlanningsFilter!$L$6:$L$1000,SMALL(IF(PlanningsFilter!$K$6:$K$1000=$A17,IF(PlanningsFilter!$C$6:$C$1000=V$2,IF(PlanningsFilter!$J$6:$J$1000=V$4,IF(PlanningsFilter!$I$6:$I$1000=\"\",ROW(PlanningsFilter!$I$6:$I$1000)-ROW($I$6)+1)))),$C17)),\"\")","v":""},{"$f":"IFERROR(INDEX(PlanningsFilter!$L$6:$L$1000,SMALL(IF(PlanningsFilter!$K$6:$K$1000=$A17,IF(PlanningsFilter!$C$6:$C$1000=W$2,IF(PlanningsFilter!$J$6:$J$1000=W$4,IF(PlanningsFilter!$I$6:$I$1000=\"\",ROW(PlanningsFilter!$I$6:$I$1000)-ROW($I$6)+1)))),$C17)),\"\")","v":""},{"$f":"IFERROR(INDEX(PlanningsFilter!$L$6:$L$1000,SMALL(IF(PlanningsFilter!$K$6:$K$1000=$A17,IF(PlanningsFilter!$C$6:$C$1000=X$2,IF(PlanningsFilter!$J$6:$J$1000=X$4,IF(PlanningsFilter!$I$6:$I$1000=\"\",ROW(PlanningsFilter!$I$6:$I$1000)-ROW($I$6)+1)))),$C17)),\"\")","v":""}]
["SCHM",null,4,{"$f":"IFERROR(INDEX(PlanningsFilter!$L$6:$L$1000,SMALL(IF(PlanningsFilter!$K$6:$K$1000=$A18,IF(PlanningsFilter!$C$6:$C$1000=D$2,IF(PlanningsFilter!$J$6:$J$1000=D$4,IF(PlanningsFilter!$I$6:$I$1000=\"\",ROW(PlanningsFilter!$I$6:$I$1000)-ROW($I$6)+1)))),$C18)),\"\")","v":""},{"$f":"IFERROR(INDEX(PlanningsFilter!$L$6:$L$1000,SMALL(IF(PlanningsFilter!$K$6:$K$1000=$A18,IF(PlanningsFilter!$C$6:$C$1000=E$2,IF(PlanningsFilter!$J$6:$J$1000=E$4,IF(PlanningsFilter!$I$6:$I$1000=\"\",ROW(PlanningsFilter!$I$6:$I$1000)-ROW($I$6)+1)))),$C18)),\"\")","v":""},{"$f":"IFERROR(INDEX(PlanningsFilter!$L$6:$L$1000,SMALL(IF(PlanningsFilter!$K$6:$K$1000=$A18,IF(PlanningsFilter!$C$6:$C$1000=F$2,IF(PlanningsFilter!$J$6:$J$1000=F$4,IF(PlanningsFilter!$I$6:$I$1000=\"\",ROW(PlanningsFilter!$I$6:$I$1000)-ROW($I$6)+1)))),$C18)),\"\")","v":""},{"$f":"IFERROR(INDEX(PlanningsFilter!$L$6:$L$1000,SMALL(IF(PlanningsFilter!$K$6:$K$1000=$A18,IF(PlanningsFilter!$C$6:$C$1000=G$2,IF(PlanningsFilter!$J$6:$J$1000=G$4,IF(PlanningsFilter!$I$6:$I$1000=\"\",ROW(PlanningsFilter!$I$6:$I$1000)-ROW($I$6)+1)))),$C18)),\"\")","v":""},{"$f":"IFERROR(INDEX(PlanningsFilter!$L$6:$L$1000,SMALL(IF(PlanningsFilter!$K$6:$K$1000=$A18,IF(PlanningsFilter!$C$6:$C$1000=H$2,IF(PlanningsFilter!$J$6:$J$1000=H$4,IF(PlanningsFilter!$I$6:$I$1000=\"\",ROW(PlanningsFilter!$I$6:$I$1000)-ROW($I$6)+1)))),$C18)),\"\")","v":""},{"$f":"IFERROR(INDEX(PlanningsFilter!$L$6:$L$1000,SMALL(IF(PlanningsFilter!$K$6:$K$1000=$A18,IF(PlanningsFilter!$C$6:$C$1000=I$2,IF(PlanningsFilter!$J$6:$J$1000=I$4,IF(PlanningsFilter!$I$6:$I$1000=\"\",ROW(PlanningsFilter!$I$6:$I$1000)-ROW($I$6)+1)))),$C18)),\"\")","v":""},{"$f":"IFERROR(INDEX(PlanningsFilter!$L$6:$L$1000,SMALL(IF(PlanningsFilter!$K$6:$K$1000=$A18,IF(PlanningsFilter!$C$6:$C$1000=J$2,IF(PlanningsFilter!$J$6:$J$1000=J$4,IF(PlanningsFilter!$I$6:$I$1000=\"\",ROW(PlanningsFilter!$I$6:$I$1000)-ROW($I$6)+1)))),$C18)),\"\")","v":""},{"$f":"IFERROR(INDEX(PlanningsFilter!$L$6:$L$1000,SMALL(IF(PlanningsFilter!$K$6:$K$1000=$A18,IF(PlanningsFilter!$C$6:$C$1000=K$2,IF(PlanningsFilter!$J$6:$J$1000=K$4,IF(PlanningsFilter!$I$6:$I$1000=\"\",ROW(PlanningsFilter!$I$6:$I$1000)-ROW($I$6)+1)))),$C18)),\"\")","v":""},{"$f":"IFERROR(INDEX(PlanningsFilter!$L$6:$L$1000,SMALL(IF(PlanningsFilter!$K$6:$K$1000=$A18,IF(PlanningsFilter!$C$6:$C$1000=L$2,IF(PlanningsFilter!$J$6:$J$1000=L$4,IF(PlanningsFilter!$I$6:$I$1000=\"\",ROW(PlanningsFilter!$I$6:$I$1000)-ROW($I$6)+1)))),$C18)),\"\")","v":""},{"$f":"IFERROR(INDEX(PlanningsFilter!$L$6:$L$1000,SMALL(IF(PlanningsFilter!$K$6:$K$1000=$A18,IF(PlanningsFilter!$C$6:$C$1000=M$2,IF(PlanningsFilter!$J$6:$J$1000=M$4,IF(PlanningsFilter!$I$6:$I$1000=\"\",ROW(PlanningsFilter!$I$6:$I$1000)-ROW($I$6)+1)))),$C18)),\"\")","v":""},{"$f":"IFERROR(INDEX(PlanningsFilter!$L$6:$L$1000,SMALL(IF(PlanningsFilter!$K$6:$K$1000=$A18,IF(PlanningsFilter!$C$6:$C$1000=N$2,IF(PlanningsFilter!$J$6:$J$1000=N$4,IF(PlanningsFilter!$I$6:$I$1000=\"\",ROW(PlanningsFilter!$I$6:$I$1000)-ROW($I$6)+1)))),$C18)),\"\")","v":""},{"$f":"IFERROR(INDEX(PlanningsFilter!$L$6:$L$1000,SMALL(IF(PlanningsFilter!$K$6:$K$1000=$A18,IF(PlanningsFilter!$C$6:$C$1000=O$2,IF(PlanningsFilter!$J$6:$J$1000=O$4,IF(PlanningsFilter!$I$6:$I$1000=\"\",ROW(PlanningsFilter!$I$6:$I$1000)-ROW($I$6)+1)))),$C18)),\"\")","v":""},{"$f":"IFERROR(INDEX(PlanningsFilter!$L$6:$L$1000,SMALL(IF(PlanningsFilter!$K$6:$K$1000=$A18,IF(PlanningsFilter!$C$6:$C$1000=P$2,IF(PlanningsFilter!$J$6:$J$1000=P$4,IF(PlanningsFilter!$I$6:$I$1000=\"\",ROW(PlanningsFilter!$I$6:$I$1000)-ROW($I$6)+1)))),$C18)),\"\")","v":""},{"$f":"IFERROR(INDEX(PlanningsFilter!$L$6:$L$1000,SMALL(IF(PlanningsFilter!$K$6:$K$1000=$A18,IF(PlanningsFilter!$C$6:$C$1000=Q$2,IF(PlanningsFilter!$J$6:$J$1000=Q$4,IF(PlanningsFilter!$I$6:$I$1000=\"\",ROW(PlanningsFilter!$I$6:$I$1000)-ROW($I$6)+1)))),$C18)),\"\")","v":""},{"$f":"IFERROR(INDEX(PlanningsFilter!$L$6:$L$1000,SMALL(IF(PlanningsFilter!$K$6:$K$1000=$A18,IF(PlanningsFilter!$C$6:$C$1000=R$2,IF(PlanningsFilter!$J$6:$J$1000=R$4,IF(PlanningsFilter!$I$6:$I$1000=\"\",ROW(PlanningsFilter!$I$6:$I$1000)-ROW($I$6)+1)))),$C18)),\"\")","v":""},{"$f":"IFERROR(INDEX(PlanningsFilter!$L$6:$L$1000,SMALL(IF(PlanningsFilter!$K$6:$K$1000=$A18,IF(PlanningsFilter!$C$6:$C$1000=S$2,IF(PlanningsFilter!$J$6:$J$1000=S$4,IF(PlanningsFilter!$I$6:$I$1000=\"\",ROW(PlanningsFilter!$I$6:$I$1000)-ROW($I$6)+1)))),$C18)),\"\")","v":""},{"$f":"IFERROR(INDEX(PlanningsFilter!$L$6:$L$1000,SMALL(IF(PlanningsFilter!$K$6:$K$1000=$A18,IF(PlanningsFilter!$C$6:$C$1000=T$2,IF(PlanningsFilter!$J$6:$J$1000=T$4,IF(PlanningsFilter!$I$6:$I$1000=\"\",ROW(PlanningsFilter!$I$6:$I$1000)-ROW($I$6)+1)))),$C18)),\"\")","v":""},{"$f":"IFERROR(INDEX(PlanningsFilter!$L$6:$L$1000,SMALL(IF(PlanningsFilter!$K$6:$K$1000=$A18,IF(PlanningsFilter!$C$6:$C$1000=U$2,IF(PlanningsFilter!$J$6:$J$1000=U$4,IF(PlanningsFilter!$I$6:$I$1000=\"\",ROW(PlanningsFilter!$I$6:$I$1000)-ROW($I$6)+1)))),$C18)),\"\")","v":""},{"$f":"IFERROR(INDEX(PlanningsFilter!$L$6:$L$1000,SMALL(IF(PlanningsFilter!$K$6:$K$1000=$A18,IF(PlanningsFilter!$C$6:$C$1000=V$2,IF(PlanningsFilter!$J$6:$J$1000=V$4,IF(PlanningsFilter!$I$6:$I$1000=\"\",ROW(PlanningsFilter!$I$6:$I$1000)-ROW($I$6)+1)))),$C18)),\"\")","v":""},{"$f":"IFERROR(INDEX(PlanningsFilter!$L$6:$L$1000,SMALL(IF(PlanningsFilter!$K$6:$K$1000=$A18,IF(PlanningsFilter!$C$6:$C$1000=W$2,IF(PlanningsFilter!$J$6:$J$1000=W$4,IF(PlanningsFilter!$I$6:$I$1000=\"\",ROW(PlanningsFilter!$I$6:$I$1000)-ROW($I$6)+1)))),$C18)),\"\")","v":""},{"$f":"IFERROR(INDEX(PlanningsFilter!$L$6:$L$1000,SMALL(IF(PlanningsFilter!$K$6:$K$1000=$A18,IF(PlanningsFilter!$C$6:$C$1000=X$2,IF(PlanningsFilter!$J$6:$J$1000=X$4,IF(PlanningsFilter!$I$6:$I$1000=\"\",ROW(PlanningsFilter!$I$6:$I$1000)-ROW($I$6)+1)))),$C18)),\"\")","v":""}]
["SCHM",null,5,{"$f":"IFERROR(INDEX(PlanningsFilter!$L$6:$L$1000,SMALL(IF(PlanningsFilter!$K$6:$K$1000=$A19,IF(PlanningsFilter!$C$6:$C$1000=D$2,IF(PlanningsFilter!$J$6:$J$1000=D$4,IF(PlanningsFilter!$I$6:$I$1000=\"\",ROW(PlanningsFilter!$I$6:$I$1000)-ROW($I$6)+1)))),$C19)),\"\")","v":""},{"$f":"IFERROR(INDEX(PlanningsFilter!$L$6:$L$1000,SMALL(IF(PlanningsFilter!$K$6:$K$1000=$A19,IF(PlanningsFilter!$C$6:$C$1000=E$2,IF(PlanningsFilter!$J$6:$J$1000=E$4,IF(PlanningsFilter!$I$6:$I$1000=\"\",ROW(PlanningsFilter!$I$6:$I$1000)-ROW($I$6)+1)))),$C19)),\"\")","v":""},{"$f":"IFERROR(INDEX(PlanningsFilter!$L$6:$L$1000,SMALL(IF(PlanningsFilter!$K$6:$K$1000=$A19,IF(PlanningsFilter!$C$6:$C$1000=F$2,IF(PlanningsFilter!$J$6:$J$1000=F$4,IF(PlanningsFilter!$I$6:$I$1000=\"\",ROW(PlanningsFilter!$I$6:$I$1000)-ROW($I$6)+1)))),$C19)),\"\")","v":""},{"$f":"IFERROR(INDEX(PlanningsFilter!$L$6:$L$1000,SMALL(IF(PlanningsFilter!$K$6:$K$1000=$A19,IF(PlanningsFilter!$C$6:$C$1000=G$2,IF(PlanningsFilter!$J$6:$J$1000=G$4,IF(PlanningsFilter!$I$6:$I$1000=\"\",ROW(PlanningsFilter!$I$6:$I$1000)-ROW($I$6)+1)))),$C19)),\"\")","v":""},{"$f":"IFERROR(INDEX(PlanningsFilter!$L$6:$L$1000,SMALL(IF(PlanningsFilter!$K$6:$K$1000=$A19,IF(PlanningsFilter!$C$6:$C$1000=H$2,IF(PlanningsFilter!$J$6:$J$1000=H$4,IF(PlanningsFilter!$I$6:$I$1000=\"\",ROW(PlanningsFilter!$I$6:$I$1000)-ROW($I$6)+1)))),$C19)),\"\")","v":""},{"$f":"IFERROR(INDEX(PlanningsFilter!$L$6:$L$1000,SMALL(IF(PlanningsFilter!$K$6:$K$1000=$A19,IF(PlanningsFilter!$C$6:$C$1000=I$2,IF(PlanningsFilter!$J$6:$J$1000=I$4,IF(PlanningsFilter!$I$6:$I$1000=\"\",ROW(PlanningsFilter!$I$6:$I$1000)-ROW($I$6)+1)))),$C19)),\"\")","v":""},{"$f":"IFERROR(INDEX(PlanningsFilter!$L$6:$L$1000,SMALL(IF(PlanningsFilter!$K$6:$K$1000=$A19,IF(PlanningsFilter!$C$6:$C$1000=J$2,IF(PlanningsFilter!$J$6:$J$1000=J$4,IF(PlanningsFilter!$I$6:$I$1000=\"\",ROW(PlanningsFilter!$I$6:$I$1000)-ROW($I$6)+1)))),$C19)),\"\")","v":""},{"$f":"IFERROR(INDEX(PlanningsFilter!$L$6:$L$1000,SMALL(IF(PlanningsFilter!$K$6:$K$1000=$A19,IF(PlanningsFilter!$C$6:$C$1000=K$2,IF(PlanningsFilter!$J$6:$J$1000=K$4,IF(PlanningsFilter!$I$6:$I$1000=\"\",ROW(PlanningsFilter!$I$6:$I$1000)-ROW($I$6)+1)))),$C19)),\"\")","v":""},{"$f":"IFERROR(INDEX(PlanningsFilter!$L$6:$L$1000,SMALL(IF(PlanningsFilter!$K$6:$K$1000=$A19,IF(PlanningsFilter!$C$6:$C$1000=L$2,IF(PlanningsFilter!$J$6:$J$1000=L$4,IF(PlanningsFilter!$I$6:$I$1000=\"\",ROW(PlanningsFilter!$I$6:$I$1000)-ROW($I$6)+1)))),$C19)),\"\")","v":""},{"$f":"IFERROR(INDEX(PlanningsFilter!$L$6:$L$1000,SMALL(IF(PlanningsFilter!$K$6:$K$1000=$A19,IF(PlanningsFilter!$C$6:$C$1000=M$2,IF(PlanningsFilter!$J$6:$J$1000=M$4,IF(PlanningsFilter!$I$6:$I$1000=\"\",ROW(PlanningsFilter!$I$6:$I$1000)-ROW($I$6)+1)))),$C19)),\"\")","v":""},{"$f":"IFERROR(INDEX(PlanningsFilter!$L$6:$L$1000,SMALL(IF(PlanningsFilter!$K$6:$K$1000=$A19,IF(PlanningsFilter!$C$6:$C$1000=N$2,IF(PlanningsFilter!$J$6:$J$1000=N$4,IF(PlanningsFilter!$I$6:$I$1000=\"\",ROW(PlanningsFilter!$I$6:$I$1000)-ROW($I$6)+1)))),$C19)),\"\")","v":""},{"$f":"IFERROR(INDEX(PlanningsFilter!$L$6:$L$1000,SMALL(IF(PlanningsFilter!$K$6:$K$1000=$A19,IF(PlanningsFilter!$C$6:$C$1000=O$2,IF(PlanningsFilter!$J$6:$J$1000=O$4,IF(PlanningsFilter!$I$6:$I$1000=\"\",ROW(PlanningsFilter!$I$6:$I$1000)-ROW($I$6)+1)))),$C19)),\"\")","v":""},{"$f":"IFERROR(INDEX(PlanningsFilter!$L$6:$L$1000,SMALL(IF(PlanningsFilter!$K$6:$K$1000=$A19,IF(PlanningsFilter!$C$6:$C$1000=P$2,IF(PlanningsFilter!$J$6:$J$1000=P$4,IF(PlanningsFilter!$I$6:$I$1000=\"\",ROW(PlanningsFilter!$I$6:$I$1000)-ROW($I$6)+1)))),$C19)),\"\")","v":""},{"$f":"IFERROR(INDEX(PlanningsFilter!$L$6:$L$1000,SMALL(IF(PlanningsFilter!$K$6:$K$1000=$A19,IF(PlanningsFilter!$C$6:$C$1000=Q$2,IF(PlanningsFilter!$J$6:$J$1000=Q$4,IF(PlanningsFilter!$I$6:$I$1000=\"\",ROW(PlanningsFilter!$I$6:$I$1000)-ROW($I$6)+1)))),$C19)),\"\")","v":""},{"$f":"IFERROR(INDEX(PlanningsFilter!$L$6:$L$1000,SMALL(IF(PlanningsFilter!$K$6:$K$1000=$A19,IF(PlanningsFilter!$C$6:$C$1000=R$2,IF(PlanningsFilter!$J$6:$J$1000=R$4,IF(PlanningsFilter!$I$6:$I$1000=\"\",ROW(PlanningsFilter!$I$6:$I$1000)-ROW($I$6)+1)))),$C19)),\"\")","v":""},{"$f":"IFERROR(INDEX(PlanningsFilter!$L$6:$L$1000,SMALL(IF(PlanningsFilter!$K$6:$K$1000=$A19,IF(PlanningsFilter!$C$6:$C$1000=S$2,IF(PlanningsFilter!$J$6:$J$1000=S$4,IF(PlanningsFilter!$I$6:$I$1000=\"\",ROW(PlanningsFilter!$I$6:$I$1000)-ROW($I$6)+1)))),$C19)),\"\")","v":""},{"$f":"IFERROR(INDEX(PlanningsFilter!$L$6:$L$1000,SMALL(IF(PlanningsFilter!$K$6:$K$1000=$A19,IF(PlanningsFilter!$C$6:$C$1000=T$2,IF(PlanningsFilter!$J$6:$J$1000=T$4,IF(PlanningsFilter!$I$6:$I$1000=\"\",ROW(PlanningsFilter!$I$6:$I$1000)-ROW($I$6)+1)))),$C19)),\"\")","v":""},{"$f":"IFERROR(INDEX(PlanningsFilter!$L$6:$L$1000,SMALL(IF(PlanningsFilter!$K$6:$K$1000=$A19,IF(PlanningsFilter!$C$6:$C$1000=U$2,IF(PlanningsFilter!$J$6:$J$1000=U$4,IF(PlanningsFilter!$I$6:$I$1000=\"\",ROW(PlanningsFilter!$I$6:$I$1000)-ROW($I$6)+1)))),$C19)),\"\")","v":""},{"$f":"IFERROR(INDEX(PlanningsFilter!$L$6:$L$1000,SMALL(IF(PlanningsFilter!$K$6:$K$1000=$A19,IF(PlanningsFilter!$C$6:$C$1000=V$2,IF(PlanningsFilter!$J$6:$J$1000=V$4,IF(PlanningsFilter!$I$6:$I$1000=\"\",ROW(PlanningsFilter!$I$6:$I$1000)-ROW($I$6)+1)))),$C19)),\"\")","v":""},{"$f":"IFERROR(INDEX(PlanningsFilter!$L$6:$L$1000,SMALL(IF(PlanningsFilter!$K$6:$K$1000=$A19,IF(PlanningsFilter!$C$6:$C$1000=W$2,IF(PlanningsFilter!$J$6:$J$1000=W$4,IF(PlanningsFilter!$I$6:$I$1000=\"\",ROW(PlanningsFilter!$I$6:$I$1000)-ROW($I$6)+1)))),$C19)),\"\")","v":""},{"$f":"IFERROR(INDEX(PlanningsFilter!$L$6:$L$1000,SMALL(IF(PlanningsFilter!$K$6:$K$1000=$A19,IF(PlanningsFilter!$C$6:$C$1000=X$2,IF(PlanningsFilter!$J$6:$J$1000=X$4,IF(PlanningsFilter!$I$6:$I$1000=\"\",ROW(PlanningsFilter!$I$6:$I$1000)-ROW($I$6)+1)))),$C19)),\"\")","v":""}]
["WERKTIIJDEN",null,null,"06:00/14:45","13:45/22:30",null,"06:00/14:45","13:45/22:30",null,"06:00/14:45","13:45/22:30",null,"06:00/14:45","13:45/22:30",null,"06:00/14:45","13:45/22:30",null,"06:00/14:45","13:45/22:30",null,"06:00/14:45","13:45/22:30"]
["HAS",null,1,{"$f":"IFERROR(INDEX(PlanningsFilter!$L$6:$L$1000,SMALL(IF(PlanningsFilter!$K$6:$K$1000=$A21,IF(PlanningsFilter!$C$6:$C$1000=D$2,IF(PlanningsFilter!$J$6:$J$1000=D$4,IF(PlanningsFilter!$I$6:$I$1000=\"\",ROW(PlanningsFilter!$I$6:$I$1000)-ROW($I$6)+1)))),$C21)),\"\")","v":"Paul van Dongen"},{"$f":"IFERROR(INDEX(PlanningsFilter!$L$6:$L$1000,SMALL(IF(PlanningsFilter!$K$6:$K$1000=$A21,IF(PlanningsFilter!$C$6:$C$1000=E$2,IF(PlanningsFilter!$J$6:$J$1000=E$4,IF(PlanningsFilter!$I$6:$I$1000=\"\",ROW(PlanningsFilter!$I$6:$I$1000)-ROW($I$6)+1)))),$C21)),\"\")","v":"Norbert de Lange"},{"$f":"IFERROR(INDEX(PlanningsFilter!$L$6:$L$1000,SMALL(IF(PlanningsFilter!$K$6:$K$1000=$A21,IF(PlanningsFilter!$C$6:$C$1000=F$2,IF(PlanningsFilter!$J$6:$J$1000=F$4,IF(PlanningsFilter!$I$6:$I$1000=\"\",ROW(PlanningsFilter!$I$6:$I$1000)-ROW($I$6)+1)))),$C21)),\"\")","v":""},{"$f":"IFERROR(INDEX(PlanningsFilter!$L$6:$L$1000,SMALL(IF(PlanningsFilter!$K$6:$K$1000=$A21,IF(PlanningsFilter!$C$6:$C$1000=G$2,IF(PlanningsFilter!$J$6:$J$1000=G$4,IF(PlanningsFilter!$I$6:$I$1000=\"\",ROW(PlanningsFilter!$I$6:$I$1000)-ROW($I$6)+1)))),$C21)),\"\")","v":"Paul van Dongen"},{"$f":"IFERROR(INDEX(PlanningsFilter!$L$6:$L$1000,SMALL(IF(PlanningsFilter!$K$6:$K$1000=$A21,IF(PlanningsFilter!$C$6:$C$1000=H$2,IF(PlanningsFilter!$J$6:$J$1000=H$4,IF(PlanningsFilter!$I$6:$I$1000=\"\",ROW(PlanningsFilter!$I$6:$I$1000)-ROW($I$6)+1)))),$C21)),\"\")","v":"Norbert de Lange"},{"$f":"IFERROR(INDEX(PlanningsFilter!$L$6:$L$1000,SMALL(IF(PlanningsFilter!$K$6:$K$1000=$A21,IF(PlanningsFilter!$C$6:$C$1000=I$2,IF(PlanningsFilter!$J$6:$J$1000=I$4,IF(PlanningsFilter!$I$6:$I$1000=\"\",ROW(PlanningsFilter!$I$6:$I$1000)-ROW($I$6)+1)))),$C21)),\"\")","v":""},{"$f":"IFERROR(INDEX(PlanningsFilter!$L$6:$L$1000,SMALL(IF(PlanningsFilter!$K$6:$K$1000=$A21,IF(PlanningsFilter!$C$6:$C$1000=J$2,IF(PlanningsFilter!$J$6:$J$1000=J$4,IF(PlanningsFilter!$I$6:$I$1000=\"\",ROW(PlanningsFilter!$I$6:$I$1000)-ROW($I$6)+1)))),$C21)),\"\")","v":"Paul van Dongen"},{"$f":"IFERROR(INDEX(PlanningsFilter!$L$6:$L$1000,SMALL(IF(PlanningsFilter!$K$6:$K$1000=$A21,IF(PlanningsFilter!$C$6:$C$1000=K$2,IF(PlanningsFilter!$J$6:$J$1000=K$4,IF(PlanningsFilter!$I$6:$I$1000=\"\",ROW(PlanningsFilter!$I$6:$I$1000)-ROW($I$6)+1)))),$C21)),\"\")","v":"Norbert de Lange"},{"$f":"IFERROR(INDEX(PlanningsFilter!$L$6:$L$1000,SMALL(IF(PlanningsFilter!$K$6:$K$1000=$A21,IF(PlanningsFilter!$C$6:$C$1000=L$2,IF(PlanningsFilter!$J$6:$J$1000=L$4,IF(PlanningsFilter!$I$6:$I$1000=\"\",ROW(PlanningsFilter!$I$6:$I$1000)-ROW($I$6)+1)))),$C21)),\"\")","v":""},{"$f":"IFERROR(INDEX(PlanningsFilter!$L$6:$L$1000,SMALL(IF(PlanningsFilter!$K$6:$K$1000=$A21,IF(PlanningsFilter!$C$6:$C$1000=M$2,IF(PlanningsFilter!$J$6:$J$1000=M$4,IF(PlanningsFilter!$I$6:$I$1000=\"\",ROW(PlanningsFilter!$I$6:$I$1000)-ROW($I$6)+1)))),$C21)),\"\")","v":"Paul van Dongen"},{"$f":"IFERROR(INDEX(PlanningsFilter!$L$6:$L$1000,SMALL(IF(PlanningsFilter!$K$6:$K$1000=$A21,IF(PlanningsFilter!$C$6:$C$1000=N$2,IF(PlanningsFilter!$J$6:$J$1000=N$4,IF(PlanningsFilter!$I$6:$I$1000=\"\",ROW(PlanningsFilter!$I$6:$I$1000)-ROW($I$6)+1)))),$C21)),\"\")","v":"Norbert de Lange"},{"$f":"IFERROR(INDEX(PlanningsFilter!$L$6:$L$1000,SMALL(IF(PlanningsFilter!$K$6:$K$1000=$A21,IF(PlanningsFilter!$C$6:$C$1000=O$2,IF(PlanningsFilter!$J$6:$J$1000=O$4,IF(PlanningsFilter!$I$6:$I$1000=\"\",ROW(PlanningsFilter!$I$6:$I$1000)-ROW($I$6)+1)))),$C21)),\"\")","v":""},{"$f":"IFERROR(INDEX(PlanningsFilter!$L$6:$L$1000,SMALL(IF(PlanningsFilter!$K$6:$K$1000=$A21,IF(PlanningsFilter!$C$6:$C$1000=P$2,IF(PlanningsFilter!$J$6:$J$1000=P$4,IF(PlanningsFilter!$I$6:$I$1000=\"\",ROW(PlanningsFilter!$I$6:$I$1000)-ROW($I$6)+1)))),$C21)),\"\")","v":"Paul van Dongen"},{"$f":"IFERROR(INDEX(PlanningsFilter!$L$6:$L$1000,SMALL(IF(PlanningsFilter!$K$6:$K$1000=$A21,IF(PlanningsFilter!$C$6:$C$1000=Q$2,IF(PlanningsFilter!$J$6:$J$1000=Q$4,IF(PlanningsFilter!$I$6:$I$1000=\"\",ROW(PlanningsFilter!$I$6:$I$1000)-ROW($I$6)+1)))),$C21)),\"\")","v":"Norbert de Lange"},{"$f":"IFERROR(INDEX(PlanningsFilter!$L$6:$L$1000,SMALL(IF(PlanningsFilter!$K$6:$K$1000=$A21,IF(PlanningsFilter!$C$6:$C$1000=R$2,IF(PlanningsFilter!$J$6:$J$1000=R$4,IF(PlanningsFilter!$I$6:$I$1000=\"\",ROW(PlanningsFilter!$I$6:$I$1000)-ROW($I$6)+1)))),$C21)),\"\")","v":""},{"$f":"IFERROR(INDEX(PlanningsFilter!$L$6:$L$1000,SMALL(IF(PlanningsFilter!$K$6:$K$1000=$A21,IF(PlanningsFilter!$C$6:$C$1000=S$2,IF(PlanningsFilter!$J$6:$J$1000=S$4,IF(PlanningsFilter!$I$6:$I$1000=\"\",ROW(PlanningsFilter!$I$6:$I$1000)-ROW($I$6)+1)))),$C21)),\"\")","v":""},{"$f":"IFERROR(INDEX(PlanningsFilter!$L$6:$L$1000,SMALL(IF(PlanningsFilter!$K$6:$K$1000=$A21,IF(PlanningsFilter!$C$6:$C$1000=T$2,IF(PlanningsFilter!$J$6:$J$1000=T$4,IF(PlanningsFilter!$I$6:$I$1000=\"\",ROW(PlanningsFilter!$I$6:$I$1000)-ROW($I$6)+1)))),$C21)),\"\")","v":""},{"$f":"IFERROR(INDEX(PlanningsFilter!$L$6:$L$1000,SMALL(IF(PlanningsFilter!$K$6:$K$1000=$A21,IF(PlanningsFilter!$C$6:$C$1000=U$2,IF(PlanningsFilter!$J$6:$J$1000=U$4,IF(PlanningsFilter!$I$6:$I$1000=\"\",ROW(PlanningsFilter!$I$6:$I$1000)-ROW($I$6)+1)))),$C21)),\"\")","v":""},{"$f":"IFERROR(INDEX(PlanningsFilter!$L$6:$L$1000,SMALL(IF(PlanningsFilter!$K$6:$K$1000=$A21,IF(PlanningsFilter!$C$6:$C$1000=V$2,IF(PlanningsFilter!$J$6:$J$1000=V$4,IF(PlanningsFilter!$I$6:$I$1000=\"\",ROW(PlanningsFilter!$I$6:$I$1000)-ROW($I$6)+1)))),$C21)),\"\")","v":""},{"$f":"IFERROR(INDEX(PlanningsFilter!$L$6:$L$1000,SMALL(IF(PlanningsFilter!$K$6:$K$1000=$A21,IF(PlanningsFilter!$C$6:$C$1000=W$2,IF(PlanningsFilter!$J$6:$J$1000=W$4,IF(PlanningsFilter!$I$6:$I$1000=\"\",ROW(PlanningsFilter!$I$6:$I$1000)-ROW($I$6)+1)))),$C21)),\"\")","v":""},{"$f":"IFERROR(INDEX(PlanningsFilter!$L$6:$L$1000,SMALL(IF(PlanningsFilter!$K$6:$K$1000=$A21,IF(PlanningsFilter!$C$6:$C$1000=X$2,IF(PlanningsFilter!$J$6:$J$1000=X$4,IF(PlanningsFilter!$I$6:$I$1000=\"\",ROW(PlanningsFilter!$I$6:$I$1000)-ROW($I$6)+1)))),$C21)),\"\")","v":""}]
["HAS",null,2,{"$f":"IFERROR(INDEX(PlanningsFilter!$L$6:$L$1000,SMALL(IF(PlanningsFilter!$K$6:$K$1000=$A22,IF(PlanningsFilter!$C$6:$C$1000=D$2,IF(PlanningsFilter!$J$6:$J$1000=D$4,IF(PlanningsFilter!$I$6:$I$1000=\"\",ROW(PlanningsFilter!$I$6:$I$1000)-ROW($I$6)+1)))),$C22)),\"\")","v":"Paul van Dongen"},{"$f":"IFERROR(INDEX(PlanningsFilter!$L$6:$L$1000,SMALL(IF(PlanningsFilter!$K$6:$K$1000=$A22,IF(PlanningsFilter!$C$6:$C$1000=E$2,IF(PlanningsFilter!$J$6:$J$1000=E$4,IF(PlanningsFilter!$I$6:$I$1000=\"\",ROW(PlanningsFilter!$I$6:$I$1000)-ROW($I$6)+1)))),$C22)),\"\")","v":"Norbert de Lange"},{"$f":"IFERROR(INDEX(PlanningsFilter!$L$6:$L$1000,SMALL(IF(PlanningsFilter!$K$6:$K$1000=$A22,IF(PlanningsFilter!$C$6:$C$1000=F$2,IF(PlanningsFilter!$J$6:$J$1000=F$4,IF(PlanningsFilter!$I$6:$I$1000=\"\",ROW(PlanningsFilter!$I$6:$I$1000)-ROW($I$6)+1)))),$C22)),\"\")","v":""},{"$f":"IFERROR(INDEX(PlanningsFilter!$L$6:$L$1000,SMALL(IF(PlanningsFilter!$K$6:$K$1000=$A22,IF(PlanningsFilter!$C$6:$C$1000=G$2,IF(PlanningsFilter!$J$6:$J$1000=G$4,IF(PlanningsFilter!$I$6:$I$1000=\"\",ROW(PlanningsFilter!$I$6:$I$1000)-ROW($I$6)+1)))),$C22)),\"\")","v":"Paul van Dongen"},{"$f":"IFERROR(INDEX(PlanningsFilter!$L$6:$L$1000,SMALL(IF(PlanningsFilter!$K$6:$K$1000=$A22,IF(PlanningsFilter!$C$6:$C$1000=H$2,IF(PlanningsFilter!$J$6:$J$1000=H$4,IF(PlanningsFilter!$I$6:$I$1000=\"\",ROW(PlanningsFilter!$I$6:$I$1000)-ROW($I$6)+1)))),$C22)),\"\")","v":"Norbert de Lange"},{"$f":"IFERROR(INDEX(PlanningsFilter!$L$6:$L$1000,SMALL(IF(PlanningsFilter!$K$6:$K$1000=$A22,IF(PlanningsFilter!$C$6:$C$1000=I$2,IF(PlanningsFilter!$J$6:$J$1000=I$4,IF(PlanningsFilter!$I$6:$I$1000=\"\",ROW(PlanningsFilter!$I$6:$I$1000)-ROW($I$6)+1)))),$C22)),\"\")","v":""},{"$f":"IFERROR(INDEX(PlanningsFilter!$L$6:$L$1000,SMALL(IF(PlanningsFilter!$K$6:$K$1000=$A22,IF(PlanningsFilter!$C$6:$C$1000=J$2,IF(PlanningsFilter!$J$6:$J$1000=J$4,IF(PlanningsFilter!$I$6:$I$1000=\"\",ROW(PlanningsFilter!$I$6:$I$1000)-ROW($I$6)+1)))),$C22)),\"\")","v":"Paul van Dongen"},{"$f":"IFERROR(INDEX(PlanningsFilter!$L$6:$L$1000,SMALL(IF(PlanningsFilter!$K$6:$K$1000=$A22,IF(PlanningsFilter!$C$6:$C$1000=K$2,IF(PlanningsFilter!$J$6:$J$1000=K$4,IF(PlanningsFilter!$I$6:$I$1000=\"\",ROW(PlanningsFilter!$I$6:$I$1000)-ROW($I$6)+1)))),$C22)),\"\")","v":"Norbert de Lange"},{"$f":"IFERROR(INDEX(PlanningsFilter!$L$6:$L$1000,SMALL(IF(PlanningsFilter!$K$6:$K$1000=$A22,IF(PlanningsFilter!$C$6:$C$1000=L$2,IF(PlanningsFilter!$J$6:$J$1000=L$4,IF(PlanningsFilter!$I$6:$I$1000=\"\",ROW(PlanningsFilter!$I$6:$I$1000)-ROW($I$6)+1)))),$C22)),\"\")","v":""},{"$f":"IFERROR(INDEX(PlanningsFilter!$L$6:$L$1000,SMALL(IF(PlanningsFilter!$K$6:$K$1000=$A22,IF(PlanningsFilter!$C$6:$C$1000=M$2,IF(PlanningsFilter!$J$6:$J$1000=M$4,IF(PlanningsFilter!$I$6:$I$1000=\"\",ROW(PlanningsFilter!$I$6:$I$1000)-ROW($I$6)+1)))),$C22)),\"\")","v":"Paul van Dongen"},{"$f":"IFERROR(INDEX(PlanningsFilter!$L$6:$L$1000,SMALL(IF(PlanningsFilter!$K$6:$K$1000=$A22,IF(PlanningsFilter!$C$6:$C$1000=N$2,IF(PlanningsFilter!$J$6:$J$1000=N$4,IF(PlanningsFilter!$I$6:$I$1000=\"\",ROW(PlanningsFilter!$I$6:$I$1000)-ROW($I$6)+1)))),$C22)),\"\")","v":"Norbert de Lange"},{"$f":"IFERROR(INDEX(PlanningsFilter!$L$6:$L$1000,SMALL(IF(PlanningsFilter!$K$6:$K$1000=$A22,IF(PlanningsFilter!$C$6:$C$1000=O$2,IF(PlanningsFilter!$J$6:$J$1000=O$4,IF(PlanningsFilter!$I$6:$I$1000=\"\",ROW(PlanningsFilter!$I$6:$I$1000)-ROW($I$6)+1)))),$C22)),\"\")","v":""},{"$f":"IFERROR(INDEX(PlanningsFilter!$L$6:$L$1000,SMALL(IF(PlanningsFilter!$K$6:$K$1000=$A22,IF(PlanningsFilter!$C$6:$C$1000=P$2,IF(PlanningsFilter!$J$6:$J$1000=P$4,IF(PlanningsFilter!$I$6:$I$1000=\"\",ROW(PlanningsFilter!$I$6:$I$1000)-ROW($I$6)+1)))),$C22)),\"\")","v":"Paul van Dongen"},{"$f":"IFERROR(INDEX(PlanningsFilter!$L$6:$L$1000,SMALL(IF(PlanningsFilter!$K$6:$K$1000=$A22,IF(PlanningsFilter!$C$6:$C$1000=Q$2,IF(PlanningsFilter!$J$6:$J$1000=Q$4,IF(PlanningsFilter!$I$6:$I$1000=\"\",ROW(PlanningsFilter!$I$6:$I$1000)-ROW($I$6)+1)))),$C22)),\"\")","v":"Norbert de Lange"},{"$f":"IFERROR(INDEX(PlanningsFilter!$L$6:$L$1000,SMALL(IF(PlanningsFilter!$K$6:$K$1000=$A22,IF(PlanningsFilter!$C$6:$C$1000=R$2,IF(PlanningsFilter!$J$6:$J$1000=R$4,IF(PlanningsFilter!$I$6:$I$1000=\"\",ROW(PlanningsFilter!$I$6:$I$1000)-ROW($I$6)+1)))),$C22)),\"\")","v":""},{"$f":"IFERROR(INDEX(PlanningsFilter!$L$6:$L$1000,SMALL(IF(PlanningsFilter!$K$6:$K$1000=$A22,IF(PlanningsFilter!$C$6:$C$1000=S$2,IF(PlanningsFilter!$J$6:$J$1000=S$4,IF(PlanningsFilter!$I$6:$I$1000=\"\",ROW(PlanningsFilter!$I$6:$I$1000)-ROW($I$6)+1)))),$C22)),\"\")","v":""},{"$f":"IFERROR(INDEX(PlanningsFilter!$L$6:$L$1000,SMALL(IF(PlanningsFilter!$K$6:$K$1000=$A22,IF(PlanningsFilter!$C$6:$C$1000=T$2,IF(PlanningsFilter!$J$6:$J$1000=T$4,IF(PlanningsFilter!$I$6:$I$1000=\"\",ROW(PlanningsFilter!$I$6:$I$1000)-ROW($I$6)+1)))),$C22)),\"\")","v":""},{"$f":"IFERROR(INDEX(PlanningsFilter!$L$6:$L$1000,SMALL(IF(PlanningsFilter!$K$6:$K$1000=$A22,IF(PlanningsFilter!$C$6:$C$1000=U$2,IF(PlanningsFilter!$J$6:$J$1000=U$4,IF(PlanningsFilter!$I$6:$I$1000=\"\",ROW(PlanningsFilter!$I$6:$I$1000)-ROW($I$6)+1)))),$C22)),\"\")","v":""},{"$f":"IFERROR(INDEX(PlanningsFilter!$L$6:$L$1000,SMALL(IF(PlanningsFilter!$K$6:$K$1000=$A22,IF(PlanningsFilter!$C$6:$C$1000=V$2,IF(PlanningsFilter!$J$6:$J$1000=V$4,IF(PlanningsFilter!$I$6:$I$1000=\"\",ROW(PlanningsFilter!$I$6:$I$1000)-ROW($I$6)+1)))),$C22)),\"\")","v":""},{"$f":"IFERROR(INDEX(PlanningsFilter!$L$6:$L$1000,SMALL(IF(PlanningsFilter!$K$6:$K$1000=$A22,IF(PlanningsFilter!$C$6:$C$1000=W$2,IF(PlanningsFilter!$J$6:$J$1000=W$4,IF(PlanningsFilter!$I$6:$I$1000=\"\",ROW(PlanningsFilter!$I$6:$I$1000)-ROW($I$6)+1)))),$C22)),\"\")","v":""},{"$f":"IFERROR(INDEX(PlanningsFilter!$L$6:$L$1000,SMALL(IF(PlanningsFilter!$K$6:$K$1000=$A22,IF(PlanningsFilter!$C$6:$C$1000=X$2,IF(PlanningsFilter!$J$6:$J$1000=X$4,IF(PlanningsFilter!$I$6:$I$1000=\"\",ROW(PlanningsFilter!$I$6:$I$1000)-ROW($I$6)+1)))),$C22)),\"\")","v":""}]
["HAS",null,3,{"$f":"IFERROR(INDEX(PlanningsFilter!$L$6:$L$1000,SMALL(IF(PlanningsFilter!$K$6:$K$1000=$A23,IF(PlanningsFilter!$C$6:$C$1000=D$2,IF(PlanningsFilter!$J$6:$J$1000=D$4,IF(PlanningsFilter!$I$6:$I$1000=\"\",ROW(PlanningsFilter!$I$6:$I$1000)-ROW($I$6)+1)))),$C23)),\"\")","v":""},{"$f":"IFERROR(INDEX(PlanningsFilter!$L$6:$L$1000,SMALL(IF(PlanningsFilter!$K$6:$K$1000=$A23,IF(PlanningsFilter!$C$6:$C$1000=E$2,IF(PlanningsFilter!$J$6:$J$1000=E$4,IF(PlanningsFilter!$I$6:$I$1000=\"\",ROW(PlanningsFilter!$I$6:$I$1000)-ROW($I$6)+1)))),$C23)),\"\")","v":""},{"$f":"IFERROR(INDEX(PlanningsFilter!$L$6:$L$1000,SMALL(IF(PlanningsFilter!$K$6:$K$1000=$A23,IF(PlanningsFilter!$C$6:$C$1000=F$2,IF(PlanningsFilter!$J$6:$J$1000=F$4,IF(PlanningsFilter!$I$6:$I$1000=\"\",ROW(PlanningsFilter!$I$6:$I$1000)-ROW($I$6)+1)))),$C23)),\"\")","v":""},{"$f":"IFERROR(INDEX(PlanningsFilter!$L$6:$L$1000,SMALL(IF(PlanningsFilter!$K$6:$K$1000=$A23,IF(PlanningsFilter!$C$6:$C$1000=G$2,IF(PlanningsFilter!$J$6:$J$1000=G$4,IF(PlanningsFilter!$I$6:$I$1000=\"\",ROW(PlanningsFilter!$I$6:$I$1000)-ROW($I$6)+1)))),$C23)),\"\")","v":""},{"$f":"IFERROR(INDEX(PlanningsFilter!$L$6:$L$1000,SMALL(IF(PlanningsFilter!$K$6:$K$1000=$A23,IF(PlanningsFilter!$C$6:$C$1000=H$2,IF(PlanningsFilter!$J$6:$J$1000=H$4,IF(PlanningsFilter!$I$6:$I$1000=\"\",ROW(PlanningsFilter!$I$6:$I$1000)-ROW($I$6)+1)))),$C23)),\"\")","v":""},{"$f":"IFERROR(INDEX(PlanningsFilter!$L$6:$L$1000,SMALL(IF(PlanningsFilter!$K$6:$K$1000=$A23,IF(PlanningsFilter!$C$6:$C$1000=I$2,IF(PlanningsFilter!$J$6:$J$1000=I$4,IF(PlanningsFilter!$I$6:$I$1000=\"\",ROW(PlanningsFilter!$I$6:$I$1000)-ROW($I$6)+1)))),$C23)),\"\")","v":""},{"$f":"IFERROR(INDEX(PlanningsFilter!$L$6:$L$1000,SMALL(IF(PlanningsFilter!$K$6:$K$1000=$A23,IF(PlanningsFilter!$C$6:$C$1000=J$2,IF(PlanningsFilter!$J$6:$J$1000=J$4,IF(PlanningsFilter!$I$6:$I$1000=\"\",ROW(PlanningsFilter!$I$6:$I$1000)-ROW($I$6)+1)))),$C23)),\"\")","v":""},{"$f":"IFERROR(INDEX(PlanningsFilter!$L$6:$L$1000,SMALL(IF(PlanningsFilter!$K$6:$K$1000=$A23,IF(PlanningsFilter!$C$6:$C$1000=K$2,IF(PlanningsFilter!$J$6:$J$1000=K$4,IF(PlanningsFilter!$I$6:$I$1000=\"\",ROW(PlanningsFilter!$I$6:$I$1000)-ROW($I$6)+1)))),$C23)),\"\")","v":""},{"$f":"IFERROR(INDEX(PlanningsFilter!$L$6:$L$1000,SMALL(IF(PlanningsFilter!$K$6:$K$1000=$A23,IF(PlanningsFilter!$C$6:$C$1000=L$2,IF(PlanningsFilter!$J$6:$J$1000=L$4,IF(PlanningsFilter!$I$6:$I$1000=\"\",ROW(PlanningsFilter!$I$6:$I$1000)-ROW($I$6)+1)))),$C23)),\"\")","v":""},{"$f":"IFERROR(INDEX(PlanningsFilter!$L$6:$L$1000,SMALL(IF(PlanningsFilter!$K$6:$K$1000=$A23,IF(PlanningsFilter!$C$6:$C$1000=M$2,IF(PlanningsFilter!$J$6:$J$1000=M$4,IF(PlanningsFilter!$I$6:$I$1000=\"\",ROW(PlanningsFilter!$I$6:$I$1000)-ROW($I$6)+1)))),$C23)),\"\")","v":""},{"$f":"IFERROR(INDEX(PlanningsFilter!$L$6:$L$1000,SMALL(IF(PlanningsFilter!$K$6:$K$1000=$A23,IF(PlanningsFilter!$C$6:$C$1000=N$2,IF(PlanningsFilter!$J$6:$J$1000=N$4,IF(PlanningsFilter!$I$6:$I$1000=\"\",ROW(PlanningsFilter!$I$6:$I$1000)-ROW($I$6)+1)))),$C23)),\"\")","v":""},{"$f":"IFERROR(INDEX(PlanningsFilter!$L$6:$L$1000,SMALL(IF(PlanningsFilter!$K$6:$K$1000=$A23,IF(PlanningsFilter!$C$6:$C$1000=O$2,IF(PlanningsFilter!$J$6:$J$1000=O$4,IF(PlanningsFilter!$I$6:$I$1000=\"\",ROW(PlanningsFilter!$I$6:$I$1000)-ROW($I$6)+1)))),$C23)),\"\")","v":""},{"$f":"IFERROR(INDEX(PlanningsFilter!$L$6:$L$1000,SMALL(IF(PlanningsFilter!$K$6:$K$1000=$A23,IF(PlanningsFilter!$C$6:$C$1000=P$2,IF(PlanningsFilter!$J$6:$J$1000=P$4,IF(PlanningsFilter!$I$6:$I$1000=\"\",ROW(PlanningsFilter!$I$6:$I$1000)-ROW($I$6)+1)))),$C23)),\"\")","v":""},{"$f":"IFERROR(INDEX(PlanningsFilter!$L$6:$L$1000,SMALL(IF(PlanningsFilter!$K$6:$K$1000=$A23,IF(PlanningsFilter!$C$6:$C$1000=Q$2,IF(PlanningsFilter!$J$6:$J$1000=Q$4,IF(PlanningsFilter!$I$6:$I$1000=\"\",ROW(PlanningsFilter!$I$6:$I$1000)-ROW($I$6)+1)))),$C23)),\"\")","v":""},{"$f":"IFERROR(INDEX(PlanningsFilter!$L$6:$L$1000,SMALL(IF(PlanningsFilter!$K$6:$K$1000=$A23,IF(PlanningsFilter!$C$6:$C$1000=R$2,IF(PlanningsFilter!$J$6:$J$1000=R$4,IF(PlanningsFilter!$I$6:$I$1000=\"\",ROW(PlanningsFilter!$I$6:$I$1000)-ROW($I$6)+1)))),$C23)),\"\")","v":""},{"$f":"IFERROR(INDEX(PlanningsFilter!$L$6:$L$1000,SMALL(IF(PlanningsFilter!$K$6:$K$1000=$A23,IF(PlanningsFilter!$C$6:$C$1000=S$2,IF(PlanningsFilter!$J$6:$J$1000=S$4,IF(PlanningsFilter!$I$6:$I$1000=\"\",ROW(PlanningsFilter!$I$6:$I$1000)-ROW($I$6)+1)))),$C23)),\"\")","v":""},{"$f":"IFERROR(INDEX(PlanningsFilter!$L$6:$L$1000,SMALL(IF(PlanningsFilter!$K$6:$K$1000=$A23,IF(PlanningsFilter!$C$6:$C$1000=T$2,IF(PlanningsFilter!$J$6:$J$1000=T$4,IF(PlanningsFilter!$I$6:$I$1000=\"\",ROW(PlanningsFilter!$I$6:$I$1000)-ROW($I$6)+1)))),$C23)),\"\")","v":""},{"$f":"IFERROR(INDEX(PlanningsFilter!$L$6:$L$1000,SMALL(IF(PlanningsFilter!$K$6:$K$1000=$A23,IF(PlanningsFilter!$C$6:$C$1000=U$2,IF(PlanningsFilter!$J$6:$J$1000=U$4,IF(PlanningsFilter!$I$6:$I$1000=\"\",ROW(PlanningsFilter!$I$6:$I$1000)-ROW($I$6)+1)))),$C23)),\"\")","v":""},{"$f":"IFERROR(INDEX(PlanningsFilter!$L$6:$L$1000,SMALL(IF(PlanningsFilter!$K$6:$K$1000=$A23,IF(PlanningsFilter!$C$6:$C$1000=V$2,IF(PlanningsFilter!$J$6:$J$1000=V$4,IF(PlanningsFilter!$I$6:$I$1000=\"\",ROW(PlanningsFilter!$I$6:$I$1000)-ROW($I$6)+1)))),$C23)),\"\")","v":""},{"$f":"IFERROR(INDEX(PlanningsFilter!$L$6:$L$1000,SMALL(IF(PlanningsFilter!$K$6:$K$1000=$A23,IF(PlanningsFilter!$C$6:$C$1000=W$2,IF(PlanningsFilter!$J$6:$J$1000=W$4,IF(PlanningsFilter!$I$6:$I$1000=\"\",ROW(PlanningsFilter!$I$6:$I$1000)-ROW($I$6)+1)))),$C23)),\"\")","v":""},{"$f":"IFERROR(INDEX(PlanningsFilter!$L$6:$L$1000,SMALL(IF(PlanningsFilter!$K$6:$K$1000=$A23,IF(PlanningsFilter!$C$6:$C$1000=X$2,IF(PlanningsFilter!$J$6:$J$1000=X$4,IF(PlanningsFilter!$I$6:$I$1000=\"\",ROW(PlanningsFilter!$I$6:$I$1000)-ROW($I$6)+1)))),$C23)),\"\")","v":""}]
["HAS",null,4,{"$f":"IFERROR(INDEX(PlanningsFilter!$L$6:$L$1000,SMALL(IF(PlanningsFilter!$K$6:$K$1000=$A24,IF(PlanningsFilter!$C$6:$C$1000=D$2,IF(PlanningsFilter!$J$6:$J$1000=D$4,IF(PlanningsFilter!$I$6:$I$1000=\"\",ROW(PlanningsFilter!$I$6:$I$1000)-ROW($I$6)+1)))),$C24)),\"\")","v":""},{"$f":"IFERROR(INDEX(PlanningsFilter!$L$6:$L$1000,SMALL(IF(PlanningsFilter!$K$6:$K$1000=$A24,IF(PlanningsFilter!$C$6:$C$1000=E$2,IF(PlanningsFilter!$J$6:$J$1000=E$4,IF(PlanningsFilter!$I$6:$I$1000=\"\",ROW(PlanningsFilter!$I$6:$I$1000)-ROW($I$6)+1)))),$C24)),\"\")","v":""},{"$f":"IFERROR(INDEX(PlanningsFilter!$L$6:$L$1000,SMALL(IF(PlanningsFilter!$K$6:$K$1000=$A24,IF(PlanningsFilter!$C$6:$C$1000=F$2,IF(PlanningsFilter!$J$6:$J$1000=F$4,IF(PlanningsFilter!$I$6:$I$1000=\"\",ROW(PlanningsFilter!$I$6:$I$1000)-ROW($I$6)+1)))),$C24)),\"\")","v":""},{"$f":"IFERROR(INDEX(PlanningsFilter!$L$6:$L$1000,SMALL(IF(PlanningsFilter!$K$6:$K$1000=$A24,IF(PlanningsFilter!$C$6:$C$1000=G$2,IF(PlanningsFilter!$J$6:$J$1000=G$4,IF(PlanningsFilter!$I$6:$I$1000=\"\",ROW(PlanningsFilter!$I$6:$I$1000)-ROW($I$6)+1)))),$C24)),\"\")","v":""},{"$f":"IFERROR(INDEX(PlanningsFilter!$L$6:$L$1000,SMALL(IF(PlanningsFilter!$K$6:$K$1000=$A24,IF(PlanningsFilter!$C$6:$C$1000=H$2,IF(PlanningsFilter!$J$6:$J$1000=H$4,IF(PlanningsFilter!$I$6:$I$1000=\"\",ROW(PlanningsFilter!$I$6:$I$1000)-ROW($I$6)+1)))),$C24)),\"\")","v":""},{"$f":"IFERROR(INDEX(PlanningsFilter!$L$6:$L$1000,SMALL(IF(PlanningsFilter!$K$6:$K$1000=$A24,IF(PlanningsFilter!$C$6:$C$1000=I$2,IF(PlanningsFilter!$J$6:$J$1000=I$4,IF(PlanningsFilter!$I$6:$I$1000=\"\",ROW(PlanningsFilter!$I$6:$I$1000)-ROW($I$6)+1)))),$C24)),\"\")","v":""},{"$f":"IFERROR(INDEX(PlanningsFilter!$L$6:$L$1000,SMALL(IF(PlanningsFilter!$K$6:$K$1000=$A24,IF(PlanningsFilter!$C$6:$C$1000=J$2,IF(PlanningsFilter!$J$6:$J$1000=J$4,IF(PlanningsFilter!$I$6:$I$1000=\"\",ROW(PlanningsFilter!$I$6:$I$1000)-ROW($I$6)+1)))),$C24)),\"\")","v":""},{"$f":"IFERROR(INDEX(PlanningsFilter!$L$6:$L$1000,SMALL(IF(PlanningsFilter!$K$6:$K$1000=$A24,IF(PlanningsFilter!$C$6:$C$1000=K$2,IF(PlanningsFilter!$J$6:$J$1000=K$4,IF(PlanningsFilter!$I$6:$I$1000=\"\",ROW(PlanningsFilter!$I$6:$I$1000)-ROW($I$6)+1)))),$C24)),\"\")","v":""},{"$f":"IFERROR(INDEX(PlanningsFilter!$L$6:$L$1000,SMALL(IF(PlanningsFilter!$K$6:$K$1000=$A24,IF(PlanningsFilter!$C$6:$C$1000=L$2,IF(PlanningsFilter!$J$6:$J$1000=L$4,IF(PlanningsFilter!$I$6:$I$1000=\"\",ROW(PlanningsFilter!$I$6:$I$1000)-ROW($I$6)+1)))),$C24)),\"\")","v":""},{"$f":"IFERROR(INDEX(PlanningsFilter!$L$6:$L$1000,SMALL(IF(PlanningsFilter!$K$6:$K$1000=$A24,IF(PlanningsFilter!$C$6:$C$1000=M$2,IF(PlanningsFilter!$J$6:$J$1000=M$4,IF(PlanningsFilter!$I$6:$I$1000=\"\",ROW(PlanningsFilter!$I$6:$I$1000)-ROW($I$6)+1)))),$C24)),\"\")","v":""},{"$f":"IFERROR(INDEX(PlanningsFilter!$L$6:$L$1000,SMALL(IF(PlanningsFilter!$K$6:$K$1000=$A24,IF(PlanningsFilter!$C$6:$C$1000=N$2,IF(PlanningsFilter!$J$6:$J$1000=N$4,IF(PlanningsFilter!$I$6:$I$1000=\"\",ROW(PlanningsFilter!$I$6:$I$1000)-ROW($I$6)+1)))),$C24)),\"\")","v":""},{"$f":"IFERROR(INDEX(PlanningsFilter!$L$6:$L$1000,SMALL(IF(PlanningsFilter!$K$6:$K$1000=$A24,IF(PlanningsFilter!$C$6:$C$1000=O$2,IF(PlanningsFilter!$J$6:$J$1000=O$4,IF(PlanningsFilter!$I$6:$I$1000=\"\",ROW(PlanningsFilter!$I$6:$I$1000)-ROW($I$6)+1)))),$C24)),\"\")","v":""},{"$f":"IFERROR(INDEX(PlanningsFilter!$L$6:$L$1000,SMALL(IF(PlanningsFilter!$K$6:$K$1000=$A24,IF(PlanningsFilter!$C$6:$C$1000=P$2,IF(PlanningsFilter!$J$6:$J$1000=P$4,IF(PlanningsFilter!$I$6:$I$1000=\"\",ROW(PlanningsFilter!$I$6:$I$1000)-ROW($I$6)+1)))),$C24)),\"\")","v":""},{"$f":"IFERROR(INDEX(PlanningsFilter!$L$6:$L$1000,SMALL(IF(PlanningsFilter!$K$6:$K$1000=$A24,IF(PlanningsFilter!$C$6:$C$1000=Q$2,IF(PlanningsFilter!$J$6:$J$1000=Q$4,IF(PlanningsFilter!$I$6:$I$1000=\"\",ROW(PlanningsFilter!$I$6:$I$1000)-ROW($I$6)+1)))),$C24)),\"\")","v":""},{"$f":"IFERROR(INDEX(PlanningsFilter!$L$6:$L$1000,SMALL(IF(PlanningsFilter!$K$6:$K$1000=$A24,IF(PlanningsFilter!$C$6:$C$1000=R$2,IF(PlanningsFilter!$J$6:$J$1000=R$4,IF(PlanningsFilter!$I$6:$I$1000=\"\",ROW(PlanningsFilter!$I$6:$I$1000)-ROW($I$6)+1)))),$C24)),\"\")","v":""},{"$f":"IFERROR(INDEX(PlanningsFilter!$L$6:$L$1000,SMALL(IF(PlanningsFilter!$K$6:$K$1000=$A24,IF(PlanningsFilter!$C$6:$C$1000=S$2,IF(PlanningsFilter!$J$6:$J$1000=S$4,IF(PlanningsFilter!$I$6:$I$1000=\"\",ROW(PlanningsFilter!$I$6:$I$1000)-ROW($I$6)+1)))),$C24)),\"\")","v":""},{"$f":"IFERROR(INDEX(PlanningsFilter!$L$6:$L$1000,SMALL(IF(PlanningsFilter!$K$6:$K$1000=$A24,IF(PlanningsFilter!$C$6:$C$1000=T$2,IF(PlanningsFilter!$J$6:$J$1000=T$4,IF(PlanningsFilter!$I$6:$I$1000=\"\",ROW(PlanningsFilter!$I$6:$I$1000)-ROW($I$6)+1)))),$C24)),\"\")","v":""},{"$f":"IFERROR(INDEX(PlanningsFilter!$L$6:$L$1000,SMALL(IF(PlanningsFilter!$K$6:$K$1000=$A24,IF(PlanningsFilter!$C$6:$C$1000=U$2,IF(PlanningsFilter!$J$6:$J$1000=U$4,IF(PlanningsFilter!$I$6:$I$1000=\"\",ROW(PlanningsFilter!$I$6:$I$1000)-ROW($I$6)+1)))),$C24)),\"\")","v":""},{"$f":"IFERROR(INDEX(PlanningsFilter!$L$6:$L$1000,SMALL(IF(PlanningsFilter!$K$6:$K$1000=$A24,IF(PlanningsFilter!$C$6:$C$1000=V$2,IF(PlanningsFilter!$J$6:$J$1000=V$4,IF(PlanningsFilter!$I$6:$I$1000=\"\",ROW(PlanningsFilter!$I$6:$I$1000)-ROW($I$6)+1)))),$C24)),\"\")","v":""},{"$f":"IFERROR(INDEX(PlanningsFilter!$L$6:$L$1000,SMALL(IF(PlanningsFilter!$K$6:$K$1000=$A24,IF(PlanningsFilter!$C$6:$C$1000=W$2,IF(PlanningsFilter!$J$6:$J$1000=W$4,IF(PlanningsFilter!$I$6:$I$1000=\"\",ROW(PlanningsFilter!$I$6:$I$1000)-ROW($I$6)+1)))),$C24)),\"\")","v":""},{"$f":"IFERROR(INDEX(PlanningsFilter!$L$6:$L$1000,SMALL(IF(PlanningsFilter!$K$6:$K$1000=$A24,IF(PlanningsFilter!$C$6:$C$1000=X$2,IF(PlanningsFilter!$J$6:$J$1000=X$4,IF(PlanningsFilter!$I$6:$I$1000=\"\",ROW(PlanningsFilter!$I$6:$I$1000)-ROW($I$6)+1)))),$C24)),\"\")","v":""}]
["LCR",null,1,{"$f":"IFERROR(INDEX(PlanningsFilter!$L$6:$L$1000,SMALL(IF(PlanningsFilter!$K$6:$K$1000=$A25,IF(PlanningsFilter!$C$6:$C$1000=D$2,IF(PlanningsFilter!$J$6:$J$1000=D$4,IF(PlanningsFilter!$I$6:$I$1000=\"\",ROW(PlanningsFilter!$I$6:$I$1000)-ROW($I$6)+1)))),$C25)),\"\")","v":"Sami van der Horst"},{"$f":"IFERROR(INDEX(PlanningsFilter!$L$6:$L$1000,SMALL(IF(PlanningsFilter!$K$6:$K$1000=$A25,IF(PlanningsFilter!$C$6:$C$1000=E$2,IF(PlanningsFilter!$J$6:$J$1000=E$4,IF(PlanningsFilter!$I$6:$I$1000=\"\",ROW(PlanningsFilter!$I$6:$I$1000)-ROW($I$6)+1)))),$C25)),\"\")","v":"Klaas Kramer"},{"$f":"IFERROR(INDEX(PlanningsFilter!$L$6:$L$1000,SMALL(IF(PlanningsFilter!$K$6:$K$1000=$A25,IF(PlanningsFilter!$C$6:$C$1000=F$2,IF(PlanningsFilter!$J$6:$J$1000=F$4,IF(PlanningsFilter!$I$6:$I$1000=\"\",ROW(PlanningsFilter!$I$6:$I$1000)-ROW($I$6)+1)))),$C25)),\"\")","v":""},{"$f":"IFERROR(INDEX(PlanningsFilter!$L$6:$L$1000,SMALL(IF(PlanningsFilter!$K$6:$K$1000=$A25,IF(PlanningsFilter!$C$6:$C$1000=G$2,IF(PlanningsFilter!$J$6:$J$1000=G$4,IF(PlanningsFilter!$I$6:$I$1000=\"\",ROW(PlanningsFilter!$I$6:$I$1000)-ROW($I$6)+1)))),$C25)),\"\")","v":"Sami van der Horst"},{"$f":"IFERROR(INDEX(PlanningsFilter!$L$6:$L$1000,SMALL(IF(PlanningsFilter!$K$6:$K$1000=$A25,IF(PlanningsFilter!$C$6:$C$1000=H$2,IF(PlanningsFilter!$J$6:$J$1000=H$4,IF(PlanningsFilter!$I$6:$I$1000=\"\",ROW(PlanningsFilter!$I$6:$I$1000)-ROW($I$6)+1)))),$C25)),\"\")","v":"Klaas Kramer"},{"$f":"IFERROR(INDEX(PlanningsFilter!$L$6:$L$1000,SMALL(IF(PlanningsFilter!$K$6:$K$1000=$A25,IF(PlanningsFilter!$C$6:$C$1000=I$2,IF(PlanningsFilter!$J$6:$J$1000=I$4,IF(PlanningsFilter!$I$6:$I$1000=\"\",ROW(PlanningsFilter!$I$6:$I$1000)-ROW($I$6)+1)))),$C25)),\"\")","v":""},{"$f":"IFERROR(INDEX(PlanningsFilter!$L$6:$L$1000,SMALL(IF(PlanningsFilter!$K$6:$K$1000=$A25,IF(PlanningsFilter!$C$6:$C$1000=J$2,IF(PlanningsFilter!$J$6:$J$1000=J$4,IF(PlanningsFilter!$I$6:$I$1000=\"\",ROW(PlanningsFilter!$I$6:$I$1000)-ROW($I$6)+1)))),$C25)),\"\")","v":"Sami van der Horst"},{"$f":"IFERROR(INDEX(PlanningsFilter!$L$6:$L$1000,SMALL(IF(PlanningsFilter!$K$6:$K$1000=$A25,IF(PlanningsFilter!$C$6:$C$1000=K$2,IF(PlanningsFilter!$J$6:$J$1000=K$4,IF(PlanningsFilter!$I$6:$I$1000=\"\",ROW(PlanningsFilter!$I$6:$I$1000)-ROW($I$6)+1)))),$C25)),\"\")","v":"Sebastiaan Mol"},{"$f":"IFERROR(INDEX(PlanningsFilter!$L$6:$L$1000,SMALL(IF(PlanningsFilter!$K$6:$K$1000=$A25,IF(PlanningsFilter!$C$6:$C$1000=L$2,IF(PlanningsFilter!$J$6:$J$1000=L$4,IF(PlanningsFilter!$I$6:$I$1000=\"\",ROW(PlanningsFilter!$I$6:$I$1000)-ROW($I$6)+1)))),$C25)),\"\")","v":""},{"$f":"IFERROR(INDEX(PlanningsFilter!$L$6:$L$1000,SMALL(IF(PlanningsFilter!$K$6:$K$1000=$A25,IF(PlanningsFilter!$C$6:$C$1000=M$2,IF(PlanningsFilter!$J$6:$J$1000=M$4,IF(PlanningsFilter!$I$6:$I$1000=\"\",ROW(PlanningsFilter!$I$6:$I$1000)-ROW($I$6)+1)))),$C25)),\"\")","v":"Sami van der Horst"},{"$f":"IFERROR(INDEX(PlanningsFilter!$L$6:$L$1000,SMALL(IF(PlanningsFilter!$K$6:$K$1000=$A25,IF(PlanningsFilter!$C$6:$C$1000=N$2,IF(PlanningsFilter!$J$6:$J$1000=N$4,IF(PlanningsFilter!$I$6:$I$1000=\"\",ROW(PlanningsFilter!$I$6:$I$1000)-ROW($I$6)+1)))),$C25)),\"\")","v":"Klaas Kramer"},{"$f":"IFERROR(INDEX(PlanningsFilter!$L$6:$L$1000,SMALL(IF(PlanningsFilter!$K$6:$K$1000=$A25,IF(PlanningsFilter!$C$6:$C$1000=O$2,IF(PlanningsFilter!$J$6:$J$1000=O$4,IF(PlanningsFilter!$I$6:$I$1000=\"\",ROW(PlanningsFilter!$I$6:$I$1000)-ROW($I$6)+1)))),$C25)),\"\")","v":""},{"$f":"IFERROR(INDEX(PlanningsFilter!$L$6:$L$1000,SMALL(IF(PlanningsFilter!$K$6:$K$1000=$A25,IF(PlanningsFilter!$C$6:$C$1000=P$2,IF(PlanningsFilter!$J$6:$J$1000=P$4,IF(PlanningsFilter!$I$6:$I$1000=\"\",ROW(PlanningsFilter!$I$6:$I$1000)-ROW($I$6)+1)))),$C25)),\"\")","v":"Sami van der Horst"},{"$f":"IFERROR(INDEX(PlanningsFilter!$L$6:$L$1000,SMALL(IF(PlanningsFilter!$K$6:$K$1000=$A25,IF(PlanningsFilter!$C$6:$C$1000=Q$2,IF(PlanningsFilter!$J$6:$J$1000=Q$4,IF(PlanningsFilter!$I$6:$I$1000=\"\",ROW(PlanningsFilter!$I$6:$I$1000)-ROW($I$6)+1)))),$C25)),\"\")","v":"Klaas Kramer"},{"$f":"IFERROR(INDEX(PlanningsFilter!$L$6:$L$1000,SMALL(IF(PlanningsFilter!$K$6:$K$1000=$A25,IF(PlanningsFilter!$C$6:$C$1000=R$2,IF(PlanningsFilter!$J$6:$J$1000=R$4,IF(PlanningsFilter!$I$6:$I$1000=\"\",ROW(PlanningsFilter!$I$6:$I$1000)-ROW($I$6)+1)))),$C25)),\"\")","v":""},{"$f":"IFERROR(INDEX(PlanningsFilter!$L$6:$L$1000,SMALL(IF(PlanningsFilter!$K$6:$K$1000=$A25,IF(PlanningsFilter!$C$6:$C$1000=S$2,IF(PlanningsFilter!$J$6:$J$1000=S$4,IF(PlanningsFilter!$I$6:$I$1000=\"\",ROW(PlanningsFilter!$I$6:$I$1000)-ROW($I$6)+1)))),$C25)),\"\")","v":""},{"$f":"IFERROR(INDEX(PlanningsFilter!$L$6:$L$1000,SMALL(IF(PlanningsFilter!$K$6:$K$1000=$A25,IF(PlanningsFilter!$C$6:$C$1000=T$2,IF(PlanningsFilter!$J$6:$J$1000=T$4,IF(PlanningsFilter!$I$6:$I$1000=\"\",ROW(PlanningsFilter!$I$6:$I$1000)-ROW($I$6)+1)))),$C25)),\"\")","v":""},{"$f":"IFERROR(INDEX(PlanningsFilter!$L$6:$L$1000,SMALL(IF(PlanningsFilter!$K$6:$K$1000=$A25,IF(PlanningsFilter!$C$6:$C$1000=U$2,IF(PlanningsFilter!$J$6:$J$1000=U$4,IF(PlanningsFilter!$I$6:$I$1000=\"\",ROW(PlanningsFilter!$I$6:$I$1000)-ROW($I$6)+1)))),$C25)),\"\")","v":""},{"$f":"IFERROR(INDEX(PlanningsFilter!$L$6:$L$1000,SMALL(IF(PlanningsFilter!$K$6:$K$1000=$A25,IF(PlanningsFilter!$C$6:$C$1000=V$2,IF(PlanningsFilter!$J$6:$J$1000=V$4,IF(PlanningsFilter!$I$6:$I$1000=\"\",ROW(PlanningsFilter!$I$6:$I$1000)-ROW($I$6)+1)))),$C25)),\"\")","v":""},{"$f":"IFERROR(INDEX(PlanningsFilter!$L$6:$L$1000,SMALL(IF(PlanningsFilter!$K$6:$K$1000=$A25,IF(PlanningsFilter!$C$6:$C$1000=W$2,IF(PlanningsFilter!$J$6:$J$1000=W$4,IF(PlanningsFilter!$I$6:$I$1000=\"\",ROW(PlanningsFilter!$I$6:$I$1000)-ROW($I$6)+1)))),$C25)),\"\")","v":""},{"$f":"IFERROR(INDEX(PlanningsFilter!$L$6:$L$1000,SMALL(IF(PlanningsFilter!$K$6:$K$1000=$A25,IF(PlanningsFilter!$C$6:$C$1000=X$2,IF(PlanningsFilter!$J$6:$J$1000=X$4,IF(PlanningsFilter!$I$6:$I$1000=\"\",ROW(PlanningsFilter!$I$6:$I$1000)-ROW($I$6)+1)))),$C25)),\"\")","v":""}]
["LCR",null,2,{"$f":"IFERROR(INDEX(PlanningsFilter!$L$6:$L$1000,SMALL(IF(PlanningsFilter!$K$6:$K$1000=$A26,IF(PlanningsFilter!$C$6:$C$1000=D$2,IF(PlanningsFilter!$J$6:$J$1000=D$4,IF(PlanningsFilter!$I$6:$I$1000=\"\",ROW(PlanningsFilter!$I$6:$I$1000)-ROW($I$6)+1)))),$C26)),\"\")","v":"Wolter De bolder"},{"$f":"IFERROR(INDEX(PlanningsFilter!$L$6:$L$1000,SMALL(IF(PlanningsFilter!$K$6:$K$1000=$A26,IF(PlanningsFilter!$C$6:$C$1000=E$2,IF(PlanningsFilter!$J$6:$J$1000=E$4,IF(PlanningsFilter!$I$6:$I$1000=\"\",ROW(PlanningsFilter!$I$6:$I$1000)-ROW($I$6)+1)))),$C26)),\"\")","v":""},{"$f":"IFERROR(INDEX(PlanningsFilter!$L$6:$L$1000,SMALL(IF(PlanningsFilter!$K$6:$K$1000=$A26,IF(PlanningsFilter!$C$6:$C$1000=F$2,IF(PlanningsFilter!$J$6:$J$1000=F$4,IF(PlanningsFilter!$I$6:$I$1000=\"\",ROW(PlanningsFilter!$I$6:$I$1000)-ROW($I$6)+1)))),$C26)),\"\")","v":""},{"$f":"IFERROR(INDEX(PlanningsFilter!$L$6:$L$1000,SMALL(IF(PlanningsFilter!$K$6:$K$1000=$A26,IF(PlanningsFilter!$C$6:$C$1000=G$2,IF(PlanningsFilter!$J$6:$J$1000=G$4,IF(PlanningsFilter!$I$6:$I$1000=\"\",ROW(PlanningsFilter!$I$6:$I$1000)-ROW($I$6)+1)))),$C26)),\"\")","v":"Wolter De bolder"},{"$f":"IFERROR(INDEX(PlanningsFilter!$L$6:$L$1000,SMALL(IF(PlanningsFilter!$K$6:$K$1000=$A26,IF(PlanningsFilter!$C$6:$C$1000=H$2,IF(PlanningsFilter!$J$6:$J$1000=H$4,IF(PlanningsFilter!$I$6:$I$1000=\"\",ROW(PlanningsFilter!$I$6:$I$1000)-ROW($I$6)+1)))),$C26)),\"\")","v":""},{"$f":"IFERROR(INDEX(PlanningsFilter!$L$6:$L$1000,SMALL(IF(PlanningsFilter!$K$6:$K$1000=$A26,IF(PlanningsFilter!$C$6:$C$1000=I$2,IF(PlanningsFilter!$J$6:$J$1000=I$4,IF(PlanningsFilter!$I$6:$I$1000=\"\",ROW(PlanningsFilter!$I$6:$I$1000)-ROW($I$6)+1)))),$C26)),\"\")","v":""},{"$f":"IFERROR(INDEX(PlanningsFilter!$L$6:$L$1000,SMALL(IF(PlanningsFilter!$K$6:$K$1000=$A26,IF(PlanningsFilter!$C$6:$C$1000=J$2,IF(PlanningsFilter!$J$6:$J$1000=J$4,IF(PlanningsFilter!$I$6:$I$1000=\"\",ROW(PlanningsFilter!$I$6:$I$1000)-ROW($I$6)+1)))),$C26)),\"\")","v":"Wolter De bolder"},{"$f":"IFERROR(INDEX(PlanningsFilter!$L$6:$L$1000,SMALL(IF(PlanningsFilter!$K$6:$K$1000=$A26,IF(PlanningsFilter!$C$6:$C$1000=K$2,IF(PlanningsFilter!$J$6:$J$1000=K$4,IF(PlanningsFilter!$I$6:$I$1000=\"\",ROW(PlanningsFilter!$I$6:$I$1000)-ROW($I$6)+1)))),$C26)),\"\")","v":""},{"$f":"IFERROR(INDEX(PlanningsFilter!$L$6:$L$1000,SMALL(IF(PlanningsFilter!$K$6:$K$1000=$A26,IF(PlanningsFilter!$C$6:$C$1000=L$2,IF(PlanningsFilter!$J$6:$J$1000=L$4,IF(PlanningsFilter!$I$6:$I$1000=\"\",ROW(PlanningsFilter!$I$6:$I$1000)-ROW($I$6)+1)))),$C26)),\"\")","v":""},{"$f":"IFERROR(INDEX(PlanningsFilter!$L$6:$L$1000,SMALL(IF(PlanningsFilter!$K$6:$K$1000=$A26,IF(PlanningsFilter!$C$6:$C$1000=M$2,IF(PlanningsFilter!$J$6:$J$1000=M$4,IF(PlanningsFilter!$I$6:$I$1000=\"\",ROW(PlanningsFilter!$I$6:$I$1000)-ROW($I$6)+1)))),$C26)),\"\")","v":""},{"$f":"IFERROR(INDEX(PlanningsFilter!$L$6:$L$1000,SMALL(IF(PlanningsFilter!$K$6:$K$1000=$A26,IF(PlanningsFilter!$C$6:$C$1000=N$2,IF(PlanningsFilter!$J$6:$J$1000=N$4,IF(PlanningsFilter!$I$6:$I$1000=\"\",ROW(PlanningsFilter!$I$6:$I$1000)-ROW($I$6)+1)))),$C26)),\"\")","v":""},{"$f":"IFERROR(INDEX(PlanningsFilter!$L$6:$L$1000,SMALL(IF(PlanningsFilter!$K$6:$K$1000=$A26,IF(PlanningsFilter!$C$6:$C$1000=O$2,IF(PlanningsFilter!$J$6:$J$1000=O$4,IF(PlanningsFilter!$I$6:$I$1000=\"\",ROW(PlanningsFilter!$I$6:$I$1000)-ROW($I$6)+1)))),$C26)),\"\")","v":""},{"$f":"IFERROR(INDEX(PlanningsFilter!$L$6:$L$1000,SMALL(IF(PlanningsFilter!$K$6:$K$1000=$A26,IF(PlanningsFilter!$C$6:$C$1000=P$2,IF(PlanningsFilter!$J$6:$J$1000=P$4,IF(PlanningsFilter!$I$6:$I$1000=\"\",ROW(PlanningsFilter!$I$6:$I$1000)-ROW($I$6)+1)))),$C26)),\"\")","v":"Wolter De bolder"},{"$f":"IFERROR(INDEX(PlanningsFilter!$L$6:$L$1000,SMALL(IF(PlanningsFilter!$K$6:$K$1000=$A26,IF(PlanningsFilter!$C$6:$C$1000=Q$2,IF(PlanningsFilter!$J$6:$J$1000=Q$4,IF(PlanningsFilter!$I$6:$I$1000=\"\",ROW(PlanningsFilter!$I$6:$I$1000)-ROW($I$6)+1)))),$C26)),\"\")","v":""},{"$f":"IFERROR(INDEX(PlanningsFilter!$L$6:$L$1000,SMALL(IF(PlanningsFilter!$K$6:$K$1000=$A26,IF(PlanningsFilter!$C$6:$C$1000=R$2,IF(PlanningsFilter!$J$6:$J$1000=R$4,IF(PlanningsFilter!$I$6:$I$1000=\"\",ROW(PlanningsFilter!$I$6:$I$1000)-ROW($I$6)+1)))),$C26)),\"\")","v":""},{"$f":"IFERROR(INDEX(PlanningsFilter!$L$6:$L$1000,SMALL(IF(PlanningsFilter!$K$6:$K$1000=$A26,IF(PlanningsFilter!$C$6:$C$1000=S$2,IF(PlanningsFilter!$J$6:$J$1000=S$4,IF(PlanningsFilter!$I$6:$I$1000=\"\",ROW(PlanningsFilter!$I$6:$I$1000)-ROW($I$6)+1)))),$C26)),\"\")","v":""},{"$f":"IFERROR(INDEX(PlanningsFilter!$L$6:$L$1000,SMALL(IF(PlanningsFilter!$K$6:$K$1000=$A26,IF(PlanningsFilter!$C$6:$C$1000=T$2,IF(PlanningsFilter!$J$6:$J$1000=T$4,IF(PlanningsFilter!$I$6:$I$1000=\"\",ROW(PlanningsFilter!$I$6:$I$1000)-ROW($I$6)+1)))),$C26)),\"\")","v":""},{"$f":"IFERROR(INDEX(PlanningsFilter!$L$6:$L$1000,SMALL(IF(PlanningsFilter!$K$6:$K$1000=$A26,IF(PlanningsFilter!$C$6:$C$1000=U$2,IF(PlanningsFilter!$J$6:$J$1000=U$4,IF(PlanningsFilter!$I$6:$I$1000=\"\",ROW(PlanningsFilter!$I$6:$I$1000)-ROW($I$6)+1)))),$C26)),\"\")","v":""},{"$f":"IFERROR(INDEX(PlanningsFilter!$L$6:$L$1000,SMALL(IF(PlanningsFilter!$K$6:$K$1000=$A26,IF(PlanningsFilter!$C$6:$C$1000=V$2,IF(PlanningsFilter!$J$6:$J$1000=V$4,IF(PlanningsFilter!$I$6:$I$1000=\"\",ROW(PlanningsFilter!$I$6:$I$1000)-ROW($I$6)+1)))),$C26)),\"\")","v":""},{"$f":"IFERROR(INDEX(PlanningsFilter!$L$6:$L$1000,SMALL(IF(PlanningsFilter!$K$6:$K$1000=$A26,IF(PlanningsFilter!$C$6:$C$1000=W$2,IF(PlanningsFilter!$J$6:$J$1000=W$4,IF(PlanningsFilter!$I$6:$I$1000=\"\",ROW(PlanningsFilter!$I$6:$I$1000)-ROW($I$6)+1)))),$C26)),\"\")","v":""},{"$f":"IFERROR(INDEX(PlanningsFilter!$L$6:$L$1000,SMALL(IF(PlanningsFilter!$K$6:$K$1000=$A26,IF(PlanningsFilter!$C$6:$C$1000=X$2,IF(PlanningsFilter!$J$6:$J$1000=X$4,IF(PlanningsFilter!$I$6:$I$1000=\"\",ROW(PlanningsFilter!$I$6:$I$1000)-ROW($I$6)+1)))),$C26)),\"\")","v":""}]
["LCR",null,3,{"$f":"IFERROR(INDEX(PlanningsFilter!$L$6:$L$1000,SMALL(IF(PlanningsFilter!$K$6:$K$1000=$A27,IF(PlanningsFilter!$C$6:$C$1000=D$2,IF(PlanningsFilter!$J$6:$J$1000=D$4,IF(PlanningsFilter!$I$6:$I$1000=\"\",ROW(PlanningsFilter!$I$6:$I$1000)-ROW($I$6)+1)))),$C27)),\"\")","v":""},{"$f":"IFERROR(INDEX(PlanningsFilter!$L$6:$L$1000,SMALL(IF(PlanningsFilter!$K$6:$K$1000=$A27,IF(PlanningsFilter!$C$6:$C$1000=E$2,IF(PlanningsFilter!$J$6:$J$1000=E$4,IF(PlanningsFilter!$I$6:$I$1000=\"\",ROW(PlanningsFilter!$I$6:$I$1000)-ROW($I$6)+1)))),$C27)),\"\")","v":""},{"$f":"IFERROR(INDEX(PlanningsFilter!$L$6:$L$1000,SMALL(IF(PlanningsFilter!$K$6:$K$1000=$A27,IF(PlanningsFilter!$C$6:$C$1000=F$2,IF(PlanningsFilter!$J$6:$J$1000=F$4,IF(PlanningsFilter!$I$6:$I$1000=\"\",ROW(PlanningsFilter!$I$6:$I$1000)-ROW($I$6)+1)))),$C27)),\"\")","v":""},{"$f":"IFERROR(INDEX(PlanningsFilter!$L$6:$L$1000,SMALL(IF(PlanningsFilter!$K$6:$K$1000=$A27,IF(PlanningsFilter!$C$6:$C$1000=G$2,IF(PlanningsFilter!$J$6:$J$1000=G$4,IF(PlanningsFilter!$I$6:$I$1000=\"\",ROW(PlanningsFilter!$I$6:$I$1000)-ROW($I$6)+1)))),$C27)),\"\")","v":""},{"$f":"IFERROR(INDEX(PlanningsFilter!$L$6:$L$1000,SMALL(IF(PlanningsFilter!$K$6:$K$1000=$A27,IF(PlanningsFilter!$C$6:$C$1000=H$2,IF(PlanningsFilter!$J$6:$J$1000=H$4,IF(PlanningsFilter!$I$6:$I$1000=\"\",ROW(PlanningsFilter!$I$6:$I$1000)-ROW($I$6)+1)))),$C27)),\"\")","v":""},{"$f":"IFERROR(INDEX(PlanningsFilter!$L$6:$L$1000,SMALL(IF(PlanningsFilter!$K$6:$K$1000=$A27,IF(PlanningsFilter!$C$6:$C$1000=I$2,IF(PlanningsFilter!$J$6:$J$1000=I$4,IF(PlanningsFilter!$I$6:$I$1000=\"\",ROW(PlanningsFilter!$I$6:$I$1000)-ROW($I$6)+1)))),$C27)),\"\")","v":""},{"$f":"IFERROR(INDEX(PlanningsFilter!$L$6:$L$1000,SMALL(IF(PlanningsFilter!$K$6:$K$1000=$A27,IF(PlanningsFilter!$C$6:$C$1000=J$2,IF(PlanningsFilter!$J$6:$J$1000=J$4,IF(PlanningsFilter!$I$6:$I$1000=\"\",ROW(PlanningsFilter!$I$6:$I$1000)-ROW($I$6)+1)))),$C27)),\"\")","v":""},{"$f":"IFERROR(INDEX(PlanningsFilter!$L$6:$L$1000,SMALL(IF(PlanningsFilter!$K$6:$K$1000=$A27,IF(PlanningsFilter!$C$6:$C$1000=K$2,IF(PlanningsFilter!$J$6:$J$1000=K$4,IF(PlanningsFilter!$I$6:$I$1000=\"\",ROW(PlanningsFilter!$I$6:$I$1000)-ROW($I$6)+1)))),$C27)),\"\")","v":""},{"$f":"IFERROR(INDEX(PlanningsFilter!$L$6:$L$1000,SMALL(IF(PlanningsFilter!$K$6:$K$1000=$A27,IF(PlanningsFilter!$C$6:$C$1000=L$2,IF(PlanningsFilter!$J$6:$J$1000=L$4,IF(PlanningsFilter!$I$6:$I$1000=\"\",ROW(PlanningsFilter!$I$6:$I$1000)-ROW($I$6)+1)))),$C27)),\"\")","v":""},{"$f":"IFERROR(INDEX(PlanningsFilter!$L$6:$L$1000,SMALL(IF(PlanningsFilter!$K$6:$K$1000=$A27,IF(PlanningsFilter!$C$6:$C$1000=M$2,IF(PlanningsFilter!$J$6:$J$1000=M$4,IF(PlanningsFilter!$I$6:$I$1000=\"\",ROW(PlanningsFilter!$I$6:$I$1000)-ROW($I$6)+1)))),$C27)),\"\")","v":""},{"$f":"IFERROR(INDEX(PlanningsFilter!$L$6:$L$1000,SMALL(IF(PlanningsFilter!$K$6:$K$1000=$A27,IF(PlanningsFilter!$C$6:$C$1000=N$2,IF(PlanningsFilter!$J$6:$J$1000=N$4,IF(PlanningsFilter!$I$6:$I$1000=\"\",ROW(PlanningsFilter!$I$6:$I$1000)-ROW($I$6)+1)))),$C27)),\"\")","v":""},{"$f":"IFERROR(INDEX(PlanningsFilter!$L$6:$L$1000,SMALL(IF(PlanningsFilter!$K$6:$K$1000=$A27,IF(PlanningsFilter!$C$6:$C$1000=O$2,IF(PlanningsFilter!$J$6:$J$1000=O$4,IF(PlanningsFilter!$I$6:$I$1000=\"\",ROW(PlanningsFilter!$I$6:$I$1000)-ROW($I$6)+1)))),$C27)),\"\")","v":""},{"$f":"IFERROR(INDEX(PlanningsFilter!$L$6:$L$1000,SMALL(IF(PlanningsFilter!$K$6:$K$1000=$A27,IF(PlanningsFilter!$C$6:$C$1000=P$2,IF(PlanningsFilter!$J$6:$J$1000=P$4,IF(PlanningsFilter!$I$6:$I$1000=\"\",ROW(PlanningsFilter!$I$6:$I$1000)-ROW($I$6)+1)))),$C27)),\"\")","v":""},{"$f":"IFERROR(INDEX(PlanningsFilter!$L$6:$L$1000,SMALL(IF(PlanningsFilter!$K$6:$K$1000=$A27,IF(PlanningsFilter!$C$6:$C$1000=Q$2,IF(PlanningsFilter!$J$6:$J$1000=Q$4,IF(PlanningsFilter!$I$6:$I$1000=\"\",ROW(PlanningsFilter!$I$6:$I$1000)-ROW($I$6)+1)))),$C27)),\"\")","v":""},{"$f":"IFERROR(INDEX(PlanningsFilter!$L$6:$L$1000,SMALL(IF(PlanningsFilter!$K$6:$K$1000=$A27,IF(PlanningsFilter!$C$6:$C$1000=R$2,IF(PlanningsFilter!$J$6:$J$1000=R$4,IF(PlanningsFilter!$I$6:$I$1000=\"\",ROW(PlanningsFilter!$I$6:$I$1000)-ROW($I$6)+1)))),$C27)),\"\")","v":""},{"$f":"IFERROR(INDEX(PlanningsFilter!$L$6:$L$1000,SMALL(IF(PlanningsFilter!$K$6:$K$1000=$A27,IF(PlanningsFilter!$C$6:$C$1000=S$2,IF(PlanningsFilter!$J$6:$J$1000=S$4,IF(PlanningsFilter!$I$6:$I$1000=\"\",ROW(PlanningsFilter!$I$6:$I$1000)-ROW($I$6)+1)))),$C27)),\"\")","v":""},{"$f":"IFERROR(INDEX(PlanningsFilter!$L$6:$L$1000,SMALL(IF(PlanningsFilter!$K$6:$K$1000=$A27,IF(PlanningsFilter!$C$6:$C$1000=T$2,IF(PlanningsFilter!$J$6:$J$1000=T$4,IF(PlanningsFilter!$I$6:$I$1000=\"\",ROW(PlanningsFilter!$I$6:$I$1000)-ROW($I$6)+1)))),$C27)),\"\")","v":""},{"$f":"IFERROR(INDEX(PlanningsFilter!$L$6:$L$1000,SMALL(IF(PlanningsFilter!$K$6:$K$1000=$A27,IF(PlanningsFilter!$C$6:$C$1000=U$2,IF(PlanningsFilter!$J$6:$J$1000=U$4,IF(PlanningsFilter!$I$6:$I$1000=\"\",ROW(PlanningsFilter!$I$6:$I$1000)-ROW($I$6)+1)))),$C27)),\"\")","v":""},{"$f":"IFERROR(INDEX(PlanningsFilter!$L$6:$L$1000,SMALL(IF(PlanningsFilter!$K$6:$K$1000=$A27,IF(PlanningsFilter!$C$6:$C$1000=V$2,IF(PlanningsFilter!$J$6:$J$1000=V$4,IF(PlanningsFilter!$I$6:$I$1000=\"\",ROW(PlanningsFilter!$I$6:$I$1000)-ROW($I$6)+1)))),$C27)),\"\")","v":""},{"$f":"IFERROR(INDEX(PlanningsFilter!$L$6:$L$1000,SMALL(IF(PlanningsFilter!$K$6:$K$1000=$A27,IF(PlanningsFilter!$C$6:$C$1000=W$2,IF(PlanningsFilter!$J$6:$J$1000=W$4,IF(PlanningsFilter!$I$6:$I$1000=\"\",ROW(PlanningsFilter!$I$6:$I$1000)-ROW($I$6)+1)))),$C27)),\"\")","v":""},{"$f":"IFERROR(INDEX(PlanningsFilter!$L$6:$L$1000,SMALL(IF(PlanningsFilter!$K$6:$K$1000=$A27,IF(PlanningsFilter!$C$6:$C$1000=X$2,IF(PlanningsFilter!$J$6:$J$1000=X$4,IF(PlanningsFilter!$I$6:$I$1000=\"\",ROW(PlanningsFilter!$I$6:$I$1000)-ROW($I$6)+1)))),$C27)),\"\")","v":""}]
["LCR",null,4,{"$f":"IFERROR(INDEX(PlanningsFilter!$L$6:$L$1000,SMALL(IF(PlanningsFilter!$K$6:$K$1000=$A28,IF(PlanningsFilter!$C$6:$C$1000=D$2,IF(PlanningsFilter!$J$6:$J$1000=D$4,IF(PlanningsFilter!$I$6:$I$1000=\"\",ROW(PlanningsFilter!$I$6:$I$1000)-ROW($I$6)+1)))),$C28)),\"\")","v":""},{"$f":"IFERROR(INDEX(PlanningsFilter!$L$6:$L$1000,SMALL(IF(PlanningsFilter!$K$6:$K$1000=$A28,IF(PlanningsFilter!$C$6:$C$1000=E$2,IF(PlanningsFilter!$J$6:$J$1000=E$4,IF(PlanningsFilter!$I$6:$I$1000=\"\",ROW(PlanningsFilter!$I$6:$I$1000)-ROW($I$6)+1)))),$C28)),\"\")","v":""},{"$f":"IFERROR(INDEX(PlanningsFilter!$L$6:$L$1000,SMALL(IF(PlanningsFilter!$K$6:$K$1000=$A28,IF(PlanningsFilter!$C$6:$C$1000=F$2,IF(PlanningsFilter!$J$6:$J$1000=F$4,IF(PlanningsFilter!$I$6:$I$1000=\"\",ROW(PlanningsFilter!$I$6:$I$1000)-ROW($I$6)+1)))),$C28)),\"\")","v":""},{"$f":"IFERROR(INDEX(PlanningsFilter!$L$6:$L$1000,SMALL(IF(PlanningsFilter!$K$6:$K$1000=$A28,IF(PlanningsFilter!$C$6:$C$1000=G$2,IF(PlanningsFilter!$J$6:$J$1000=G$4,IF(PlanningsFilter!$I$6:$I$1000=\"\",ROW(PlanningsFilter!$I$6:$I$1000)-ROW($I$6)+1)))),$C28)),\"\")","v":""},{"$f":"IFERROR(INDEX(PlanningsFilter!$L$6:$L$1000,SMALL(IF(PlanningsFilter!$K$6:$K$1000=$A28,IF(PlanningsFilter!$C$6:$C$1000=H$2,IF(PlanningsFilter!$J$6:$J$1000=H$4,IF(PlanningsFilter!$I$6:$I$1000=\"\",ROW(PlanningsFilter!$I$6:$I$1000)-ROW($I$6)+1)))),$C28)),\"\")","v":""},{"$f":"IFERROR(INDEX(PlanningsFilter!$L$6:$L$1000,SMALL(IF(PlanningsFilter!$K$6:$K$1000=$A28,IF(PlanningsFilter!$C$6:$C$1000=I$2,IF(PlanningsFilter!$J$6:$J$1000=I$4,IF(PlanningsFilter!$I$6:$I$1000=\"\",ROW(PlanningsFilter!$I$6:$I$1000)-ROW($I$6)+1)))),$C28)),\"\")","v":""},{"$f":"IFERROR(INDEX(PlanningsFilter!$L$6:$L$1000,SMALL(IF(PlanningsFilter!$K$6:$K$1000=$A28,IF(PlanningsFilter!$C$6:$C$1000=J$2,IF(PlanningsFilter!$J$6:$J$1000=J$4,IF(PlanningsFilter!$I$6:$I$1000=\"\",ROW(PlanningsFilter!$I$6:$I$1000)-ROW($I$6)+1)))),$C28)),\"\")","v":""},{"$f":"IFERROR(INDEX(PlanningsFilter!$L$6:$L$1000,SMALL(IF(PlanningsFilter!$K$6:$K$1000=$A28,IF(PlanningsFilter!$C$6:$C$1000=K$2,IF(PlanningsFilter!$J$6:$J$1000=K$4,IF(PlanningsFilter!$I$6:$I$1000=\"\",ROW(PlanningsFilter!$I$6:$I$1000)-ROW($I$6)+1)))),$C28)),\"\")","v":""},{"$f":"IFERROR(INDEX(PlanningsFilter!$L$6:$L$1000,SMALL(IF(PlanningsFilter!$K$6:$K$1000=$A28,IF(PlanningsFilter!$C$6:$C$1000=L$2,IF(PlanningsFilter!$J$6:$J$1000=L$4,IF(PlanningsFilter!$I$6:$I$1000=\"\",ROW(PlanningsFilter!$I$6:$I$1000)-ROW($I$6)+1)))),$C28)),\"\")","v":""},{"$f":"IFERROR(INDEX(PlanningsFilter!$L$6:$L$1000,SMALL(IF(PlanningsFilter!$K$6:$K$1000=$A28,IF(PlanningsFilter!$C$6:$C$1000=M$2,IF(PlanningsFilter!$J$6:$J$1000=M$4,IF(PlanningsFilter!$I$6:$I$1000=\"\",ROW(PlanningsFilter!$I$6:$I$1000)-ROW($I$6)+1)))),$C28)),\"\")","v":""},{"$f":"IFERROR(INDEX(PlanningsFilter!$L$6:$L$1000,SMALL(IF(PlanningsFilter!$K$6:$K$1000=$A28,IF(PlanningsFilter!$C$6:$C$1000=N$2,IF(PlanningsFilter!$J$6:$J$1000=N$4,IF(PlanningsFilter!$I$6:$I$1000=\"\",ROW(PlanningsFilter!$I$6:$I$1000)-ROW($I$6)+1)))),$C28)),\"\")","v":""},{"$f":"IFERROR(INDEX(PlanningsFilter!$L$6:$L$1000,SMALL(IF(PlanningsFilter!$K$6:$K$1000=$A28,IF(PlanningsFilter!$C$6:$C$1000=O$2,IF(PlanningsFilter!$J$6:$J$1000=O$4,IF(PlanningsFilter!$I$6:$I$1000=\"\",ROW(PlanningsFilter!$I$6:$I$1000)-ROW($I$6)+1)))),$C28)),\"\")","v":""},{"$f":"IFERROR(INDEX(PlanningsFilter!$L$6:$L$1000,SMALL(IF(PlanningsFilter!$K$6:$K$1000=$A28,IF(PlanningsFilter!$C$6:$C$1000=P$2,IF(PlanningsFilter!$J$6:$J$1000=P$4,IF(PlanningsFilter!$I$6:$I$1000=\"\",ROW(PlanningsFilter!$I$6:$I$1000)-ROW($I$6)+1)))),$C28)),\"\")","v":""},{"$f":"IFERROR(INDEX(PlanningsFilter!$L$6:$L$1000,SMALL(IF(PlanningsFilter!$K$6:$K$1000=$A28,IF(PlanningsFilter!$C$6:$C$1000=Q$2,IF(PlanningsFilter!$J$6:$J$1000=Q$4,IF(PlanningsFilter!$I$6:$I$1000=\"\",ROW(PlanningsFilter!$I$6:$I$1000)-ROW($I$6)+1)))),$C28)),\"\")","v":""},{"$f":"IFERROR(INDEX(PlanningsFilter!$L$6:$L$1000,SMALL(IF(PlanningsFilter!$K$6:$K$1000=$A28,IF(PlanningsFilter!$C$6:$C$1000=R$2,IF(PlanningsFilter!$J$6:$J$1000=R$4,IF(PlanningsFilter!$I$6:$I$1000=\"\",ROW(PlanningsFilter!$I$6:$I$1000)-ROW($I$6)+1)))),$C28)),\"\")","v":""},{"$f":"IFERROR(INDEX(PlanningsFilter!$L$6:$L$1000,SMALL(IF(PlanningsFilter!$K$6:$K$1000=$A28,IF(PlanningsFilter!$C$6:$C$1000=S$2,IF(PlanningsFilter!$J$6:$J$1000=S$4,IF(PlanningsFilter!$I$6:$I$1000=\"\",ROW(PlanningsFilter!$I$6:$I$1000)-ROW($I$6)+1)))),$C28)),\"\")","v":""},{"$f":"IFERROR(INDEX(PlanningsFilter!$L$6:$L$1000,SMALL(IF(PlanningsFilter!$K$6:$K$1000=$A28,IF(PlanningsFilter!$C$6:$C$1000=T$2,IF(PlanningsFilter!$J$6:$J$1000=T$4,IF(PlanningsFilter!$I$6:$I$1000=\"\",ROW(PlanningsFilter!$I$6:$I$1000)-ROW($I$6)+1)))),$C28)),\"\")","v":""},{"$f":"IFERROR(INDEX(PlanningsFilter!$L$6:$L$1000,SMALL(IF(PlanningsFilter!$K$6:$K$1000=$A28,IF(PlanningsFilter!$C$6:$C$1000=U$2,IF(PlanningsFilter!$J$6:$J$1000=U$4,IF(PlanningsFilter!$I$6:$I$1000=\"\",ROW(PlanningsFilter!$I$6:$I$1000)-ROW($I$6)+1)))),$C28)),\"\")","v":""},{"$f":"IFERROR(INDEX(PlanningsFilter!$L$6:$L$1000,SMALL(IF(PlanningsFilter!$K$6:$K$1000=$A28,IF(PlanningsFilter!$C$6:$C$1000=V$2,IF(PlanningsFilter!$J$6:$J$1000=V$4,IF(PlanningsFilter!$I$6:$I$1000=\"\",ROW(PlanningsFilter!$I$6:$I$1000)-ROW($I$6)+1)))),$C28)),\"\")","v":""},{"$f":"IFERROR(INDEX(PlanningsFilter!$L$6:$L$1000,SMALL(IF(PlanningsFilter!$K$6:$K$1000=$A28,IF(PlanningsFilter!$C$6:$C$1000=W$2,IF(PlanningsFilter!$J$6:$J$1000=W$4,IF(PlanningsFilter!$I$6:$I$1000=\"\",ROW(PlanningsFilter!$I$6:$I$1000)-ROW($I$6)+1)))),$C28)),\"\")","v":""},{"$f":"IFERROR(INDEX(PlanningsFilter!$L$6:$L$1000,SMALL(IF(PlanningsFilter!$K$6:$K$1000=$A28,IF(PlanningsFilter!$C$6:$C$1000=X$2,IF(PlanningsFilter!$J$6:$J$1000=X$4,IF(PlanningsFilter!$I$6:$I$1000=\"\",ROW(PlanningsFilter!$I$6:$I$1000)-ROW($I$6)+1)))),$C28)),\"\")","v":""}]
["ABB",null,1,{"$f":"IFERROR(INDEX(PlanningsFilter!$L$6:$L$1000,SMALL(IF(PlanningsFilter!$K$6:$K$1000=$A29,IF(PlanningsFilter!$C$6:$C$1000=D$2,IF(PlanningsFilter!$J$6:$J$1000=D$4,IF(PlanningsFilter!$I$6:$I$1000=\"\",ROW(PlanningsFilter!$I$6:$I$1000)-ROW($I$6)+1)))),$C29)),\"\")","v":""},{"$f":"IFERROR(INDEX(PlanningsFilter!$L$6:$L$1000,SMALL(IF(PlanningsFilter!$K$6:$K$1000=$A29,IF(PlanningsFilter!$C$6:$C$1000=E$2,IF(PlanningsFilter!$J$6:$J$1000=E$4,IF(PlanningsFilter!$I$6:$I$1000=\"\",ROW(PlanningsFilter!$I$6:$I$1000)-ROW($I$6)+1)))),$C29)),\"\")","v":"Bile Hendriks"},{"$f":"IFERROR(INDEX(PlanningsFilter!$L$6:$L$1000,SMALL(IF(PlanningsFilter!$K$6:$K$1000=$A29,IF(PlanningsFilter!$C$6:$C$1000=F$2,IF(PlanningsFilter!$J$6:$J$1000=F$4,IF(PlanningsFilter!$I$6:$I$1000=\"\",ROW(PlanningsFilter!$I$6:$I$1000)-ROW($I$6)+1)))),$C29)),\"\")","v":""},{"$f":"IFERROR(INDEX(PlanningsFilter!$L$6:$L$1000,SMALL(IF(PlanningsFilter!$K$6:$K$1000=$A29,IF(PlanningsFilter!$C$6:$C$1000=G$2,IF(PlanningsFilter!$J$6:$J$1000=G$4,IF(PlanningsFilter!$I$6:$I$1000=\"\",ROW(PlanningsFilter!$I$6:$I$1000)-ROW($I$6)+1)))),$C29)),\"\")","v":"Trienko Spooren"},{"$f":"IFERROR(INDEX(PlanningsFilter!$L$6:$L$1000,SMALL(IF(PlanningsFilter!$K$6:$K$1000=$A29,IF(PlanningsFilter!$C$6:$C$1000=H$2,IF(PlanningsFilter!$J$6:$J$1000=H$4,IF(PlanningsFilter!$I$6:$I$1000=\"\",ROW(PlanningsFilter!$I$6:$I$1000)-ROW($I$6)+1)))),$C29)),\"\")","v":"Bile Hendriks"},{"$f":"IFERROR(INDEX(PlanningsFilter!$L$6:$L$1000,SMALL(IF(PlanningsFilter!$K$6:$K$1000=$A29,IF(PlanningsFilter!$C$6:$C$1000=I$2,IF(PlanningsFilter!$J$6:$J$1000=I$4,IF(PlanningsFilter!$I$6:$I$1000=\"\",ROW(PlanningsFilter!$I$6:$I$1000)-ROW($I$6)+1)))),$C29)),\"\")","v":""},{"$f":"IFERROR(INDEX(PlanningsFilter!$L$6:$L$1000,SMALL(IF(PlanningsFilter!$K$6:$K$1000=$A29,IF(PlanningsFilter!$C$6:$C$1000=J$2,IF(PlanningsFilter!$J$6:$J$1000=J$4,IF(PlanningsFilter!$I$6:$I$1000=\"\",ROW(PlanningsFilter!$I$6:$I$1000)-ROW($I$6)+1)))),$C29)),\"\")","v":"Trienko Spooren"},{"$f":"IFERROR(INDEX(PlanningsFilter!$L$6:$L$1000,SMALL(IF(PlanningsFilter!$K$6:$K$1000=$A29,IF(PlanningsFilter!$C$6:$C$1000=K$2,IF(PlanningsFilter!$J$6:$J$1000=K$4,IF(PlanningsFilter!$I$6:$I$1000=\"\",ROW(PlanningsFilter!$I$6:$I$1000)-ROW($I$6)+1)))),$C29)),\"\")","v":"Bile Hendriks"},{"$f":"IFERROR(INDEX(PlanningsFilter!$L$6:$L$1000,SMALL(IF(PlanningsFilter!$K$6:$K$1000=$A29,IF(PlanningsFilter!$C$6:$C$1000=L$2,IF(PlanningsFilter!$J$6:$J$1000=L$4,IF(PlanningsFilter!$I$6:$I$1000=\"\",ROW(PlanningsFilter!$I$6:$I$1000)-ROW($I$6)+1)))),$C29)),\"\")","v":""},{"$f":"IFERROR(INDEX(PlanningsFilter!$L$6:$L$1000,SMALL(IF(PlanningsFilter!$K$6:$K$1000=$A29,IF(PlanningsFilter!$C$6:$C$1000=M$2,IF(PlanningsFilter!$J$6:$J$1000=M$4,IF(PlanningsFilter!$I$6:$I$1000=\"\",ROW(PlanningsFilter!$I$6:$I$1000)-ROW($I$6)+1)))),$C29)),\"\")","v":"Trienko Spooren"},{"$f":"IFERROR(INDEX(PlanningsFilter!$L$6:$L$1000,SMALL(IF(PlanningsFilter!$K$6:$K$1000=$A29,IF(PlanningsFilter!$C$6:$C$1000=N$2,IF(PlanningsFilter!$J$6:$J$1000=N$4,IF(PlanningsFilter!$I$6:$I$1000=\"\",ROW(PlanningsFilter!$I$6:$I$1000)-ROW($I$6)+1)))),$C29)),\"\")","v":"Bile Hendriks"},{"$f":"IFERROR(INDEX(PlanningsFilter!$L$6:$L$1000,SMALL(IF(PlanningsFilter!$K$6:$K$1000=$A29,IF(PlanningsFilter!$C$6:$C$1000=O$2,IF(PlanningsFilter!$J$6:$J$1000=O$4,IF(PlanningsFilter!$I$6:$I$1000=\"\",ROW(PlanningsFilter!$I$6:$I$1000)-ROW($I$6)+1)))),$C29)),\"\")","v":""},{"$f":"IFERROR(INDEX(PlanningsFilter!$L$6:$L$1000,SMALL(IF(PlanningsFilter!$K$6:$K$1000=$A29,IF(PlanningsFilter!$C$6:$C$1000=P$2,IF(PlanningsFilter!$J$6:$J$1000=P$4,IF(PlanningsFilter!$I$6:$I$1000=\"\",ROW(PlanningsFilter!$I$6:$I$1000)-ROW($I$6)+1)))),$C29)),\"\")","v":"Trienko Spooren"},{"$f":"IFERROR(INDEX(PlanningsFilter!$L$6:$L$1000,SMALL(IF(PlanningsFilter!$K$6:$K$1000=$A29,IF(PlanningsFilter!$C$6:$C$1000=Q$2,IF(PlanningsFilter!$J$6:$J$1000=Q$4,IF(PlanningsFilter!$I$6:$I$1000=\"\",ROW(PlanningsFilter!$I$6:$I$1000)-ROW($I$6)+1)))),$C29)),\"\")","v":"Bile Hendriks"},{"$f":"IFERROR(INDEX(PlanningsFilter!$L$6:$L$1000,SMALL(IF(PlanningsFilter!$K$6:$K$1000=$A29,IF(PlanningsFilter!$C$6:$C$1000=R$2,IF(PlanningsFilter!$J$6:$J$1000=R$4,IF(PlanningsFilter!$I$6:$I$1000=\"\",ROW(PlanningsFilter!$I$6:$I$1000)-ROW($I$6)+1)))),$C29)),\"\")","v":""},{"$f":"IFERROR(INDEX(PlanningsFilter!$L$6:$L$1000,SMALL(IF(PlanningsFilter!$K$6:$K$1000=$A29,IF(PlanningsFilter!$C$6:$C$1000=S$2,IF(PlanningsFilter!$J$6:$J$1000=S$4,IF(PlanningsFilter!$I$6:$I$1000=\"\",ROW(PlanningsFilter!$I$6:$I$1000)-ROW($I$6)+1)))),$C29)),\"\")","v":"Niek Smeets"},{"$f":"IFERROR(INDEX(PlanningsFilter!$L$6:$L$1000,SMALL(IF(PlanningsFilter!$K$6:$K$1000=$A29,IF(PlanningsFilter!$C$6:$C$1000=T$2,IF(PlanningsFilter!$J$6:$J$1000=T$4,IF(PlanningsFilter!$I$6:$I$1000=\"\",ROW(PlanningsFilter!$I$6:$I$1000)-ROW($I$6)+1)))),$C29)),\"\")","v":""},{"$f":"IFERROR(INDEX(PlanningsFilter!$L$6:$L$1000,SMALL(IF(PlanningsFilter!$K$6:$K$1000=$A29,IF(PlanningsFilter!$C$6:$C$1000=U$2,IF(PlanningsFilter!$J$6:$J$1000=U$4,IF(PlanningsFilter!$I$6:$I$1000=\"\",ROW(PlanningsFilter!$I$6:$I$1000)-ROW($I$6)+1)))),$C29)),\"\")","v":""},{"$f":"IFERROR(INDEX(PlanningsFilter!$L$6:$L$1000,SMALL(IF(PlanningsFilter!$K$6:$K$1000=$A29,IF(PlanningsFilter!$C$6:$C$1000=V$2,IF(PlanningsFilter!$J$6:$J$1000=V$4,IF(PlanningsFilter!$I$6:$I$1000=\"\",ROW(PlanningsFilter!$I$6:$I$1000)-ROW($I$6)+1)))),$C29)),\"\")","v":""},{"$f":"IFERROR(INDEX(PlanningsFilter!$L$6:$L$1000,SMALL(IF(PlanningsFilter!$K$6:$K$1000=$A29,IF(PlanningsFilter!$C$6:$C$1000=W$2,IF(PlanningsFilter!$J$6:$J$1000=W$4,IF(PlanningsFilter!$I$6:$I$1000=\"\",ROW(PlanningsFilter!$I$6:$I$1000)-ROW($I$6)+1)))),$C29)),\"\")","v":""},{"$f":"IFERROR(INDEX(PlanningsFilter!$L$6:$L$1000,SMALL(IF(PlanningsFilter!$K$6:$K$1000=$A29,IF(PlanningsFilter!$C$6:$C$1000=X$2,IF(PlanningsFilter!$J$6:$J$1000=X$4,IF(PlanningsFilter!$I$6:$I$1000=\"\",ROW(PlanningsFilter!$I$6:$I$1000)-ROW($I$6)+1)))),$C29)),\"\")","v":""}]
["ABB",null,2,{"$f":"IFERROR(INDEX(PlanningsFilter!$L$6:$L$1000,SMALL(IF(PlanningsFilter!$K$6:$K$1000=$A30,IF(PlanningsFilter!$C$6:$C$1000=D$2,IF(PlanningsFilter!$J$6:$J$1000=D$4,IF(PlanningsFilter!$I$6:$I$1000=\"\",ROW(PlanningsFilter!$I$6:$I$1000)-ROW($I$6)+1)))),$C30)),\"\")","v":""},{"$f":"IFERROR(INDEX(PlanningsFilter!$L$6:$L$1000,SMALL(IF(PlanningsFilter!$K$6:$K$1000=$A30,IF(PlanningsFilter!$C$6:$C$1000=E$2,IF(PlanningsFilter!$J$6:$J$1000=E$4,IF(PlanningsFilter!$I$6:$I$1000=\"\",ROW(PlanningsFilter!$I$6:$I$1000)-ROW($I$6)+1)))),$C30)),\"\")","v":"Flavi van der Heyden"},{"$f":"IFERROR(INDEX(PlanningsFilter!$L$6:$L$1000,SMALL(IF(PlanningsFilter!$K$6:$K$1000=$A30,IF(PlanningsFilter!$C$6:$C$1000=F$2,IF(PlanningsFilter!$J$6:$J$1000=F$4,IF(PlanningsFilter!$I$6:$I$1000=\"\",ROW(PlanningsFilter!$I$6:$I$1000)-ROW($I$6)+1)))),$C30)),\"\")","v":""},{"$f":"IFERROR(INDEX(PlanningsFilter!$L$6:$L$1000,SMALL(IF(PlanningsFilter!$K$6:$K$1000=$A30,IF(PlanningsFilter!$C$6:$C$1000=G$2,IF(PlanningsFilter!$J$6:$J$1000=G$4,IF(PlanningsFilter!$I$6:$I$1000=\"\",ROW(PlanningsFilter!$I$6:$I$1000)-ROW($I$6)+1)))),$C30)),\"\")","v":""},{"$f":"IFERROR(INDEX(PlanningsFilter!$L$6:$L$1000,SMALL(IF(PlanningsFilter!$K$6:$K$1000=$A30,IF(PlanningsFilter!$C$6:$C$1000=H$2,IF(PlanningsFilter!$J$6:$J$1000=H$4,IF(PlanningsFilter!$I$6:$I$1000=\"\",ROW(PlanningsFilter!$I$6:$I$1000)-ROW($I$6)+1)))),$C30)),\"\")","v":"Flavi van der Heyden"},{"$f":"IFERROR(INDEX(PlanningsFilter!$L$6:$L$1000,SMALL(IF(PlanningsFilter!$K$6:$K$1000=$A30,IF(PlanningsFilter!$C$6:$C$1000=I$2,IF(PlanningsFilter!$J$6:$J$1000=I$4,IF(PlanningsFilter!$I$6:$I$1000=\"\",ROW(PlanningsFilter!$I$6:$I$1000)-ROW($I$6)+1)))),$C30)),\"\")","v":""},{"$f":"IFERROR(INDEX(PlanningsFilter!$L$6:$L$1000,SMALL(IF(PlanningsFilter!$K$6:$K$1000=$A30,IF(PlanningsFilter!$C$6:$C$1000=J$2,IF(PlanningsFilter!$J$6:$J$1000=J$4,IF(PlanningsFilter!$I$6:$I$1000=\"\",ROW(PlanningsFilter!$I$6:$I$1000)-ROW($I$6)+1)))),$C30)),\"\")","v":""},{"$f":"IFERROR(INDEX(PlanningsFilter!$L$6:$L$1000,SMALL(IF(PlanningsFilter!$K$6:$K$1000=$A30,IF(PlanningsFilter!$C$6:$C$1000=K$2,IF(PlanningsFilter!$J$6:$J$1000=K$4,IF(PlanningsFilter!$I$6:$I$1000=\"\",ROW(PlanningsFilter!$I$6:$I$1000)-ROW($I$6)+1)))),$C30)),\"\")","v":""},{"$f":"IFERROR(INDEX(PlanningsFilter!$L$6:$L$1000,SMALL(IF(PlanningsFilter!$K$6:$K$1000=$A30,IF(PlanningsFilter!$C$6:$C$1000=L$2,IF(PlanningsFilter!$J$6:$J$1000=L$4,IF(PlanningsFilter!$I$6:$I$1000=\"\",ROW(PlanningsFilter!$I$6:$I$1000)-ROW($I$6)+1)))),$C30)),\"\")","v":""},{"$f":"IFERROR(INDEX(PlanningsFilter!$L$6:$L$1000,SMALL(IF(PlanningsFilter!$K$6:$K$1000=$A30,IF(PlanningsFilter!$C$6:$C$1000=M$2,IF(PlanningsFilter!$J$6:$J$1000=M$4,IF(PlanningsFilter!$I$6:$I$1000=\"\",ROW(PlanningsFilter!$I$6:$I$1000)-ROW($I$6)+1)))),$C30)),\"\")","v":""},{"$f":"IFERROR(INDEX(PlanningsFilter!$L$6:$L$1000,SMALL(IF(PlanningsFilter!$K$6:$K$1000=$A30,IF(PlanningsFilter!$C$6:$C$1000=N$2,IF(PlanningsFilter!$J$6:$J$1000=N$4,IF(PlanningsFilter!$I$6:$I$1000=\"\",ROW(PlanningsFilter!$I$6:$I$1000)-ROW($I$6)+1)))),$C30)),\"\")","v":""},{"$f":"IFERROR(INDEX(PlanningsFilter!$L$6:$L$1000,SMALL(IF(PlanningsFilter!$K$6:$K$1000=$A30,IF(PlanningsFilter!$C$6:$C$1000=O$2,IF(PlanningsFilter!$J$6:$J$1000=O$4,IF(PlanningsFilter!$I$6:$I$1000=\"\",ROW(PlanningsFilter!$I$6:$I$1000)-ROW($I$6)+1)))),$C30)),\"\")","v":""},{"$f":"IFERROR(INDEX(PlanningsFilter!$L$6:$L$1000,SMALL(IF(PlanningsFilter!$K$6:$K$1000=$A30,IF(PlanningsFilter!$C$6:$C$1000=P$2,IF(PlanningsFilter!$J$6:$J$1000=P$4,IF(PlanningsFilter!$I$6:$I$1000=\"\",ROW(PlanningsFilter!$I$6:$I$1000)-ROW($I$6)+1)))),$C30)),\"\")","v":""},{"$f":"IFERROR(INDEX(PlanningsFilter!$L$6:$L$1000,SMALL(IF(PlanningsFilter!$K$6:$K$1000=$A30,IF(PlanningsFilter!$C$6:$C$1000=Q$2,IF(PlanningsFilter!$J$6:$J$1000=Q$4,IF(PlanningsFilter!$I$6:$I$1000=\"\",ROW(PlanningsFilter!$I$6:$I$1000)-ROW($I$6)+1)))),$C30)),\"\")","v":""},{"$f":"IFERROR(INDEX(PlanningsFilter!$L$6:$L$1000,SMALL(IF(PlanningsFilter!$K$6:$K$1000=$A30,IF(PlanningsFilter!$C$6:$C$1000=R$2,IF(PlanningsFilter!$J$6:$J$1000=R$4,IF(PlanningsFilter!$I$6:$I$1000=\"\",ROW(PlanningsFilter!$I$6:$I$1000)-ROW($I$6)+1)))),$C30)),\"\")","v":""},{"$f":"IFERROR(INDEX(PlanningsFilter!$L$6:$L$1000,SMALL(IF(PlanningsFilter!$K$6:$K$1000=$A30,IF(PlanningsFilter!$C$6:$C$1000=S$2,IF(PlanningsFilter!$J$6:$J$1000=S$4,IF(PlanningsFilter!$I$6:$I$1000=\"\",ROW(PlanningsFilter!$I$6:$I$1000)-ROW($I$6)+1)))),$C30)),\"\")","v":""},{"$f":"IFERROR(INDEX(PlanningsFilter!$L$6:$L$1000,SMALL(IF(PlanningsFilter!$K$6:$K$1000=$A30,IF(PlanningsFilter!$C$6:$C$1000=T$2,IF(PlanningsFilter!$J$6:$J$1000=T$4,IF(PlanningsFilter!$I$6:$I$1000=\"\",ROW(PlanningsFilter!$I$6:$I$1000)-ROW($I$6)+1)))),$C30)),\"\")","v":""},{"$f":"IFERROR(INDEX(PlanningsFilter!$L$6:$L$1000,SMALL(IF(PlanningsFilter!$K$6:$K$1000=$A30,IF(PlanningsFilter!$C$6:$C$1000=U$2,IF(PlanningsFilter!$J$6:$J$1000=U$4,IF(PlanningsFilter!$I$6:$I$1000=\"\",ROW(PlanningsFilter!$I$6:$I$1000)-ROW($I$6)+1)))),$C30)),\"\")","v":""},{"$f":"IFERROR(INDEX(PlanningsFilter!$L$6:$L$1000,SMALL(IF(PlanningsFilter!$K$6:$K$1000=$A30,IF(PlanningsFilter!$C$6:$C$1000=V$2,IF(PlanningsFilter!$J$6:$J$1000=V$4,IF(PlanningsFilter!$I$6:$I$1000=\"\",ROW(PlanningsFilter!$I$6:$I$1000)-ROW($I$6)+1)))),$C30)),\"\")","v":""},{"$f":"IFERROR(INDEX(PlanningsFilter!$L$6:$L$1000,SMALL(IF(PlanningsFilter!$K$6:$K$1000=$A30,IF(PlanningsFilter!$C$6:$C$1000=W$2,IF(PlanningsFilter!$J$6:$J$1000=W$4,IF(PlanningsFilter!$I$6:$I$1000=\"\",ROW(PlanningsFilter!$I$6:$I$1000)-ROW($I$6)+1)))),$C30)),\"\")","v":""},{"$f":"IFERROR(INDEX(PlanningsFilter!$L$6:$L$1000,SMALL(IF(PlanningsFilter!$K$6:$K$1000=$A30,IF(PlanningsFilter!$C$6:$C$1000=X$2,IF(PlanningsFilter!$J$6:$J$1000=X$4,IF(PlanningsFilter!$I$6:$I$1000=\"\",ROW(PlanningsFilter!$I$6:$I$1000)-ROW($I$6)+1)))),$C30)),\"\")","v":""}]
["ABB",null,3,{"$f":"IFERROR(INDEX(PlanningsFilter!$L$6:$L$1000,SMALL(IF(PlanningsFilter!$K$6:$K$1000=$A31,IF(PlanningsFilter!$C$6:$C$1000=D$2,IF(PlanningsFilter!$J$6:$J$1000=D$4,IF(PlanningsFilter!$I$6:$I$1000=\"\",ROW(PlanningsFilter!$I$6:$I$1000)-ROW($I$6)+1)))),$C31)),\"\")","v":""},{"$f":"IFERROR(INDEX(PlanningsFilter!$L$6:$L$1000,SMALL(IF(PlanningsFilter!$K$6:$K$1000=$A31,IF(PlanningsFilter!$C$6:$C$1000=E$2,IF(PlanningsFilter!$J$6:$J$1000=E$4,IF(PlanningsFilter!$I$6:$I$1000=\"\",ROW(PlanningsFilter!$I$6:$I$1000)-ROW($I$6)+1)))),$C31)),\"\")","v":""},{"$f":"IFERROR(INDEX(PlanningsFilter!$L$6:$L$1000,SMALL(IF(PlanningsFilter!$K$6:$K$1000=$A31,IF(PlanningsFilter!$C$6:$C$1000=F$2,IF(PlanningsFilter!$J$6:$J$1000=F$4,IF(PlanningsFilter!$I$6:$I$1000=\"\",ROW(PlanningsFilter!$I$6:$I$1000)-ROW($I$6)+1)))),$C31)),\"\")","v":""},{"$f":"IFERROR(INDEX(PlanningsFilter!$L$6:$L$1000,SMALL(IF(PlanningsFilter!$K$6:$K$1000=$A31,IF(PlanningsFilter!$C$6:$C$1000=G$2,IF(PlanningsFilter!$J$6:$J$1000=G$4,IF(PlanningsFilter!$I$6:$I$1000=\"\",ROW(PlanningsFilter!$I$6:$I$1000)-ROW($I$6)+1)))),$C31)),\"\")","v":""},{"$f":"IFERROR(INDEX(PlanningsFilter!$L$6:$L$1000,SMALL(IF(PlanningsFilter!$K$6:$K$1000=$A31,IF(PlanningsFilter!$C$6:$C$1000=H$2,IF(PlanningsFilter!$J$6:$J$1000=H$4,IF(PlanningsFilter!$I$6:$I$1000=\"\",ROW(PlanningsFilter!$I$6:$I$1000)-ROW($I$6)+1)))),$C31)),\"\")","v":""},{"$f":"IFERROR(INDEX(PlanningsFilter!$L$6:$L$1000,SMALL(IF(PlanningsFilter!$K$6:$K$1000=$A31,IF(PlanningsFilter!$C$6:$C$1000=I$2,IF(PlanningsFilter!$J$6:$J$1000=I$4,IF(PlanningsFilter!$I$6:$I$1000=\"\",ROW(PlanningsFilter!$I$6:$I$1000)-ROW($I$6)+1)))),$C31)),\"\")","v":""},{"$f":"IFERROR(INDEX(PlanningsFilter!$L$6:$L$1000,SMALL(IF(PlanningsFilter!$K$6:$K$1000=$A31,IF(PlanningsFilter!$C$6:$C$1000=J$2,IF(PlanningsFilter!$J$6:$J$1000=J$4,IF(PlanningsFilter!$I$6:$I$1000=\"\",ROW(PlanningsFilter!$I$6:$I$1000)-ROW($I$6)+1)))),$C31)),\"\")","v":""},{"$f":"IFERROR(INDEX(PlanningsFilter!$L$6:$L$1000,SMALL(IF(PlanningsFilter!$K$6:$K$1000=$A31,IF(PlanningsFilter!$C$6:$C$1000=K$2,IF(PlanningsFilter!$J$6:$J$1000=K$4,IF(PlanningsFilter!$I$6:$I$1000=\"\",ROW(PlanningsFilter!$I$6:$I$1000)-ROW($I$6)+1)))),$C31)),\"\")","v":""},{"$f":"IFERROR(INDEX(PlanningsFilter!$L$6:$L$1000,SMALL(IF(PlanningsFilter!$K$6:$K$1000=$A31,IF(PlanningsFilter!$C$6:$C$1000=L$2,IF(PlanningsFilter!$J$6:$J$1000=L$4,IF(PlanningsFilter!$I$6:$I$1000=\"\",ROW(PlanningsFilter!$I$6:$I$1000)-ROW($I$6)+1)))),$C31)),\"\")","v":""},{"$f":"IFERROR(INDEX(PlanningsFilter!$L$6:$L$1000,SMALL(IF(PlanningsFilter!$K$6:$K$1000=$A31,IF(PlanningsFilter!$C$6:$C$1000=M$2,IF(PlanningsFilter!$J$6:$J$1000=M$4,IF(PlanningsFilter!$I$6:$I$1000=\"\",ROW(PlanningsFilter!$I$6:$I$1000)-ROW($I$6)+1)))),$C31)),\"\")","v":""},{"$f":"IFERROR(INDEX(PlanningsFilter!$L$6:$L$1000,SMALL(IF(PlanningsFilter!$K$6:$K$1000=$A31,IF(PlanningsFilter!$C$6:$C$1000=N$2,IF(PlanningsFilter!$J$6:$J$1000=N$4,IF(PlanningsFilter!$I$6:$I$1000=\"\",ROW(PlanningsFilter!$I$6:$I$1000)-ROW($I$6)+1)))),$C31)),\"\")","v":""},{"$f":"IFERROR(INDEX(PlanningsFilter!$L$6:$L$1000,SMALL(IF(PlanningsFilter!$K$6:$K$1000=$A31,IF(PlanningsFilter!$C$6:$C$1000=O$2,IF(PlanningsFilter!$J$6:$J$1000=O$4,IF(PlanningsFilter!$I$6:$I$1000=\"\",ROW(PlanningsFilter!$I$6:$I$1000)-ROW($I$6)+1)))),$C31)),\"\")","v":""},{"$f":"IFERROR(INDEX(PlanningsFilter!$L$6:$L$1000,SMALL(IF(PlanningsFilter!$K$6:$K$1000=$A31,IF(PlanningsFilter!$C$6:$C$1000=P$2,IF(PlanningsFilter!$J$6:$J$1000=P$4,IF(PlanningsFilter!$I$6:$I$1000=\"\",ROW(PlanningsFilter!$I$6:$I$1000)-ROW($I$6)+1)))),$C31)),\"\")","v":""},{"$f":"IFERROR(INDEX(PlanningsFilter!$L$6:$L$1000,SMALL(IF(PlanningsFilter!$K$6:$K$1000=$A31,IF(PlanningsFilter!$C$6:$C$1000=Q$2,IF(PlanningsFilter!$J$6:$J$1000=Q$4,IF(PlanningsFilter!$I$6:$I$1000=\"\",ROW(PlanningsFilter!$I$6:$I$1000)-ROW($I$6)+1)))),$C31)),\"\")","v":""},{"$f":"IFERROR(INDEX(PlanningsFilter!$L$6:$L$1000,SMALL(IF(PlanningsFilter!$K$6:$K$1000=$A31,IF(PlanningsFilter!$C$6:$C$1000=R$2,IF(PlanningsFilter!$J$6:$J$1000=R$4,IF(PlanningsFilter!$I$6:$I$1000=\"\",ROW(PlanningsFilter!$I$6:$I$1000)-ROW($I$6)+1)))),$C31)),\"\")","v":""},{"$f":"IFERROR(INDEX(PlanningsFilter!$L$6:$L$1000,SMALL(IF(PlanningsFilter!$K$6:$K$1000=$A31,IF(PlanningsFilter!$C$6:$C$1000=S$2,IF(PlanningsFilter!$J$6:$J$1000=S$4,IF(PlanningsFilter!$I$6:$I$1000=\"\",ROW(PlanningsFilter!$I$6:$I$1000)-ROW($I$6)+1)))),$C31)),\"\")","v":""},{"$f":"IFERROR(INDEX(PlanningsFilter!$L$6:$L$1000,SMALL(IF(PlanningsFilter!$K$6:$K$1000=$A31,IF(PlanningsFilter!$C$6:$C$1000=T$2,IF(PlanningsFilter!$J$6:$J$1000=T$4,IF(PlanningsFilter!$I$6:$I$1000=\"\",ROW(PlanningsFilter!$I$6:$I$1000)-ROW($I$6)+1)))),$C31)),\"\")","v":""},{"$f":"IFERROR(INDEX(PlanningsFilter!$L$6:$L$1000,SMALL(IF(PlanningsFilter!$K$6:$K$1000=$A31,IF(PlanningsFilter!$C$6:$C$1000=U$2,IF(PlanningsFilter!$J$6:$J$1000=U$4,IF(PlanningsFilter!$I$6:$I$1000=\"\",ROW(PlanningsFilter!$I$6:$I$1000)-ROW($I$6)+1)))),$C31)),\"\")","v":""},{"$f":"IFERROR(INDEX(PlanningsFilter!$L$6:$L$1000,SMALL(IF(PlanningsFilter!$K$6:$K$1000=$A31,IF(PlanningsFilter!$C$6:$C$1000=V$2,IF(PlanningsFilter!$J$6:$J$1000=V$4,IF(PlanningsFilter!$I$6:$I$1000=\"\",ROW(PlanningsFilter!$I$6:$I$1000)-ROW($I$6)+1)))),$C31)),\"\")","v":""},{"$f":"IFERROR(INDEX(PlanningsFilter!$L$6:$L$1000,SMALL(IF(PlanningsFilter!$K$6:$K$1000=$A31,IF(PlanningsFilter!$C$6:$C$1000=W$2,IF(PlanningsFilter!$J$6:$J$1000=W$4,IF(PlanningsFilter!$I$6:$I$1000=\"\",ROW(PlanningsFilter!$I$6:$I$1000)-ROW($I$6)+1)))),$C31)),\"\")","v":""},{"$f":"IFERROR(INDEX(PlanningsFilter!$L$6:$L$1000,SMALL(IF(PlanningsFilter!$K$6:$K$1000=$A31,IF(PlanningsFilter!$C$6:$C$1000=X$2,IF(PlanningsFilter!$J$6:$J$1000=X$4,IF(PlanningsFilter!$I$6:$I$1000=\"\",ROW(PlanningsFilter!$I$6:$I$1000)-ROW($I$6)+1)))),$C31)),\"\")","v":""}]
["ABB",null,4,{"$f":"IFERROR(INDEX(PlanningsFilter!$L$6:$L$1000,SMALL(IF(PlanningsFilter!$K$6:$K$1000=$A32,IF(PlanningsFilter!$C$6:$C$1000=D$2,IF(PlanningsFilter!$J$6:$J$1000=D$4,IF(PlanningsFilter!$I$6:$I$1000=\"\",ROW(PlanningsFilter!$I$6:$I$1000)-ROW($I$6)+1)))),$C32)),\"\")","v":""},{"$f":"IFERROR(INDEX(PlanningsFilter!$L$6:$L$1000,SMALL(IF(PlanningsFilter!$K$6:$K$1000=$A32,IF(PlanningsFilter!$C$6:$C$1000=E$2,IF(PlanningsFilter!$J$6:$J$1000=E$4,IF(PlanningsFilter!$I$6:$I$1000=\"\",ROW(PlanningsFilter!$I$6:$I$1000)-ROW($I$6)+1)))),$C32)),\"\")","v":""},{"$f":"IFERROR(INDEX(PlanningsFilter!$L$6:$L$1000,SMALL(IF(PlanningsFilter!$K$6:$K$1000=$A32,IF(PlanningsFilter!$C$6:$C$1000=F$2,IF(PlanningsFilter!$J$6:$J$1000=F$4,IF(PlanningsFilter!$I$6:$I$1000=\"\",ROW(PlanningsFilter!$I$6:$I$1000)-ROW($I$6)+1)))),$C32)),\"\")","v":""},{"$f":"IFERROR(INDEX(PlanningsFilter!$L$6:$L$1000,SMALL(IF(PlanningsFilter!$K$6:$K$1000=$A32,IF(PlanningsFilter!$C$6:$C$1000=G$2,IF(PlanningsFilter!$J$6:$J$1000=G$4,IF(PlanningsFilter!$I$6:$I$1000=\"\",ROW(PlanningsFilter!$I$6:$I$1000)-ROW($I$6)+1)))),$C32)),\"\")","v":""},{"$f":"IFERROR(INDEX(PlanningsFilter!$L$6:$L$1000,SMALL(IF(PlanningsFilter!$K$6:$K$1000=$A32,IF(PlanningsFilter!$C$6:$C$1000=H$2,IF(PlanningsFilter!$J$6:$J$1000=H$4,IF(PlanningsFilter!$I$6:$I$1000=\"\",ROW(PlanningsFilter!$I$6:$I$1000)-ROW($I$6)+1)))),$C32)),\"\")","v":""},{"$f":"IFERROR(INDEX(PlanningsFilter!$L$6:$L$1000,SMALL(IF(PlanningsFilter!$K$6:$K$1000=$A32,IF(PlanningsFilter!$C$6:$C$1000=I$2,IF(PlanningsFilter!$J$6:$J$1000=I$4,IF(PlanningsFilter!$I$6:$I$1000=\"\",ROW(PlanningsFilter!$I$6:$I$1000)-ROW($I$6)+1)))),$C32)),\"\")","v":""},{"$f":"IFERROR(INDEX(PlanningsFilter!$L$6:$L$1000,SMALL(IF(PlanningsFilter!$K$6:$K$1000=$A32,IF(PlanningsFilter!$C$6:$C$1000=J$2,IF(PlanningsFilter!$J$6:$J$1000=J$4,IF(PlanningsFilter!$I$6:$I$1000=\"\",ROW(PlanningsFilter!$I$6:$I$1000)-ROW($I$6)+1)))),$C32)),\"\")","v":""},{"$f":"IFERROR(INDEX(PlanningsFilter!$L$6:$L$1000,SMALL(IF(PlanningsFilter!$K$6:$K$1000=$A32,IF(PlanningsFilter!$C$6:$C$1000=K$2,IF(PlanningsFilter!$J$6:$J$1000=K$4,IF(PlanningsFilter!$I$6:$I$1000=\"\",ROW(PlanningsFilter!$I$6:$I$1000)-ROW($I$6)+1)))),$C32)),\"\")","v":""},{"$f":"IFERROR(INDEX(PlanningsFilter!$L$6:$L$1000,SMALL(IF(PlanningsFilter!$K$6:$K$1000=$A32,IF(PlanningsFilter!$C$6:$C$1000=L$2,IF(PlanningsFilter!$J$6:$J$1000=L$4,IF(PlanningsFilter!$I$6:$I$1000=\"\",ROW(PlanningsFilter!$I$6:$I$1000)-ROW($I$6)+1)))),$C32)),\"\")","v":""},{"$f":"IFERROR(INDEX(PlanningsFilter!$L$6:$L$1000,SMALL(IF(PlanningsFilter!$K$6:$K$1000=$A32,IF(PlanningsFilter!$C$6:$C$1000=M$2,IF(PlanningsFilter!$J$6:$J$1000=M$4,IF(PlanningsFilter!$I$6:$I$1000=\"\",ROW(PlanningsFilter!$I$6:$I$1000)-ROW($I$6)+1)))),$C32)),\"\")","v":""},{"$f":"IFERROR(INDEX(PlanningsFilter!$L$6:$L$1000,SMALL(IF(PlanningsFilter!$K$6:$K$1000=$A32,IF(PlanningsFilter!$C$6:$C$1000=N$2,IF(PlanningsFilter!$J$6:$J$1000=N$4,IF(PlanningsFilter!$I$6:$I$1000=\"\",ROW(PlanningsFilter!$I$6:$I$1000)-ROW($I$6)+1)))),$C32)),\"\")","v":""},{"$f":"IFERROR(INDEX(PlanningsFilter!$L$6:$L$1000,SMALL(IF(PlanningsFilter!$K$6:$K$1000=$A32,IF(PlanningsFilter!$C$6:$C$1000=O$2,IF(PlanningsFilter!$J$6:$J$1000=O$4,IF(PlanningsFilter!$I$6:$I$1000=\"\",ROW(PlanningsFilter!$I$6:$I$1000)-ROW($I$6)+1)))),$C32)),\"\")","v":""},{"$f":"IFERROR(INDEX(PlanningsFilter!$L$6:$L$1000,SMALL(IF(PlanningsFilter!$K$6:$K$1000=$A32,IF(PlanningsFilter!$C$6:$C$1000=P$2,IF(PlanningsFilter!$J$6:$J$1000=P$4,IF(PlanningsFilter!$I$6:$I$1000=\"\",ROW(PlanningsFilter!$I$6:$I$1000)-ROW($I$6)+1)))),$C32)),\"\")","v":""},{"$f":"IFERROR(INDEX(PlanningsFilter!$L$6:$L$1000,SMALL(IF(PlanningsFilter!$K$6:$K$1000=$A32,IF(PlanningsFilter!$C$6:$C$1000=Q$2,IF(PlanningsFilter!$J$6:$J$1000=Q$4,IF(PlanningsFilter!$I$6:$I$1000=\"\",ROW(PlanningsFilter!$I$6:$I$1000)-ROW($I$6)+1)))),$C32)),\"\")","v":""},{"$f":"IFERROR(INDEX(PlanningsFilter!$L$6:$L$1000,SMALL(IF(PlanningsFilter!$K$6:$K$1000=$A32,IF(PlanningsFilter!$C$6:$C$1000=R$2,IF(PlanningsFilter!$J$6:$J$1000=R$4,IF(PlanningsFilter!$I$6:$I$1000=\"\",ROW(PlanningsFilter!$I$6:$I$1000)-ROW($I$6)+1)))),$C32)),\"\")","v":""},{"$f":"IFERROR(INDEX(PlanningsFilter!$L$6:$L$1000,SMALL(IF(PlanningsFilter!$K$6:$K$1000=$A32,IF(PlanningsFilter!$C$6:$C$1000=S$2,IF(PlanningsFilter!$J$6:$J$1000=S$4,IF(PlanningsFilter!$I$6:$I$1000=\"\",ROW(PlanningsFilter!$I$6:$I$1000)-ROW($I$6)+1)))),$C32)),\"\")","v":""},{"$f":"IFERROR(INDEX(PlanningsFilter!$L$6:$L$1000,SMALL(IF(PlanningsFilter!$K$6:$K$1000=$A32,IF(PlanningsFilter!$C$6:$C$1000=T$2,IF(PlanningsFilter!$J$6:$J$1000=T$4,IF(PlanningsFilter!$I$6:$I$1000=\"\",ROW(PlanningsFilter!$I$6:$I$1000)-ROW($I$6)+1)))),$C32)),\"\")","v":""},{"$f":"IFERROR(INDEX(PlanningsFilter!$L$6:$L$1000,SMALL(IF(PlanningsFilter!$K$6:$K$1000=$A32,IF(PlanningsFilter!$C$6:$C$1000=U$2,IF(PlanningsFilter!$J$6:$J$1000=U$4,IF(PlanningsFilter!$I$6:$I$1000=\"\",ROW(PlanningsFilter!$I$6:$I$1000)-ROW($I$6)+1)))),$C32)),\"\")","v":""},{"$f":"IFERROR(INDEX(PlanningsFilter!$L$6:$L$1000,SMALL(IF(PlanningsFilter!$K$6:$K$1000=$A32,IF(PlanningsFilter!$C$6:$C$1000=V$2,IF(PlanningsFilter!$J$6:$J$1000=V$4,IF(PlanningsFilter!$I$6:$I$1000=\"\",ROW(PlanningsFilter!$I$6:$I$1000)-ROW($I$6)+1)))),$C32)),\"\")","v":""},{"$f":"IFERROR(INDEX(PlanningsFilter!$L$6:$L$1000,SMALL(IF(PlanningsFilter!$K$6:$K$1000=$A32,IF(PlanningsFilter!$C$6:$C$1000=W$2,IF(PlanningsFilter!$J$6:$J$1000=W$4,IF(PlanningsFilter!$I$6:$I$1000=\"\",ROW(PlanningsFilter!$I$6:$I$1000)-ROW($I$6)+1)))),$C32)),\"\")","v":""},{"$f":"IFERROR(INDEX(PlanningsFilter!$L$6:$L$1000,SMALL(IF(PlanningsFilter!$K$6:$K$1000=$A32,IF(PlanningsFilter!$C$6:$C$1000=X$2,IF(PlanningsFilter!$J$6:$J$1000=X$4,IF(PlanningsFilter!$I$6:$I$1000=\"\",ROW(PlanningsFilter!$I$6:$I$1000)-ROW($I$6)+1)))),$C32)),\"\")","v":""}]
["MEP",null,1,{"$f":"IFERROR(INDEX(PlanningsFilter!$L$6:$L$1000,SMALL(IF(PlanningsFilter!$K$6:$K$1000=$A33,IF(PlanningsFilter!$C$6:$C$1000=D$2,IF(PlanningsFilter!$J$6:$J$1000=D$4,IF(PlanningsFilter!$I$6:$I$1000=\"\",ROW(PlanningsFilter!$I$6:$I$1000)-ROW($I$6)+1)))),$C33)),\"\")","v":"Rudolf Hofman"},{"$f":"IFERROR(INDEX(PlanningsFilter!$L$6:$L$1000,SMALL(IF(PlanningsFilter!$K$6:$K$1000=$A33,IF(PlanningsFilter!$C$6:$C$1000=E$2,IF(PlanningsFilter!$J$6:$J$1000=E$4,IF(PlanningsFilter!$I$6:$I$1000=\"\",ROW(PlanningsFilter!$I$6:$I$1000)-ROW($I$6)+1)))),$C33)),\"\")","v":"Houcin Huisman"},{"$f":"IFERROR(INDEX(PlanningsFilter!$L$6:$L$1000,SMALL(IF(PlanningsFilter!$K$6:$K$1000=$A33,IF(PlanningsFilter!$C$6:$C$1000=F$2,IF(PlanningsFilter!$J$6:$J$1000=F$4,IF(PlanningsFilter!$I$6:$I$1000=\"\",ROW(PlanningsFilter!$I$6:$I$1000)-ROW($I$6)+1)))),$C33)),\"\")","v":""},{"$f":"IFERROR(INDEX(PlanningsFilter!$L$6:$L$1000,SMALL(IF(PlanningsFilter!$K$6:$K$1000=$A33,IF(PlanningsFilter!$C$6:$C$1000=G$2,IF(PlanningsFilter!$J$6:$J$1000=G$4,IF(PlanningsFilter!$I$6:$I$1000=\"\",ROW(PlanningsFilter!$I$6:$I$1000)-ROW($I$6)+1)))),$C33)),\"\")","v":"Rudolf Hofman"},{"$f":"IFERROR(INDEX(PlanningsFilter!$L$6:$L$1000,SMALL(IF(PlanningsFilter!$K$6:$K$1000=$A33,IF(PlanningsFilter!$C$6:$C$1000=H$2,IF(PlanningsFilter!$J$6:$J$1000=H$4,IF(PlanningsFilter!$I$6:$I$1000=\"\",ROW(PlanningsFilter!$I$6:$I$1000)-ROW($I$6)+1)))),$C33)),\"\")","v":"Houcin Huisman"},{"$f":"IFERROR(INDEX(PlanningsFilter!$L$6:$L$1000,SMALL(IF(PlanningsFilter!$K$6:$K$1000=$A33,IF(PlanningsFilter!$C$6:$C$1000=I$2,IF(PlanningsFilter!$J$6:$J$1000=I$4,IF(PlanningsFilter!$I$6:$I$1000=\"\",ROW(PlanningsFilter!$I$6:$I$1000)-ROW($I$6)+1)))),$C33)),\"\")","v":""},{"$f":"IFERROR(INDEX(PlanningsFilter!$L$6:$L$1000,SMALL(IF(PlanningsFilter!$K$6:$K$1000=$A33,IF(PlanningsFilter!$C$6:$C$1000=J$2,IF(PlanningsFilter!$J$6:$J$1000=J$4,IF(PlanningsFilter!$I$6:$I$1000=\"\",ROW(PlanningsFilter!$I$6:$I$1000)-ROW($I$6)+1)))),$C33)),\"\")","v":"Rudolf Hofman"},{"$f":"IFERROR(INDEX(PlanningsFilter!$L$6:$L$1000,SMALL(IF(PlanningsFilter!$K$6:$K$1000=$A33,IF(PlanningsFilter!$C$6:$C$1000=K$2,IF(PlanningsFilter!$J$6:$J$1000=K$4,IF(PlanningsFilter!$I$6:$I$1000=\"\",ROW(PlanningsFilter!$I$6:$I$1000)-ROW($I$6)+1)))),$C33)),\"\")","v":"Houcin Huisman"},{"$f":"IFERROR(INDEX(PlanningsFilter!$L$6:$L$1000,SMALL(IF(PlanningsFilter!$K$6:$K$1000=$A33,IF(PlanningsFilter!$C$6:$C$1000=L$2,IF(PlanningsFilter!$J$6:$J$1000=L$4,IF(PlanningsFilter!$I$6:$I$1000=\"\",ROW(PlanningsFilter!$I$6:$I$1000)-ROW($I$6)+1)))),$C33)),\"\")","v":""},{"$f":"IFERROR(INDEX(PlanningsFilter!$L$6:$L$1000,SMALL(IF(PlanningsFilter!$K$6:$K$1000=$A33,IF(PlanningsFilter!$C$6:$C$1000=M$2,IF(PlanningsFilter!$J$6:$J$1000=M$4,IF(PlanningsFilter!$I$6:$I$1000=\"\",ROW(PlanningsFilter!$I$6:$I$1000)-ROW($I$6)+1)))),$C33)),\"\")","v":"Rudolf Hofman"},{"$f":"IFERROR(INDEX(PlanningsFilter!$L$6:$L$1000,SMALL(IF(PlanningsFilter!$K$6:$K$1000=$A33,IF(PlanningsFilter!$C$6:$C$1000=N$2,IF(PlanningsFilter!$J$6:$J$1000=N$4,IF(PlanningsFilter!$I$6:$I$1000=\"\",ROW(PlanningsFilter!$I$6:$I$1000)-ROW($I$6)+1)))),$C33)),\"\")","v":"Houcin Huisman"},{"$f":"IFERROR(INDEX(PlanningsFilter!$L$6:$L$1000,SMALL(IF(PlanningsFilter!$K$6:$K$1000=$A33,IF(PlanningsFilter!$C$6:$C$1000=O$2,IF(PlanningsFilter!$J$6:$J$1000=O$4,IF(PlanningsFilter!$I$6:$I$1000=\"\",ROW(PlanningsFilter!$I$6:$I$1000)-ROW($I$6)+1)))),$C33)),\"\")","v":""},{"$f":"IFERROR(INDEX(PlanningsFilter!$L$6:$L$1000,SMALL(IF(PlanningsFilter!$K$6:$K$1000=$A33,IF(PlanningsFilter!$C$6:$C$1000=P$2,IF(PlanningsFilter!$J$6:$J$1000=P$4,IF(PlanningsFilter!$I$6:$I$1000=\"\",ROW(PlanningsFilter!$I$6:$I$1000)-ROW($I$6)+1)))),$C33)),\"\")","v":"Rudolf Hofman"},{"$f":"IFERROR(INDEX(PlanningsFilter!$L$6:$L$1000,SMALL(IF(PlanningsFilter!$K$6:$K$1000=$A33,IF(PlanningsFilter!$C$6:$C$1000=Q$2,IF(PlanningsFilter!$J$6:$J$1000=Q$4,IF(PlanningsFilter!$I$6:$I$1000=\"\",ROW(PlanningsFilter!$I$6:$I$1000)-ROW($I$6)+1)))),$C33)),\"\")","v":"Houcin Huisman"},{"$f":"IFERROR(INDEX(PlanningsFilter!$L$6:$L$1000,SMALL(IF(PlanningsFilter!$K$6:$K$1000=$A33,IF(PlanningsFilter!$C$6:$C$1000=R$2,IF(PlanningsFilter!$J$6:$J$1000=R$4,IF(PlanningsFilter!$I$6:$I$1000=\"\",ROW(PlanningsFilter!$I$6:$I$1000)-ROW($I$6)+1)))),$C33)),\"\")","v":""},{"$f":"IFERROR(INDEX(PlanningsFilter!$L$6:$L$1000,SMALL(IF(PlanningsFilter!$K$6:$K$1000=$A33,IF(PlanningsFilter!$C$6:$C$1000=S$2,IF(PlanningsFilter!$J$6:$J$1000=S$4,IF(PlanningsFilter!$I$6:$I$1000=\"\",ROW(PlanningsFilter!$I$6:$I$1000)-ROW($I$6)+1)))),$C33)),\"\")","v":""},{"$f":"IFERROR(INDEX(PlanningsFilter!$L$6:$L$1000,SMALL(IF(PlanningsFilter!$K$6:$K$1000=$A33,IF(PlanningsFilter!$C$6:$C$1000=T$2,IF(PlanningsFilter!$J$6:$J$1000=T$4,IF(PlanningsFilter!$I$6:$I$1000=\"\",ROW(PlanningsFilter!$I$6:$I$1000)-ROW($I$6)+1)))),$C33)),\"\")","v":""},{"$f":"IFERROR(INDEX(PlanningsFilter!$L$6:$L$1000,SMALL(IF(PlanningsFilter!$K$6:$K$1000=$A33,IF(PlanningsFilter!$C$6:$C$1000=U$2,IF(PlanningsFilter!$J$6:$J$1000=U$4,IF(PlanningsFilter!$I$6:$I$1000=\"\",ROW(PlanningsFilter!$I$6:$I$1000)-ROW($I$6)+1)))),$C33)),\"\")","v":""},{"$f":"IFERROR(INDEX(PlanningsFilter!$L$6:$L$1000,SMALL(IF(PlanningsFilter!$K$6:$K$1000=$A33,IF(PlanningsFilter!$C$6:$C$1000=V$2,IF(PlanningsFilter!$J$6:$J$1000=V$4,IF(PlanningsFilter!$I$6:$I$1000=\"\",ROW(PlanningsFilter!$I$6:$I$1000)-ROW($I$6)+1)))),$C33)),\"\")","v":""},{"$f":"IFERROR(INDEX(PlanningsFilter!$L$6:$L$1000,SMALL(IF(PlanningsFilter!$K$6:$K$1000=$A33,IF(PlanningsFilter!$C$6:$C$1000=W$2,IF(PlanningsFilter!$J$6:$J$1000=W$4,IF(PlanningsFilter!$I$6:$I$1000=\"\",ROW(PlanningsFilter!$I$6:$I$1000)-ROW($I$6)+1)))),$C33)),\"\")","v":""},{"$f":"IFERROR(INDEX(PlanningsFilter!$L$6:$L$1000,SMALL(IF(PlanningsFilter!$K$6:$K$1000=$A33,IF(PlanningsFilter!$C$6:$C$1000=X$2,IF(PlanningsFilter!$J$6:$J$1000=X$4,IF(PlanningsFilter!$I$6:$I$1000=\"\",ROW(PlanningsFilter!$I$6:$I$1000)-ROW($I$6)+1)))),$C33)),\"\")","v":""}]
["MEP",null,2,{"$f":"IFERROR(INDEX(PlanningsFilter!$L$6:$L$1000,SMALL(IF(PlanningsFilter!$K$6:$K$1000=$A34,IF(PlanningsFilter!$C$6:$C$1000=D$2,IF(PlanningsFilter!$J$6:$J$1000=D$4,IF(PlanningsFilter!$I$6:$I$1000=\"\",ROW(PlanningsFilter!$I$6:$I$1000)-ROW($I$6)+1)))),$C34)),\"\")","v":"Rijk van Doorn"},{"$f":"IFERROR(INDEX(PlanningsFilter!$L$6:$L$1000,SMALL(IF(PlanningsFilter!$K$6:$K$1000=$A34,IF(PlanningsFilter!$C$6:$C$1000=E$2,IF(PlanningsFilter!$J$6:$J$1000=E$4,IF(PlanningsFilter!$I$6:$I$1000=\"\",ROW(PlanningsFilter!$I$6:$I$1000)-ROW($I$6)+1)))),$C34)),\"\")","v":""},{"$f":"IFERROR(INDEX(PlanningsFilter!$L$6:$L$1000,SMALL(IF(PlanningsFilter!$K$6:$K$1000=$A34,IF(PlanningsFilter!$C$6:$C$1000=F$2,IF(PlanningsFilter!$J$6:$J$1000=F$4,IF(PlanningsFilter!$I$6:$I$1000=\"\",ROW(PlanningsFilter!$I$6:$I$1000)-ROW($I$6)+1)))),$C34)),\"\")","v":""},{"$f":"IFERROR(INDEX(PlanningsFilter!$L$6:$L$1000,SMALL(IF(PlanningsFilter!$K$6:$K$1000=$A34,IF(PlanningsFilter!$C$6:$C$1000=G$2,IF(PlanningsFilter!$J$6:$J$1000=G$4,IF(PlanningsFilter!$I$6:$I$1000=\"\",ROW(PlanningsFilter!$I$6:$I$1000)-ROW($I$6)+1)))),$C34)),\"\")","v":"Rijk van Doorn"},{"$f":"IFERROR(INDEX(PlanningsFilter!$L$6:$L$1000,SMALL(IF(PlanningsFilter!$K$6:$K$1000=$A34,IF(PlanningsFilter!$C$6:$C$1000=H$2,IF(PlanningsFilter!$J$6:$J$1000=H$4,IF(PlanningsFilter!$I$6:$I$1000=\"\",ROW(PlanningsFilter!$I$6:$I$1000)-ROW($I$6)+1)))),$C34)),\"\")","v":""},{"$f":"IFERROR(INDEX(PlanningsFilter!$L$6:$L$1000,SMALL(IF(PlanningsFilter!$K$6:$K$1000=$A34,IF(PlanningsFilter!$C$6:$C$1000=I$2,IF(PlanningsFilter!$J$6:$J$1000=I$4,IF(PlanningsFilter!$I$6:$I$1000=\"\",ROW(PlanningsFilter!$I$6:$I$1000)-ROW($I$6)+1)))),$C34)),\"\")","v":""},{"$f":"IFERROR(INDEX(PlanningsFilter!$L$6:$L$1000,SMALL(IF(PlanningsFilter!$K$6:$K$1000=$A34,IF(PlanningsFilter!$C$6:$C$1000=J$2,IF(PlanningsFilter!$J$6:$J$1000=J$4,IF(PlanningsFilter!$I$6:$I$1000=\"\",ROW(PlanningsFilter!$I$6:$I$1000)-ROW($I$6)+1)))),$C34)),\"\")","v":"Rijk van Doorn"},{"$f":"IFERROR(INDEX(PlanningsFilter!$L$6:$L$1000,SMALL(IF(PlanningsFilter!$K$6:$K$1000=$A34,IF(PlanningsFilter!$C$6:$C$1000=K$2,IF(PlanningsFilter!$J$6:$J$1000=K$4,IF(PlanningsFilter!$I$6:$I$1000=\"\",ROW(PlanningsFilter!$I$6:$I$1000)-ROW($I$6)+1)))),$C34)),\"\")","v":""},{"$f":"IFERROR(INDEX(PlanningsFilter!$L$6:$L$1000,SMALL(IF(PlanningsFilter!$K$6:$K$1000=$A34,IF(PlanningsFilter!$C$6:$C$1000=L$2,IF(PlanningsFilter!$J$6:$J$1000=L$4,IF(PlanningsFilter!$I$6:$I$1000=\"\",ROW(PlanningsFilter!$I$6:$I$1000)-ROW($I$6)+1)))),$C34)),\"\")","v":""},{"$f":"IFERROR(INDEX(PlanningsFilter!$L$6:$L$1000,SMALL(IF(PlanningsFilter!$K$6:$K$1000=$A34,IF(PlanningsFilter!$C$6:$C$1000=M$2,IF(PlanningsFilter!$J$6:$J$1000=M$4,IF(PlanningsFilter!$I$6:$I$1000=\"\",ROW(PlanningsFilter!$I$6:$I$1000)-ROW($I$6)+1)))),$C34)),\"\")","v":"Rijk van Doorn"},{"$f":"IFERROR(INDEX(PlanningsFilter!$L$6:$L$1000,SMALL(IF(PlanningsFilter!$K$6:$K$1000=$A34,IF(PlanningsFilter!$C$6:$C$1000=N$2,IF(PlanningsFilter!$J$6:$J$1000=N$4,IF(PlanningsFilter!$I$6:$I$1000=\"\",ROW(PlanningsFilter!$I$6:$I$1000)-ROW($I$6)+1)))),$C34)),\"\")","v":""},{"$f":"IFERROR(INDEX(PlanningsFilter!$L$6:$L$1000,SMALL(IF(PlanningsFilter!$K$6:$K$1000=$A34,IF(PlanningsFilter!$C$6:$C$1000=O$2,IF(PlanningsFilter!$J$6:$J$1000=O$4,IF(PlanningsFilter!$I$6:$I$1000=\"\",ROW(PlanningsFilter!$I$6:$I$1000)-ROW($I$6)+1)))),$C34)),\"\")","v":""},{"$f":"IFERROR(INDEX(PlanningsFilter!$L$6:$L$1000,SMALL(IF(PlanningsFilter!$K$6:$K$1000=$A34,IF(PlanningsFilter!$C$6:$C$1000=P$2,IF(PlanningsFilter!$J$6:$J$1000=P$4,IF(PlanningsFilter!$I$6:$I$1000=\"\",ROW(PlanningsFilter!$I$6:$I$1000)-ROW($I$6)+1)))),$C34)),\"\")","v":"Rijk van Doorn"},{"$f":"IFERROR(INDEX(PlanningsFilter!$L$6:$L$1000,SMALL(IF(PlanningsFilter!$K$6:$K$1000=$A34,IF(PlanningsFilter!$C$6:$C$1000=Q$2,IF(PlanningsFilter!$J$6:$J$1000=Q$4,IF(PlanningsFilter!$I$6:$I$1000=\"\",ROW(PlanningsFilter!$I$6:$I$1000)-ROW($I$6)+1)))),$C34)),\"\")","v":""},{"$f":"IFERROR(INDEX(PlanningsFilter!$L$6:$L$1000,SMALL(IF(PlanningsFilter!$K$6:$K$1000=$A34,IF(PlanningsFilter!$C$6:$C$1000=R$2,IF(PlanningsFilter!$J$6:$J$1000=R$4,IF(PlanningsFilter!$I$6:$I$1000=\"\",ROW(PlanningsFilter!$I$6:$I$1000)-ROW($I$6)+1)))),$C34)),\"\")","v":""},{"$f":"IFERROR(INDEX(PlanningsFilter!$L$6:$L$1000,SMALL(IF(PlanningsFilter!$K$6:$K$1000=$A34,IF(PlanningsFilter!$C$6:$C$1000=S$2,IF(PlanningsFilter!$J$6:$J$1000=S$4,IF(PlanningsFilter!$I$6:$I$1000=\"\",ROW(PlanningsFilter!$I$6:$I$1000)-ROW($I$6)+1)))),$C34)),\"\")","v":""},{"$f":"IFERROR(INDEX(PlanningsFilter!$L$6:$L$1000,SMALL(IF(PlanningsFilter!$K$6:$K$1000=$A34,IF(PlanningsFilter!$C$6:$C$1000=T$2,IF(PlanningsFilter!$J$6:$J$1000=T$4,IF(PlanningsFilter!$I$6:$I$1000=\"\",ROW(PlanningsFilter!$I$6:$I$1000)-ROW($I$6)+1)))),$C34)),\"\")","v":""},{"$f":"IFERROR(INDEX(PlanningsFilter!$L$6:$L$1000,SMALL(IF(PlanningsFilter!$K$6:$K$1000=$A34,IF(PlanningsFilter!$C$6:$C$1000=U$2,IF(PlanningsFilter!$J$6:$J$1000=U$4,IF(PlanningsFilter!$I$6:$I$1000=\"\",ROW(PlanningsFilter!$I$6:$I$1000)-ROW($I$6)+1)))),$C34)),\"\")","v":""},{"$f":"IFERROR(INDEX(PlanningsFilter!$L$6:$L$1000,SMALL(IF(PlanningsFilter!$K$6:$K$1000=$A34,IF(PlanningsFilter!$C$6:$C$1000=V$2,IF(PlanningsFilter!$J$6:$J$1000=V$4,IF(PlanningsFilter!$I$6:$I$1000=\"\",ROW(PlanningsFilter!$I$6:$I$1000)-ROW($I$6)+1)))),$C34)),\"\")","v":""},{"$f":"IFERROR(INDEX(PlanningsFilter!$L$6:$L$1000,SMALL(IF(PlanningsFilter!$K$6:$K$1000=$A34,IF(PlanningsFilter!$C$6:$C$1000=W$2,IF(PlanningsFilter!$J$6:$J$1000=W$4,IF(PlanningsFilter!$I$6:$I$1000=\"\",ROW(PlanningsFilter!$I$6:$I$1000)-ROW($I$6)+1)))),$C34)),\"\")","v":""},{"$f":"IFERROR(INDEX(PlanningsFilter!$L$6:$L$1000,SMALL(IF(PlanningsFilter!$K$6:$K$1000=$A34,IF(PlanningsFilter!$C$6:$C$1000=X$2,IF(PlanningsFilter!$J$6:$J$1000=X$4,IF(PlanningsFilter!$I$6:$I$1000=\"\",ROW(PlanningsFilter!$I$6:$I$1000)-ROW($I$6)+1)))),$C34)),\"\")","v":""}]
["MEP",null,3,{"$f":"IFERROR(INDEX(PlanningsFilter!$L$6:$L$1000,SMALL(IF(PlanningsFilter!$K$6:$K$1000=$A35,IF(PlanningsFilter!$C$6:$C$1000=D$2,IF(PlanningsFilter!$J$6:$J$1000=D$4,IF(PlanningsFilter!$I$6:$I$1000=\"\",ROW(PlanningsFilter!$I$6:$I$1000)-ROW($I$6)+1)))),$C35)),\"\")","v":""},{"$f":"IFERROR(INDEX(PlanningsFilter!$L$6:$L$1000,SMALL(IF(PlanningsFilter!$K$6:$K$1000=$A35,IF(PlanningsFilter!$C$6:$C$1000=E$2,IF(PlanningsFilter!$J$6:$J$1000=E$4,IF(PlanningsFilter!$I$6:$I$1000=\"\",ROW(PlanningsFilter!$I$6:$I$1000)-ROW($I$6)+1)))),$C35)),\"\")","v":""},{"$f":"IFERROR(INDEX(PlanningsFilter!$L$6:$L$1000,SMALL(IF(PlanningsFilter!$K$6:$K$1000=$A35,IF(PlanningsFilter!$C$6:$C$1000=F$2,IF(PlanningsFilter!$J$6:$J$1000=F$4,IF(PlanningsFilter!$I$6:$I$1000=\"\",ROW(PlanningsFilter!$I$6:$I$1000)-ROW($I$6)+1)))),$C35)),\"\")","v":""},{"$f":"IFERROR(INDEX(PlanningsFilter!$L$6:$L$1000,SMALL(IF(PlanningsFilter!$K$6:$K$1000=$A35,IF(PlanningsFilter!$C$6:$C$1000=G$2,IF(PlanningsFilter!$J$6:$J$1000=G$4,IF(PlanningsFilter!$I$6:$I$1000=\"\",ROW(PlanningsFilter!$I$6:$I$1000)-ROW($I$6)+1)))),$C35)),\"\")","v":""},{"$f":"IFERROR(INDEX(PlanningsFilter!$L$6:$L$1000,SMALL(IF(PlanningsFilter!$K$6:$K$1000=$A35,IF(PlanningsFilter!$C$6:$C$1000=H$2,IF(PlanningsFilter!$J$6:$J$1000=H$4,IF(PlanningsFilter!$I$6:$I$1000=\"\",ROW(PlanningsFilter!$I$6:$I$1000)-ROW($I$6)+1)))),$C35)),\"\")","v":""},{"$f":"IFERROR(INDEX(PlanningsFilter!$L$6:$L$1000,SMALL(IF(PlanningsFilter!$K$6:$K$1000=$A35,IF(PlanningsFilter!$C$6:$C$1000=I$2,IF(PlanningsFilter!$J$6:$J$1000=I$4,IF(PlanningsFilter!$I$6:$I$1000=\"\",ROW(PlanningsFilter!$I$6:$I$1000)-ROW($I$6)+1)))),$C35)),\"\")","v":""},{"$f":"IFERROR(INDEX(PlanningsFilter!$L$6:$L$1000,SMALL(IF(PlanningsFilter!$K$6:$K$1000=$A35,IF(PlanningsFilter!$C$6:$C$1000=J$2,IF(PlanningsFilter!$J$6:$J$1000=J$4,IF(PlanningsFilter!$I$6:$I$1000=\"\",ROW(PlanningsFilter!$I$6:$I$1000)-ROW($I$6)+1)))),$C35)),\"\")","v":""},{"$f":"IFERROR(INDEX(PlanningsFilter!$L$6:$L$1000,SMALL(IF(PlanningsFilter!$K$6:$K$1000=$A35,IF(PlanningsFilter!$C$6:$C$1000=K$2,IF(PlanningsFilter!$J$6:$J$1000=K$4,IF(PlanningsFilter!$I$6:$I$1000=\"\",ROW(PlanningsFilter!$I$6:$I$1000)-ROW($I$6)+1)))),$C35)),\"\")","v":""},{"$f":"IFERROR(INDEX(PlanningsFilter!$L$6:$L$1000,SMALL(IF(PlanningsFilter!$K$6:$K$1000=$A35,IF(PlanningsFilter!$C$6:$C$1000=L$2,IF(PlanningsFilter!$J$6:$J$1000=L$4,IF(PlanningsFilter!$I$6:$I$1000=\"\",ROW(PlanningsFilter!$I$6:$I$1000)-ROW($I$6)+1)))),$C35)),\"\")","v":""},{"$f":"IFERROR(INDEX(PlanningsFilter!$L$6:$L$1000,SMALL(IF(PlanningsFilter!$K$6:$K$1000=$A35,IF(PlanningsFilter!$C$6:$C$1000=M$2,IF(PlanningsFilter!$J$6:$J$1000=M$4,IF(PlanningsFilter!$I$6:$I$1000=\"\",ROW(PlanningsFilter!$I$6:$I$1000)-ROW($I$6)+1)))),$C35)),\"\")","v":""},{"$f":"IFERROR(INDEX(PlanningsFilter!$L$6:$L$1000,SMALL(IF(PlanningsFilter!$K$6:$K$1000=$A35,IF(PlanningsFilter!$C$6:$C$1000=N$2,IF(PlanningsFilter!$J$6:$J$1000=N$4,IF(PlanningsFilter!$I$6:$I$1000=\"\",ROW(PlanningsFilter!$I$6:$I$1000)-ROW($I$6)+1)))),$C35)),\"\")","v":""},{"$f":"IFERROR(INDEX(PlanningsFilter!$L$6:$L$1000,SMALL(IF(PlanningsFilter!$K$6:$K$1000=$A35,IF(PlanningsFilter!$C$6:$C$1000=O$2,IF(PlanningsFilter!$J$6:$J$1000=O$4,IF(PlanningsFilter!$I$6:$I$1000=\"\",ROW(PlanningsFilter!$I$6:$I$1000)-ROW($I$6)+1)))),$C35)),\"\")","v":""},{"$f":"IFERROR(INDEX(PlanningsFilter!$L$6:$L$1000,SMALL(IF(PlanningsFilter!$K$6:$K$1000=$A35,IF(PlanningsFilter!$C$6:$C$1000=P$2,IF(PlanningsFilter!$J$6:$J$1000=P$4,IF(PlanningsFilter!$I$6:$I$1000=\"\",ROW(PlanningsFilter!$I$6:$I$1000)-ROW($I$6)+1)))),$C35)),\"\")","v":""},{"$f":"IFERROR(INDEX(PlanningsFilter!$L$6:$L$1000,SMALL(IF(PlanningsFilter!$K$6:$K$1000=$A35,IF(PlanningsFilter!$C$6:$C$1000=Q$2,IF(PlanningsFilter!$J$6:$J$1000=Q$4,IF(PlanningsFilter!$I$6:$I$1000=\"\",ROW(PlanningsFilter!$I$6:$I$1000)-ROW($I$6)+1)))),$C35)),\"\")","v":""},{"$f":"IFERROR(INDEX(PlanningsFilter!$L$6:$L$1000,SMALL(IF(PlanningsFilter!$K$6:$K$1000=$A35,IF(PlanningsFilter!$C$6:$C$1000=R$2,IF(PlanningsFilter!$J$6:$J$1000=R$4,IF(PlanningsFilter!$I$6:$I$1000=\"\",ROW(PlanningsFilter!$I$6:$I$1000)-ROW($I$6)+1)))),$C35)),\"\")","v":""},{"$f":"IFERROR(INDEX(PlanningsFilter!$L$6:$L$1000,SMALL(IF(PlanningsFilter!$K$6:$K$1000=$A35,IF(PlanningsFilter!$C$6:$C$1000=S$2,IF(PlanningsFilter!$J$6:$J$1000=S$4,IF(PlanningsFilter!$I$6:$I$1000=\"\",ROW(PlanningsFilter!$I$6:$I$1000)-ROW($I$6)+1)))),$C35)),\"\")","v":""},{"$f":"IFERROR(INDEX(PlanningsFilter!$L$6:$L$1000,SMALL(IF(PlanningsFilter!$K$6:$K$1000=$A35,IF(PlanningsFilter!$C$6:$C$1000=T$2,IF(PlanningsFilter!$J$6:$J$1000=T$4,IF(PlanningsFilter!$I$6:$I$1000=\"\",ROW(PlanningsFilter!$I$6:$I$1000)-ROW($I$6)+1)))),$C35)),\"\")","v":""},{"$f":"IFERROR(INDEX(PlanningsFilter!$L$6:$L$1000,SMALL(IF(PlanningsFilter!$K$6:$K$1000=$A35,IF(PlanningsFilter!$C$6:$C$1000=U$2,IF(PlanningsFilter!$J$6:$J$1000=U$4,IF(PlanningsFilter!$I$6:$I$1000=\"\",ROW(PlanningsFilter!$I$6:$I$1000)-ROW($I$6)+1)))),$C35)),\"\")","v":""},{"$f":"IFERROR(INDEX(PlanningsFilter!$L$6:$L$1000,SMALL(IF(PlanningsFilter!$K$6:$K$1000=$A35,IF(PlanningsFilter!$C$6:$C$1000=V$2,IF(PlanningsFilter!$J$6:$J$1000=V$4,IF(PlanningsFilter!$I$6:$I$1000=\"\",ROW(PlanningsFilter!$I$6:$I$1000)-ROW($I$6)+1)))),$C35)),\"\")","v":""},{"$f":"IFERROR(INDEX(PlanningsFilter!$L$6:$L$1000,SMALL(IF(PlanningsFilter!$K$6:$K$1000=$A35,IF(PlanningsFilter!$C$6:$C$1000=W$2,IF(PlanningsFilter!$J$6:$J$1000=W$4,IF(PlanningsFilter!$I$6:$I$1000=\"\",ROW(PlanningsFilter!$I$6:$I$1000)-ROW($I$6)+1)))),$C35)),\"\")","v":""},{"$f":"IFERROR(INDEX(PlanningsFilter!$L$6:$L$1000,SMALL(IF(PlanningsFilter!$K$6:$K$1000=$A35,IF(PlanningsFilter!$C$6:$C$1000=X$2,IF(PlanningsFilter!$J$6:$J$1000=X$4,IF(PlanningsFilter!$I$6:$I$1000=\"\",ROW(PlanningsFilter!$I$6:$I$1000)-ROW($I$6)+1)))),$C35)),\"\")","v":""}]
["MEP",null,4,{"$f":"IFERROR(INDEX(PlanningsFilter!$L$6:$L$1000,SMALL(IF(PlanningsFilter!$K$6:$K$1000=$A36,IF(PlanningsFilter!$C$6:$C$1000=D$2,IF(PlanningsFilter!$J$6:$J$1000=D$4,IF(PlanningsFilter!$I$6:$I$1000=\"\",ROW(PlanningsFilter!$I$6:$I$1000)-ROW($I$6)+1)))),$C36)),\"\")","v":""},{"$f":"IFERROR(INDEX(PlanningsFilter!$L$6:$L$1000,SMALL(IF(PlanningsFilter!$K$6:$K$1000=$A36,IF(PlanningsFilter!$C$6:$C$1000=E$2,IF(PlanningsFilter!$J$6:$J$1000=E$4,IF(PlanningsFilter!$I$6:$I$1000=\"\",ROW(PlanningsFilter!$I$6:$I$1000)-ROW($I$6)+1)))),$C36)),\"\")","v":""},{"$f":"IFERROR(INDEX(PlanningsFilter!$L$6:$L$1000,SMALL(IF(PlanningsFilter!$K$6:$K$1000=$A36,IF(PlanningsFilter!$C$6:$C$1000=F$2,IF(PlanningsFilter!$J$6:$J$1000=F$4,IF(PlanningsFilter!$I$6:$I$1000=\"\",ROW(PlanningsFilter!$I$6:$I$1000)-ROW($I$6)+1)))),$C36)),\"\")","v":""},{"$f":"IFERROR(INDEX(PlanningsFilter!$L$6:$L$1000,SMALL(IF(PlanningsFilter!$K$6:$K$1000=$A36,IF(PlanningsFilter!$C$6:$C$1000=G$2,IF(PlanningsFilter!$J$6:$J$1000=G$4,IF(PlanningsFilter!$I$6:$I$1000=\"\",ROW(PlanningsFilter!$I$6:$I$1000)-ROW($I$6)+1)))),$C36)),\"\")","v":""},{"$f":"IFERROR(INDEX(PlanningsFilter!$L$6:$L$1000,SMALL(IF(PlanningsFilter!$K$6:$K$1000=$A36,IF(PlanningsFilter!$C$6:$C$1000=H$2,IF(PlanningsFilter!$J$6:$J$1000=H$4,IF(PlanningsFilter!$I$6:$I$1000=\"\",ROW(PlanningsFilter!$I$6:$I$1000)-ROW($I$6)+1)))),$C36)),\"\")","v":""},{"$f":"IFERROR(INDEX(PlanningsFilter!$L$6:$L$1000,SMALL(IF(PlanningsFilter!$K$6:$K$1000=$A36,IF(PlanningsFilter!$C$6:$C$1000=I$2,IF(PlanningsFilter!$J$6:$J$1000=I$4,IF(PlanningsFilter!$I$6:$I$1000=\"\",ROW(PlanningsFilter!$I$6:$I$1000)-ROW($I$6)+1)))),$C36)),\"\")","v":""},{"$f":"IFERROR(INDEX(PlanningsFilter!$L$6:$L$1000,SMALL(IF(PlanningsFilter!$K$6:$K$1000=$A36,IF(PlanningsFilter!$C$6:$C$1000=J$2,IF(PlanningsFilter!$J$6:$J$1000=J$4,IF(PlanningsFilter!$I$6:$I$1000=\"\",ROW(PlanningsFilter!$I$6:$I$1000)-ROW($I$6)+1)))),$C36)),\"\")","v":""},{"$f":"IFERROR(INDEX(PlanningsFilter!$L$6:$L$1000,SMALL(IF(PlanningsFilter!$K$6:$K$1000=$A36,IF(PlanningsFilter!$C$6:$C$1000=K$2,IF(PlanningsFilter!$J$6:$J$1000=K$4,IF(PlanningsFilter!$I$6:$I$1000=\"\",ROW(PlanningsFilter!$I$6:$I$1000)-ROW($I$6)+1)))),$C36)),\"\")","v":""},{"$f":"IFERROR(INDEX(PlanningsFilter!$L$6:$L$1000,SMALL(IF(PlanningsFilter!$K$6:$K$1000=$A36,IF(PlanningsFilter!$C$6:$C$1000=L$2,IF(PlanningsFilter!$J$6:$J$1000=L$4,IF(PlanningsFilter!$I$6:$I$1000=\"\",ROW(PlanningsFilter!$I$6:$I$1000)-ROW($I$6)+1)))),$C36)),\"\")","v":""},{"$f":"IFERROR(INDEX(PlanningsFilter!$L$6:$L$1000,SMALL(IF(PlanningsFilter!$K$6:$K$1000=$A36,IF(PlanningsFilter!$C$6:$C$1000=M$2,IF(PlanningsFilter!$J$6:$J$1000=M$4,IF(PlanningsFilter!$I$6:$I$1000=\"\",ROW(PlanningsFilter!$I$6:$I$1000)-ROW($I$6)+1)))),$C36)),\"\")","v":""},{"$f":"IFERROR(INDEX(PlanningsFilter!$L$6:$L$1000,SMALL(IF(PlanningsFilter!$K$6:$K$1000=$A36,IF(PlanningsFilter!$C$6:$C$1000=N$2,IF(PlanningsFilter!$J$6:$J$1000=N$4,IF(PlanningsFilter!$I$6:$I$1000=\"\",ROW(PlanningsFilter!$I$6:$I$1000)-ROW($I$6)+1)))),$C36)),\"\")","v":""},{"$f":"IFERROR(INDEX(PlanningsFilter!$L$6:$L$1000,SMALL(IF(PlanningsFilter!$K$6:$K$1000=$A36,IF(PlanningsFilter!$C$6:$C$1000=O$2,IF(PlanningsFilter!$J$6:$J$1000=O$4,IF(PlanningsFilter!$I$6:$I$1000=\"\",ROW(PlanningsFilter!$I$6:$I$1000)-ROW($I$6)+1)))),$C36)),\"\")","v":""},{"$f":"IFERROR(INDEX(PlanningsFilter!$L$6:$L$1000,SMALL(IF(PlanningsFilter!$K$6:$K$1000=$A36,IF(PlanningsFilter!$C$6:$C$1000=P$2,IF(PlanningsFilter!$J$6:$J$1000=P$4,IF(PlanningsFilter!$I$6:$I$1000=\"\",ROW(PlanningsFilter!$I$6:$I$1000)-ROW($I$6)+1)))),$C36)),\"\")","v":""},{"$f":"IFERROR(INDEX(PlanningsFilter!$L$6:$L$1000,SMALL(IF(PlanningsFilter!$K$6:$K$1000=$A36,IF(PlanningsFilter!$C$6:$C$1000=Q$2,IF(PlanningsFilter!$J$6:$J$1000=Q$4,IF(PlanningsFilter!$I$6:$I$1000=\"\",ROW(PlanningsFilter!$I$6:$I$1000)-ROW($I$6)+1)))),$C36)),\"\")","v":""},{"$f":"IFERROR(INDEX(PlanningsFilter!$L$6:$L$1000,SMALL(IF(PlanningsFilter!$K$6:$K$1000=$A36,IF(PlanningsFilter!$C$6:$C$1000=R$2,IF(PlanningsFilter!$J$6:$J$1000=R$4,IF(PlanningsFilter!$I$6:$I$1000=\"\",ROW(PlanningsFilter!$I$6:$I$1000)-ROW($I$6)+1)))),$C36)),\"\")","v":""},{"$f":"IFERROR(INDEX(PlanningsFilter!$L$6:$L$1000,SMALL(IF(PlanningsFilter!$K$6:$K$1000=$A36,IF(PlanningsFilter!$C$6:$C$1000=S$2,IF(PlanningsFilter!$J$6:$J$1000=S$4,IF(PlanningsFilter!$I$6:$I$1000=\"\",ROW(PlanningsFilter!$I$6:$I$1000)-ROW($I$6)+1)))),$C36)),\"\")","v":""},{"$f":"IFERROR(INDEX(PlanningsFilter!$L$6:$L$1000,SMALL(IF(PlanningsFilter!$K$6:$K$1000=$A36,IF(PlanningsFilter!$C$6:$C$1000=T$2,IF(PlanningsFilter!$J$6:$J$1000=T$4,IF(PlanningsFilter!$I$6:$I$1000=\"\",ROW(PlanningsFilter!$I$6:$I$1000)-ROW($I$6)+1)))),$C36)),\"\")","v":""},{"$f":"IFERROR(INDEX(PlanningsFilter!$L$6:$L$1000,SMALL(IF(PlanningsFilter!$K$6:$K$1000=$A36,IF(PlanningsFilter!$C$6:$C$1000=U$2,IF(PlanningsFilter!$J$6:$J$1000=U$4,IF(PlanningsFilter!$I$6:$I$1000=\"\",ROW(PlanningsFilter!$I$6:$I$1000)-ROW($I$6)+1)))),$C36)),\"\")","v":""},{"$f":"IFERROR(INDEX(PlanningsFilter!$L$6:$L$1000,SMALL(IF(PlanningsFilter!$K$6:$K$1000=$A36,IF(PlanningsFilter!$C$6:$C$1000=V$2,IF(PlanningsFilter!$J$6:$J$1000=V$4,IF(PlanningsFilter!$I$6:$I$1000=\"\",ROW(PlanningsFilter!$I$6:$I$1000)-ROW($I$6)+1)))),$C36)),\"\")","v":""},{"$f":"IFERROR(INDEX(PlanningsFilter!$L$6:$L$1000,SMALL(IF(PlanningsFilter!$K$6:$K$1000=$A36,IF(PlanningsFilter!$C$6:$C$1000=W$2,IF(PlanningsFilter!$J$6:$J$1000=W$4,IF(PlanningsFilter!$I$6:$I$1000=\"\",ROW(PlanningsFilter!$I$6:$I$1000)-ROW($I$6)+1)))),$C36)),\"\")","v":""},{"$f":"IFERROR(INDEX(PlanningsFilter!$L$6:$L$1000,SMALL(IF(PlanningsFilter!$K$6:$K$1000=$A36,IF(PlanningsFilter!$C$6:$C$1000=X$2,IF(PlanningsFilter!$J$6:$J$1000=X$4,IF(PlanningsFilter!$I$6:$I$1000=\"\",ROW(PlanningsFilter!$I$6:$I$1000)-ROW($I$6)+1)))),$C36)),\"\")","v":""}]
["MEP",null,5,{"$f":"IFERROR(INDEX(PlanningsFilter!$L$6:$L$1000,SMALL(IF(PlanningsFilter!$K$6:$K$1000=$A37,IF(PlanningsFilter!$C$6:$C$1000=D$2,IF(PlanningsFilter!$J$6:$J$1000=D$4,IF(PlanningsFilter!$I$6:$I$1000=\"\",ROW(PlanningsFilter!$I$6:$I$1000)-ROW($I$6)+1)))),$C37)),\"\")","v":""},{"$f":"IFERROR(INDEX(PlanningsFilter!$L$6:$L$1000,SMALL(IF(PlanningsFilter!$K$6:$K$1000=$A37,IF(PlanningsFilter!$C$6:$C$1000=E$2,IF(PlanningsFilter!$J$6:$J$1000=E$4,IF(PlanningsFilter!$I$6:$I$1000=\"\",ROW(PlanningsFilter!$I$6:$I$1000)-ROW($I$6)+1)))),$C37)),\"\")","v":""},{"$f":"IFERROR(INDEX(PlanningsFilter!$L$6:$L$1000,SMALL(IF(PlanningsFilter!$K$6:$K$1000=$A37,IF(PlanningsFilter!$C$6:$C$1000=F$2,IF(PlanningsFilter!$J$6:$J$1000=F$4,IF(PlanningsFilter!$I$6:$I$1000=\"\",ROW(PlanningsFilter!$I$6:$I$1000)-ROW($I$6)+1)))),$C37)),\"\")","v":""},{"$f":"IFERROR(INDEX(PlanningsFilter!$L$6:$L$1000,SMALL(IF(PlanningsFilter!$K$6:$K$1000=$A37,IF(PlanningsFilter!$C$6:$C$1000=G$2,IF(PlanningsFilter!$J$6:$J$1000=G$4,IF(PlanningsFilter!$I$6:$I$1000=\"\",ROW(PlanningsFilter!$I$6:$I$1000)-ROW($I$6)+1)))),$C37)),\"\")","v":""},{"$f":"IFERROR(INDEX(PlanningsFilter!$L$6:$L$1000,SMALL(IF(PlanningsFilter!$K$6:$K$1000=$A37,IF(PlanningsFilter!$C$6:$C$1000=H$2,IF(PlanningsFilter!$J$6:$J$1000=H$4,IF(PlanningsFilter!$I$6:$I$1000=\"\",ROW(PlanningsFilter!$I$6:$I$1000)-ROW($I$6)+1)))),$C37)),\"\")","v":""},{"$f":"IFERROR(INDEX(PlanningsFilter!$L$6:$L$1000,SMALL(IF(PlanningsFilter!$K$6:$K$1000=$A37,IF(PlanningsFilter!$C$6:$C$1000=I$2,IF(PlanningsFilter!$J$6:$J$1000=I$4,IF(PlanningsFilter!$I$6:$I$1000=\"\",ROW(PlanningsFilter!$I$6:$I$1000)-ROW($I$6)+1)))),$C37)),\"\")","v":""},{"$f":"IFERROR(INDEX(PlanningsFilter!$L$6:$L$1000,SMALL(IF(PlanningsFilter!$K$6:$K$1000=$A37,IF(PlanningsFilter!$C$6:$C$1000=J$2,IF(PlanningsFilter!$J$6:$J$1000=J$4,IF(PlanningsFilter!$I$6:$I$1000=\"\",ROW(PlanningsFilter!$I$6:$I$1000)-ROW($I$6)+1)))),$C37)),\"\")","v":""},{"$f":"IFERROR(INDEX(PlanningsFilter!$L$6:$L$1000,SMALL(IF(PlanningsFilter!$K$6:$K$1000=$A37,IF(PlanningsFilter!$C$6:$C$1000=K$2,IF(PlanningsFilter!$J$6:$J$1000=K$4,IF(PlanningsFilter!$I$6:$I$1000=\"\",ROW(PlanningsFilter!$I$6:$I$1000)-ROW($I$6)+1)))),$C37)),\"\")","v":""},{"$f":"IFERROR(INDEX(PlanningsFilter!$L$6:$L$1000,SMALL(IF(PlanningsFilter!$K$6:$K$1000=$A37,IF(PlanningsFilter!$C$6:$C$1000=L$2,IF(PlanningsFilter!$J$6:$J$1000=L$4,IF(PlanningsFilter!$I$6:$I$1000=\"\",ROW(PlanningsFilter!$I$6:$I$1000)-ROW($I$6)+1)))),$C37)),\"\")","v":""},{"$f":"IFERROR(INDEX(PlanningsFilter!$L$6:$L$1000,SMALL(IF(PlanningsFilter!$K$6:$K$1000=$A37,IF(PlanningsFilter!$C$6:$C$1000=M$2,IF(PlanningsFilter!$J$6:$J$1000=M$4,IF(PlanningsFilter!$I$6:$I$1000=\"\",ROW(PlanningsFilter!$I$6:$I$1000)-ROW($I$6)+1)))),$C37)),\"\")","v":""},{"$f":"IFERROR(INDEX(PlanningsFilter!$L$6:$L$1000,SMALL(IF(PlanningsFilter!$K$6:$K$1000=$A37,IF(PlanningsFilter!$C$6:$C$1000=N$2,IF(PlanningsFilter!$J$6:$J$1000=N$4,IF(PlanningsFilter!$I$6:$I$1000=\"\",ROW(PlanningsFilter!$I$6:$I$1000)-ROW($I$6)+1)))),$C37)),\"\")","v":""},{"$f":"IFERROR(INDEX(PlanningsFilter!$L$6:$L$1000,SMALL(IF(PlanningsFilter!$K$6:$K$1000=$A37,IF(PlanningsFilter!$C$6:$C$1000=O$2,IF(PlanningsFilter!$J$6:$J$1000=O$4,IF(PlanningsFilter!$I$6:$I$1000=\"\",ROW(PlanningsFilter!$I$6:$I$1000)-ROW($I$6)+1)))),$C37)),\"\")","v":""},{"$f":"IFERROR(INDEX(PlanningsFilter!$L$6:$L$1000,SMALL(IF(PlanningsFilter!$K$6:$K$1000=$A37,IF(PlanningsFilter!$C$6:$C$1000=P$2,IF(PlanningsFilter!$J$6:$J$1000=P$4,IF(PlanningsFilter!$I$6:$I$1000=\"\",ROW(PlanningsFilter!$I$6:$I$1000)-ROW($I$6)+1)))),$C37)),\"\")","v":""},{"$f":"IFERROR(INDEX(PlanningsFilter!$L$6:$L$1000,SMALL(IF(PlanningsFilter!$K$6:$K$1000=$A37,IF(PlanningsFilter!$C$6:$C$1000=Q$2,IF(PlanningsFilter!$J$6:$J$1000=Q$4,IF(PlanningsFilter!$I$6:$I$1000=\"\",ROW(PlanningsFilter!$I$6:$I$1000)-ROW($I$6)+1)))),$C37)),\"\")","v":""},{"$f":"IFERROR(INDEX(PlanningsFilter!$L$6:$L$1000,SMALL(IF(PlanningsFilter!$K$6:$K$1000=$A37,IF(PlanningsFilter!$C$6:$C$1000=R$2,IF(PlanningsFilter!$J$6:$J$1000=R$4,IF(PlanningsFilter!$I$6:$I$1000=\"\",ROW(PlanningsFilter!$I$6:$I$1000)-ROW($I$6)+1)))),$C37)),\"\")","v":""},{"$f":"IFERROR(INDEX(PlanningsFilter!$L$6:$L$1000,SMALL(IF(PlanningsFilter!$K$6:$K$1000=$A37,IF(PlanningsFilter!$C$6:$C$1000=S$2,IF(PlanningsFilter!$J$6:$J$1000=S$4,IF(PlanningsFilter!$I$6:$I$1000=\"\",ROW(PlanningsFilter!$I$6:$I$1000)-ROW($I$6)+1)))),$C37)),\"\")","v":""},{"$f":"IFERROR(INDEX(PlanningsFilter!$L$6:$L$1000,SMALL(IF(PlanningsFilter!$K$6:$K$1000=$A37,IF(PlanningsFilter!$C$6:$C$1000=T$2,IF(PlanningsFilter!$J$6:$J$1000=T$4,IF(PlanningsFilter!$I$6:$I$1000=\"\",ROW(PlanningsFilter!$I$6:$I$1000)-ROW($I$6)+1)))),$C37)),\"\")","v":""},{"$f":"IFERROR(INDEX(PlanningsFilter!$L$6:$L$1000,SMALL(IF(PlanningsFilter!$K$6:$K$1000=$A37,IF(PlanningsFilter!$C$6:$C$1000=U$2,IF(PlanningsFilter!$J$6:$J$1000=U$4,IF(PlanningsFilter!$I$6:$I$1000=\"\",ROW(PlanningsFilter!$I$6:$I$1000)-ROW($I$6)+1)))),$C37)),\"\")","v":""},{"$f":"IFERROR(INDEX(PlanningsFilter!$L$6:$L$1000,SMALL(IF(PlanningsFilter!$K$6:$K$1000=$A37,IF(PlanningsFilter!$C$6:$C$1000=V$2,IF(PlanningsFilter!$J$6:$J$1000=V$4,IF(PlanningsFilter!$I$6:$I$1000=\"\",ROW(PlanningsFilter!$I$6:$I$1000)-ROW($I$6)+1)))),$C37)),\"\")","v":""},{"$f":"IFERROR(INDEX(PlanningsFilter!$L$6:$L$1000,SMALL(IF(PlanningsFilter!$K$6:$K$1000=$A37,IF(PlanningsFilter!$C$6:$C$1000=W$2,IF(PlanningsFilter!$J$6:$J$1000=W$4,IF(PlanningsFilter!$I$6:$I$1000=\"\",ROW(PlanningsFilter!$I$6:$I$1000)-ROW($I$6)+1)))),$C37)),\"\")","v":""},{"$f":"IFERROR(INDEX(PlanningsFilter!$L$6:$L$1000,SMALL(IF(PlanningsFilter!$K$6:$K$1000=$A37,IF(PlanningsFilter!$C$6:$C$1000=X$2,IF(PlanningsFilter!$J$6:$J$1000=X$4,IF(PlanningsFilter!$I$6:$I$1000=\"\",ROW(PlanningsFilter!$I$6:$I$1000)-ROW($I$6)+1)))),$C37)),\"\")","v":""}]
["MEP",null,6,{"$f":"IFERROR(INDEX(PlanningsFilter!$L$6:$L$1000,SMALL(IF(PlanningsFilter!$K$6:$K$1000=$A38,IF(PlanningsFilter!$C$6:$C$1000=D$2,IF(PlanningsFilter!$J$6:$J$1000=D$4,IF(PlanningsFilter!$I$6:$I$1000=\"\",ROW(PlanningsFilter!$I$6:$I$1000)-ROW($I$6)+1)))),$C38)),\"\")","v":""},{"$f":"IFERROR(INDEX(PlanningsFilter!$L$6:$L$1000,SMALL(IF(PlanningsFilter!$K$6:$K$1000=$A38,IF(PlanningsFilter!$C$6:$C$1000=E$2,IF(PlanningsFilter!$J$6:$J$1000=E$4,IF(PlanningsFilter!$I$6:$I$1000=\"\",ROW(PlanningsFilter!$I$6:$I$1000)-ROW($I$6)+1)))),$C38)),\"\")","v":""},{"$f":"IFERROR(INDEX(PlanningsFilter!$L$6:$L$1000,SMALL(IF(PlanningsFilter!$K$6:$K$1000=$A38,IF(PlanningsFilter!$C$6:$C$1000=F$2,IF(PlanningsFilter!$J$6:$J$1000=F$4,IF(PlanningsFilter!$I$6:$I$1000=\"\",ROW(PlanningsFilter!$I$6:$I$1000)-ROW($I$6)+1)))),$C38)),\"\")","v":""},{"$f":"IFERROR(INDEX(PlanningsFilter!$L$6:$L$1000,SMALL(IF(PlanningsFilter!$K$6:$K$1000=$A38,IF(PlanningsFilter!$C$6:$C$1000=G$2,IF(PlanningsFilter!$J$6:$J$1000=G$4,IF(PlanningsFilter!$I$6:$I$1000=\"\",ROW(PlanningsFilter!$I$6:$I$1000)-ROW($I$6)+1)))),$C38)),\"\")","v":""},{"$f":"IFERROR(INDEX(PlanningsFilter!$L$6:$L$1000,SMALL(IF(PlanningsFilter!$K$6:$K$1000=$A38,IF(PlanningsFilter!$C$6:$C$1000=H$2,IF(PlanningsFilter!$J$6:$J$1000=H$4,IF(PlanningsFilter!$I$6:$I$1000=\"\",ROW(PlanningsFilter!$I$6:$I$1000)-ROW($I$6)+1)))),$C38)),\"\")","v":""},{"$f":"IFERROR(INDEX(PlanningsFilter!$L$6:$L$1000,SMALL(IF(PlanningsFilter!$K$6:$K$1000=$A38,IF(PlanningsFilter!$C$6:$C$1000=I$2,IF(PlanningsFilter!$J$6:$J$1000=I$4,IF(PlanningsFilter!$I$6:$I$1000=\"\",ROW(PlanningsFilter!$I$6:$I$1000)-ROW($I$6)+1)))),$C38)),\"\")","v":""},{"$f":"IFERROR(INDEX(PlanningsFilter!$L$6:$L$1000,SMALL(IF(PlanningsFilter!$K$6:$K$1000=$A38,IF(PlanningsFilter!$C$6:$C$1000=J$2,IF(PlanningsFilter!$J$6:$J$1000=J$4,IF(PlanningsFilter!$I$6:$I$1000=\"\",ROW(PlanningsFilter!$I$6:$I$1000)-ROW($I$6)+1)))),$C38)),\"\")","v":""},{"$f":"IFERROR(INDEX(PlanningsFilter!$L$6:$L$1000,SMALL(IF(PlanningsFilter!$K$6:$K$1000=$A38,IF(PlanningsFilter!$C$6:$C$1000=K$2,IF(PlanningsFilter!$J$6:$J$1000=K$4,IF(PlanningsFilter!$I$6:$I$1000=\"\",ROW(PlanningsFilter!$I$6:$I$1000)-ROW($I$6)+1)))),$C38)),\"\")","v":""},{"$f":"IFERROR(INDEX(PlanningsFilter!$L$6:$L$1000,SMALL(IF(PlanningsFilter!$K$6:$K$1000=$A38,IF(PlanningsFilter!$C$6:$C$1000=L$2,IF(PlanningsFilter!$J$6:$J$1000=L$4,IF(PlanningsFilter!$I$6:$I$1000=\"\",ROW(PlanningsFilter!$I$6:$I$1000)-ROW($I$6)+1)))),$C38)),\"\")","v":""},{"$f":"IFERROR(INDEX(PlanningsFilter!$L$6:$L$1000,SMALL(IF(PlanningsFilter!$K$6:$K$1000=$A38,IF(PlanningsFilter!$C$6:$C$1000=M$2,IF(PlanningsFilter!$J$6:$J$1000=M$4,IF(PlanningsFilter!$I$6:$I$1000=\"\",ROW(PlanningsFilter!$I$6:$I$1000)-ROW($I$6)+1)))),$C38)),\"\")","v":""},{"$f":"IFERROR(INDEX(PlanningsFilter!$L$6:$L$1000,SMALL(IF(PlanningsFilter!$K$6:$K$1000=$A38,IF(PlanningsFilter!$C$6:$C$1000=N$2,IF(PlanningsFilter!$J$6:$J$1000=N$4,IF(PlanningsFilter!$I$6:$I$1000=\"\",ROW(PlanningsFilter!$I$6:$I$1000)-ROW($I$6)+1)))),$C38)),\"\")","v":""},{"$f":"IFERROR(INDEX(PlanningsFilter!$L$6:$L$1000,SMALL(IF(PlanningsFilter!$K$6:$K$1000=$A38,IF(PlanningsFilter!$C$6:$C$1000=O$2,IF(PlanningsFilter!$J$6:$J$1000=O$4,IF(PlanningsFilter!$I$6:$I$1000=\"\",ROW(PlanningsFilter!$I$6:$I$1000)-ROW($I$6)+1)))),$C38)),\"\")","v":""},{"$f":"IFERROR(INDEX(PlanningsFilter!$L$6:$L$1000,SMALL(IF(PlanningsFilter!$K$6:$K$1000=$A38,IF(PlanningsFilter!$C$6:$C$1000=P$2,IF(PlanningsFilter!$J$6:$J$1000=P$4,IF(PlanningsFilter!$I$6:$I$1000=\"\",ROW(PlanningsFilter!$I$6:$I$1000)-ROW($I$6)+1)))),$C38)),\"\")","v":""},{"$f":"IFERROR(INDEX(PlanningsFilter!$L$6:$L$1000,SMALL(IF(PlanningsFilter!$K$6:$K$1000=$A38,IF(PlanningsFilter!$C$6:$C$1000=Q$2,IF(PlanningsFilter!$J$6:$J$1000=Q$4,IF(PlanningsFilter!$I$6:$I$1000=\"\",ROW(PlanningsFilter!$I$6:$I$1000)-ROW($I$6)+1)))),$C38)),\"\")","v":""},{"$f":"IFERROR(INDEX(PlanningsFilter!$L$6:$L$1000,SMALL(IF(PlanningsFilter!$K$6:$K$1000=$A38,IF(PlanningsFilter!$C$6:$C$1000=R$2,IF(PlanningsFilter!$J$6:$J$1000=R$4,IF(PlanningsFilter!$I$6:$I$1000=\"\",ROW(PlanningsFilter!$I$6:$I$1000)-ROW($I$6)+1)))),$C38)),\"\")","v":""},{"$f":"IFERROR(INDEX(PlanningsFilter!$L$6:$L$1000,SMALL(IF(PlanningsFilter!$K$6:$K$1000=$A38,IF(PlanningsFilter!$C$6:$C$1000=S$2,IF(PlanningsFilter!$J$6:$J$1000=S$4,IF(PlanningsFilter!$I$6:$I$1000=\"\",ROW(PlanningsFilter!$I$6:$I$1000)-ROW($I$6)+1)))),$C38)),\"\")","v":""},{"$f":"IFERROR(INDEX(PlanningsFilter!$L$6:$L$1000,SMALL(IF(PlanningsFilter!$K$6:$K$1000=$A38,IF(PlanningsFilter!$C$6:$C$1000=T$2,IF(PlanningsFilter!$J$6:$J$1000=T$4,IF(PlanningsFilter!$I$6:$I$1000=\"\",ROW(PlanningsFilter!$I$6:$I$1000)-ROW($I$6)+1)))),$C38)),\"\")","v":""},{"$f":"IFERROR(INDEX(PlanningsFilter!$L$6:$L$1000,SMALL(IF(PlanningsFilter!$K$6:$K$1000=$A38,IF(PlanningsFilter!$C$6:$C$1000=U$2,IF(PlanningsFilter!$J$6:$J$1000=U$4,IF(PlanningsFilter!$I$6:$I$1000=\"\",ROW(PlanningsFilter!$I$6:$I$1000)-ROW($I$6)+1)))),$C38)),\"\")","v":""},{"$f":"IFERROR(INDEX(PlanningsFilter!$L$6:$L$1000,SMALL(IF(PlanningsFilter!$K$6:$K$1000=$A38,IF(PlanningsFilter!$C$6:$C$1000=V$2,IF(PlanningsFilter!$J$6:$J$1000=V$4,IF(PlanningsFilter!$I$6:$I$1000=\"\",ROW(PlanningsFilter!$I$6:$I$1000)-ROW($I$6)+1)))),$C38)),\"\")","v":""},{"$f":"IFERROR(INDEX(PlanningsFilter!$L$6:$L$1000,SMALL(IF(PlanningsFilter!$K$6:$K$1000=$A38,IF(PlanningsFilter!$C$6:$C$1000=W$2,IF(PlanningsFilter!$J$6:$J$1000=W$4,IF(PlanningsFilter!$I$6:$I$1000=\"\",ROW(PlanningsFilter!$I$6:$I$1000)-ROW($I$6)+1)))),$C38)),\"\")","v":""},{"$f":"IFERROR(INDEX(PlanningsFilter!$L$6:$L$1000,SMALL(IF(PlanningsFilter!$K$6:$K$1000=$A38,IF(PlanningsFilter!$C$6:$C$1000=X$2,IF(PlanningsFilter!$J$6:$J$1000=X$4,IF(PlanningsFilter!$I$6:$I$1000=\"\",ROW(PlanningsFilter!$I$6:$I$1000)-ROW($I$6)+1)))),$C38)),\"\")","v":""}]

{"sheet":"PlanningsFilter","index":3,"n_rows":600,"n_cols":13,"rows_kept":600,"cut":false,"hidden":false,"merged":[]}
[null,"Info","Info","Functie","Starttijd","Eindtijd","Voornaam","Achternaam"]
[null,">43807","<43815"]
[]
[]
[null,null,"Info","Functie","Starttijd","Eindtijd","Voornaam","Achternaam","Verlof","Post","PA","Vn & A","Naam exist"]
[null,null,"2019-12-09","ABB ochtend ",43808.25,43808.614583333336,"Trienko","Spooren",{"$f":"IF(H6=\"\",\"\",IF(SUMPRODUCT(--(ValVerlofVoornaam=G6),--(ValVerlofNaam=H6),--(ValVerlofVan<=C6),--(ValVerlofTot>=C6)*(1))>0,\"V\",\"\"))","v":"V"},{"$f":"IF(C6=\"\",\"\",INDEX(Validatie!$Q$2:$Q$6,MATCH(MOD(E6,1),Validatie!$P$2:$P$6,1)))","v":"Vroeg"},{"$f":"IF(C6=\"\",\"\",IFERROR(VLOOKUP(D6,DataMijnAfdeling,2,0),\"?\"))","v":"ABB"},{"$f":"IF(C6=\"\",\"\",CONCATENATE(G6,\" \",H6))","v":"Trienko Spooren"},{"$f":"IF(C6=\"\",\"\",IFERROR(MATCH(G6&H6,ValVoorNamen&ValNamen,0),\"Fout\")+1)","v":103}]
[null,null,"2019-12-09","AFV HAS",43808.25,43808.40625,"Paul","van Dongen","",{"$f":"IF(C7=\"\",\"\",INDEX(Validatie!$Q$2:$Q$6,MATCH(MOD(E7,1),Validatie!$P$2:$P$6,1)))","v":"Vroeg"},"HAS",{"$f":"IF(C7=\"\",\"\",CONCATENATE(G7,\" \",H7))","v":"Paul van Dongen"},{"$f":"IF(C7=\"\",\"\",IFERROR(MATCH(G7&H7,ValVoorNamen&ValNamen,0),\"Fout\")+1)","v":79}]
[null,null,"2019-12-09","AFV MEP",43808.25,43808.614583333336,"Rudolf","Hofman","",{"$f":"IF(C8=\"\",\"\",INDEX(Validatie!$Q$2:$Q$6,MATCH(MOD(E8,1),Validatie!$P$2:$P$6,1)))","v":"Vroeg"},"MEP","Rudolf Hofman",{"$f":"IF(C8=\"\",\"\",IFERROR(MATCH(G8&H8,ValVoorNamen&ValNamen,0),\"Fout\")+1)","v":91}]
[null,null,"2019-12-09","LCR ochtend",43808.25,43808.614583333336,"Sami","van der Horst","",{"$f":"IF(C9=\"\",\"\",INDEX(Validatie!$Q$2:$Q$6,MATCH(MOD(E9,1),Validatie!$P$2:$P$6,1)))","v":"Vroeg"},"LCR","Sami van der Horst",{"$f":"IF(C9=\"\",\"\",IFERROR(MATCH(G9&H9,ValVoorNamen&ValNamen,0),\"Fout\")+1)","v":95}]
[null,null,"2019-12-09","LCR ochtend",43808.25,43808.614583333336,"Wolter","De bolder","",{"$f":"IF(C10=\"\",\"\",INDEX(Validatie!$Q$2:$Q$6,MATCH(MOD(E10,1),Validatie!$P$2:$P$6,1)))","v":"Vroeg"},"LCR","Wolter De bolder",{"$f":"IF(C10=\"\",\"\",IFERROR(MATCH(G10&H10,ValVoorNamen&ValNamen,0),\"Fout\")+1)","v":107}]
[null,null,"2019-12-09","PALL HAS",43808.25,43808.614583333336,"Henk","Koster","",{"$f":"IF(C11=\"\",\"\",INDEX(Validatie!$Q$2:$Q$6,MATCH(MOD(E11,1),Validatie!$P$2:$P$6,1)))","v":"Vroeg"},"-","Henk Koster",{"$f":"IF(C11=\"\",\"\",IFERROR(MATCH(G11&H11,ValVoorNamen&ValNamen,0),\"Fout\")+1)","v":46}]
[null,null,"2019-12-09","PALL MEP",43808.25,43808.614583333336,"Wenaron","Kurkema","",{"$f":"IF(C12=\"\",\"\",INDEX(Validatie!$Q$2:$Q$6,MATCH(MOD(E12,1),Validatie!$P$2:$P$6,1)))","v":"Vroeg"},"-","Wenaron Kurkema",{"$f":"IF(C12=\"\",\"\",IFERROR(MATCH(G12&H12,ValVoorNamen&ValNamen,0),\"Fout\")+1)","v":105}]
[null,null,"2019-12-09","PALL MEP",43808.25,43808.614583333336,"Salahadin","Wolters","",{"$f":"IF(C13=\"\",\"\",INDEX(Validatie!$Q$2:$Q$6,MATCH(MOD(E13,1),Validatie!$P$2:$P$6,1)))","v":"Vroeg"},"-","Salahadin Wolters",{"$f":"IF(C13=\"\",\"\",IFERROR(MATCH(G13&H13,ValVoorNamen&ValNamen,0),\"Fout\")+1)","v":93}]
[null,null,"2019-12-09","PALL MEP",43808.25,43808.614583333336,"Dikkie","van der Meer","",{"$f":"IF(C14=\"\",\"\",INDEX(Validatie!$Q$2:$Q$6,MATCH(MOD(E14,1),Validatie!$P$2:$P$6,1)))","v":"Vroeg"},"-","Dikkie van der Meer",{"$f":"IF(C14=\"\",\"\",IFERROR(MATCH(G14&H14,ValVoorNamen&ValNamen,0),\"Fout\")+1)","v":26}]
[null,null,"2019-12-09","PALL MEP",43808.25,43808.614583333336,"Rene","van der Velden","",{"$f":"IF(C15=\"\",\"\",INDEX(Validatie!$Q$2:$Q$6,MATCH(MOD(E15,1),Validatie!$P$2:$P$6,1)))","v":"Vroeg"},"-","Rene van der Velden",{"$f":"IF(C15=\"\",\"\",IFERROR(MATCH(G15&H15,ValVoorNamen&ValNamen,0),\"Fout\")+1)","v":84}]
[null,null,"2019-12-09","PALL MEP",43808.25,43808.614583333336,"Richard","Driessen","",{"$f":"IF(C16=\"\",\"\",INDEX(Validatie!$Q$2:$Q$6,MATCH(MOD(E16,1),Validatie!$P$2:$P$6,1)))","v":"Vroeg"},"-","Richard Driessen",{"$f":"IF(C16=\"\",\"\",IFERROR(MATCH(G16&H16,ValVoorNamen&ValNamen,0),\"Fout\")+1)","v":85}]
[null,null,"2019-12-09","PALL Rweg",43808.25,43808.614583333336,"Felicia","van den Broek","",{"$f":"IF(C17=\"\",\"\",INDEX(Validatie!$Q$2:$Q$6,MATCH(MOD(E17,1),Validatie!$P$2:$P$6,1)))","v":"Vroeg"},"-","Felicia van den Broek",{"$f":"IF(C17=\"\",\"\",IFERROR(MATCH(G17&H17,ValVoorNamen&ValNamen,0),\"Fout\")+1)","v":34}]
[null,null,"2019-12-09","PALL Rweg",43808.25,43808.614583333336,"Shawn","Molenaar","",{"$f":"IF(C18=\"\",\"\",INDEX(Validatie!$Q$2:$Q$6,MATCH(MOD(E18,1),Validatie!$P$2:$P$6,1)))","v":"Vroeg"},"-","Shawn Molenaar",{"$f":"IF(C18=\"\",\"\",IFERROR(MATCH(G18&H18,ValVoorNamen&ValNamen,0),\"Fout\")+1)","v":98}]
[null,null,"2019-12-09","PALL Rweg",43808.25,43808.614583333336,"Elroy","van der Linden","",{"$f":"IF(C19=\"\",\"\",INDEX(Validatie!$Q$2:$Q$6,MATCH(MOD(E19,1),Validatie!$P$2:$P$6,1)))","v":"Vroeg"},"-","Elroy van der Linden",{"$f":"IF(C19=\"\",\"\",IFERROR(MATCH(G19&H19,ValVoorNamen&ValNamen,0),\"Fout\")+1)","v":27}]
[null,null,"2019-12-09","PALL Rweg",43808.25,43808.614583333336,"Swen","de Leeuw","",{"$f":"IF(C20=\"\",\"\",INDEX(Validatie!$Q$2:$Q$6,MATCH(MOD(E20,1),Validatie!$P$2:$P$6,1)))","v":"Vroeg"},"-","Swen de Leeuw",{"$f":"IF(C20=\"\",\"\",IFERROR(MATCH(G20&H20,ValVoorNamen&ValNamen,0),\"Fout\")+1)","v":100}]
[null,null,"2019-12-09","PALL Rweg",43808.25,43808.614583333336,"Arsenio","Mulder","",{"$f":"IF(C21=\"\",\"\",INDEX(Validatie!$Q$2:$Q$6,MATCH(MOD(E21,1),Validatie!$P$2:$P$6,1)))","v":"Vroeg"},"-","Arsenio Mulder",{"$f":"IF(C21=\"\",\"\",IFERROR(MATCH(G21&H21,ValVoorNamen&ValNamen,0),\"Fout\")+1)","v":13}]
[null,null,"2019-12-09","PALL Rweg",43808.25,43808.614583333336,"Viorel","Triest","",{"$f":"IF(C22=\"\",\"\",INDEX(Validatie!$Q$2:$Q$6,MATCH(MOD(E22,1),Validatie!$P$2:$P$6,1)))","v":"Vroeg"},"-","Viorel Triest",{"$f":"IF(C22=\"\",\"\",IFERROR(MATCH(G22&H22,ValVoorNamen&ValNamen,0),\"Fout\")+1)","v":104}]
[null,null,"2019-12-09","PALL Rweg",43808.25,43808.614583333336,"Olcay","de Vos","",{"$f":"IF(C23=\"\",\"\",INDEX(Validatie!$Q$2:$Q$6,MATCH(MOD(E23,1),Validatie!$P$2:$P$6,1)))","v":"Vroeg"},"-","Olcay de Vos",{"$f":"IF(C23=\"\",\"\",IFERROR(MATCH(G23&H23,ValVoorNamen&ValNamen,0),\"Fout\")+1)","v":77}]
[null,null,"2019-12-09","PALL Rweg",43808.25,43808.614583333336,"Sebastiaan","Mol","",{"$f":"IF(C24=\"\",\"\",INDEX(Validatie!$Q$2:$Q$6,MATCH(MOD(E24,1),Validatie!$P$2:$P$6,1)))","v":"Vroeg"},"-","Sebastiaan Mol",{"$f":"IF(C24=\"\",\"\",IFERROR(MATCH(G24&H24,ValVoorNamen&ValNamen,0),\"Fout\")+1)","v":96}]
[null,null,"2019-12-09","PALL Rweg",43808.25,43808.614583333336,"Amadou","Bakker","",{"$f":"IF(C25=\"\",\"\",INDEX(Validatie!$Q$2:$Q$6,MATCH(MOD(E25,1),Validatie!$P$2:$P$6,1)))","v":"Vroeg"},"-","Amadou Bakker",{"$f":"IF(C25=\"\",\"\",IFERROR(MATCH(G25&H25,ValVoorNamen&ValNamen,0),\"Fout\")+1)","v":7}]
[null,null,"2019-12-09","PALL Rweg",43808.25,43808.614583333336,"Wout","Van Goud","",{"$f":"IF(C26=\"\",\"\",INDEX(Validatie!$Q$2:$Q$6,MATCH(MOD(E26,1),Validatie!$P$2:$P$6,1)))","v":"Vroeg"},"-","Wout Van Goud",{"$f":"IF(C26=\"\",\"\",IFERROR(MATCH(G26&H26,ValVoorNamen&ValNamen,0),\"Fout\")+1)","v":108}]
[null,null,"2019-12-09","PALL Rweg",43808.25,43808.614583333336,"Fars","van de Veen","",{"$f":"IF(C27=\"\",\"\",INDEX(Validatie!$Q$2:$Q$6,MATCH(MOD(E27,1),Validatie!$P$2:$P$6,1)))","v":"Vroeg"},"-","Fars van de Veen",{"$f":"IF(C27=\"\",\"\",IFERROR(MATCH(G27&H27,ValVoorNamen&ValNamen,0),\"Fout\")+1)","v":33}]
[null,null,"2019-12-09","PALL Rweg",43808.25,43808.614583333336,"Magdalena","Postma","",{"$f":"IF(C28=\"\",\"\",INDEX(Validatie!$Q$2:$Q$6,MATCH(MOD(E28,1),Validatie!$P$2:$P$6,1)))","v":"Vroeg"},"-","Magdalena Postma",{"$f":"IF(C28=\"\",\"\",IFERROR(MATCH(G28&H28,ValVoorNamen&ValNamen,0),\"Fout\")+1)","v":63}]
[null,null,"2019-12-09","PALL Rweg",43808.25,43808.614583333336,"Charles","Dekker","",{"$f":"IF(C29=\"\",\"\",INDEX(Validatie!$Q$2:$Q$6,MATCH(MOD(E29,1),Validatie!$P$2:$P$6,1)))","v":"Vroeg"},"-","Charles Dekker",{"$f":"IF(C29=\"\",\"\",IFERROR(MATCH(G29&H29,ValVoorNamen&ValNamen,0),\"Fout\")+1)","v":20}]
[null,null,"2019-12-09","PALL Rweg",43808.25,43808.614583333336,"Ko","van de Brink","",{"$f":"IF(C30=\"\",\"\",INDEX(Validatie!$Q$2:$Q$6,MATCH(MOD(E30,1),Validatie!$P$2:$P$6,1)))","v":"Vroeg"},"-","Ko van de Brink",{"$f":"IF(C30=\"\",\"\",IFERROR(MATCH(G30&H30,ValVoorNamen&ValNamen,0),\"Fout\")+1)","v":60}]
[null,null,"2019-12-09","PALL Rweg",43808.25,43808.614583333336,"Gerrit","van Beek","",{"$f":"IF(C31=\"\",\"\",INDEX(Validatie!$Q$2:$Q$6,MATCH(MOD(E31,1),Validatie!$P$2:$P$6,1)))","v":"Vroeg"},"-","Gerrit van Beek",{"$f":"IF(C31=\"\",\"\",IFERROR(MATCH(G31&H31,ValVoorNamen&ValNamen,0),\"Fout\")+1)","v":39}]
[null,null,"2019-12-09","PALL Rweg",43808.25,43808.614583333336,"Everon","van den Heuvel","",{"$f":"IF(C32=\"\",\"\",INDEX(Validatie!$Q$2:$Q$6,MATCH(MOD(E32,1),Validatie!$P$2:$P$6,1)))","v":"Vroeg"},"-","Everon van den Heuvel",{"$f":"IF(C32=\"\",\"\",IFERROR(MATCH(G32&H32,ValVoorNamen&ValNamen,0),\"Fout\")+1)","v":32}]
[null,null,"2019-12-09","PALL Rweg",43808.25,43808.614583333336,"Davood","Smits","",{"$f":"IF(C33=\"\",\"\",INDEX(Validatie!$Q$2:$Q$6,MATCH(MOD(E33,1),Validatie!$P$2:$P$6,1)))","v":"Vroeg"},"-","Davood Smits",{"$f":"IF(C33=\"\",\"\",IFERROR(MATCH(G33&H33,ValVoorNamen&ValNamen,0),\"Fout\")+1)","v":24}]
[null,null,"2019-12-09","PALL Rweg",43808.25,43808.614583333336,"Saidou","Bosman","",{"$f":"IF(C34=\"\",\"\",INDEX(Validatie!$Q$2:$Q$6,MATCH(MOD(E34,1),Validatie!$P$2:$P$6,1)))","v":"Vroeg"},"-","Saidou Bosman",{"$f":"IF(C34=\"\",\"\",IFERROR(MATCH(G34&H34,ValVoorNamen&ValNamen,0),\"Fout\")+1)","v":92}]
[null,null,"2019-12-09","PALL Rweg",43808.25,43808.614583333336,"Wim","Vogel","",{"$f":"IF(C35=\"\",\"\",INDEX(Validatie!$Q$2:$Q$6,MATCH(MOD(E35,1),Validatie!$P$2:$P$6,1)))","v":"Vroeg"},"-","Wim Vogel",{"$f":"IF(C35=\"\",\"\",IFERROR(MATCH(G35&H35,ValVoorNamen&ValNamen,0),\"Fout\")+1)","v":106}]
[null,null,"2019-12-09","PALL Rweg",43808.25,43808.614583333336,"Quincy","de Koning","",{"$f":"IF(C36=\"\",\"\",INDEX(Validatie!$Q$2:$Q$6,MATCH(MOD(E36,1),Validatie!$P$2:$P$6,1)))","v":"Vroeg"},"-","Quincy de Koning",{"$f":"IF(C36=\"\",\"\",IFERROR(MATCH(G36&H36,ValVoorNamen&ValNamen,0),\"Fout\")+1)","v":81}]
[null,null,"2019-12-09","PALL Rweg",43808.25,43808.614583333336,"Henk","Koster","",{"$f":"IF(C37=\"\",\"\",INDEX(Validatie!$Q$2:$Q$6,MATCH(MOD(E37,1),Validatie!$P$2:$P$6,1)))","v":"Vroeg"},"-","Henk Koster",{"$f":"IF(C37=\"\",\"\",IFERROR(MATCH(G37&H37,ValVoorNamen&ValNamen,0),\"Fout\")+1)","v":46}]
[null,null,"2019-12-09","Reserve ochtend",43808.25,43808.614583333336,"Robin","Evers","",{"$f":"IF(C38=\"\",\"\",INDEX(Validatie!$Q$2:$Q$6,MATCH(MOD(E38,1),Validatie!$P$2:$P$6,1)))","v":"Vroeg"},"-","Robin Evers",{"$f":"IF(C38=\"\",\"\",IFERROR(MATCH(G38&H38,ValVoorNamen&ValNamen,0),\"Fout\")+1)","v":88}]
[null,null,"2019-12-09","SCHM",43808.25,43808.614583333336,"Marjolein","Martens","",{"$f":"IF(C39=\"\",\"\",INDEX(Validatie!$Q$2:$Q$6,MATCH(MOD(E39,1),Validatie!$P$2:$P$6,1)))","v":"Vroeg"},"SCHM","Marjolein Martens",{"$f":"IF(C39=\"\",\"\",IFERROR(MATCH(G39&H39,ValVoorNamen&ValNamen,0),\"Fout\")+1)","v":64}]
[null,null,"2019-12-09","SCHM",43808.25,43808.614583333336,"Piet","Schipper","",{"$f":"IF(C40=\"\",\"\",INDEX(Validatie!$Q$2:$Q$6,MATCH(MOD(E40,1),Validatie!$P$2:$P$6,1)))","v":"Vroeg"},"SCHM","Piet Schipper",{"$f":"IF(C40=\"\",\"\",IFERROR(MATCH(G40&H40,ValVoorNamen&ValNamen,0),\"Fout\")+1)","v":80}]
[null,null,"2019-12-09","SCHM",43808.25,43808.614583333336,"Roy","van der Meulen","",{"$f":"IF(C41=\"\",\"\",INDEX(Validatie!$Q$2:$Q$6,MATCH(MOD(E41,1),Validatie!$P$2:$P$6,1)))","v":"Vroeg"},"SCHM","Roy van der Meulen",{"$f":"IF(C41=\"\",\"\",IFERROR(MATCH(G41&H41,ValVoorNamen&ValNamen,0),\"Fout\")+1)","v":90}]
[null,null,"2019-12-09","SCHM AFV",43808.25,43808.614583333336,"Christiaan","de Wit","",{"$f":"IF(C42=\"\",\"\",INDEX(Validatie!$Q$2:$Q$6,MATCH(MOD(E42,1),Validatie!$P$2:$P$6,1)))","v":"Vroeg"},"AFV","Christiaan de Wit",{"$f":"IF(C42=\"\",\"\",IFERROR(MATCH(G42&H42,ValVoorNamen&ValNamen,0),\"Fout\")+1)","v":22}]
[null,null,"2019-12-09","SCHM AFV",43808.25,43808.614583333336,"Henri","van Dam","",{"$f":"IF(C43=\"\",\"\",INDEX(Validatie!$Q$2:$Q$6,MATCH(MOD(E43,1),Validatie!$P$2:$P$6,1)))","v":"Vroeg"},"AFV","Henri van Dam",{"$f":"IF(C43=\"\",\"\",IFERROR(MATCH(G43&H43,ValVoorNamen&ValNamen,0),\"Fout\")+1)","v":47}]
[null,null,"2019-12-09","SCHM AFV",43808.25,43808.614583333336,"Jan","de Jonge","",{"$f":"IF(C44=\"\",\"\",INDEX(Validatie!$Q$2:$Q$6,MATCH(MOD(E44,1),Validatie!$P$2:$P$6,1)))","v":"Vroeg"},"AFV","Jan de Jonge",{"$f":"IF(C44=\"\",\"\",IFERROR(MATCH(G44&H44,ValVoorNamen&ValNamen,0),\"Fout\")+1)","v":53}]
[null,null,"2019-12-09","SCHM AFV",43808.25,43808.614583333336,"Boyan","van Leeuwen","",{"$f":"IF(C45=\"\",\"\",INDEX(Validatie!$Q$2:$Q$6,MATCH(MOD(E45,1),Validatie!$P$2:$P$6,1)))","v":"Vroeg"},"AFV","Boyan van Leeuwen",{"$f":"IF(C45=\"\",\"\",IFERROR(MATCH(G45&H45,ValVoorNamen&ValNamen,0),\"Fout\")+1)","v":19}]
[null,null,"2019-12-09","SCHM AFV",43808.25,43808.614583333336,"Michel","Jonker","",{"$f":"IF(C46=\"\",\"\",INDEX(Validatie!$Q$2:$Q$6,MATCH(MOD(E46,1),Validatie!$P$2:$P$6,1)))","v":"Vroeg"},"AFV","Michel Jonker",{"$f":"IF(C46=\"\",\"\",IFERROR(MATCH(G46&H46,ValVoorNamen&ValNamen,0),\"Fout\")+1)","v":70}]
[null,null,"2019-12-09","TRSP",43808.25,43808.614583333336,"Anton","Smit","",{"$f":"IF(C47=\"\",\"\",INDEX(Validatie!$Q$2:$Q$6,MATCH(MOD(E47,1),Validatie!$P$2:$P$6,1)))","v":"Vroeg"},"?","Anton Smit",{"$f":"IF(C47=\"\",\"\",IFERROR(MATCH(G47&H47,ValVoorNamen&ValNamen,0),\"Fout\")+1)","v":10}]
[null,null,"2019-12-09","TRSP",43808.25,43808.614583333336,"Henk","Koster","",{"$f":"IF(C48=\"\",\"\",INDEX(Validatie!$Q$2:$Q$6,MATCH(MOD(E48,1),Validatie!$P$2:$P$6,1)))","v":"Vroeg"},"?","Henk Koster",{"$f":"IF(C48=\"\",\"\",IFERROR(MATCH(G48&H48,ValVoorNamen&ValNamen,0),\"Fout\")+1)","v":46}]
[null,null,"2019-12-09","AFV MEP",43808.291666666664,43808.65625,"Rijk","van Doorn","",{"$f":"IF(C49=\"\",\"\",INDEX(Validatie!$Q$2:$Q$6,MATCH(MOD(E49,1),Validatie!$P$2:$P$6,1)))","v":"Vroeg"},"MEP","Rijk van Doorn",{"$f":"IF(C49=\"\",\"\",IFERROR(MATCH(G49&H49,ValVoorNamen&ValNamen,0),\"Fout\")+1)","v":86}]
[null,null,"2019-12-09","Teamleider PALL",43808.3125,43808.677083333336,"Hilko","Prins","",{"$f":"IF(C50=\"\",\"\",INDEX(Validatie!$Q$2:$Q$6,MATCH(MOD(E50,1),Validatie!$P$2:$P$6,1)))","v":"Vroeg"},"?","Hilko Prins",{"$f":"IF(C50=\"\",\"\",IFERROR(MATCH(G50&H50,ValVoorNamen&ValNamen,0),\"Fout\")+1)","v":49}]
[null,null,"2019-12-09","TRSP",43808.333333333336,43808.697916666664,"Harrie","Hoekstra","",{"$f":"IF(C51=\"\",\"\",INDEX(Validatie!$Q$2:$Q$6,MATCH(MOD(E51,1),Validatie!$P$2:$P$6,1)))","v":"Vroeg"},"?","Harrie Hoekstra",{"$f":"IF(C51=\"\",\"\",IFERROR(MATCH(G51&H51,ValVoorNamen&ValNamen,0),\"Fout\")+1)","v":43}]
[null,null,"2019-12-09","SCHM HAS",43808.40625,43808.614583333336,"Paul","van Dongen","",{"$f":"IF(C52=\"\",\"\",INDEX(Validatie!$Q$2:$Q$6,MATCH(MOD(E52,1),Validatie!$P$2:$P$6,1)))","v":"Vroeg"},"HAS","Paul van Dongen",{"$f":"IF(C52=\"\",\"\",IFERROR(MATCH(G52&H52,ValVoorNamen&ValNamen,0),\"Fout\")+1)","v":79}]
[null,null,"2019-12-09","ABB middag",43808.572916666664,43808.9375,"Bile","Hendriks","",{"$f":"IF(C53=\"\",\"\",INDEX(Validatie!$Q$2:$Q$6,MATCH(MOD(E53,1),Validatie!$P$2:$P$6,1)))","v":"Laat"},"ABB","Bile Hendriks",{"$f":"IF(C53=\"\",\"\",IFERROR(MATCH(G53&H53,ValVoorNamen&ValNamen,0),\"Fout\")+1)","v":18}]
[null,null,"2019-12-09","ABB middag",43808.572916666664,43808.9375,"Flavi","van der Heyden","",{"$f":"IF(C54=\"\",\"\",INDEX(Validatie!$Q$2:$Q$6,MATCH(MOD(E54,1),Validatie!$P$2:$P$6,1)))","v":"Laat"},"ABB","Flavi van der Heyden",{"$f":"IF(C54=\"\",\"\",IFERROR(MATCH(G54&H54,ValVoorNamen&ValNamen,0),\"Fout\")+1)","v":37}]
[null,null,"2019-12-09","AFV HAS",43808.572916666664,43808.697916666664,"Norbert","de Lange","",{"$f":"IF(C55=\"\",\"\",INDEX(Validatie!$Q$2:$Q$6,MATCH(MOD(E55,1),Validatie!$P$2:$P$6,1)))","v":"Laat"},"HAS","Norbert de Lange",{"$f":"IF(C55=\"\",\"\",IFERROR(MATCH(G55&H55,ValVoorNamen&ValNamen,0),\"Fout\")+1)","v":76}]
[null,null,"2019-12-09","AFV MEP",43808.572916666664,43808.9375,"Houcin","Huisman","",{"$f":"IF(C56=\"\",\"\",INDEX(Validatie!$Q$2:$Q$6,MATCH(MOD(E56,1),Validatie!$P$2:$P$6,1)))","v":"Laat"},"MEP","Houcin Huisman",{"$f":"IF(C56=\"\",\"\",IFERROR(MATCH(G56&H56,ValVoorNamen&ValNamen,0),\"Fout\")+1)","v":51}]
[null,null,"2019-12-09","LCR middag",43808.572916666664,43808.9375,"Klaas","Kramer","",{"$f":"IF(C57=\"\",\"\",INDEX(Validatie!$Q$2:$Q$6,MATCH(MOD(E57,1),Validatie!$P$2:$P$6,1)))","v":"Laat"},"LCR","Klaas Kramer",{"$f":"IF(C57=\"\",\"\",IFERROR(MATCH(G57&H57,ValVoorNamen&ValNamen,0),\"Fout\")+1)","v":59}]
[null,null,"2019-12-09","PALL MEP",43808.614583333336,43808.979166666664,"Latie","van Wijk","",{"$f":"IF(C58=\"\",\"\",INDEX(Validatie!$Q$2:$Q$6,MATCH(MOD(E58,1),Validatie!$P$2:$P$6,1)))","v":"Laat"},"-","Latie van Wijk",{"$f":"IF(C58=\"\",\"\",IFERROR(MATCH(G58&H58,ValVoorNamen&ValNamen,0),\"Fout\")+1)","v":62}]
[null,null,"2019-12-09","PALL MEP",43808.614583333336,43808.979166666664,"Abdurahman Ibrahim","de Vries","",{"$f":"IF(C59=\"\",\"\",INDEX(Validatie!$Q$2:$Q$6,MATCH(MOD(E59,1),Validatie!$P$2:$P$6,1)))","v":"Laat"},"-","Abdurahman Ibrahim de Vries",{"$f":"IF(C59=\"\",\"\",IFERROR(MATCH(G59&H59,ValVoorNamen&ValNamen,0),\"Fout\")+1)","v":4}]
[null,null,"2019-12-09","PALL MEP",43808.614583333336,43808.979166666664,"Michael","Gerritsen","",{"$f":"IF(C60=\"\",\"\",INDEX(Validatie!$Q$2:$Q$6,MATCH(MOD(E60,1),Validatie!$P$2:$P$6,1)))","v":"Laat"},"-","Michael Gerritsen",{"$f":"IF(C60=\"\",\"\",IFERROR(MATCH(G60&H60,ValVoorNamen&ValNamen,0),\"Fout\")+1)","v":69}]
[null,null,"2019-12-09","PALL MEP",43808.614583333336,43808.979166666664,"Hans","van de Ven ","",{"$f":"IF(C61=\"\",\"\",INDEX(Validatie!$Q$2:$Q$6,MATCH(MOD(E61,1),Validatie!$P$2:$P$6,1)))","v":"Laat"},"-","Hans van de Ven ",{"$f":"IF(C61=\"\",\"\",IFERROR(MATCH(G61&H61,ValVoorNamen&ValNamen,0),\"Fout\")+1)","v":42}]
[null,null,"2019-12-09","PALL MEP",43808.614583333336,43808.979166666664,"Jeroen","Post","",{"$f":"IF(C62=\"\",\"\",INDEX(Validatie!$Q$2:$Q$6,MATCH(MOD(E62,1),Validatie!$P$2:$P$6,1)))","v":"Laat"},"-","Jeroen Post",{"$f":"IF(C62=\"\",\"\",IFERROR(MATCH(G62&H62,ValVoorNamen&ValNamen,0),\"Fout\")+1)","v":56}]
[null,null,"2019-12-09","PALL Rweg",43808.614583333336,43808.979166666664,"Akela","van Dijk","",{"$f":"IF(C63=\"\",\"\",INDEX(Validatie!$Q$2:$Q$6,MATCH(MOD(E63,1),Validatie!$P$2:$P$6,1)))","v":"Laat"},"-","Akela van Dijk",{"$f":"IF(C63=\"\",\"\",IFERROR(MATCH(G63&H63,ValVoorNamen&ValNamen,0),\"Fout\")+1)","v":6}]
[null,null,"2019-12-09","PALL Rweg",43808.614583333336,43808.979166666664,"Karrar","Kuiper","",{"$f":"IF(C64=\"\",\"\",INDEX(Validatie!$Q$2:$Q$6,MATCH(MOD(E64,1),Validatie!$P$2:$P$6,1)))","v":"Laat"},"-","Karrar Kuiper",{"$f":"IF(C64=\"\",\"\",IFERROR(MATCH(G64&H64,ValVoorNamen&ValNamen,0),\"Fout\")+1)","v":57}]
[null,null,"2019-12-09","PALL Rweg",43808.614583333336,43808.979166666664,"Sebastian","Kuijpers","",{"$f":"IF(C65=\"\",\"\",INDEX(Validatie!$Q$2:$Q$6,MATCH(MOD(E65,1),Validatie!$P$2:$P$6,1)))","v":"Laat"},"-","Sebastian Kuijpers",{"$f":"IF(C65=\"\",\"\",IFERROR(MATCH(G65&H65,ValVoorNamen&ValNamen,0),\"Fout\")+1)","v":97}]
[null,null,"2019-12-09","PALL Rweg",43808.614583333336,43808.979166666664,"Harry","Maas","",{"$f":"IF(C66=\"\",\"\",INDEX(Validatie!$Q$2:$Q$6,MATCH(MOD(E66,1),Validatie!$P$2:$P$6,1)))","v":"Laat"},"-","Harry Maas",{"$f":"IF(C66=\"\",\"\",IFERROR(MATCH(G66&H66,ValVoorNamen&ValNamen,0),\"Fout\")+1)","v":44}]
[null,null,"2019-12-09","PALL Rweg",43808.614583333336,43808.979166666664,"Apollonia","Meijer","",{"$f":"IF(C67=\"\",\"\",INDEX(Validatie!$Q$2:$Q$6,MATCH(MOD(E67,1),Validatie!$P$2:$P$6,1)))","v":"Laat"},"-","Apollonia Meijer",{"$f":"IF(C67=\"\",\"\",IFERROR(MATCH(G67&H67,ValVoorNamen&ValNamen,0),\"Fout\")+1)","v":11}]
[null,null,"2019-12-09","PALL Rweg",43808.614583333336,43808.979166666664,"Agathe","van de Berg ","",{"$f":"IF(C68=\"\",\"\",INDEX(Validatie!$Q$2:$Q$6,MATCH(MOD(E68,1),Validatie!$P$2:$P$6,1)))","v":"Laat"},"-","Agathe van de Berg ",{"$f":"IF(C68=\"\",\"\",IFERROR(MATCH(G68&H68,ValVoorNamen&ValNamen,0),\"Fout\")+1)","v":5}]
[null,null,"2019-12-09","PALL Rweg",43808.614583333336,43808.979166666664,"Heruy","van de Wal ","",{"$f":"IF(C69=\"\",\"\",INDEX(Validatie!$Q$2:$Q$6,MATCH(MOD(E69,1),Validatie!$P$2:$P$6,1)))","v":"Laat"},"-","Heruy van de Wal ",{"$f":"IF(C69=\"\",\"\",IFERROR(MATCH(G69&H69,ValVoorNamen&ValNamen,0),\"Fout\")+1)","v":48}]
[null,null,"2019-12-09","PALL Rweg",43808.614583333336,43808.979166666664,"Hassan","Verhoeven",{"$f":"IF(H70=\"\",\"\",IF(SUMPRODUCT(--(ValVerlofVoornaam=G70),--(ValVerlofNaam=H70),--(ValVerlofVan<=C70),--(ValVerlofTot>=C70)*(1))>0,\"V\",\"\"))","v":""},{"$f":"IF(C70=\"\",\"\",INDEX(Validatie!$Q$2:$Q$6,MATCH(MOD(E70,1),Validatie!$P$2:$P$6,1)))","v":"Laat"},{"$f":"IF(C70=\"\",\"\",IFERROR(VLOOKUP(D70,DataMijnAfdeling,2,0),\"?\"))","v":"-"},"Hassan Verhoeven",{"$f":"IF(C70=\"\",\"\",IFERROR(MATCH(G70&H70,ValVoorNamen&ValNamen,0),\"Fout\")+1)","v":45}]
[null,null,"2019-12-09","PALL Rweg",43808.614583333336,43808.979166666664,"Samantha","Sanders","",{"$f":"IF(C71=\"\",\"\",INDEX(Validatie!$Q$2:$Q$6,MATCH(MOD(E71,1),Validatie!$P$2:$P$6,1)))","v":"Laat"},"-",{"$f":"IF(C71=\"\",\"\",CONCATENATE(G71,\" \",H71))","v":"Samantha Sanders"},{"$f":"IF(C71=\"\",\"\",IFERROR(MATCH(G71&H71,ValVoorNamen&ValNamen,0),\"Fout\")+1)","v":94}]
[null,null,"2019-12-09","PALL Rweg",43808.614583333336,43808.979166666664,"Sied"," van der Pol","",{"$f":"IF(C72=\"\",\"\",INDEX(Validatie!$Q$2:$Q$6,MATCH(MOD(E72,1),Validatie!$P$2:$P$6,1)))","v":"Laat"},"-","Sied  van der Pol",{"$f":"IF(C72=\"\",\"\",IFERROR(MATCH(G72&H72,ValVoorNamen&ValNamen,0),\"Fout\")+1)","v":99}]
[null,null,"2019-12-09","PALL Rweg",43808.614583333336,43808.979166666664,"Laszlo","Scholten","",{"$f":"IF(C73=\"\",\"\",INDEX(Validatie!$Q$2:$Q$6,MATCH(MOD(E73,1),Validatie!$P$2:$P$6,1)))","v":"Laat"},"-","Laszlo Scholten",{"$f":"IF(C73=\"\",\"\",IFERROR(MATCH(G73&H73,ValVoorNamen&ValNamen,0),\"Fout\")+1)","v":61}]
[null,null,"2019-12-09","PALL Rweg",43808.614583333336,43808.979166666664,"Atobhran","de Groot","",{"$f":"IF(C74=\"\",\"\",INDEX(Validatie!$Q$2:$Q$6,MATCH(MOD(E74,1),Validatie!$P$2:$P$6,1)))","v":"Laat"},"-","Atobhran de Groot",{"$f":"IF(C74=\"\",\"\",IFERROR(MATCH(G74&H74,ValVoorNamen&ValNamen,0),\"Fout\")+1)","v":14}]
[null,null,"2019-12-09","PALL Rweg",43808.614583333336,43808.979166666664,"Abdul","Jansen","",{"$f":"IF(C75=\"\",\"\",INDEX(Validatie!$Q$2:$Q$6,MATCH(MOD(E75,1),Validatie!$P$2:$P$6,1)))","v":"Laat"},"-","Abdul Jansen",{"$f":"IF(C75=\"\",\"\",IFERROR(MATCH(G75&H75,ValVoorNamen&ValNamen,0),\"Fout\")+1)","v":3}]
[null,null,"2019-12-09","PALL Rweg",43808.614583333336,43808.979166666664,"Naoufel","van de Velde ","",{"$f":"IF(C76=\"\",\"\",INDEX(Validatie!$Q$2:$Q$6,MATCH(MOD(E76,1),Validatie!$P$2:$P$6,1)))","v":"Laat"},"-","Naoufel van de Velde ",{"$f":"IF(C76=\"\",\"\",IFERROR(MATCH(G76&H76,ValVoorNamen&ValNamen,0),\"Fout\")+1)","v":73}]
[null,null,"2019-12-09","PALL Rweg",43808.614583333336,43808.979166666664,"Niek","Smeets","",{"$f":"IF(C77=\"\",\"\",INDEX(Validatie!$Q$2:$Q$6,MATCH(MOD(E77,1),Validatie!$P$2:$P$6,1)))","v":"Laat"},"-","Niek Smeets",{"$f":"IF(C77=\"\",\"\",IFERROR(MATCH(G77&H77,ValVoorNamen&ValNamen,0),\"Fout\")+1)","v":75}]
[null,null,"2019-12-09","PALL Rweg",43808.614583333336,43808.979166666664,"Jarek","Kuipers","",{"$f":"IF(C78=\"\",\"\",INDEX(Validatie!$Q$2:$Q$6,MATCH(MOD(E78,1),Validatie!$P$2:$P$6,1)))","v":"Laat"},"-","Jarek Kuipers",{"$f":"IF(C78=\"\",\"\",IFERROR(MATCH(G78&H78,ValVoorNamen&ValNamen,0),\"Fout\")+1)","v":54}]
[null,null,"2019-12-09","PALL Rweg",43808.614583333336,43808.979166666664,"Martijn","de Ruiter","",{"$f":"IF(C79=\"\",\"\",INDEX(Validatie!$Q$2:$Q$6,MATCH(MOD(E79,1),Validatie!$P$2:$P$6,1)))","v":"Laat"},"-","Martijn de Ruiter",{"$f":"IF(C79=\"\",\"\",IFERROR(MATCH(G79&H79,ValVoorNamen&ValNamen,0),\"Fout\")+1)","v":66}]
[null,null,"2019-12-09","PALL Rweg",43808.614583333336,43808.979166666664,"Mark","Vink","",{"$f":"IF(C80=\"\",\"\",INDEX(Validatie!$Q$2:$Q$6,MATCH(MOD(E80,1),Validatie!$P$2:$P$6,1)))","v":"Laat"},"-","Mark Vink",{"$f":"IF(C80=\"\",\"\",IFERROR(MATCH(G80&H80,ValVoorNamen&ValNamen,0),\"Fout\")+1)","v":65}]
[null,null,"2019-12-09","PALL Rweg",43808.614583333336,43808.979166666664,"Abdiqadir","de Jong","",{"$f":"IF(C81=\"\",\"\",INDEX(Validatie!$Q$2:$Q$6,MATCH(MOD(E81,1),Validatie!$P$2:$P$6,1)))","v":"Laat"},"-","Abdiqadir de Jong",{"$f":"IF(C81=\"\",\"\",IFERROR(MATCH(G81&H81,ValVoorNamen&ValNamen,0),\"Fout\")+1)","v":2}]
[null,null,"2019-12-09","PALL Rweg",43808.614583333336,43808.979166666664,"Nexhmedi","Willemsen","",{"$f":"IF(C82=\"\",\"\",INDEX(Validatie!$Q$2:$Q$6,MATCH(MOD(E82,1),Validatie!$P$2:$P$6,1)))","v":"Laat"},"-","Nexhmedi Willemsen",{"$f":"IF(C82=\"\",\"\",IFERROR(MATCH(G82&H82,ValVoorNamen&ValNamen,0),\"Fout\")+1)","v":74}]
[null,null,"2019-12-09","SCHM",43808.614583333336,43808.979166666664,"Erik","de Haan","",{"$f":"IF(C83=\"\",\"\",INDEX(Validatie!$Q$2:$Q$6,MATCH(MOD(E83,1),Validatie!$P$2:$P$6,1)))","v":"Laat"},"SCHM","Erik de Haan",{"$f":"IF(C83=\"\",\"\",IFERROR(MATCH(G83&H83,ValVoorNamen&ValNamen,0),\"Fout\")+1)","v":30}]
[null,null,"2019-12-09","SCHM",43808.614583333336,43808.979166666664,"Patrick","Bosch","",{"$f":"IF(C84=\"\",\"\",INDEX(Validatie!$Q$2:$Q$6,MATCH(MOD(E84,1),Validatie!$P$2:$P$6,1)))","v":"Laat"},"SCHM","Patrick Bosch",{"$f":"IF(C84=\"\",\"\",IFERROR(MATCH(G84&H84,ValVoorNamen&ValNamen,0),\"Fout\")+1)","v":78}]
[null,null,"2019-12-09","SCHM",43808.614583333336,43808.979166666664,"Rolinka","van den Bosch","",{"$f":"IF(C85=\"\",\"\",INDEX(Validatie!$Q$2:$Q$6,MATCH(MOD(E85,1),Validatie!$P$2:$P$6,1)))","v":"Laat"},"SCHM","Rolinka van den Bosch",{"$f":"IF(C85=\"\",\"\",IFERROR(MATCH(G85&H85,ValVoorNamen&ValNamen,0),\"Fout\")+1)","v":89}]
[null,null,"2019-12-09","SCHM AFV",43808.614583333336,43808.979166666664,"Miquel","van Loon","",{"$f":"IF(C86=\"\",\"\",INDEX(Validatie!$Q$2:$Q$6,MATCH(MOD(E86,1),Validatie!$P$2:$P$6,1)))","v":"Laat"},"AFV","Miquel van Loon",{"$f":"IF(C86=\"\",\"\",IFERROR(MATCH(G86&H86,ValVoorNamen&ValNamen,0),\"Fout\")+1)","v":71}]
[null,null,"2019-12-09","SCHM AFV",43808.614583333336,43808.979166666664,"Paul","van Dongen","",{"$f":"IF(C87=\"\",\"\",INDEX(Validatie!$Q$2:$Q$6,MATCH(MOD(E87,1),Validatie!$P$2:$P$6,1)))","v":"Laat"},"AFV","Paul van Dongen",{"$f":"IF(C87=\"\",\"\",IFERROR(MATCH(G87&H87,ValVoorNamen&ValNamen,0),\"Fout\")+1)","v":79}]
[null,null,"2019-12-09","SCHM AFV",43808.614583333336,43808.979166666664,"Sebastiaan","Mol","",{"$f":"IF(C88=\"\",\"\",INDEX(Validatie!$Q$2:$Q$6,MATCH(MOD(E88,1),Validatie!$P$2:$P$6,1)))","v":"Laat"},"AFV","Sebastiaan Mol",{"$f":"IF(C88=\"\",\"\",IFERROR(MATCH(G88&H88,ValVoorNamen&ValNamen,0),\"Fout\")+1)","v":96}]
[null,null,"2019-12-09","SCHM AFV",43808.614583333336,43808.979166666664,"Baki","Bos","",{"$f":"IF(C89=\"\",\"\",INDEX(Validatie!$Q$2:$Q$6,MATCH(MOD(E89,1),Validatie!$P$2:$P$6,1)))","v":"Laat"},"AFV","Baki Bos",{"$f":"IF(C89=\"\",\"\",IFERROR(MATCH(G89&H89,ValVoorNamen&ValNamen,0),\"Fout\")+1)","v":15}]
[null,null,"2019-12-09","SCHM AFV",43808.614583333336,43808.979166666664,"Ilker","Peeters","",{"$f":"IF(C90=\"\",\"\",INDEX(Validatie!$Q$2:$Q$6,MATCH(MOD(E90,1),Validatie!$P$2:$P$6,1)))","v":"Laat"},"AFV","Ilker Peeters",{"$f":"IF(C90=\"\",\"\",IFERROR(MATCH(G90&H90,ValVoorNamen&ValNamen,0),\"Fout\")+1)","v":52}]
[null,null,"2019-12-09","TRSP",43808.614583333336,43808.979166666664,"Emsud","Kok","",{"$f":"IF(C91=\"\",\"\",INDEX(Validatie!$Q$2:$Q$6,MATCH(MOD(E91,1),Validatie!$P$2:$P$6,1)))","v":"Laat"},"?","Emsud Kok",{"$f":"IF(C91=\"\",\"\",IFERROR(MATCH(G91&H91,ValVoorNamen&ValNamen,0),\"Fout\")+1)","v":28}]
[null,null,"2019-12-09","TRSP",43808.614583333336,43808.979166666664,"Reinder","Koning","",{"$f":"IF(C92=\"\",\"\",INDEX(Validatie!$Q$2:$Q$6,MATCH(MOD(E92,1),Validatie!$P$2:$P$6,1)))","v":"Laat"},"?","Reinder Koning",{"$f":"IF(C92=\"\",\"\",IFERROR(MATCH(G92&H92,ValVoorNamen&ValNamen,0),\"Fout\")+1)","v":83}]
[null,null,"2019-12-09","PALL Rweg",43808.645833333336,43808.979166666664,"Amanuel","Janssen","",{"$f":"IF(C93=\"\",\"\",INDEX(Validatie!$Q$2:$Q$6,MATCH(MOD(E93,1),Validatie!$P$2:$P$6,1)))","v":"Laat"},"-","Amanuel Janssen",{"$f":"IF(C93=\"\",\"\",IFERROR(MATCH(G93&H93,ValVoorNamen&ValNamen,0),\"Fout\")+1)","v":8}]
[null,null,"2019-12-09","PALL Rweg",43808.666666666664,43808.979166666664,"Gebrehiwet","Schouten","",{"$f":"IF(C94=\"\",\"\",INDEX(Validatie!$Q$2:$Q$6,MATCH(MOD(E94,1),Validatie!$P$2:$P$6,1)))","v":"Laat"},"-","Gebrehiwet Schouten",{"$f":"IF(C94=\"\",\"\",IFERROR(MATCH(G94&H94,ValVoorNamen&ValNamen,0),\"Fout\")+1)","v":38}]
[null,null,"2019-12-09","Reserve middag",43808.666666666664,43808.979166666664,"Bereket","Peters","",{"$f":"IF(C95=\"\",\"\",INDEX(Validatie!$Q$2:$Q$6,MATCH(MOD(E95,1),Validatie!$P$2:$P$6,1)))","v":"Laat"},"-","Bereket Peters",{"$f":"IF(C95=\"\",\"\",IFERROR(MATCH(G95&H95,ValVoorNamen&ValNamen,0),\"Fout\")+1)","v":17}]
[null,null,"2019-12-09","SCHM HAS",43808.697916666664,43808.9375,"Norbert","de Lange","",{"$f":"IF(C96=\"\",\"\",INDEX(Validatie!$Q$2:$Q$6,MATCH(MOD(E96,1),Validatie!$P$2:$P$6,1)))","v":"Laat"},"HAS","Norbert de Lange",{"$f":"IF(C96=\"\",\"\",IFERROR(MATCH(G96&H96,ValVoorNamen&ValNamen,0),\"Fout\")+1)","v":76}]
[null,null,"2019-12-09","SCHM",43808.916666666664,43809.28125,"Rachid","van der Laan","",{"$f":"IF(C97=\"\",\"\",INDEX(Validatie!$Q$2:$Q$6,MATCH(MOD(E97,1),Validatie!$P$2:$P$6,1)))","v":"Nacht"},"SCHM","Rachid van der Laan",{"$f":"IF(C97=\"\",\"\",IFERROR(MATCH(G97&H97,ValVoorNamen&ValNamen,0),\"Fout\")+1)","v":82}]
[null,null,"2019-12-09","SCHM",43808.916666666664,43809.28125,"Evans","Vermeulen","",{"$f":"IF(C98=\"\",\"\",INDEX(Validatie!$Q$2:$Q$6,MATCH(MOD(E98,1),Validatie!$P$2:$P$6,1)))","v":"Nacht"},"SCHM","Evans Vermeulen",{"$f":"IF(C98=\"\",\"\",IFERROR(MATCH(G98&H98,ValVoorNamen&ValNamen,0),\"Fout\")+1)","v":31}]
[null,null,"2019-12-09","SCHM",43808.916666666664,43809.28125,"Kevin","Veenstra","",{"$f":"IF(C99=\"\",\"\",INDEX(Validatie!$Q$2:$Q$6,MATCH(MOD(E99,1),Validatie!$P$2:$P$6,1)))","v":"Nacht"},"SCHM","Kevin Veenstra",{"$f":"IF(C99=\"\",\"\",IFERROR(MATCH(G99&H99,ValVoorNamen&ValNamen,0),\"Fout\")+1)","v":58}]
[null,null,"2019-12-10","ABB ochtend ",43809.25,43809.614583333336,"Trienko","Spooren","",{"$f":"IF(C100=\"\",\"\",INDEX(Validatie!$Q$2:$Q$6,MATCH(MOD(E100,1),Validatie!$P$2:$P$6,1)))","v":"Vroeg"},"ABB","Trienko Spooren",{"$f":"IF(C100=\"\",\"\",IFERROR(MATCH(G100&H100,ValVoorNamen&ValNamen,0),\"Fout\")+1)","v":103}]
[null,null,"2019-12-10","AFV HAS",43809.25,43809.40625,"Paul","van Dongen","",{"$f":"IF(C101=\"\",\"\",INDEX(Validatie!$Q$2:$Q$6,MATCH(MOD(E101,1),Validatie!$P$2:$P$6,1)))","v":"Vroeg"},"HAS","Paul van Dongen",{"$f":"IF(C101=\"\",\"\",IFERROR(MATCH(G101&H101,ValVoorNamen&ValNamen,0),\"Fout\")+1)","v":79}]
[null,null,"2019-12-10","AFV MEP",43809.25,43809.614583333336,"Rudolf","Hofman","",{"$f":"IF(C102=\"\",\"\",INDEX(Validatie!$Q$2:$Q$6,MATCH(MOD(E102,1),Validatie!$P$2:$P$6,1)))","v":"Vroeg"},"MEP","Rudolf Hofman",{"$f":"IF(C102=\"\",\"\",IFERROR(MATCH(G102&H102,ValVoorNamen&ValNamen,0),\"Fout\")+1)","v":91}]
[null,null,"2019-12-10","LCR ochtend",43809.25,43809.614583333336,"Sami","van der Horst","",{"$f":"IF(C103=\"\",\"\",INDEX(Validatie!$Q$2:$Q$6,MATCH(MOD(E103,1),Validatie!$P$2:$P$6,1)))","v":"Vroeg"},"LCR","Sami van der Horst",{"$f":"IF(C103=\"\",\"\",IFERROR(MATCH(G103&H103,ValVoorNamen&ValNamen,0),\"Fout\")+1)","v":95}]
[null,null,"2019-12-10","LCR ochtend",43809.25,43809.614583333336,"Wolter","De bolder","",{"$f":"IF(C104=\"\",\"\",INDEX(Validatie!$Q$2:$Q$6,MATCH(MOD(E104,1),Validatie!$P$2:$P$6,1)))","v":"Vroeg"},"LCR","Wolter De bolder",{"$f":"IF(C104=\"\",\"\",IFERROR(MATCH(G104&H104,ValVoorNamen&ValNamen,0),\"Fout\")+1)","v":107}]
[null,null,"2019-12-10","PALL HAS",43809.25,43809.614583333336,"Henk","Koster","",{"$f":"IF(C105=\"\",\"\",INDEX(Validatie!$Q$2:$Q$6,MATCH(MOD(E105,1),Validatie!$P$2:$P$6,1)))","v":"Vroeg"},"-","Henk Koster",{"$f":"IF(C105=\"\",\"\",IFERROR(MATCH(G105&H105,ValVoorNamen&ValNamen,0),\"Fout\")+1)","v":46}]
[null,null,"2019-12-10","PALL MEP",43809.25,43809.614583333336,"Wenaron","Kurkema","",{"$f":"IF(C106=\"\",\"\",INDEX(Validatie!$Q$2:$Q$6,MATCH(MOD(E106,1),Validatie!$P$2:$P$6,1)))","v":"Vroeg"},"-","Wenaron Kurkema",{"$f":"IF(C106=\"\",\"\",IFERROR(MATCH(G106&H106,ValVoorNamen&ValNamen,0),\"Fout\")+1)","v":105}]
[null,null,"2019-12-10","PALL MEP",43809.25,43809.614583333336,"Salahadin","Wolters","",{"$f":"IF(C107=\"\",\"\",INDEX(Validatie!$Q$2:$Q$6,MATCH(MOD(E107,1),Validatie!$P$2:$P$6,1)))","v":"Vroeg"},"-","Salahadin Wolters",{"$f":"IF(C107=\"\",\"\",IFERROR(MATCH(G107&H107,ValVoorNamen&ValNamen,0),\"Fout\")+1)","v":93}]
[null,null,"2019-12-10","PALL MEP",43809.25,43809.614583333336,"Dikkie","van der Meer","",{"$f":"IF(C108=\"\",\"\",INDEX(Validatie!$Q$2:$Q$6,MATCH(MOD(E108,1),Validatie!$P$2:$P$6,1)))","v":"Vroeg"},"-","Dikkie van der Meer",{"$f":"IF(C108=\"\",\"\",IFERROR(MATCH(G108&H108,ValVoorNamen&ValNamen,0),\"Fout\")+1)","v":26}]
[null,null,"2019-12-10","PALL MEP",43809.25,43809.614583333336,"Rene","van der Velden","",{"$f":"IF(C109=\"\",\"\",INDEX(Validatie!$Q$2:$Q$6,MATCH(MOD(E109,1),Validatie!$P$2:$P$6,1)))","v":"Vroeg"},"-","Rene van der Velden",{"$f":"IF(C109=\"\",\"\",IFERROR(MATCH(G109&H109,ValVoorNamen&ValNamen,0),\"Fout\")+1)","v":84}]
[null,null,"2019-12-10","PALL MEP",43809.25,43809.614583333336,"Richard","Driessen","",{"$f":"IF(C110=\"\",\"\",INDEX(Validatie!$Q$2:$Q$6,MATCH(MOD(E110,1),Validatie!$P$2:$P$6,1)))","v":"Vroeg"},"-","Richard Driessen",{"$f":"IF(C110=\"\",\"\",IFERROR(MATCH(G110&H110,ValVoorNamen&ValNamen,0),\"Fout\")+1)","v":85}]
[null,null,"2019-12-10","PALL Rweg",43809.25,43809.614583333336,"Shawn","Molenaar","",{"$f":"IF(C111=\"\",\"\",INDEX(Validatie!$Q$2:$Q$6,MATCH(MOD(E111,1),Validatie!$P$2:$P$6,1)))","v":"Vroeg"},"-","Shawn Molenaar",{"$f":"IF(C111=\"\",\"\",IFERROR(MATCH(G111&H111,ValVoorNamen&ValNamen,0),\"Fout\")+1)","v":98}]
[null,null,"2019-12-10","PALL Rweg",43809.25,43809.614583333336,"Elroy","van der Linden","",{"$f":"IF(C112=\"\",\"\",INDEX(Validatie!$Q$2:$Q$6,MATCH(MOD(E112,1),Validatie!$P$2:$P$6,1)))","v":"Vroeg"},"-","Elroy van der Linden",{"$f":"IF(C112=\"\",\"\",IFERROR(MATCH(G112&H112,ValVoorNamen&ValNamen,0),\"Fout\")+1)","v":27}]
[null,null,"2019-12-10","PALL Rweg",43809.25,43809.614583333336,"Arsenio","Mulder","",{"$f":"IF(C113=\"\",\"\",INDEX(Validatie!$Q$2:$Q$6,MATCH(MOD(E113,1),Validatie!$P$2:$P$6,1)))","v":"Vroeg"},"-","Arsenio Mulder",{"$f":"IF(C113=\"\",\"\",IFERROR(MATCH(G113&H113,ValVoorNamen&ValNamen,0),\"Fout\")+1)","v":13}]
[null,null,"2019-12-10","PALL Rweg",43809.25,43809.614583333336,"Viorel","Triest","",{"$f":"IF(C114=\"\",\"\",INDEX(Validatie!$Q$2:$Q$6,MATCH(MOD(E114,1),Validatie!$P$2:$P$6,1)))","v":"Vroeg"},"-","Viorel Triest",{"$f":"IF(C114=\"\",\"\",IFERROR(MATCH(G114&H114,ValVoorNamen&ValNamen,0),\"Fout\")+1)","v":104}]
[null,null,"2019-12-10","PALL Rweg",43809.25,43809.614583333336,"Olcay","de Vos","",{"$f":"IF(C115=\"\",\"\",INDEX(Validatie!$Q$2:$Q$6,MATCH(MOD(E115,1),Validatie!$P$2:$P$6,1)))","v":"Vroeg"},"-","Olcay de Vos",{"$f":"IF(C115=\"\",\"\",IFERROR(MATCH(G115&H115,ValVoorNamen&ValNamen,0),\"Fout\")+1)","v":77}]
[null,null,"2019-12-10","PALL Rweg",43809.25,43809.614583333336,"Amadou","Bakker","",{"$f":"IF(C116=\"\",\"\",INDEX(Validatie!$Q$2:$Q$6,MATCH(MOD(E116,1),Validatie!$P$2:$P$6,1)))","v":"Vroeg"},"-","Amadou Bakker",{"$f":"IF(C116=\"\",\"\",IFERROR(MATCH(G116&H116,ValVoorNamen&ValNamen,0),\"Fout\")+1)","v":7}]
[null,null,"2019-12-10","PALL Rweg",43809.25,43809.614583333336,"Wout","Van Goud","",{"$f":"IF(C117=\"\",\"\",INDEX(Validatie!$Q$2:$Q$6,MATCH(MOD(E117,1),Validatie!$P$2:$P$6,1)))","v":"Vroeg"},"-","Wout Van Goud",{"$f":"IF(C117=\"\",\"\",IFERROR(MATCH(G117&H117,ValVoorNamen&ValNamen,0),\"Fout\")+1)","v":108}]
[null,null,"2019-12-10","PALL Rweg",43809.25,43809.614583333336,"Magdalena","Postma","",{"$f":"IF(C118=\"\",\"\",INDEX(Validatie!$Q$2:$Q$6,MATCH(MOD(E118,1),Validatie!$P$2:$P$6,1)))","v":"Vroeg"},"-","Magdalena Postma",{"$f":"IF(C118=\"\",\"\",IFERROR(MATCH(G118&H118,ValVoorNamen&ValNamen,0),\"Fout\")+1)","v":63}]
[null,null,"2019-12-10","PALL Rweg",43809.25,43809.614583333336,"Charles","Dekker","",{"$f":"IF(C119=\"\",\"\",INDEX(Validatie!$Q$2:$Q$6,MATCH(MOD(E119,1),Validatie!$P$2:$P$6,1)))","v":"Vroeg"},"-","Charles Dekker",{"$f":"IF(C119=\"\",\"\",IFERROR(MATCH(G119&H119,ValVoorNamen&ValNamen,0),\"Fout\")+1)","v":20}]
[null,null,"2019-12-10","PALL Rweg",43809.25,43809.614583333336,"Ko","van de Brink","",{"$f":"IF(C120=\"\",\"\",INDEX(Validatie!$Q$2:$Q$6,MATCH(MOD(E120,1),Validatie!$P$2:$P$6,1)))","v":"Vroeg"},"-","Ko van de Brink",{"$f":"IF(C120=\"\",\"\",IFERROR(MATCH(G120&H120,ValVoorNamen&ValNamen,0),\"Fout\")+1)","v":60}]
[null,null,"2019-12-10","PALL Rweg",43809.25,43809.614583333336,"Robin","Evers","",{"$f":"IF(C121=\"\",\"\",INDEX(Validatie!$Q$2:$Q$6,MATCH(MOD(E121,1),Validatie!$P$2:$P$6,1)))","v":"Vroeg"},"-","Robin Evers",{"$f":"IF(C121=\"\",\"\",IFERROR(MATCH(G121&H121,ValVoorNamen&ValNamen,0),\"Fout\")+1)","v":88}]
[null,null,"2019-12-10","PALL Rweg",43809.25,43809.614583333336,"Gerrit","van Beek","",{"$f":"IF(C122=\"\",\"\",INDEX(Validatie!$Q$2:$Q$6,MATCH(MOD(E122,1),Validatie!$P$2:$P$6,1)))","v":"Vroeg"},"-","Gerrit van Beek",{"$f":"IF(C122=\"\",\"\",IFERROR(MATCH(G122&H122,ValVoorNamen&ValNamen,0),\"Fout\")+1)","v":39}]
[null,null,"2019-12-10","PALL Rweg",43809.25,43809.614583333336,"Everon","van den Heuvel","",{"$f":"IF(C123=\"\",\"\",INDEX(Validatie!$Q$2:$Q$6,MATCH(MOD(E123,1),Validatie!$P$2:$P$6,1)))","v":"Vroeg"},"-","Everon van den Heuvel",{"$f":"IF(C123=\"\",\"\",IFERROR(MATCH(G123&H123,ValVoorNamen&ValNamen,0),\"Fout\")+1)","v":32}]
[null,null,"2019-12-10","PALL Rweg",43809.25,43809.614583333336,"Davood","Smits","",{"$f":"IF(C124=\"\",\"\",INDEX(Validatie!$Q$2:$Q$6,MATCH(MOD(E124,1),Validatie!$P$2:$P$6,1)))","v":"Vroeg"},"-","Davood Smits",{"$f":"IF(C124=\"\",\"\",IFERROR(MATCH(G124&H124,ValVoorNamen&ValNamen,0),\"Fout\")+1)","v":24}]
[null,null,"2019-12-10","PALL Rweg",43809.25,43809.614583333336,"Swen","de Leeuw","",{"$f":"IF(C125=\"\",\"\",INDEX(Validatie!$Q$2:$Q$6,MATCH(MOD(E125,1),Validatie!$P$2:$P$6,1)))","v":"Vroeg"},"-","Swen de Leeuw",{"$f":"IF(C125=\"\",\"\",IFERROR(MATCH(G125&H125,ValVoorNamen&ValNamen,0),\"Fout\")+1)","v":100}]
[null,null,"2019-12-10","PALL Rweg",43809.25,43809.614583333336,"Saidou","Bosman","",{"$f":"IF(C126=\"\",\"\",INDEX(Validatie!$Q$2:$Q$6,MATCH(MOD(E126,1),Validatie!$P$2:$P$6,1)))","v":"Vroeg"},"-","Saidou Bosman",{"$f":"IF(C126=\"\",\"\",IFERROR(MATCH(G126&H126,ValVoorNamen&ValNamen,0),\"Fout\")+1)","v":92}]
[null,null,"2019-12-10","PALL Rweg",43809.25,43809.614583333336,"Wim","Vogel","",{"$f":"IF(C127=\"\",\"\",INDEX(Validatie!$Q$2:$Q$6,MATCH(MOD(E127,1),Validatie!$P$2:$P$6,1)))","v":"Vroeg"},"-","Wim Vogel",{"$f":"IF(C127=\"\",\"\",IFERROR(MATCH(G127&H127,ValVoorNamen&ValNamen,0),\"Fout\")+1)","v":106}]
[null,null,"2019-12-10","PALL Rweg",43809.25,43809.614583333336,"Quincy","de Koning","",{"$f":"IF(C128=\"\",\"\",INDEX(Validatie!$Q$2:$Q$6,MATCH(MOD(E128,1),Validatie!$P$2:$P$6,1)))","v":"Vroeg"},"-","Quincy de Koning",{"$f":"IF(C128=\"\",\"\",IFERROR(MATCH(G128&H128,ValVoorNamen&ValNamen,0),\"Fout\")+1)","v":81}]
[null,null,"2019-12-10","PALL Rweg",43809.25,43809.614583333336,"Henk","Koster","",{"$f":"IF(C129=\"\",\"\",INDEX(Validatie!$Q$2:$Q$6,MATCH(MOD(E129,1),Validatie!$P$2:$P$6,1)))","v":"Vroeg"},"-","Henk Koster",{"$f":"IF(C129=\"\",\"\",IFERROR(MATCH(G129&H129,ValVoorNamen&ValNamen,0),\"Fout\")+1)","v":46}]
[null,null,"2019-12-10","SCHM",43809.25,43809.614583333336,"Marjolein","Martens","",{"$f":"IF(C130=\"\",\"\",INDEX(Validatie!$Q$2:$Q$6,MATCH(MOD(E130,1),Validatie!$P$2:$P$6,1)))","v":"Vroeg"},"SCHM","Marjolein Martens",{"$f":"IF(C130=\"\",\"\",IFERROR(MATCH(G130&H130,ValVoorNamen&ValNamen,0),\"Fout\")+1)","v":64}]
[null,null,"2019-12-10","SCHM",43809.25,43809.614583333336,"Piet","Schipper","",{"$f":"IF(C131=\"\",\"\",INDEX(Validatie!$Q$2:$Q$6,MATCH(MOD(E131,1),Validatie!$P$2:$P$6,1)))","v":"Vroeg"},"SCHM","Piet Schipper",{"$f":"IF(C131=\"\",\"\",IFERROR(MATCH(G131&H131,ValVoorNamen&ValNamen,0),\"Fout\")+1)","v":80}]
[null,null,"2019-12-10","SCHM",43809.25,43809.614583333336,"Roy","van der Meulen","",{"$f":"IF(C132=\"\",\"\",INDEX(Validatie!$Q$2:$Q$6,MATCH(MOD(E132,1),Validatie!$P$2:$P$6,1)))","v":"Vroeg"},"SCHM","Roy van der Meulen",{"$f":"IF(C132=\"\",\"\",IFERROR(MATCH(G132&H132,ValVoorNamen&ValNamen,0),\"Fout\")+1)","v":90}]
[null,null,"2019-12-10","SCHM AFV",43809.25,43809.614583333336,"Christiaan","de Wit","",{"$f":"IF(C133=\"\",\"\",INDEX(Validatie!$Q$2:$Q$6,MATCH(MOD(E133,1),Validatie!$P$2:$P$6,1)))","v":"Vroeg"},"AFV","Christiaan de Wit",{"$f":"IF(C133=\"\",\"\",IFERROR(MATCH(G133&H133,ValVoorNamen&ValNamen,0),\"Fout\")+1)","v":22}]
[null,null,"2019-12-10","SCHM AFV",43809.25,43809.614583333336,"Henri","van Dam",{"$f":"IF(H134=\"\",\"\",IF(SUMPRODUCT(--(ValVerlofVoornaam=G134),--(ValVerlofNaam=H134),--(ValVerlofVan<=C134),--(ValVerlofTot>=C134)*(1))>0,\"V\",\"\"))","v":""},{"$f":"IF(C134=\"\",\"\",INDEX(Validatie!$Q$2:$Q$6,MATCH(MOD(E134,1),Validatie!$P$2:$P$6,1)))","v":"Vroeg"},{"$f":"IF(C134=\"\",\"\",IFERROR(VLOOKUP(D134,DataMijnAfdeling,2,0),\"?\"))","v":"AFV"},"Henri van Dam",{"$f":"IF(C134=\"\",\"\",IFERROR(MATCH(G134&H134,ValVoorNamen&ValNamen,0),\"Fout\")+1)","v":47}]
[null,null,"2019-12-10","SCHM AFV",43809.25,43809.614583333336,"Jan","de Jonge","",{"$f":"IF(C135=\"\",\"\",INDEX(Validatie!$Q$2:$Q$6,MATCH(MOD(E135,1),Validatie!$P$2:$P$6,1)))","v":"Vroeg"},"AFV",{"$f":"IF(C135=\"\",\"\",CONCATENATE(G135,\" \",H135))","v":"Jan de Jonge"},{"$f":"IF(C135=\"\",\"\",IFERROR(MATCH(G135&H135,ValVoorNamen&ValNamen,0),\"Fout\")+1)","v":53}]
[null,null,"2019-12-10","SCHM AFV",43809.25,43809.614583333336,"Boyan","van Leeuwen","",{"$f":"IF(C136=\"\",\"\",INDEX(Validatie!$Q$2:$Q$6,MATCH(MOD(E136,1),Validatie!$P$2:$P$6,1)))","v":"Vroeg"},"AFV","Boyan van Leeuwen",{"$f":"IF(C136=\"\",\"\",IFERROR(MATCH(G136&H136,ValVoorNamen&ValNamen,0),\"Fout\")+1)","v":19}]
[null,null,"2019-12-10","SCHM AFV",43809.25,43809.614583333336,"Michel","Jonker","",{"$f":"IF(C137=\"\",\"\",INDEX(Validatie!$Q$2:$Q$6,MATCH(MOD(E137,1),Validatie!$P$2:$P$6,1)))","v":"Vroeg"},"AFV","Michel Jonker",{"$f":"IF(C137=\"\",\"\",IFERROR(MATCH(G137&H137,ValVoorNamen&ValNamen,0),\"Fout\")+1)","v":70}]
[null,null,"2019-12-10","TRSP",43809.25,43809.614583333336,"Anton","Smit","",{"$f":"IF(C138=\"\",\"\",INDEX(Validatie!$Q$2:$Q$6,MATCH(MOD(E138,1),Validatie!$P$2:$P$6,1)))","v":"Vroeg"},"?","Anton Smit",{"$f":"IF(C138=\"\",\"\",IFERROR(MATCH(G138&H138,ValVoorNamen&ValNamen,0),\"Fout\")+1)","v":10}]
[null,null,"2019-12-10","TRSP",43809.25,43809.614583333336,"Henk","Koster","",{"$f":"IF(C139=\"\",\"\",INDEX(Validatie!$Q$2:$Q$6,MATCH(MOD(E139,1),Validatie!$P$2:$P$6,1)))","v":"Vroeg"},"?","Henk Koster",{"$f":"IF(C139=\"\",\"\",IFERROR(MATCH(G139&H139,ValVoorNamen&ValNamen,0),\"Fout\")+1)","v":46}]
[null,null,"2019-12-10","AFV MEP",43809.291666666664,43809.65625,"Rijk","van Doorn","",{"$f":"IF(C140=\"\",\"\",INDEX(Validatie!$Q$2:$Q$6,MATCH(MOD(E140,1),Validatie!$P$2:$P$6,1)))","v":"Vroeg"},"MEP","Rijk van Doorn",{"$f":"IF(C140=\"\",\"\",IFERROR(MATCH(G140&H140,ValVoorNamen&ValNamen,0),\"Fout\")+1)","v":86}]
[null,null,"2019-12-10","Teamleider PALL",43809.3125,43809.677083333336,"Hilko","Prins","",{"$f":"IF(C141=\"\",\"\",INDEX(Validatie!$Q$2:$Q$6,MATCH(MOD(E141,1),Validatie!$P$2:$P$6,1)))","v":"Vroeg"},"?","Hilko Prins",{"$f":"IF(C141=\"\",\"\",IFERROR(MATCH(G141&H141,ValVoorNamen&ValNamen,0),\"Fout\")+1)","v":49}]
[null,null,"2019-12-10","TRSP",43809.333333333336,43809.697916666664,"Harrie","Hoekstra","",{"$f":"IF(C142=\"\",\"\",INDEX(Validatie!$Q$2:$Q$6,MATCH(MOD(E142,1),Validatie!$P$2:$P$6,1)))","v":"Vroeg"},"?","Harrie Hoekstra",{"$f":"IF(C142=\"\",\"\",IFERROR(MATCH(G142&H142,ValVoorNamen&ValNamen,0),\"Fout\")+1)","v":43}]
[null,null,"2019-12-10","SCHM HAS",43809.40625,43809.614583333336,"Paul","van Dongen","",{"$f":"IF(C143=\"\",\"\",INDEX(Validatie!$Q$2:$Q$6,MATCH(MOD(E143,1),Validatie!$P$2:$P$6,1)))","v":"Vroeg"},"HAS","Paul van Dongen",{"$f":"IF(C143=\"\",\"\",IFERROR(MATCH(G143&H143,ValVoorNamen&ValNamen,0),\"Fout\")+1)","v":79}]
[null,null,"2019-12-10","Reserve ochtend",43809.458333333336,43809.614583333336,"Fars","van de Veen","",{"$f":"IF(C144=\"\",\"\",INDEX(Validatie!$Q$2:$Q$6,MATCH(MOD(E144,1),Validatie!$P$2:$P$6,1)))","v":"Vroeg"},"-","Fars van de Veen",{"$f":"IF(C144=\"\",\"\",IFERROR(MATCH(G144&H144,ValVoorNamen&ValNamen,0),\"Fout\")+1)","v":33}]
[null,null,"2019-12-10","ABB middag",43809.572916666664,43809.9375,"Bile","Hendriks","",{"$f":"IF(C145=\"\",\"\",INDEX(Validatie!$Q$2:$Q$6,MATCH(MOD(E145,1),Validatie!$P$2:$P$6,1)))","v":"Laat"},"ABB","Bile Hendriks",{"$f":"IF(C145=\"\",\"\",IFERROR(MATCH(G145&H145,ValVoorNamen&ValNamen,0),\"Fout\")+1)","v":18}]
[null,null,"2019-12-10","ABB middag",43809.572916666664,43809.9375,"Flavi","van der Heyden","",{"$f":"IF(C146=\"\",\"\",INDEX(Validatie!$Q$2:$Q$6,MATCH(MOD(E146,1),Validatie!$P$2:$P$6,1)))","v":"Laat"},"ABB","Flavi van der Heyden",{"$f":"IF(C146=\"\",\"\",IFERROR(MATCH(G146&H146,ValVoorNamen&ValNamen,0),\"Fout\")+1)","v":37}]
[null,null,"2019-12-10","AFV HAS",43809.572916666664,43809.697916666664,"Norbert","de Lange","",{"$f":"IF(C147=\"\",\"\",INDEX(Validatie!$Q$2:$Q$6,MATCH(MOD(E147,1),Validatie!$P$2:$P$6,1)))","v":"Laat"},"HAS","Norbert de Lange",{"$f":"IF(C147=\"\",\"\",IFERROR(MATCH(G147&H147,ValVoorNamen&ValNamen,0),\"Fout\")+1)","v":76}]
[null,null,"2019-12-10","AFV MEP",43809.572916666664,43809.9375,"Houcin","Huisman","",{"$f":"IF(C148=\"\",\"\",INDEX(Validatie!$Q$2:$Q$6,MATCH(MOD(E148,1),Validatie!$P$2:$P$6,1)))","v":"Laat"},"MEP","Houcin Huisman",{"$f":"IF(C148=\"\",\"\",IFERROR(MATCH(G148&H148,ValVoorNamen&ValNamen,0),\"Fout\")+1)","v":51}]
[null,null,"2019-12-10","LCR middag",43809.572916666664,43809.9375,"Klaas","Kramer","",{"$f":"IF(C149=\"\",\"\",INDEX(Validatie!$Q$2:$Q$6,MATCH(MOD(E149,1),Validatie!$P$2:$P$6,1)))","v":"Laat"},"LCR","Klaas Kramer",{"$f":"IF(C149=\"\",\"\",IFERROR(MATCH(G149&H149,ValVoorNamen&ValNamen,0),\"Fout\")+1)","v":59}]
[null,null,"2019-12-10","PALL MEP",43809.614583333336,43809.979166666664,"Latie","van Wijk","",{"$f":"IF(C150=\"\",\"\",INDEX(Validatie!$Q$2:$Q$6,MATCH(MOD(E150,1),Validatie!$P$2:$P$6,1)))","v":"Laat"},"-","Latie van Wijk",{"$f":"IF(C150=\"\",\"\",IFERROR(MATCH(G150&H150,ValVoorNamen&ValNamen,0),\"Fout\")+1)","v":62}]
[null,null,"2019-12-10","PALL MEP",43809.614583333336,43809.979166666664,"Abdurahman Ibrahim","de Vries","",{"$f":"IF(C151=\"\",\"\",INDEX(Validatie!$Q$2:$Q$6,MATCH(MOD(E151,1),Validatie!$P$2:$P$6,1)))","v":"Laat"},"-","Abdurahman Ibrahim de Vries",{"$f":"IF(C151=\"\",\"\",IFERROR(MATCH(G151&H151,ValVoorNamen&ValNamen,0),\"Fout\")+1)","v":4}]
[null,null,"2019-12-10","PALL MEP",43809.614583333336,43809.979166666664,"Michael","Gerritsen","",{"$f":"IF(C152=\"\",\"\",INDEX(Validatie!$Q$2:$Q$6,MATCH(MOD(E152,1),Validatie!$P$2:$P$6,1)))","v":"Laat"},"-","Michael Gerritsen",{"$f":"IF(C152=\"\",\"\",IFERROR(MATCH(G152&H152,ValVoorNamen&ValNamen,0),\"Fout\")+1)","v":69}]
[null,null,"2019-12-10","PALL MEP",43809.614583333336,43809.979166666664,"Hans","van de Ven ","",{"$f":"IF(C153=\"\",\"\",INDEX(Validatie!$Q$2:$Q$6,MATCH(MOD(E153,1),Validatie!$P$2:$P$6,1)))","v":"Laat"},"-","Hans van de Ven ",{"$f":"IF(C153=\"\",\"\",IFERROR(MATCH(G153&H153,ValVoorNamen&ValNamen,0),\"Fout\")+1)","v":42}]
[null,null,"2019-12-10","PALL MEP",43809.614583333336,43809.979166666664,"Jeroen","Post","",{"$f":"IF(C154=\"\",\"\",INDEX(Validatie!$Q$2:$Q$6,MATCH(MOD(E154,1),Validatie!$P$2:$P$6,1)))","v":"Laat"},"-","Jeroen Post",{"$f":"IF(C154=\"\",\"\",IFERROR(MATCH(G154&H154,ValVoorNamen&ValNamen,0),\"Fout\")+1)","v":56}]
[null,null,"2019-12-10","PALL Rweg",43809.614583333336,43809.979166666664,"Akela","van Dijk","",{"$f":"IF(C155=\"\",\"\",INDEX(Validatie!$Q$2:$Q$6,MATCH(MOD(E155,1),Validatie!$P$2:$P$6,1)))","v":"Laat"},"-","Akela van Dijk",{"$f":"IF(C155=\"\",\"\",IFERROR(MATCH(G155&H155,ValVoorNamen&ValNamen,0),\"Fout\")+1)","v":6}]
[null,null,"2019-12-10","PALL Rweg",43809.614583333336,43809.979166666664,"Karrar","Kuiper","",{"$f":"IF(C156=\"\",\"\",INDEX(Validatie!$Q$2:$Q$6,MATCH(MOD(E156,1),Validatie!$P$2:$P$6,1)))","v":"Laat"},"-","Karrar Kuiper",{"$f":"IF(C156=\"\",\"\",IFERROR(MATCH(G156&H156,ValVoorNamen&ValNamen,0),\"Fout\")+1)","v":57}]
[null,null,"2019-12-10","PALL Rweg",43809.614583333336,43809.979166666664,"Sebastian","Kuijpers","",{"$f":"IF(C157=\"\",\"\",INDEX(Validatie!$Q$2:$Q$6,MATCH(MOD(E157,1),Validatie!$P$2:$P$6,1)))","v":"Laat"},"-","Sebastian Kuijpers",{"$f":"IF(C157=\"\",\"\",IFERROR(MATCH(G157&H157,ValVoorNamen&ValNamen,0),\"Fout\")+1)","v":97}]
[null,null,"2019-12-10","PALL Rweg",43809.614583333336,43809.979166666664,"Chevindio","Brouwer","",{"$f":"IF(C158=\"\",\"\",INDEX(Validatie!$Q$2:$Q$6,MATCH(MOD(E158,1),Validatie!$P$2:$P$6,1)))","v":"Laat"},"-","Chevindio Brouwer",{"$f":"IF(C158=\"\",\"\",IFERROR(MATCH(G158&H158,ValVoorNamen&ValNamen,0),\"Fout\")+1)","v":21}]
[null,null,"2019-12-10","PALL Rweg",43809.614583333336,43809.979166666664,"Harry","Maas","",{"$f":"IF(C159=\"\",\"\",INDEX(Validatie!$Q$2:$Q$6,MATCH(MOD(E159,1),Validatie!$P$2:$P$6,1)))","v":"Laat"},"-","Harry Maas",{"$f":"IF(C159=\"\",\"\",IFERROR(MATCH(G159&H159,ValVoorNamen&ValNamen,0),\"Fout\")+1)","v":44}]
[null,null,"2019-12-10","PALL Rweg",43809.614583333336,43809.979166666664,"Apollonia","Meijer","",{"$f":"IF(C160=\"\",\"\",INDEX(Validatie!$Q$2:$Q$6,MATCH(MOD(E160,1),Validatie!$P$2:$P$6,1)))","v":"Laat"},"-","Apollonia Meijer",{"$f":"IF(C160=\"\",\"\",IFERROR(MATCH(G160&H160,ValVoorNamen&ValNamen,0),\"Fout\")+1)","v":11}]
[null,null,"2019-12-10","PALL Rweg",43809.614583333336,43809.979166666664,"Dennis","de Graaf","",{"$f":"IF(C161=\"\",\"\",INDEX(Validatie!$Q$2:$Q$6,MATCH(MOD(E161,1),Validatie!$P$2:$P$6,1)))","v":"Laat"},"-","Dennis de Graaf",{"$f":"IF(C161=\"\",\"\",IFERROR(MATCH(G161&H161,ValVoorNamen&ValNamen,0),\"Fout\")+1)","v":25}]
[null,null,"2019-12-10","PALL Rweg",43809.614583333336,43809.979166666664,"Agathe","van de Berg ","",{"$f":"IF(C162=\"\",\"\",INDEX(Validatie!$Q$2:$Q$6,MATCH(MOD(E162,1),Validatie!$P$2:$P$6,1)))","v":"Laat"},"-","Agathe van de Berg ",{"$f":"IF(C162=\"\",\"\",IFERROR(MATCH(G162&H162,ValVoorNamen&ValNamen,0),\"Fout\")+1)","v":5}]
[null,null,"2019-12-10","PALL Rweg",43809.614583333336,43809.979166666664,"Heruy","van de Wal ","",{"$f":"IF(C163=\"\",\"\",INDEX(Validatie!$Q$2:$Q$6,MATCH(MOD(E163,1),Validatie!$P$2:$P$6,1)))","v":"Laat"},"-","Heruy van de Wal ",{"$f":"IF(C163=\"\",\"\",IFERROR(MATCH(G163&H163,ValVoorNamen&ValNamen,0),\"Fout\")+1)","v":48}]
[null,null,"2019-12-10","PALL Rweg",43809.614583333336,43809.979166666664,"Hassan","Verhoeven","",{"$f":"IF(C164=\"\",\"\",INDEX(Validatie!$Q$2:$Q$6,MATCH(MOD(E164,1),Validatie!$P$2:$P$6,1)))","v":"Laat"},"-","Hassan Verhoeven",{"$f":"IF(C164=\"\",\"\",IFERROR(MATCH(G164&H164,ValVoorNamen&ValNamen,0),\"Fout\")+1)","v":45}]
[null,null,"2019-12-10","PALL Rweg",43809.614583333336,43809.979166666664,"Samantha","Sanders","",{"$f":"IF(C165=\"\",\"\",INDEX(Validatie!$Q$2:$Q$6,MATCH(MOD(E165,1),Validatie!$P$2:$P$6,1)))","v":"Laat"},"-","Samantha Sanders",{"$f":"IF(C165=\"\",\"\",IFERROR(MATCH(G165&H165,ValVoorNamen&ValNamen,0),\"Fout\")+1)","v":94}]
[null,null,"2019-12-10","PALL Rweg",43809.614583333336,43809.979166666664,"Sied"," van der Pol","",{"$f":"IF(C166=\"\",\"\",INDEX(Validatie!$Q$2:$Q$6,MATCH(MOD(E166,1),Validatie!$P$2:$P$6,1)))","v":"Laat"},"-","Sied  van der Pol",{"$f":"IF(C166=\"\",\"\",IFERROR(MATCH(G166&H166,ValVoorNamen&ValNamen,0),\"Fout\")+1)","v":99}]
[null,null,"2019-12-10","PALL Rweg",43809.614583333336,43809.979166666664,"Atobhran","de Groot","",{"$f":"IF(C167=\"\",\"\",INDEX(Validatie!$Q$2:$Q$6,MATCH(MOD(E167,1),Validatie!$P$2:$P$6,1)))","v":"Laat"},"-","Atobhran de Groot",{"$f":"IF(C167=\"\",\"\",IFERROR(MATCH(G167&H167,ValVoorNamen&ValNamen,0),\"Fout\")+1)","v":14}]
[null,null,"2019-12-10","PALL Rweg",43809.614583333336,43809.979166666664,"Abdul","Jansen","",{"$f":"IF(C168=\"\",\"\",INDEX(Validatie!$Q$2:$Q$6,MATCH(MOD(E168,1),Validatie!$P$2:$P$6,1)))","v":"Laat"},"-","Abdul Jansen",{"$f":"IF(C168=\"\",\"\",IFERROR(MATCH(G168&H168,ValVoorNamen&ValNamen,0),\"Fout\")+1)","v":3}]
[null,null,"2019-12-10","PALL Rweg",43809.614583333336,43809.979166666664,"Naoufel","van de Velde ","",{"$f":"IF(C169=\"\",\"\",INDEX(Validatie!$Q$2:$Q$6,MATCH(MOD(E169,1),Validatie!$P$2:$P$6,1)))","v":"Laat"},"-","Naoufel van de Velde ",{"$f":"IF(C169=\"\",\"\",IFERROR(MATCH(G169&H169,ValVoorNamen&ValNamen,0),\"Fout\")+1)","v":73}]
[null,null,"2019-12-10","PALL Rweg",43809.614583333336,43809.979166666664,"Niek","Smeets","",{"$f":"IF(C170=\"\",\"\",INDEX(Validatie!$Q$2:$Q$6,MATCH(MOD(E170,1),Validatie!$P$2:$P$6,1)))","v":"Laat"},"-","Niek Smeets",{"$f":"IF(C170=\"\",\"\",IFERROR(MATCH(G170&H170,ValVoorNamen&ValNamen,0),\"Fout\")+1)","v":75}]
[null,null,"2019-12-10","PALL Rweg",43809.614583333336,43809.979166666664,"Jarek","Kuipers","",{"$f":"IF(C171=\"\",\"\",INDEX(Validatie!$Q$2:$Q$6,MATCH(MOD(E171,1),Validatie!$P$2:$P$6,1)))","v":"Laat"},"-","Jarek Kuipers",{"$f":"IF(C171=\"\",\"\",IFERROR(MATCH(G171&H171,ValVoorNamen&ValNamen,0),\"Fout\")+1)","v":54}]
[null,null,"2019-12-10","PALL Rweg",43809.614583333336,43809.979166666664,"Martijn","de Ruiter","",{"$f":"IF(C172=\"\",\"\",INDEX(Validatie!$Q$2:$Q$6,MATCH(MOD(E172,1),Validatie!$P$2:$P$6,1)))","v":"Laat"},"-","Martijn de Ruiter",{"$f":"IF(C172=\"\",\"\",IFERROR(MATCH(G172&H172,ValVoorNamen&ValNamen,0),\"Fout\")+1)","v":66}]
[null,null,"2019-12-10","PALL Rweg",43809.614583333336,43809.979166666664,"Mark","Vink","",{"$f":"IF(C173=\"\",\"\",INDEX(Validatie!$Q$2:$Q$6,MATCH(MOD(E173,1),Validatie!$P$2:$P$6,1)))","v":"Laat"},"-","Mark Vink",{"$f":"IF(C173=\"\",\"\",IFERROR(MATCH(G173&H173,ValVoorNamen&ValNamen,0),\"Fout\")+1)","v":65}]
[null,null,"2019-12-10","PALL Rweg",43809.614583333336,43809.979166666664,"Abdiqadir","de Jong","",{"$f":"IF(C174=\"\",\"\",INDEX(Validatie!$Q$2:$Q$6,MATCH(MOD(E174,1),Validatie!$P$2:$P$6,1)))","v":"Laat"},"-","Abdiqadir de Jong",{"$f":"IF(C174=\"\",\"\",IFERROR(MATCH(G174&H174,ValVoorNamen&ValNamen,0),\"Fout\")+1)","v":2}]
[null,null,"2019-12-10","PALL Rweg",43809.614583333336,43809.979166666664,"Nexhmedi","Willemsen","",{"$f":"IF(C175=\"\",\"\",INDEX(Validatie!$Q$2:$Q$6,MATCH(MOD(E175,1),Validatie!$P$2:$P$6,1)))","v":"Laat"},"-","Nexhmedi Willemsen",{"$f":"IF(C175=\"\",\"\",IFERROR(MATCH(G175&H175,ValVoorNamen&ValNamen,0),\"Fout\")+1)","v":74}]
[null,null,"2019-12-10","SCHM",43809.614583333336,43809.979166666664,"Erik","de Haan","V",{"$f":"IF(C176=\"\",\"\",INDEX(Validatie!$Q$2:$Q$6,MATCH(MOD(E176,1),Validatie!$P$2:$P$6,1)))","v":"Laat"},"SCHM","Erik de Haan",{"$f":"IF(C176=\"\",\"\",IFERROR(MATCH(G176&H176,ValVoorNamen&ValNamen,0),\"Fout\")+1)","v":30}]
[null,null,"2019-12-10","SCHM",43809.614583333336,43809.979166666664,"Patrick","Bosch","",{"$f":"IF(C177=\"\",\"\",INDEX(Validatie!$Q$2:$Q$6,MATCH(MOD(E177,1),Validatie!$P$2:$P$6,1)))","v":"Laat"},"SCHM","Patrick Bosch",{"$f":"IF(C177=\"\",\"\",IFERROR(MATCH(G177&H177,ValVoorNamen&ValNamen,0),\"Fout\")+1)","v":78}]
[null,null,"2019-12-10","SCHM",43809.614583333336,43809.979166666664,"Rolinka","van den Bosch","",{"$f":"IF(C178=\"\",\"\",INDEX(Validatie!$Q$2:$Q$6,MATCH(MOD(E178,1),Validatie!$P$2:$P$6,1)))","v":"Laat"},"SCHM","Rolinka van den Bosch",{"$f":"IF(C178=\"\",\"\",IFERROR(MATCH(G178&H178,ValVoorNamen&ValNamen,0),\"Fout\")+1)","v":89}]
[null,null,"2019-12-10","SCHM AFV",43809.614583333336,43809.979166666664,"Miquel","van Loon","",{"$f":"IF(C179=\"\",\"\",INDEX(Validatie!$Q$2:$Q$6,MATCH(MOD(E179,1),Validatie!$P$2:$P$6,1)))","v":"Laat"},"AFV","Miquel van Loon",{"$f":"IF(C179=\"\",\"\",IFERROR(MATCH(G179&H179,ValVoorNamen&ValNamen,0),\"Fout\")+1)","v":71}]
[null,null,"2019-12-10","SCHM AFV",43809.614583333336,43809.979166666664,"Paul","van Dongen","",{"$f":"IF(C180=\"\",\"\",INDEX(Validatie!$Q$2:$Q$6,MATCH(MOD(E180,1),Validatie!$P$2:$P$6,1)))","v":"Laat"},"AFV","Paul van Dongen",{"$f":"IF(C180=\"\",\"\",IFERROR(MATCH(G180&H180,ValVoorNamen&ValNamen,0),\"Fout\")+1)","v":79}]
[null,null,"2019-12-10","SCHM AFV",43809.614583333336,43809.979166666664,"Sebastiaan","Mol","",{"$f":"IF(C181=\"\",\"\",INDEX(Validatie!$Q$2:$Q$6,MATCH(MOD(E181,1),Validatie!$P$2:$P$6,1)))","v":"Laat"},"AFV","Sebastiaan Mol",{"$f":"IF(C181=\"\",\"\",IFERROR(MATCH(G181&H181,ValVoorNamen&ValNamen,0),\"Fout\")+1)","v":96}]
[null,null,"2019-12-10","SCHM AFV",43809.614583333336,43809.979166666664,"Baki","Bos","",{"$f":"IF(C182=\"\",\"\",INDEX(Validatie!$Q$2:$Q$6,MATCH(MOD(E182,1),Validatie!$P$2:$P$6,1)))","v":"Laat"},"AFV","Baki Bos",{"$f":"IF(C182=\"\",\"\",IFERROR(MATCH(G182&H182,ValVoorNamen&ValNamen,0),\"Fout\")+1)","v":15}]
[null,null,"2019-12-10","SCHM AFV",43809.614583333336,43809.979166666664,"Ilker","Peeters","",{"$f":"IF(C183=\"\",\"\",INDEX(Validatie!$Q$2:$Q$6,MATCH(MOD(E183,1),Validatie!$P$2:$P$6,1)))","v":"Laat"},"AFV","Ilker Peeters",{"$f":"IF(C183=\"\",\"\",IFERROR(MATCH(G183&H183,ValVoorNamen&ValNamen,0),\"Fout\")+1)","v":52}]
[null,null,"2019-12-10","TRSP",43809.614583333336,43809.979166666664,"Emsud","Kok","",{"$f":"IF(C184=\"\",\"\",INDEX(Validatie!$Q$2:$Q$6,MATCH(MOD(E184,1),Validatie!$P$2:$P$6,1)))","v":"Laat"},"?","Emsud Kok",{"$f":"IF(C184=\"\",\"\",IFERROR(MATCH(G184&H184,ValVoorNamen&ValNamen,0),\"Fout\")+1)","v":28}]
[null,null,"2019-12-10","TRSP",43809.614583333336,43809.979166666664,"Reinder","Koning","",{"$f":"IF(C185=\"\",\"\",INDEX(Validatie!$Q$2:$Q$6,MATCH(MOD(E185,1),Validatie!$P$2:$P$6,1)))","v":"Laat"},"?","Reinder Koning",{"$f":"IF(C185=\"\",\"\",IFERROR(MATCH(G185&H185,ValVoorNamen&ValNamen,0),\"Fout\")+1)","v":83}]
[null,null,"2019-12-10","PALL Rweg",43809.645833333336,43809.979166666664,"Amanuel","Janssen","",{"$f":"IF(C186=\"\",\"\",INDEX(Validatie!$Q$2:$Q$6,MATCH(MOD(E186,1),Validatie!$P$2:$P$6,1)))","v":"Laat"},"-","Amanuel Janssen",{"$f":"IF(C186=\"\",\"\",IFERROR(MATCH(G186&H186,ValVoorNamen&ValNamen,0),\"Fout\")+1)","v":8}]
[null,null,"2019-12-10","Reserve middag",43809.666666666664,43809.979166666664,"Haben","Willems","",{"$f":"IF(C187=\"\",\"\",INDEX(Validatie!$Q$2:$Q$6,MATCH(MOD(E187,1),Validatie!$P$2:$P$6,1)))","v":"Laat"},"-","Haben Willems",{"$f":"IF(C187=\"\",\"\",IFERROR(MATCH(G187&H187,ValVoorNamen&ValNamen,0),\"Fout\")+1)","v":40}]
[null,null,"2019-12-10","Reserve middag",43809.666666666664,43809.979166666664,"Bereket","Peters","",{"$f":"IF(C188=\"\",\"\",INDEX(Validatie!$Q$2:$Q$6,MATCH(MOD(E188,1),Validatie!$P$2:$P$6,1)))","v":"Laat"},"-","Bereket Peters",{"$f":"IF(C188=\"\",\"\",IFERROR(MATCH(G188&H188,ValVoorNamen&ValNamen,0),\"Fout\")+1)","v":17}]
[null,null,"2019-12-10","Reserve middag",43809.666666666664,43809.979166666664,"Gebrehiwet","Schouten","",{"$f":"IF(C189=\"\",\"\",INDEX(Validatie!$Q$2:$Q$6,MATCH(MOD(E189,1),Validatie!$P$2:$P$6,1)))","v":"Laat"},"-","Gebrehiwet Schouten",{"$f":"IF(C189=\"\",\"\",IFERROR(MATCH(G189&H189,ValVoorNamen&ValNamen,0),\"Fout\")+1)","v":38}]
[null,null,"2019-12-10","Reserve middag",43809.666666666664,43809.979166666664,"Robel","Hermans","",{"$f":"IF(C190=\"\",\"\",INDEX(Validatie!$Q$2:$Q$6,MATCH(MOD(E190,1),Validatie!$P$2:$P$6,1)))","v":"Laat"},"-","Robel Hermans",{"$f":"IF(C190=\"\",\"\",IFERROR(MATCH(G190&H190,ValVoorNamen&ValNamen,0),\"Fout\")+1)","v":87}]
[null,null,"2019-12-10","SCHM HAS",43809.697916666664,43809.9375,"Norbert","de Lange","",{"$f":"IF(C191=\"\",\"\",INDEX(Validatie!$Q$2:$Q$6,MATCH(MOD(E191,1),Validatie!$P$2:$P$6,1)))","v":"Laat"},"HAS","Norbert de Lange",{"$f":"IF(C191=\"\",\"\",IFERROR(MATCH(G191&H191,ValVoorNamen&ValNamen,0),\"Fout\")+1)","v":76}]
[null,null,"2019-12-10","SCHM",43809.916666666664,43810.28125,"Rachid","van der Laan","",{"$f":"IF(C192=\"\",\"\",INDEX(Validatie!$Q$2:$Q$6,MATCH(MOD(E192,1),Validatie!$P$2:$P$6,1)))","v":"Nacht"},"SCHM","Rachid van der Laan",{"$f":"IF(C192=\"\",\"\",IFERROR(MATCH(G192&H192,ValVoorNamen&ValNamen,0),\"Fout\")+1)","v":82}]
[null,null,"2019-12-10","SCHM",43809.916666666664,43810.28125,"Evans","Vermeulen","",{"$f":"IF(C193=\"\",\"\",INDEX(Validatie!$Q$2:$Q$6,MATCH(MOD(E193,1),Validatie!$P$2:$P$6,1)))","v":"Nacht"},"SCHM","Evans Vermeulen",{"$f":"IF(C193=\"\",\"\",IFERROR(MATCH(G193&H193,ValVoorNamen&ValNamen,0),\"Fout\")+1)","v":31}]
[null,null,"2019-12-10","SCHM",43809.916666666664,43810.28125,"Kevin","Veenstra","",{"$f":"IF(C194=\"\",\"\",INDEX(Validatie!$Q$2:$Q$6,MATCH(MOD(E194,1),Validatie!$P$2:$P$6,1)))","v":"Nacht"},"SCHM","Kevin Veenstra",{"$f":"IF(C194=\"\",\"\",IFERROR(MATCH(G194&H194,ValVoorNamen&ValNamen,0),\"Fout\")+1)","v":58}]
[null,null,"2019-12-11","ABB ochtend ",43810.25,43810.614583333336,"Trienko","Spooren","",{"$f":"IF(C195=\"\",\"\",INDEX(Validatie!$Q$2:$Q$6,MATCH(MOD(E195,1),Validatie!$P$2:$P$6,1)))","v":"Vroeg"},"ABB","Trienko Spooren",{"$f":"IF(C195=\"\",\"\",IFERROR(MATCH(G195&H195,ValVoorNamen&ValNamen,0),\"Fout\")+1)","v":103}]
[null,null,"2019-12-11","AFV HAS",43810.25,43810.40625,"Paul","van Dongen","",{"$f":"IF(C196=\"\",\"\",INDEX(Validatie!$Q$2:$Q$6,MATCH(MOD(E196,1),Validatie!$P$2:$P$6,1)))","v":"Vroeg"},"HAS","Paul van Dongen",{"$f":"IF(C196=\"\",\"\",IFERROR(MATCH(G196&H196,ValVoorNamen&ValNamen,0),\"Fout\")+1)","v":79}]
[null,null,"2019-12-11","AFV MEP",43810.25,43810.614583333336,"Rudolf","Hofman","",{"$f":"IF(C197=\"\",\"\",INDEX(Validatie!$Q$2:$Q$6,MATCH(MOD(E197,1),Validatie!$P$2:$P$6,1)))","v":"Vroeg"},"MEP","Rudolf Hofman",{"$f":"IF(C197=\"\",\"\",IFERROR(MATCH(G197&H197,ValVoorNamen&ValNamen,0),\"Fout\")+1)","v":91}]
[null,null,"2019-12-11","LCR ochtend",43810.25,43810.614583333336,"Sami","van der Horst",{"$f":"IF(H198=\"\",\"\",IF(SUMPRODUCT(--(ValVerlofVoornaam=G198),--(ValVerlofNaam=H198),--(ValVerlofVan<=C198),--(ValVerlofTot>=C198)*(1))>0,\"V\",\"\"))","v":""},{"$f":"IF(C198=\"\",\"\",INDEX(Validatie!$Q$2:$Q$6,MATCH(MOD(E198,1),Validatie!$P$2:$P$6,1)))","v":"Vroeg"},{"$f":"IF(C198=\"\",\"\",IFERROR(VLOOKUP(D198,DataMijnAfdeling,2,0),\"?\"))","v":"LCR"},"Sami van der Horst",{"$f":"IF(C198=\"\",\"\",IFERROR(MATCH(G198&H198,ValVoorNamen&ValNamen,0),\"Fout\")+1)","v":95}]
[null,null,"2019-12-11","LCR ochtend",43810.25,43810.614583333336,"Wolter","De bolder","",{"$f":"IF(C199=\"\",\"\",INDEX(Validatie!$Q$2:$Q$6,MATCH(MOD(E199,1),Validatie!$P$2:$P$6,1)))","v":"Vroeg"},"LCR",{"$f":"IF(C199=\"\",\"\",CONCATENATE(G199,\" \",H199))","v":"Wolter De bolder"},{"$f":"IF(C199=\"\",\"\",IFERROR(MATCH(G199&H199,ValVoorNamen&ValNamen,0),\"Fout\")+1)","v":107}]
[null,null,"2019-12-11","PALL HAS",43810.25,43810.614583333336,"Henk","Koster","",{"$f":"IF(C200=\"\",\"\",INDEX(Validatie!$Q$2:$Q$6,MATCH(MOD(E200,1),Validatie!$P$2:$P$6,1)))","v":"Vroeg"},"-","Henk Koster",{"$f":"IF(C200=\"\",\"\",IFERROR(MATCH(G200&H200,ValVoorNamen&ValNamen,0),\"Fout\")+1)","v":46}]
[null,null,"2019-12-11","PALL MEP",43810.25,43810.614583333336,"Wenaron","Kurkema","",{"$f":"IF(C201=\"\",\"\",INDEX(Validatie!$Q$2:$Q$6,MATCH(MOD(E201,1),Validatie!$P$2:$P$6,1)))","v":"Vroeg"},"-","Wenaron Kurkema",{"$f":"IF(C201=\"\",\"\",IFERROR(MATCH(G201&H201,ValVoorNamen&ValNamen,0),\"Fout\")+1)","v":105}]
[null,null,"2019-12-11","PALL MEP",43810.25,43810.614583333336,"Salahadin","Wolters","",{"$f":"IF(C202=\"\",\"\",INDEX(Validatie!$Q$2:$Q$6,MATCH(MOD(E202,1),Validatie!$P$2:$P$6,1)))","v":"Vroeg"},"-","Salahadin Wolters",{"$f":"IF(C202=\"\",\"\",IFERROR(MATCH(G202&H202,ValVoorNamen&ValNamen,0),\"Fout\")+1)","v":93}]
[null,null,"2019-12-11","PALL MEP",43810.25,43810.614583333336,"Dikkie","van der Meer","",{"$f":"IF(C203=\"\",\"\",INDEX(Validatie!$Q$2:$Q$6,MATCH(MOD(E203,1),Validatie!$P$2:$P$6,1)))","v":"Vroeg"},"-","Dikkie van der Meer",{"$f":"IF(C203=\"\",\"\",IFERROR(MATCH(G203&H203,ValVoorNamen&ValNamen,0),\"Fout\")+1)","v":26}]
[null,null,"2019-12-11","PALL MEP",43810.25,43810.614583333336,"Rene","van der Velden","",{"$f":"IF(C204=\"\",\"\",INDEX(Validatie!$Q$2:$Q$6,MATCH(MOD(E204,1),Validatie!$P$2:$P$6,1)))","v":"Vroeg"},"-","Rene van der Velden",{"$f":"IF(C204=\"\",\"\",IFERROR(MATCH(G204&H204,ValVoorNamen&ValNamen,0),\"Fout\")+1)","v":84}]
[null,null,"2019-12-11","PALL MEP",43810.25,43810.614583333336,"Richard","Driessen","",{"$f":"IF(C205=\"\",\"\",INDEX(Validatie!$Q$2:$Q$6,MATCH(MOD(E205,1),Validatie!$P$2:$P$6,1)))","v":"Vroeg"},"-","Richard Driessen",{"$f":"IF(C205=\"\",\"\",IFERROR(MATCH(G205&H205,ValVoorNamen&ValNamen,0),\"Fout\")+1)","v":85}]
[null,null,"2019-12-11","PALL Rweg",43810.25,43810.614583333336,"Felicia","van den Broek","",{"$f":"IF(C206=\"\",\"\",INDEX(Validatie!$Q$2:$Q$6,MATCH(MOD(E206,1),Validatie!$P$2:$P$6,1)))","v":"Vroeg"},"-","Felicia van den Broek",{"$f":"IF(C206=\"\",\"\",IFERROR(MATCH(G206&H206,ValVoorNamen&ValNamen,0),\"Fout\")+1)","v":34}]
[null,null,"2019-12-11","PALL Rweg",43810.25,43810.614583333336,"Elroy","van der Linden","",{"$f":"IF(C207=\"\",\"\",INDEX(Validatie!$Q$2:$Q$6,MATCH(MOD(E207,1),Validatie!$P$2:$P$6,1)))","v":"Vroeg"},"-","Elroy van der Linden",{"$f":"IF(C207=\"\",\"\",IFERROR(MATCH(G207&H207,ValVoorNamen&ValNamen,0),\"Fout\")+1)","v":27}]
[null,null,"2019-12-11","PALL Rweg",43810.25,43810.614583333336,"Arsenio","Mulder","",{"$f":"IF(C208=\"\",\"\",INDEX(Validatie!$Q$2:$Q$6,MATCH(MOD(E208,1),Validatie!$P$2:$P$6,1)))","v":"Vroeg"},"-","Arsenio Mulder",{"$f":"IF(C208=\"\",\"\",IFERROR(MATCH(G208&H208,ValVoorNamen&ValNamen,0),\"Fout\")+1)","v":13}]
[null,null,"2019-12-11","PALL Rweg",43810.25,43810.614583333336,"Viorel","Triest","",{"$f":"IF(C209=\"\",\"\",INDEX(Validatie!$Q$2:$Q$6,MATCH(MOD(E209,1),Validatie!$P$2:$P$6,1)))","v":"Vroeg"},"-","Viorel Triest",{"$f":"IF(C209=\"\",\"\",IFERROR(MATCH(G209&H209,ValVoorNamen&ValNamen,0),\"Fout\")+1)","v":104}]
[null,null,"2019-12-11","PALL Rweg",43810.25,43810.614583333336,"Olcay","de Vos","",{"$f":"IF(C210=\"\",\"\",INDEX(Validatie!$Q$2:$Q$6,MATCH(MOD(E210,1),Validatie!$P$2:$P$6,1)))","v":"Vroeg"},"-","Olcay de Vos",{"$f":"IF(C210=\"\",\"\",IFERROR(MATCH(G210&H210,ValVoorNamen&ValNamen,0),\"Fout\")+1)","v":77}]
[null,null,"2019-12-11","PALL Rweg",43810.25,43810.614583333336,"Sebastiaan","Mol","",{"$f":"IF(C211=\"\",\"\",INDEX(Validatie!$Q$2:$Q$6,MATCH(MOD(E211,1),Validatie!$P$2:$P$6,1)))","v":"Vroeg"},"-","Sebastiaan Mol",{"$f":"IF(C211=\"\",\"\",IFERROR(MATCH(G211&H211,ValVoorNamen&ValNamen,0),\"Fout\")+1)","v":96}]
[null,null,"2019-12-11","PALL Rweg",43810.25,43810.614583333336,"Amadou","Bakker","",{"$f":"IF(C212=\"\",\"\",INDEX(Validatie!$Q$2:$Q$6,MATCH(MOD(E212,1),Validatie!$P$2:$P$6,1)))","v":"Vroeg"},"-","Amadou Bakker",{"$f":"IF(C212=\"\",\"\",IFERROR(MATCH(G212&H212,ValVoorNamen&ValNamen,0),\"Fout\")+1)","v":7}]
[null,null,"2019-12-11","PALL Rweg",43810.25,43810.614583333336,"Wout","Van Goud","",{"$f":"IF(C213=\"\",\"\",INDEX(Validatie!$Q$2:$Q$6,MATCH(MOD(E213,1),Validatie!$P$2:$P$6,1)))","v":"Vroeg"},"-","Wout Van Goud",{"$f":"IF(C213=\"\",\"\",IFERROR(MATCH(G213&H213,ValVoorNamen&ValNamen,0),\"Fout\")+1)","v":108}]
[null,null,"2019-12-11","PALL Rweg",43810.25,43810.614583333336,"Magdalena","Postma","",{"$f":"IF(C214=\"\",\"\",INDEX(Validatie!$Q$2:$Q$6,MATCH(MOD(E214,1),Validatie!$P$2:$P$6,1)))","v":"Vroeg"},"-","Magdalena Postma",{"$f":"IF(C214=\"\",\"\",IFERROR(MATCH(G214&H214,ValVoorNamen&ValNamen,0),\"Fout\")+1)","v":63}]
[null,null,"2019-12-11","PALL Rweg",43810.25,43810.614583333336,"Charles","Dekker","",{"$f":"IF(C215=\"\",\"\",INDEX(Validatie!$Q$2:$Q$6,MATCH(MOD(E215,1),Validatie!$P$2:$P$6,1)))","v":"Vroeg"},"-","Charles Dekker",{"$f":"IF(C215=\"\",\"\",IFERROR(MATCH(G215&H215,ValVoorNamen&ValNamen,0),\"Fout\")+1)","v":20}]
[null,null,"2019-12-11","PALL Rweg",43810.25,43810.614583333336,"Ko","van de Brink","",{"$f":"IF(C216=\"\",\"\",INDEX(Validatie!$Q$2:$Q$6,MATCH(MOD(E216,1),Validatie!$P$2:$P$6,1)))","v":"Vroeg"},"-","Ko van de Brink",{"$f":"IF(C216=\"\",\"\",IFERROR(MATCH(G216&H216,ValVoorNamen&ValNamen,0),\"Fout\")+1)","v":60}]
[null,null,"2019-12-11","PALL Rweg",43810.25,43810.614583333336,"Robin","Evers","",{"$f":"IF(C217=\"\",\"\",INDEX(Validatie!$Q$2:$Q$6,MATCH(MOD(E217,1),Validatie!$P$2:$P$6,1)))","v":"Vroeg"},"-","Robin Evers",{"$f":"IF(C217=\"\",\"\",IFERROR(MATCH(G217&H217,ValVoorNamen&ValNamen,0),\"Fout\")+1)","v":88}]
[null,null,"2019-12-11","PALL Rweg",43810.25,43810.614583333336,"Gerrit","van Beek","",{"$f":"IF(C218=\"\",\"\",INDEX(Validatie!$Q$2:$Q$6,MATCH(MOD(E218,1),Validatie!$P$2:$P$6,1)))","v":"Vroeg"},"-","Gerrit van Beek",{"$f":"IF(C218=\"\",\"\",IFERROR(MATCH(G218&H218,ValVoorNamen&ValNamen,0),\"Fout\")+1)","v":39}]
[null,null,"2019-12-11","PALL Rweg",43810.25,43810.614583333336,"Everon","van den Heuvel","",{"$f":"IF(C219=\"\",\"\",INDEX(Validatie!$Q$2:$Q$6,MATCH(MOD(E219,1),Validatie!$P$2:$P$6,1)))","v":"Vroeg"},"-","Everon van den Heuvel",{"$f":"IF(C219=\"\",\"\",IFERROR(MATCH(G219&H219,ValVoorNamen&ValNamen,0),\"Fout\")+1)","v":32}]
[null,null,"2019-12-11","PALL Rweg",43810.25,43810.614583333336,"Davood","Smits","",{"$f":"IF(C220=\"\",\"\",INDEX(Validatie!$Q$2:$Q$6,MATCH(MOD(E220,1),Validatie!$P$2:$P$6,1)))","v":"Vroeg"},"-","Davood Smits",{"$f":"IF(C220=\"\",\"\",IFERROR(MATCH(G220&H220,ValVoorNamen&ValNamen,0),\"Fout\")+1)","v":24}]
[null,null,"2019-12-11","PALL Rweg",43810.25,43810.614583333336,"Swen","de Leeuw","",{"$f":"IF(C221=\"\",\"\",INDEX(Validatie!$Q$2:$Q$6,MATCH(MOD(E221,1),Validatie!$P$2:$P$6,1)))","v":"Vroeg"},"-","Swen de Leeuw",{"$f":"IF(C221=\"\",\"\",IFERROR(MATCH(G221&H221,ValVoorNamen&ValNamen,0),\"Fout\")+1)","v":100}]
[null,null,"2019-12-11","PALL Rweg",43810.25,43810.614583333336,"Saidou","Bosman","",{"$f":"IF(C222=\"\",\"\",INDEX(Validatie!$Q$2:$Q$6,MATCH(MOD(E222,1),Validatie!$P$2:$P$6,1)))","v":"Vroeg"},"-","Saidou Bosman",{"$f":"IF(C222=\"\",\"\",IFERROR(MATCH(G222&H222,ValVoorNamen&ValNamen,0),\"Fout\")+1)","v":92}]
[null,null,"2019-12-11","PALL Rweg",43810.25,43810.614583333336,"Wim","Vogel","",{"$f":"IF(C223=\"\",\"\",INDEX(Validatie!$Q$2:$Q$6,MATCH(MOD(E223,1),Validatie!$P$2:$P$6,1)))","v":"Vroeg"},"-","Wim Vogel",{"$f":"IF(C223=\"\",\"\",IFERROR(MATCH(G223&H223,ValVoorNamen&ValNamen,0),\"Fout\")+1)","v":106}]
[null,null,"2019-12-11","PALL Rweg",43810.25,43810.614583333336,"Quincy","de Koning","",{"$f":"IF(C224=\"\",\"\",INDEX(Validatie!$Q$2:$Q$6,MATCH(MOD(E224,1),Validatie!$P$2:$P$6,1)))","v":"Vroeg"},"-","Quincy de Koning",{"$f":"IF(C224=\"\",\"\",IFERROR(MATCH(G224&H224,ValVoorNamen&ValNamen,0),\"Fout\")+1)","v":81}]
[null,null,"2019-12-11","PALL Rweg",43810.25,43810.614583333336,"Daniel","Dijkstra","",{"$f":"IF(C225=\"\",\"\",INDEX(Validatie!$Q$2:$Q$6,MATCH(MOD(E225,1),Validatie!$P$2:$P$6,1)))","v":"Vroeg"},"-","Daniel Dijkstra",{"$f":"IF(C225=\"\",\"\",IFERROR(MATCH(G225&H225,ValVoorNamen&ValNamen,0),\"Fout\")+1)","v":23}]
[null,null,"2019-12-11","PALL Rweg",43810.25,43810.614583333336,"Henk","Koster","",{"$f":"IF(C226=\"\",\"\",INDEX(Validatie!$Q$2:$Q$6,MATCH(MOD(E226,1),Validatie!$P$2:$P$6,1)))","v":"Vroeg"},"-","Henk Koster",{"$f":"IF(C226=\"\",\"\",IFERROR(MATCH(G226&H226,ValVoorNamen&ValNamen,0),\"Fout\")+1)","v":46}]
[null,null,"2019-12-11","Reserve ochtend",43810.25,43810.614583333336,"Shawn","Molenaar","",{"$f":"IF(C227=\"\",\"\",INDEX(Validatie!$Q$2:$Q$6,MATCH(MOD(E227,1),Validatie!$P$2:$P$6,1)))","v":"Vroeg"},"-","Shawn Molenaar",{"$f":"IF(C227=\"\",\"\",IFERROR(MATCH(G227&H227,ValVoorNamen&ValNamen,0),\"Fout\")+1)","v":98}]
[null,null,"2019-12-11","Reserve ochtend",43810.25,43810.614583333336,"Fars","van de Veen","",{"$f":"IF(C228=\"\",\"\",INDEX(Validatie!$Q$2:$Q$6,MATCH(MOD(E228,1),Validatie!$P$2:$P$6,1)))","v":"Vroeg"},"-","Fars van de Veen",{"$f":"IF(C228=\"\",\"\",IFERROR(MATCH(G228&H228,ValVoorNamen&ValNamen,0),\"Fout\")+1)","v":33}]
[null,null,"2019-12-11","Reserve ochtend",43810.25,43810.614583333336,"Mebrathu","Timmermans","",{"$f":"IF(C229=\"\",\"\",INDEX(Validatie!$Q$2:$Q$6,MATCH(MOD(E229,1),Validatie!$P$2:$P$6,1)))","v":"Vroeg"},"-","Mebrathu Timmermans",{"$f":"IF(C229=\"\",\"\",IFERROR(MATCH(G229&H229,ValVoorNamen&ValNamen,0),\"Fout\")+1)","v":67}]
[null,null,"2019-12-11","SCHM",43810.25,43810.614583333336,"Marjolein","Martens","",{"$f":"IF(C230=\"\",\"\",INDEX(Validatie!$Q$2:$Q$6,MATCH(MOD(E230,1),Validatie!$P$2:$P$6,1)))","v":"Vroeg"},"SCHM","Marjolein Martens",{"$f":"IF(C230=\"\",\"\",IFERROR(MATCH(G230&H230,ValVoorNamen&ValNamen,0),\"Fout\")+1)","v":64}]
[null,null,"2019-12-11","SCHM",43810.25,43810.614583333336,"Piet","Schipper","",{"$f":"IF(C231=\"\",\"\",INDEX(Validatie!$Q$2:$Q$6,MATCH(MOD(E231,1),Validatie!$P$2:$P$6,1)))","v":"Vroeg"},"SCHM","Piet Schipper",{"$f":"IF(C231=\"\",\"\",IFERROR(MATCH(G231&H231,ValVoorNamen&ValNamen,0),\"Fout\")+1)","v":80}]
[null,null,"2019-12-11","SCHM",43810.25,43810.614583333336,"Roy","van der Meulen","",{"$f":"IF(C232=\"\",\"\",INDEX(Validatie!$Q$2:$Q$6,MATCH(MOD(E232,1),Validatie!$P$2:$P$6,1)))","v":"Vroeg"},"SCHM","Roy van der Meulen",{"$f":"IF(C232=\"\",\"\",IFERROR(MATCH(G232&H232,ValVoorNamen&ValNamen,0),\"Fout\")+1)","v":90}]
[null,null,"2019-12-11","SCHM AFV",43810.25,43810.614583333336,"Christiaan","de Wit","",{"$f":"IF(C233=\"\",\"\",INDEX(Validatie!$Q$2:$Q$6,MATCH(MOD(E233,1),Validatie!$P$2:$P$6,1)))","v":"Vroeg"},"AFV","Christiaan de Wit",{"$f":"IF(C233=\"\",\"\",IFERROR(MATCH(G233&H233,ValVoorNamen&ValNamen,0),\"Fout\")+1)","v":22}]
[null,null,"2019-12-11","SCHM AFV",43810.25,43810.614583333336,"Henri","van Dam","",{"$f":"IF(C234=\"\",\"\",INDEX(Validatie!$Q$2:$Q$6,MATCH(MOD(E234,1),Validatie!$P$2:$P$6,1)))","v":"Vroeg"},"AFV","Henri van Dam",{"$f":"IF(C234=\"\",\"\",IFERROR(MATCH(G234&H234,ValVoorNamen&ValNamen,0),\"Fout\")+1)","v":47}]
[null,null,"2019-12-11","SCHM AFV",43810.25,43810.614583333336,"Jan","de Jonge","",{"$f":"IF(C235=\"\",\"\",INDEX(Validatie!$Q$2:$Q$6,MATCH(MOD(E235,1),Validatie!$P$2:$P$6,1)))","v":"Vroeg"},"AFV","Jan de Jonge",{"$f":"IF(C235=\"\",\"\",IFERROR(MATCH(G235&H235,ValVoorNamen&ValNamen,0),\"Fout\")+1)","v":53}]
[null,null,"2019-12-11","SCHM AFV",43810.25,43810.614583333336,"Boyan","van Leeuwen","",{"$f":"IF(C236=\"\",\"\",INDEX(Validatie!$Q$2:$Q$6,MATCH(MOD(E236,1),Validatie!$P$2:$P$6,1)))","v":"Vroeg"},"AFV","Boyan van Leeuwen",{"$f":"IF(C236=\"\",\"\",IFERROR(MATCH(G236&H236,ValVoorNamen&ValNamen,0),\"Fout\")+1)","v":19}]
[null,null,"2019-12-11","SCHM AFV",43810.25,43810.614583333336,"Michel","Jonker","",{"$f":"IF(C237=\"\",\"\",INDEX(Validatie!$Q$2:$Q$6,MATCH(MOD(E237,1),Validatie!$P$2:$P$6,1)))","v":"Vroeg"},"AFV","Michel Jonker",{"$f":"IF(C237=\"\",\"\",IFERROR(MATCH(G237&H237,ValVoorNamen&ValNamen,0),\"Fout\")+1)","v":70}]
[null,null,"2019-12-11","TRSP",43810.25,43810.614583333336,"Anton","Smit","",{"$f":"IF(C238=\"\",\"\",INDEX(Validatie!$Q$2:$Q$6,MATCH(MOD(E238,1),Validatie!$P$2:$P$6,1)))","v":"Vroeg"},"?","Anton Smit",{"$f":"IF(C238=\"\",\"\",IFERROR(MATCH(G238&H238,ValVoorNamen&ValNamen,0),\"Fout\")+1)","v":10}]
[null,null,"2019-12-11","TRSP",43810.25,43810.614583333336,"Henk","Koster","",{"$f":"IF(C239=\"\",\"\",INDEX(Validatie!$Q$2:$Q$6,MATCH(MOD(E239,1),Validatie!$P$2:$P$6,1)))","v":"Vroeg"},"?","Henk Koster",{"$f":"IF(C239=\"\",\"\",IFERROR(MATCH(G239&H239,ValVoorNamen&ValNamen,0),\"Fout\")+1)","v":46}]
[null,null,"2019-12-11","AFV MEP",43810.291666666664,43810.65625,"Rijk","van Doorn","",{"$f":"IF(C240=\"\",\"\",INDEX(Validatie!$Q$2:$Q$6,MATCH(MOD(E240,1),Validatie!$P$2:$P$6,1)))","v":"Vroeg"},"MEP","Rijk van Doorn",{"$f":"IF(C240=\"\",\"\",IFERROR(MATCH(G240&H240,ValVoorNamen&ValNamen,0),\"Fout\")+1)","v":86}]
[null,null,"2019-12-11","Teamleider PALL",43810.3125,43810.677083333336,"Hilko","Prins","",{"$f":"IF(C241=\"\",\"\",INDEX(Validatie!$Q$2:$Q$6,MATCH(MOD(E241,1),Validatie!$P$2:$P$6,1)))","v":"Vroeg"},"?","Hilko Prins",{"$f":"IF(C241=\"\",\"\",IFERROR(MATCH(G241&H241,ValVoorNamen&ValNamen,0),\"Fout\")+1)","v":49}]
[null,null,"2019-12-11","TRSP",43810.333333333336,43810.697916666664,"Harrie","Hoekstra","",{"$f":"IF(C242=\"\",\"\",INDEX(Validatie!$Q$2:$Q$6,MATCH(MOD(E242,1),Validatie!$P$2:$P$6,1)))","v":"Vroeg"},"?","Harrie Hoekstra",{"$f":"IF(C242=\"\",\"\",IFERROR(MATCH(G242&H242,ValVoorNamen&ValNamen,0),\"Fout\")+1)","v":43}]
[null,null,"2019-12-11","SCHM HAS",43810.40625,43810.614583333336,"Paul","van Dongen","",{"$f":"IF(C243=\"\",\"\",INDEX(Validatie!$Q$2:$Q$6,MATCH(MOD(E243,1),Validatie!$P$2:$P$6,1)))","v":"Vroeg"},"HAS","Paul van Dongen",{"$f":"IF(C243=\"\",\"\",IFERROR(MATCH(G243&H243,ValVoorNamen&ValNamen,0),\"Fout\")+1)","v":79}]
[null,null,"2019-12-11","ABB middag",43810.572916666664,43810.9375,"Bile","Hendriks","",{"$f":"IF(C244=\"\",\"\",INDEX(Validatie!$Q$2:$Q$6,MATCH(MOD(E244,1),Validatie!$P$2:$P$6,1)))","v":"Laat"},"ABB","Bile Hendriks",{"$f":"IF(C244=\"\",\"\",IFERROR(MATCH(G244&H244,ValVoorNamen&ValNamen,0),\"Fout\")+1)","v":18}]
[null,null,"2019-12-11","AFV HAS",43810.572916666664,43810.697916666664,"Norbert","de Lange","",{"$f":"IF(C245=\"\",\"\",INDEX(Validatie!$Q$2:$Q$6,MATCH(MOD(E245,1),Validatie!$P$2:$P$6,1)))","v":"Laat"},"HAS","Norbert de Lange",{"$f":"IF(C245=\"\",\"\",IFERROR(MATCH(G245&H245,ValVoorNamen&ValNamen,0),\"Fout\")+1)","v":76}]
[null,null,"2019-12-11","AFV MEP",43810.572916666664,43810.9375,"Houcin","Huisman","",{"$f":"IF(C246=\"\",\"\",INDEX(Validatie!$Q$2:$Q$6,MATCH(MOD(E246,1),Validatie!$P$2:$P$6,1)))","v":"Laat"},"MEP","Houcin Huisman",{"$f":"IF(C246=\"\",\"\",IFERROR(MATCH(G246&H246,ValVoorNamen&ValNamen,0),\"Fout\")+1)","v":51}]
[null,null,"2019-12-11","LCR middag",43810.572916666664,43810.9375,"Sebastiaan","Mol","",{"$f":"IF(C247=\"\",\"\",INDEX(Validatie!$Q$2:$Q$6,MATCH(MOD(E247,1),Validatie!$P$2:$P$6,1)))","v":"Laat"},"LCR","Sebastiaan Mol",{"$f":"IF(C247=\"\",\"\",IFERROR(MATCH(G247&H247,ValVoorNamen&ValNamen,0),\"Fout\")+1)","v":96}]
[null,null,"2019-12-11","PALL MEP",43810.614583333336,43810.979166666664,"Latie","van Wijk","",{"$f":"IF(C248=\"\",\"\",INDEX(Validatie!$Q$2:$Q$6,MATCH(MOD(E248,1),Validatie!$P$2:$P$6,1)))","v":"Laat"},"-","Latie van Wijk",{"$f":"IF(C248=\"\",\"\",IFERROR(MATCH(G248&H248,ValVoorNamen&ValNamen,0),\"Fout\")+1)","v":62}]
[null,null,"2019-12-11","PALL MEP",43810.614583333336,43810.979166666664,"Abdurahman Ibrahim","de Vries","",{"$f":"IF(C249=\"\",\"\",INDEX(Validatie!$Q$2:$Q$6,MATCH(MOD(E249,1),Validatie!$P$2:$P$6,1)))","v":"Laat"},"-","Abdurahman Ibrahim de Vries",{"$f":"IF(C249=\"\",\"\",IFERROR(MATCH(G249&H249,ValVoorNamen&ValNamen,0),\"Fout\")+1)","v":4}]
[null,null,"2019-12-11","PALL MEP",43810.614583333336,43810.979166666664,"Michael","Gerritsen","",{"$f":"IF(C250=\"\",\"\",INDEX(Validatie!$Q$2:$Q$6,MATCH(MOD(E250,1),Validatie!$P$2:$P$6,1)))","v":"Laat"},"-","Michael Gerritsen",{"$f":"IF(C250=\"\",\"\",IFERROR(MATCH(G250&H250,ValVoorNamen&ValNamen,0),\"Fout\")+1)","v":69}]
[null,null,"2019-12-11","PALL MEP",43810.614583333336,43810.979166666664,"Hans","van de Ven ","",{"$f":"IF(C251=\"\",\"\",INDEX(Validatie!$Q$2:$Q$6,MATCH(MOD(E251,1),Validatie!$P$2:$P$6,1)))","v":"Laat"},"-","Hans van de Ven ",{"$f":"IF(C251=\"\",\"\",IFERROR(MATCH(G251&H251,ValVoorNamen&ValNamen,0),\"Fout\")+1)","v":42}]
[null,null,"2019-12-11","PALL MEP",43810.614583333336,43810.979166666664,"Jeroen","Post","",{"$f":"IF(C252=\"\",\"\",INDEX(Validatie!$Q$2:$Q$6,MATCH(MOD(E252,1),Validatie!$P$2:$P$6,1)))","v":"Laat"},"-","Jeroen Post",{"$f":"IF(C252=\"\",\"\",IFERROR(MATCH(G252&H252,ValVoorNamen&ValNamen,0),\"Fout\")+1)","v":56}]
[null,null,"2019-12-11","PALL Rweg",43810.614583333336,43810.979166666664,"Akela","van Dijk","",{"$f":"IF(C253=\"\",\"\",INDEX(Validatie!$Q$2:$Q$6,MATCH(MOD(E253,1),Validatie!$P$2:$P$6,1)))","v":"Laat"},"-","Akela van Dijk",{"$f":"IF(C253=\"\",\"\",IFERROR(MATCH(G253&H253,ValVoorNamen&ValNamen,0),\"Fout\")+1)","v":6}]
[null,null,"2019-12-11","PALL Rweg",43810.614583333336,43810.979166666664,"Karrar","Kuiper","",{"$f":"IF(C254=\"\",\"\",INDEX(Validatie!$Q$2:$Q$6,MATCH(MOD(E254,1),Validatie!$P$2:$P$6,1)))","v":"Laat"},"-","Karrar Kuiper",{"$f":"IF(C254=\"\",\"\",IFERROR(MATCH(G254&H254,ValVoorNamen&ValNamen,0),\"Fout\")+1)","v":57}]
[null,null,"2019-12-11","PALL Rweg",43810.614583333336,43810.979166666664,"Sebastian","Kuijpers","",{"$f":"IF(C255=\"\",\"\",INDEX(Validatie!$Q$2:$Q$6,MATCH(MOD(E255,1),Validatie!$P$2:$P$6,1)))","v":"Laat"},"-","Sebastian Kuijpers",{"$f":"IF(C255=\"\",\"\",IFERROR(MATCH(G255&H255,ValVoorNamen&ValNamen,0),\"Fout\")+1)","v":97}]
[null,null,"2019-12-11","PALL Rweg",43810.614583333336,43810.979166666664,"Chevindio","Brouwer","",{"$f":"IF(C256=\"\",\"\",INDEX(Validatie!$Q$2:$Q$6,MATCH(MOD(E256,1),Validatie!$P$2:$P$6,1)))","v":"Laat"},"-","Chevindio Brouwer",{"$f":"IF(C256=\"\",\"\",IFERROR(MATCH(G256&H256,ValVoorNamen&ValNamen,0),\"Fout\")+1)","v":21}]
[null,null,"2019-12-11","PALL Rweg",43810.614583333336,43810.979166666664,"Harry","Maas","",{"$f":"IF(C257=\"\",\"\",INDEX(Validatie!$Q$2:$Q$6,MATCH(MOD(E257,1),Validatie!$P$2:$P$6,1)))","v":"Laat"},"-","Harry Maas",{"$f":"IF(C257=\"\",\"\",IFERROR(MATCH(G257&H257,ValVoorNamen&ValNamen,0),\"Fout\")+1)","v":44}]
[null,null,"2019-12-11","PALL Rweg",43810.614583333336,43810.979166666664,"Dennis","de Graaf","",{"$f":"IF(C258=\"\",\"\",INDEX(Validatie!$Q$2:$Q$6,MATCH(MOD(E258,1),Validatie!$P$2:$P$6,1)))","v":"Laat"},"-","Dennis de Graaf",{"$f":"IF(C258=\"\",\"\",IFERROR(MATCH(G258&H258,ValVoorNamen&ValNamen,0),\"Fout\")+1)","v":25}]
[null,null,"2019-12-11","PALL Rweg",43810.614583333336,43810.979166666664,"Jelte","van Veen","",{"$f":"IF(C259=\"\",\"\",INDEX(Validatie!$Q$2:$Q$6,MATCH(MOD(E259,1),Validatie!$P$2:$P$6,1)))","v":"Laat"},"-","Jelte van Veen",{"$f":"IF(C259=\"\",\"\",IFERROR(MATCH(G259&H259,ValVoorNamen&ValNamen,0),\"Fout\")+1)","v":55}]
[null,null,"2019-12-11","PALL Rweg",43810.614583333336,43810.979166666664,"Agathe","van de Berg ","",{"$f":"IF(C260=\"\",\"\",INDEX(Validatie!$Q$2:$Q$6,MATCH(MOD(E260,1),Validatie!$P$2:$P$6,1)))","v":"Laat"},"-","Agathe van de Berg ",{"$f":"IF(C260=\"\",\"\",IFERROR(MATCH(G260&H260,ValVoorNamen&ValNamen,0),\"Fout\")+1)","v":5}]
[null,null,"2019-12-11","PALL Rweg",43810.614583333336,43810.979166666664,"Amanuel","Janssen","",{"$f":"IF(C261=\"\",\"\",INDEX(Validatie!$Q$2:$Q$6,MATCH(MOD(E261,1),Validatie!$P$2:$P$6,1)))","v":"Laat"},"-","Amanuel Janssen",{"$f":"IF(C261=\"\",\"\",IFERROR(MATCH(G261&H261,ValVoorNamen&ValNamen,0),\"Fout\")+1)","v":8}]
[null,null,"2019-12-11","PALL Rweg",43810.614583333336,43810.979166666664,"Hassan","Verhoeven",{"$f":"IF(H262=\"\",\"\",IF(SUMPRODUCT(--(ValVerlofVoornaam=G262),--(ValVerlofNaam=H262),--(ValVerlofVan<=C262),--(ValVerlofTot>=C262)*(1))>0,\"V\",\"\"))","v":""},{"$f":"IF(C262=\"\",\"\",INDEX(Validatie!$Q$2:$Q$6,MATCH(MOD(E262,1),Validatie!$P$2:$P$6,1)))","v":"Laat"},{"$f":"IF(C262=\"\",\"\",IFERROR(VLOOKUP(D262,DataMijnAfdeling,2,0),\"?\"))","v":"-"},"Hassan Verhoeven",{"$f":"IF(C262=\"\",\"\",IFERROR(MATCH(G262&H262,ValVoorNamen&ValNamen,0),\"Fout\")+1)","v":45}]
[null,null,"2019-12-11","PALL Rweg",43810.614583333336,43810.979166666664,"Samantha","Sanders","",{"$f":"IF(C263=\"\",\"\",INDEX(Validatie!$Q$2:$Q$6,MATCH(MOD(E263,1),Validatie!$P$2:$P$6,1)))","v":"Laat"},"-",{"$f":"IF(C263=\"\",\"\",CONCATENATE(G263,\" \",H263))","v":"Samantha Sanders"},{"$f":"IF(C263=\"\",\"\",IFERROR(MATCH(G263&H263,ValVoorNamen&ValNamen,0),\"Fout\")+1)","v":94}]
[null,null,"2019-12-11","PALL Rweg",43810.614583333336,43810.979166666664,"Sied"," van der Pol","",{"$f":"IF(C264=\"\",\"\",INDEX(Validatie!$Q$2:$Q$6,MATCH(MOD(E264,1),Validatie!$P$2:$P$6,1)))","v":"Laat"},"-","Sied  van der Pol",{"$f":"IF(C264=\"\",\"\",IFERROR(MATCH(G264&H264,ValVoorNamen&ValNamen,0),\"Fout\")+1)","v":99}]
[null,null,"2019-12-11","PALL Rweg",43810.614583333336,43810.979166666664,"Ambroise","Visser","",{"$f":"IF(C265=\"\",\"\",INDEX(Validatie!$Q$2:$Q$6,MATCH(MOD(E265,1),Validatie!$P$2:$P$6,1)))","v":"Laat"},"-","Ambroise Visser",{"$f":"IF(C265=\"\",\"\",IFERROR(MATCH(G265&H265,ValVoorNamen&ValNamen,0),\"Fout\")+1)","v":9}]
[null,null,"2019-12-11","PALL Rweg",43810.614583333336,43810.979166666664,"Atobhran","de Groot","",{"$f":"IF(C266=\"\",\"\",INDEX(Validatie!$Q$2:$Q$6,MATCH(MOD(E266,1),Validatie!$P$2:$P$6,1)))","v":"Laat"},"-","Atobhran de Groot",{"$f":"IF(C266=\"\",\"\",IFERROR(MATCH(G266&H266,ValVoorNamen&ValNamen,0),\"Fout\")+1)","v":14}]
[null,null,"2019-12-11","PALL Rweg",43810.614583333336,43810.979166666664,"Abdul","Jansen","",{"$f":"IF(C267=\"\",\"\",INDEX(Validatie!$Q$2:$Q$6,MATCH(MOD(E267,1),Validatie!$P$2:$P$6,1)))","v":"Laat"},"-","Abdul Jansen",{"$f":"IF(C267=\"\",\"\",IFERROR(MATCH(G267&H267,ValVoorNamen&ValNamen,0),\"Fout\")+1)","v":3}]
[null,null,"2019-12-11","PALL Rweg",43810.614583333336,43810.979166666664,"Naoufel","van de Velde ","",{"$f":"IF(C268=\"\",\"\",INDEX(Validatie!$Q$2:$Q$6,MATCH(MOD(E268,1),Validatie!$P$2:$P$6,1)))","v":"Laat"},"-","Naoufel van de Velde ",{"$f":"IF(C268=\"\",\"\",IFERROR(MATCH(G268&H268,ValVoorNamen&ValNamen,0),\"Fout\")+1)","v":73}]
[null,null,"2019-12-11","PALL Rweg",43810.614583333336,43810.979166666664,"Niek","Smeets","",{"$f":"IF(C269=\"\",\"\",INDEX(Validatie!$Q$2:$Q$6,MATCH(MOD(E269,1),Validatie!$P$2:$P$6,1)))","v":"Laat"},"-","Niek Smeets",{"$f":"IF(C269=\"\",\"\",IFERROR(MATCH(G269&H269,ValVoorNamen&ValNamen,0),\"Fout\")+1)","v":75}]
[null,null,"2019-12-11","PALL Rweg",43810.614583333336,43810.979166666664,"Jarek","Kuipers","",{"$f":"IF(C270=\"\",\"\",INDEX(Validatie!$Q$2:$Q$6,MATCH(MOD(E270,1),Validatie!$P$2:$P$6,1)))","v":"Laat"},"-","Jarek Kuipers",{"$f":"IF(C270=\"\",\"\",IFERROR(MATCH(G270&H270,ValVoorNamen&ValNamen,0),\"Fout\")+1)","v":54}]
[null,null,"2019-12-11","PALL Rweg",43810.614583333336,43810.979166666664,"Martijn","de Ruiter","",{"$f":"IF(C271=\"\",\"\",INDEX(Validatie!$Q$2:$Q$6,MATCH(MOD(E271,1),Validatie!$P$2:$P$6,1)))","v":"Laat"},"-","Martijn de Ruiter",{"$f":"IF(C271=\"\",\"\",IFERROR(MATCH(G271&H271,ValVoorNamen&ValNamen,0),\"Fout\")+1)","v":66}]
[null,null,"2019-12-11","PALL Rweg",43810.614583333336,43810.979166666664,"Mark","Vink","",{"$f":"IF(C272=\"\",\"\",INDEX(Validatie!$Q$2:$Q$6,MATCH(MOD(E272,1),Validatie!$P$2:$P$6,1)))","v":"Laat"},"-","Mark Vink",{"$f":"IF(C272=\"\",\"\",IFERROR(MATCH(G272&H272,ValVoorNamen&ValNamen,0),\"Fout\")+1)","v":65}]
[null,null,"2019-12-11","PALL Rweg",43810.614583333336,43810.979166666664,"Abdiqadir","de Jong","",{"$f":"IF(C273=\"\",\"\",INDEX(Validatie!$Q$2:$Q$6,MATCH(MOD(E273,1),Validatie!$P$2:$P$6,1)))","v":"Laat"},"-","Abdiqadir de Jong",{"$f":"IF(C273=\"\",\"\",IFERROR(MATCH(G273&H273,ValVoorNamen&ValNamen,0),\"Fout\")+1)","v":2}]
[null,null,"2019-12-11","PALL Rweg",43810.614583333336,43810.979166666664,"Nexhmedi","Willemsen","",{"$f":"IF(C274=\"\",\"\",INDEX(Validatie!$Q$2:$Q$6,MATCH(MOD(E274,1),Validatie!$P$2:$P$6,1)))","v":"Laat"},"-","Nexhmedi Willemsen",{"$f":"IF(C274=\"\",\"\",IFERROR(MATCH(G274&H274,ValVoorNamen&ValNamen,0),\"Fout\")+1)","v":74}]
[null,null,"2019-12-11","Reserve middag",43810.614583333336,43810.979166666664,"Tomas","Koolen","",{"$f":"IF(C275=\"\",\"\",INDEX(Validatie!$Q$2:$Q$6,MATCH(MOD(E275,1),Validatie!$P$2:$P$6,1)))","v":"Laat"},"-","Tomas Koolen",{"$f":"IF(C275=\"\",\"\",IFERROR(MATCH(G275&H275,ValVoorNamen&ValNamen,0),\"Fout\")+1)","v":102}]
[null,null,"2019-12-11","Reserve middag",43810.614583333336,43810.979166666664,"Heruy","van de Wal ","",{"$f":"IF(C276=\"\",\"\",INDEX(Validatie!$Q$2:$Q$6,MATCH(MOD(E276,1),Validatie!$P$2:$P$6,1)))","v":"Laat"},"-","Heruy van de Wal ",{"$f":"IF(C276=\"\",\"\",IFERROR(MATCH(G276&H276,ValVoorNamen&ValNamen,0),\"Fout\")+1)","v":48}]
[null,null,"2019-12-11","Reserve middag",43810.614583333336,43810.979166666664,"Tesfaldet","Verbeek","",{"$f":"IF(C277=\"\",\"\",INDEX(Validatie!$Q$2:$Q$6,MATCH(MOD(E277,1),Validatie!$P$2:$P$6,1)))","v":"Laat"},"-","Tesfaldet Verbeek",{"$f":"IF(C277=\"\",\"\",IFERROR(MATCH(G277&H277,ValVoorNamen&ValNamen,0),\"Fout\")+1)","v":101}]
[null,null,"2019-12-11","Reserve middag",43810.614583333336,43810.979166666664,"Laszlo","Scholten","",{"$f":"IF(C278=\"\",\"\",INDEX(Validatie!$Q$2:$Q$6,MATCH(MOD(E278,1),Validatie!$P$2:$P$6,1)))","v":"Laat"},"-","Laszlo Scholten",{"$f":"IF(C278=\"\",\"\",IFERROR(MATCH(G278&H278,ValVoorNamen&ValNamen,0),\"Fout\")+1)","v":61}]
[null,null,"2019-12-11","Reserve middag",43810.614583333336,43810.979166666664,"Gebrehiwet","Schouten","",{"$f":"IF(C279=\"\",\"\",INDEX(Validatie!$Q$2:$Q$6,MATCH(MOD(E279,1),Validatie!$P$2:$P$6,1)))","v":"Laat"},"-","Gebrehiwet Schouten",{"$f":"IF(C279=\"\",\"\",IFERROR(MATCH(G279&H279,ValVoorNamen&ValNamen,0),\"Fout\")+1)","v":38}]
[null,null,"2019-12-11","SCHM",43810.614583333336,43810.979166666664,"Erik","de Haan","",{"$f":"IF(C280=\"\",\"\",INDEX(Validatie!$Q$2:$Q$6,MATCH(MOD(E280,1),Validatie!$P$2:$P$6,1)))","v":"Laat"},"SCHM","Erik de Haan",{"$f":"IF(C280=\"\",\"\",IFERROR(MATCH(G280&H280,ValVoorNamen&ValNamen,0),\"Fout\")+1)","v":30}]
[null,null,"2019-12-11","SCHM",43810.614583333336,43810.979166666664,"Patrick","Bosch","",{"$f":"IF(C281=\"\",\"\",INDEX(Validatie!$Q$2:$Q$6,MATCH(MOD(E281,1),Validatie!$P$2:$P$6,1)))","v":"Laat"},"SCHM","Patrick Bosch",{"$f":"IF(C281=\"\",\"\",IFERROR(MATCH(G281&H281,ValVoorNamen&ValNamen,0),\"Fout\")+1)","v":78}]
[null,null,"2019-12-11","SCHM",43810.614583333336,43810.979166666664,"Rolinka","van den Bosch","",{"$f":"IF(C282=\"\",\"\",INDEX(Validatie!$Q$2:$Q$6,MATCH(MOD(E282,1),Validatie!$P$2:$P$6,1)))","v":"Laat"},"SCHM","Rolinka van den Bosch",{"$f":"IF(C282=\"\",\"\",IFERROR(MATCH(G282&H282,ValVoorNamen&ValNamen,0),\"Fout\")+1)","v":89}]
[null,null,"2019-12-11","SCHM AFV",43810.614583333336,43810.979166666664,"Paul","van Dongen","",{"$f":"IF(C283=\"\",\"\",INDEX(Validatie!$Q$2:$Q$6,MATCH(MOD(E283,1),Validatie!$P$2:$P$6,1)))","v":"Laat"},"AFV","Paul van Dongen",{"$f":"IF(C283=\"\",\"\",IFERROR(MATCH(G283&H283,ValVoorNamen&ValNamen,0),\"Fout\")+1)","v":79}]
[null,null,"2019-12-11","SCHM AFV",43810.614583333336,43810.979166666664,"Baki","Bos","",{"$f":"IF(C284=\"\",\"\",INDEX(Validatie!$Q$2:$Q$6,MATCH(MOD(E284,1),Validatie!$P$2:$P$6,1)))","v":"Laat"},"AFV","Baki Bos",{"$f":"IF(C284=\"\",\"\",IFERROR(MATCH(G284&H284,ValVoorNamen&ValNamen,0),\"Fout\")+1)","v":15}]
[null,null,"2019-12-11","SCHM AFV",43810.614583333336,43810.979166666664,"Ilker","Peeters","",{"$f":"IF(C285=\"\",\"\",INDEX(Validatie!$Q$2:$Q$6,MATCH(MOD(E285,1),Validatie!$P$2:$P$6,1)))","v":"Laat"},"AFV","Ilker Peeters",{"$f":"IF(C285=\"\",\"\",IFERROR(MATCH(G285&H285,ValVoorNamen&ValNamen,0),\"Fout\")+1)","v":52}]
[null,null,"2019-12-11","SCHM AFV",43810.614583333336,43810.979166666664,"Flavi","van der Heyden","",{"$f":"IF(C286=\"\",\"\",INDEX(Validatie!$Q$2:$Q$6,MATCH(MOD(E286,1),Validatie!$P$2:$P$6,1)))","v":"Laat"},"AFV","Flavi van der Heyden",{"$f":"IF(C286=\"\",\"\",IFERROR(MATCH(G286&H286,ValVoorNamen&ValNamen,0),\"Fout\")+1)","v":37}]
[null,null,"2019-12-11","TRSP",43810.614583333336,43810.979166666664,"Emsud","Kok","",{"$f":"IF(C287=\"\",\"\",INDEX(Validatie!$Q$2:$Q$6,MATCH(MOD(E287,1),Validatie!$P$2:$P$6,1)))","v":"Laat"},"?","Emsud Kok",{"$f":"IF(C287=\"\",\"\",IFERROR(MATCH(G287&H287,ValVoorNamen&ValNamen,0),\"Fout\")+1)","v":28}]
[null,null,"2019-12-11","TRSP",43810.614583333336,43810.979166666664,"Reinder","Koning","",{"$f":"IF(C288=\"\",\"\",INDEX(Validatie!$Q$2:$Q$6,MATCH(MOD(E288,1),Validatie!$P$2:$P$6,1)))","v":"Laat"},"?","Reinder Koning",{"$f":"IF(C288=\"\",\"\",IFERROR(MATCH(G288&H288,ValVoorNamen&ValNamen,0),\"Fout\")+1)","v":83}]
[null,null,"2019-12-11","SCHM HAS",43810.697916666664,43810.9375,"Norbert","de Lange","",{"$f":"IF(C289=\"\",\"\",INDEX(Validatie!$Q$2:$Q$6,MATCH(MOD(E289,1),Validatie!$P$2:$P$6,1)))","v":"Laat"},"HAS","Norbert de Lange",{"$f":"IF(C289=\"\",\"\",IFERROR(MATCH(G289&H289,ValVoorNamen&ValNamen,0),\"Fout\")+1)","v":76}]
[null,null,"2019-12-11","SCHM",43810.916666666664,43811.28125,"Rachid","van der Laan","",{"$f":"IF(C290=\"\",\"\",INDEX(Validatie!$Q$2:$Q$6,MATCH(MOD(E290,1),Validatie!$P$2:$P$6,1)))","v":"Nacht"},"SCHM","Rachid van der Laan",{"$f":"IF(C290=\"\",\"\",IFERROR(MATCH(G290&H290,ValVoorNamen&ValNamen,0),\"Fout\")+1)","v":82}]
[null,null,"2019-12-11","SCHM",43810.916666666664,43811.28125,"Evans","Vermeulen","",{"$f":"IF(C291=\"\",\"\",INDEX(Validatie!$Q$2:$Q$6,MATCH(MOD(E291,1),Validatie!$P$2:$P$6,1)))","v":"Nacht"},"SCHM","Evans Vermeulen",{"$f":"IF(C291=\"\",\"\",IFERROR(MATCH(G291&H291,ValVoorNamen&ValNamen,0),\"Fout\")+1)","v":31}]
[null,null,"2019-12-11","SCHM",43810.916666666664,43811.28125,"Kevin","Veenstra","",{"$f":"IF(C292=\"\",\"\",INDEX(Validatie!$Q$2:$Q$6,MATCH(MOD(E292,1),Validatie!$P$2:$P$6,1)))","v":"Nacht"},"SCHM","Kevin Veenstra",{"$f":"IF(C292=\"\",\"\",IFERROR(MATCH(G292&H292,ValVoorNamen&ValNamen,0),\"Fout\")+1)","v":58}]
[null,null,"2019-12-12","ABB ochtend ",43811.25,43811.614583333336,"Trienko","Spooren","",{"$f":"IF(C293=\"\",\"\",INDEX(Validatie!$Q$2:$Q$6,MATCH(MOD(E293,1),Validatie!$P$2:$P$6,1)))","v":"Vroeg"},"ABB","Trienko Spooren",{"$f":"IF(C293=\"\",\"\",IFERROR(MATCH(G293&H293,ValVoorNamen&ValNamen,0),\"Fout\")+1)","v":103}]
[null,null,"2019-12-12","AFV HAS",43811.25,43811.40625,"Paul","van Dongen","",{"$f":"IF(C294=\"\",\"\",INDEX(Validatie!$Q$2:$Q$6,MATCH(MOD(E294,1),Validatie!$P$2:$P$6,1)))","v":"Vroeg"},"HAS","Paul van Dongen",{"$f":"IF(C294=\"\",\"\",IFERROR(MATCH(G294&H294,ValVoorNamen&ValNamen,0),\"Fout\")+1)","v":79}]
[null,null,"2019-12-12","AFV MEP",43811.25,43811.614583333336,"Rudolf","Hofman","",{"$f":"IF(C295=\"\",\"\",INDEX(Validatie!$Q$2:$Q$6,MATCH(MOD(E295,1),Validatie!$P$2:$P$6,1)))","v":"Vroeg"},"MEP","Rudolf Hofman",{"$f":"IF(C295=\"\",\"\",IFERROR(MATCH(G295&H295,ValVoorNamen&ValNamen,0),\"Fout\")+1)","v":91}]
[null,null,"2019-12-12","LCR ochtend",43811.25,43811.614583333336,"Sami","van der Horst","",{"$f":"IF(C296=\"\",\"\",INDEX(Validatie!$Q$2:$Q$6,MATCH(MOD(E296,1),Validatie!$P$2:$P$6,1)))","v":"Vroeg"},"LCR","Sami van der Horst",{"$f":"IF(C296=\"\",\"\",IFERROR(MATCH(G296&H296,ValVoorNamen&ValNamen,0),\"Fout\")+1)","v":95}]
[null,null,"2019-12-12","PALL HAS",43811.25,43811.614583333336,"Henk","Koster","",{"$f":"IF(C297=\"\",\"\",INDEX(Validatie!$Q$2:$Q$6,MATCH(MOD(E297,1),Validatie!$P$2:$P$6,1)))","v":"Vroeg"},"-","Henk Koster",{"$f":"IF(C297=\"\",\"\",IFERROR(MATCH(G297&H297,ValVoorNamen&ValNamen,0),\"Fout\")+1)","v":46}]
[null,null,"2019-12-12","PALL MEP",43811.25,43811.614583333336,"Wenaron","Kurkema","",{"$f":"IF(C298=\"\",\"\",INDEX(Validatie!$Q$2:$Q$6,MATCH(MOD(E298,1),Validatie!$P$2:$P$6,1)))","v":"Vroeg"},"-","Wenaron Kurkema",{"$f":"IF(C298=\"\",\"\",IFERROR(MATCH(G298&H298,ValVoorNamen&ValNamen,0),\"Fout\")+1)","v":105}]
[null,null,"2019-12-12","PALL MEP",43811.25,43811.614583333336,"Salahadin","Wolters","",{"$f":"IF(C299=\"\",\"\",INDEX(Validatie!$Q$2:$Q$6,MATCH(MOD(E299,1),Validatie!$P$2:$P$6,1)))","v":"Vroeg"},"-","Salahadin Wolters",{"$f":"IF(C299=\"\",\"\",IFERROR(MATCH(G299&H299,ValVoorNamen&ValNamen,0),\"Fout\")+1)","v":93}]
[null,null,"2019-12-12","PALL MEP",43811.25,43811.614583333336,"Dikkie","van der Meer","",{"$f":"IF(C300=\"\",\"\",INDEX(Validatie!$Q$2:$Q$6,MATCH(MOD(E300,1),Validatie!$P$2:$P$6,1)))","v":"Vroeg"},"-","Dikkie van der Meer",{"$f":"IF(C300=\"\",\"\",IFERROR(MATCH(G300&H300,ValVoorNamen&ValNamen,0),\"Fout\")+1)","v":26}]
[null,null,"2019-12-12","PALL MEP",43811.25,43811.614583333336,"Rene","van der Velden","",{"$f":"IF(C301=\"\",\"\",INDEX(Validatie!$Q$2:$Q$6,MATCH(MOD(E301,1),Validatie!$P$2:$P$6,1)))","v":"Vroeg"},"-","Rene van der Velden",{"$f":"IF(C301=\"\",\"\",IFERROR(MATCH(G301&H301,ValVoorNamen&ValNamen,0),\"Fout\")+1)","v":84}]
[null,null,"2019-12-12","PALL MEP",43811.25,43811.614583333336,"Richard","Driessen","",{"$f":"IF(C302=\"\",\"\",INDEX(Validatie!$Q$2:$Q$6,MATCH(MOD(E302,1),Validatie!$P$2:$P$6,1)))","v":"Vroeg"},"-","Richard Driessen",{"$f":"IF(C302=\"\",\"\",IFERROR(MATCH(G302&H302,ValVoorNamen&ValNamen,0),\"Fout\")+1)","v":85}]
[null,null,"2019-12-12","PALL Rweg",43811.25,43811.614583333336,"Elroy","van der Linden","",{"$f":"IF(C303=\"\",\"\",INDEX(Validatie!$Q$2:$Q$6,MATCH(MOD(E303,1),Validatie!$P$2:$P$6,1)))","v":"Vroeg"},"-","Elroy van der Linden",{"$f":"IF(C303=\"\",\"\",IFERROR(MATCH(G303&H303,ValVoorNamen&ValNamen,0),\"Fout\")+1)","v":27}]
[null,null,"2019-12-12","PALL Rweg",43811.25,43811.614583333336,"Arsenio","Mulder","",{"$f":"IF(C304=\"\",\"\",INDEX(Validatie!$Q$2:$Q$6,MATCH(MOD(E304,1),Validatie!$P$2:$P$6,1)))","v":"Vroeg"},"-","Arsenio Mulder",{"$f":"IF(C304=\"\",\"\",IFERROR(MATCH(G304&H304,ValVoorNamen&ValNamen,0),\"Fout\")+1)","v":13}]
[null,null,"2019-12-12","PALL Rweg",43811.25,43811.614583333336,"Viorel","Triest","",{"$f":"IF(C305=\"\",\"\",INDEX(Validatie!$Q$2:$Q$6,MATCH(MOD(E305,1),Validatie!$P$2:$P$6,1)))","v":"Vroeg"},"-","Viorel Triest",{"$f":"IF(C305=\"\",\"\",IFERROR(MATCH(G305&H305,ValVoorNamen&ValNamen,0),\"Fout\")+1)","v":104}]
[null,null,"2019-12-12","PALL Rweg",43811.25,43811.614583333336,"Olcay","de Vos","",{"$f":"IF(C306=\"\",\"\",INDEX(Validatie!$Q$2:$Q$6,MATCH(MOD(E306,1),Validatie!$P$2:$P$6,1)))","v":"Vroeg"},"-","Olcay de Vos",{"$f":"IF(C306=\"\",\"\",IFERROR(MATCH(G306&H306,ValVoorNamen&ValNamen,0),\"Fout\")+1)","v":77}]
[null,null,"2019-12-12","PALL Rweg",43811.25,43811.614583333336,"Sebastiaan","Mol","",{"$f":"IF(C307=\"\",\"\",INDEX(Validatie!$Q$2:$Q$6,MATCH(MOD(E307,1),Validatie!$P$2:$P$6,1)))","v":"Vroeg"},"-","Sebastiaan Mol",{"$f":"IF(C307=\"\",\"\",IFERROR(MATCH(G307&H307,ValVoorNamen&ValNamen,0),\"Fout\")+1)","v":96}]
[null,null,"2019-12-12","PALL Rweg",43811.25,43811.614583333336,"Amadou","Bakker","",{"$f":"IF(C308=\"\",\"\",INDEX(Validatie!$Q$2:$Q$6,MATCH(MOD(E308,1),Validatie!$P$2:$P$6,1)))","v":"Vroeg"},"-","Amadou Bakker",{"$f":"IF(C308=\"\",\"\",IFERROR(MATCH(G308&H308,ValVoorNamen&ValNamen,0),\"Fout\")+1)","v":7}]
[null,null,"2019-12-12","PALL Rweg",43811.25,43811.614583333336,"Wout","Van Goud","",{"$f":"IF(C309=\"\",\"\",INDEX(Validatie!$Q$2:$Q$6,MATCH(MOD(E309,1),Validatie!$P$2:$P$6,1)))","v":"Vroeg"},"-","Wout Van Goud",{"$f":"IF(C309=\"\",\"\",IFERROR(MATCH(G309&H309,ValVoorNamen&ValNamen,0),\"Fout\")+1)","v":108}]
[null,null,"2019-12-12","PALL Rweg",43811.25,43811.614583333336,"Fars","van de Veen","",{"$f":"IF(C310=\"\",\"\",INDEX(Validatie!$Q$2:$Q$6,MATCH(MOD(E310,1),Validatie!$P$2:$P$6,1)))","v":"Vroeg"},"-","Fars van de Veen",{"$f":"IF(C310=\"\",\"\",IFERROR(MATCH(G310&H310,ValVoorNamen&ValNamen,0),\"Fout\")+1)","v":33}]
[null,null,"2019-12-12","PALL Rweg",43811.25,43811.614583333336,"Magdalena","Postma","",{"$f":"IF(C311=\"\",\"\",INDEX(Validatie!$Q$2:$Q$6,MATCH(MOD(E311,1),Validatie!$P$2:$P$6,1)))","v":"Vroeg"},"-","Magdalena Postma",{"$f":"IF(C311=\"\",\"\",IFERROR(MATCH(G311&H311,ValVoorNamen&ValNamen,0),\"Fout\")+1)","v":63}]
[null,null,"2019-12-12","PALL Rweg",43811.25,43811.614583333336,"Charles","Dekker","",{"$f":"IF(C312=\"\",\"\",INDEX(Validatie!$Q$2:$Q$6,MATCH(MOD(E312,1),Validatie!$P$2:$P$6,1)))","v":"Vroeg"},"-","Charles Dekker",{"$f":"IF(C312=\"\",\"\",IFERROR(MATCH(G312&H312,ValVoorNamen&ValNamen,0),\"Fout\")+1)","v":20}]
[null,null,"2019-12-12","PALL Rweg",43811.25,43811.614583333336,"Ko","van de Brink","",{"$f":"IF(C313=\"\",\"\",INDEX(Validatie!$Q$2:$Q$6,MATCH(MOD(E313,1),Validatie!$P$2:$P$6,1)))","v":"Vroeg"},"-","Ko van de Brink",{"$f":"IF(C313=\"\",\"\",IFERROR(MATCH(G313&H313,ValVoorNamen&ValNamen,0),\"Fout\")+1)","v":60}]
[null,null,"2019-12-12","PALL Rweg",43811.25,43811.614583333336,"Robin","Evers","",{"$f":"IF(C314=\"\",\"\",INDEX(Validatie!$Q$2:$Q$6,MATCH(MOD(E314,1),Validatie!$P$2:$P$6,1)))","v":"Vroeg"},"-","Robin Evers",{"$f":"IF(C314=\"\",\"\",IFERROR(MATCH(G314&H314,ValVoorNamen&ValNamen,0),\"Fout\")+1)","v":88}]
[null,null,"2019-12-12","PALL Rweg",43811.25,43811.614583333336,"Gerrit","van Beek","",{"$f":"IF(C315=\"\",\"\",INDEX(Validatie!$Q$2:$Q$6,MATCH(MOD(E315,1),Validatie!$P$2:$P$6,1)))","v":"Vroeg"},"-","Gerrit van Beek",{"$f":"IF(C315=\"\",\"\",IFERROR(MATCH(G315&H315,ValVoorNamen&ValNamen,0),\"Fout\")+1)","v":39}]
[null,null,"2019-12-12","PALL Rweg",43811.25,43811.614583333336,"Everon","van den Heuvel","",{"$f":"IF(C316=\"\",\"\",INDEX(Validatie!$Q$2:$Q$6,MATCH(MOD(E316,1),Validatie!$P$2:$P$6,1)))","v":"Vroeg"},"-","Everon van den Heuvel",{"$f":"IF(C316=\"\",\"\",IFERROR(MATCH(G316&H316,ValVoorNamen&ValNamen,0),\"Fout\")+1)","v":32}]
[null,null,"2019-12-12","PALL Rweg",43811.25,43811.614583333336,"Davood","Smits","",{"$f":"IF(C317=\"\",\"\",INDEX(Validatie!$Q$2:$Q$6,MATCH(MOD(E317,1),Validatie!$P$2:$P$6,1)))","v":"Vroeg"},"-","Davood Smits",{"$f":"IF(C317=\"\",\"\",IFERROR(MATCH(G317&H317,ValVoorNamen&ValNamen,0),\"Fout\")+1)","v":24}]
[null,null,"2019-12-12","PALL Rweg",43811.25,43811.614583333336,"Swen","de Leeuw","",{"$f":"IF(C318=\"\",\"\",INDEX(Validatie!$Q$2:$Q$6,MATCH(MOD(E318,1),Validatie!$P$2:$P$6,1)))","v":"Vroeg"},"-","Swen de Leeuw",{"$f":"IF(C318=\"\",\"\",IFERROR(MATCH(G318&H318,ValVoorNamen&ValNamen,0),\"Fout\")+1)","v":100}]
[null,null,"2019-12-12","PALL Rweg",43811.25,43811.614583333336,"Saidou","Bosman","",{"$f":"IF(C319=\"\",\"\",INDEX(Validatie!$Q$2:$Q$6,MATCH(MOD(E319,1),Validatie!$P$2:$P$6,1)))","v":"Vroeg"},"-","Saidou Bosman",{"$f":"IF(C319=\"\",\"\",IFERROR(MATCH(G319&H319,ValVoorNamen&ValNamen,0),\"Fout\")+1)","v":92}]
[null,null,"2019-12-12","PALL Rweg",43811.25,43811.614583333336,"Wim","Vogel","",{"$f":"IF(C320=\"\",\"\",INDEX(Validatie!$Q$2:$Q$6,MATCH(MOD(E320,1),Validatie!$P$2:$P$6,1)))","v":"Vroeg"},"-","Wim Vogel",{"$f":"IF(C320=\"\",\"\",IFERROR(MATCH(G320&H320,ValVoorNamen&ValNamen,0),\"Fout\")+1)","v":106}]
[null,null,"2019-12-12","PALL Rweg",43811.25,43811.614583333336,"Quincy","de Koning","",{"$f":"IF(C321=\"\",\"\",INDEX(Validatie!$Q$2:$Q$6,MATCH(MOD(E321,1),Validatie!$P$2:$P$6,1)))","v":"Vroeg"},"-","Quincy de Koning",{"$f":"IF(C321=\"\",\"\",IFERROR(MATCH(G321&H321,ValVoorNamen&ValNamen,0),\"Fout\")+1)","v":81}]
[null,null,"2019-12-12","PALL Rweg",43811.25,43811.614583333336,"Daniel","Dijkstra","",{"$f":"IF(C322=\"\",\"\",INDEX(Validatie!$Q$2:$Q$6,MATCH(MOD(E322,1),Validatie!$P$2:$P$6,1)))","v":"Vroeg"},"-","Daniel Dijkstra",{"$f":"IF(C322=\"\",\"\",IFERROR(MATCH(G322&H322,ValVoorNamen&ValNamen,0),\"Fout\")+1)","v":23}]
[null,null,"2019-12-12","PALL Rweg",43811.25,43811.614583333336,"Henk","Koster","",{"$f":"IF(C323=\"\",\"\",INDEX(Validatie!$Q$2:$Q$6,MATCH(MOD(E323,1),Validatie!$P$2:$P$6,1)))","v":"Vroeg"},"-","Henk Koster",{"$f":"IF(C323=\"\",\"\",IFERROR(MATCH(G323&H323,ValVoorNamen&ValNamen,0),\"Fout\")+1)","v":46}]
[null,null,"2019-12-12","SCHM",43811.25,43811.614583333336,"Marjolein","Martens","",{"$f":"IF(C324=\"\",\"\",INDEX(Validatie!$Q$2:$Q$6,MATCH(MOD(E324,1),Validatie!$P$2:$P$6,1)))","v":"Vroeg"},"SCHM","Marjolein Martens",{"$f":"IF(C324=\"\",\"\",IFERROR(MATCH(G324&H324,ValVoorNamen&ValNamen,0),\"Fout\")+1)","v":64}]
[null,null,"2019-12-12","SCHM",43811.25,43811.614583333336,"Piet","Schipper","",{"$f":"IF(C325=\"\",\"\",INDEX(Validatie!$Q$2:$Q$6,MATCH(MOD(E325,1),Validatie!$P$2:$P$6,1)))","v":"Vroeg"},"SCHM","Piet Schipper",{"$f":"IF(C325=\"\",\"\",IFERROR(MATCH(G325&H325,ValVoorNamen&ValNamen,0),\"Fout\")+1)","v":80}]
[null,null,"2019-12-12","SCHM",43811.25,43811.614583333336,"Roy","van der Meulen",{"$f":"IF(H326=\"\",\"\",IF(SUMPRODUCT(--(ValVerlofVoornaam=G326),--(ValVerlofNaam=H326),--(ValVerlofVan<=C326),--(ValVerlofTot>=C326)*(1))>0,\"V\",\"\"))","v":""},{"$f":"IF(C326=\"\",\"\",INDEX(Validatie!$Q$2:$Q$6,MATCH(MOD(E326,1),Validatie!$P$2:$P$6,1)))","v":"Vroeg"},{"$f":"IF(C326=\"\",\"\",IFERROR(VLOOKUP(D326,DataMijnAfdeling,2,0),\"?\"))","v":"SCHM"},"Roy van der Meulen",{"$f":"IF(C326=\"\",\"\",IFERROR(MATCH(G326&H326,ValVoorNamen&ValNamen,0),\"Fout\")+1)","v":90}]
[null,null,"2019-12-12","SCHM AFV",43811.25,43811.614583333336,"Christiaan","de Wit","",{"$f":"IF(C327=\"\",\"\",INDEX(Validatie!$Q$2:$Q$6,MATCH(MOD(E327,1),Validatie!$P$2:$P$6,1)))","v":"Vroeg"},"AFV",{"$f":"IF(C327=\"\",\"\",CONCATENATE(G327,\" \",H327))","v":"Christiaan de Wit"},{"$f":"IF(C327=\"\",\"\",IFERROR(MATCH(G327&H327,ValVoorNamen&ValNamen,0),\"Fout\")+1)","v":22}]
[null,null,"2019-12-12","SCHM AFV",43811.25,43811.614583333336,"Henri","van Dam","",{"$f":"IF(C328=\"\",\"\",INDEX(Validatie!$Q$2:$Q$6,MATCH(MOD(E328,1),Validatie!$P$2:$P$6,1)))","v":"Vroeg"},"AFV","Henri van Dam",{"$f":"IF(C328=\"\",\"\",IFERROR(MATCH(G328&H328,ValVoorNamen&ValNamen,0),\"Fout\")+1)","v":47}]
[null,null,"2019-12-12","SCHM AFV",43811.25,43811.614583333336,"Jan","de Jonge","",{"$f":"IF(C329=\"\",\"\",INDEX(Validatie!$Q$2:$Q$6,MATCH(MOD(E329,1),Validatie!$P$2:$P$6,1)))","v":"Vroeg"},"AFV","Jan de Jonge",{"$f":"IF(C329=\"\",\"\",IFERROR(MATCH(G329&H329,ValVoorNamen&ValNamen,0),\"Fout\")+1)","v":53}]
[null,null,"2019-12-12","SCHM AFV",43811.25,43811.614583333336,"Boyan","van Leeuwen","",{"$f":"IF(C330=\"\",\"\",INDEX(Validatie!$Q$2:$Q$6,MATCH(MOD(E330,1),Validatie!$P$2:$P$6,1)))","v":"Vroeg"},"AFV","Boyan van Leeuwen",{"$f":"IF(C330=\"\",\"\",IFERROR(MATCH(G330&H330,ValVoorNamen&ValNamen,0),\"Fout\")+1)","v":19}]
[null,null,"2019-12-12","SCHM AFV",43811.25,43811.614583333336,"Michel","Jonker","",{"$f":"IF(C331=\"\",\"\",INDEX(Validatie!$Q$2:$Q$6,MATCH(MOD(E331,1),Validatie!$P$2:$P$6,1)))","v":"Vroeg"},"AFV","Michel Jonker",{"$f":"IF(C331=\"\",\"\",IFERROR(MATCH(G331&H331,ValVoorNamen&ValNamen,0),\"Fout\")+1)","v":70}]
[null,null,"2019-12-12","TRSP",43811.25,43811.614583333336,"Anton","Smit","",{"$f":"IF(C332=\"\",\"\",INDEX(Validatie!$Q$2:$Q$6,MATCH(MOD(E332,1),Validatie!$P$2:$P$6,1)))","v":"Vroeg"},"?","Anton Smit",{"$f":"IF(C332=\"\",\"\",IFERROR(MATCH(G332&H332,ValVoorNamen&ValNamen,0),\"Fout\")+1)","v":10}]
[null,null,"2019-12-12","TRSP",43811.25,43811.614583333336,"Henk","Koster","",{"$f":"IF(C333=\"\",\"\",INDEX(Validatie!$Q$2:$Q$6,MATCH(MOD(E333,1),Validatie!$P$2:$P$6,1)))","v":"Vroeg"},"?","Henk Koster",{"$f":"IF(C333=\"\",\"\",IFERROR(MATCH(G333&H333,ValVoorNamen&ValNamen,0),\"Fout\")+1)","v":46}]
[null,null,"2019-12-12","AFV MEP",43811.291666666664,43811.65625,"Rijk","van Doorn","",{"$f":"IF(C334=\"\",\"\",INDEX(Validatie!$Q$2:$Q$6,MATCH(MOD(E334,1),Validatie!$P$2:$P$6,1)))","v":"Vroeg"},"MEP","Rijk van Doorn",{"$f":"IF(C334=\"\",\"\",IFERROR(MATCH(G334&H334,ValVoorNamen&ValNamen,0),\"Fout\")+1)","v":86}]
[null,null,"2019-12-12","Teamleider PALL",43811.3125,43811.677083333336,"Hilko","Prins","",{"$f":"IF(C335=\"\",\"\",INDEX(Validatie!$Q$2:$Q$6,MATCH(MOD(E335,1),Validatie!$P$2:$P$6,1)))","v":"Vroeg"},"?","Hilko Prins",{"$f":"IF(C335=\"\",\"\",IFERROR(MATCH(G335&H335,ValVoorNamen&ValNamen,0),\"Fout\")+1)","v":49}]
[null,null,"2019-12-12","TRSP",43811.333333333336,43811.697916666664,"Harrie","Hoekstra","",{"$f":"IF(C336=\"\",\"\",INDEX(Validatie!$Q$2:$Q$6,MATCH(MOD(E336,1),Validatie!$P$2:$P$6,1)))","v":"Vroeg"},"?","Harrie Hoekstra",{"$f":"IF(C336=\"\",\"\",IFERROR(MATCH(G336&H336,ValVoorNamen&ValNamen,0),\"Fout\")+1)","v":43}]
[null,null,"2019-12-12","SCHM HAS",43811.40625,43811.614583333336,"Paul","van Dongen","",{"$f":"IF(C337=\"\",\"\",INDEX(Validatie!$Q$2:$Q$6,MATCH(MOD(E337,1),Validatie!$P$2:$P$6,1)))","v":"Vroeg"},"HAS","Paul van Dongen",{"$f":"IF(C337=\"\",\"\",IFERROR(MATCH(G337&H337,ValVoorNamen&ValNamen,0),\"Fout\")+1)","v":79}]
[null,null,"2019-12-12","ABB middag",43811.572916666664,43811.9375,"Bile","Hendriks","",{"$f":"IF(C338=\"\",\"\",INDEX(Validatie!$Q$2:$Q$6,MATCH(MOD(E338,1),Validatie!$P$2:$P$6,1)))","v":"Laat"},"ABB","Bile Hendriks",{"$f":"IF(C338=\"\",\"\",IFERROR(MATCH(G338&H338,ValVoorNamen&ValNamen,0),\"Fout\")+1)","v":18}]
[null,null,"2019-12-12","AFV HAS",43811.572916666664,43811.697916666664,"Norbert","de Lange","",{"$f":"IF(C339=\"\",\"\",INDEX(Validatie!$Q$2:$Q$6,MATCH(MOD(E339,1),Validatie!$P$2:$P$6,1)))","v":"Laat"},"HAS","Norbert de Lange",{"$f":"IF(C339=\"\",\"\",IFERROR(MATCH(G339&H339,ValVoorNamen&ValNamen,0),\"Fout\")+1)","v":76}]
[null,null,"2019-12-12","AFV MEP",43811.572916666664,43811.9375,"Houcin","Huisman","",{"$f":"IF(C340=\"\",\"\",INDEX(Validatie!$Q$2:$Q$6,MATCH(MOD(E340,1),Validatie!$P$2:$P$6,1)))","v":"Laat"},"MEP","Houcin Huisman",{"$f":"IF(C340=\"\",\"\",IFERROR(MATCH(G340&H340,ValVoorNamen&ValNamen,0),\"Fout\")+1)","v":51}]
[null,null,"2019-12-12","LCR middag",43811.572916666664,43811.9375,"Klaas","Kramer","",{"$f":"IF(C341=\"\",\"\",INDEX(Validatie!$Q$2:$Q$6,MATCH(MOD(E341,1),Validatie!$P$2:$P$6,1)))","v":"Laat"},"LCR","Klaas Kramer",{"$f":"IF(C341=\"\",\"\",IFERROR(MATCH(G341&H341,ValVoorNamen&ValNamen,0),\"Fout\")+1)","v":59}]
[null,null,"2019-12-12","PALL MEP",43811.614583333336,43811.979166666664,"Latie","van Wijk","",{"$f":"IF(C342=\"\",\"\",INDEX(Validatie!$Q$2:$Q$6,MATCH(MOD(E342,1),Validatie!$P$2:$P$6,1)))","v":"Laat"},"-","Latie van Wijk",{"$f":"IF(C342=\"\",\"\",IFERROR(MATCH(G342&H342,ValVoorNamen&ValNamen,0),\"Fout\")+1)","v":62}]
[null,null,"2019-12-12","PALL MEP",43811.614583333336,43811.979166666664,"Abdurahman Ibrahim","de Vries","",{"$f":"IF(C343=\"\",\"\",INDEX(Validatie!$Q$2:$Q$6,MATCH(MOD(E343,1),Validatie!$P$2:$P$6,1)))","v":"Laat"},"-","Abdurahman Ibrahim de Vries",{"$f":"IF(C343=\"\",\"\",IFERROR(MATCH(G343&H343,ValVoorNamen&ValNamen,0),\"Fout\")+1)","v":4}]
[null,null,"2019-12-12","PALL MEP",43811.614583333336,43811.979166666664,"Michael","Gerritsen","",{"$f":"IF(C344=\"\",\"\",INDEX(Validatie!$Q$2:$Q$6,MATCH(MOD(E344,1),Validatie!$P$2:$P$6,1)))","v":"Laat"},"-","Michael Gerritsen",{"$f":"IF(C344=\"\",\"\",IFERROR(MATCH(G344&H344,ValVoorNamen&ValNamen,0),\"Fout\")+1)","v":69}]
[null,null,"2019-12-12","PALL MEP",43811.614583333336,43811.979166666664,"Hans","van de Ven ","",{"$f":"IF(C345=\"\",\"\",INDEX(Validatie!$Q$2:$Q$6,MATCH(MOD(E345,1),Validatie!$P$2:$P$6,1)))","v":"Laat"},"-","Hans van de Ven ",{"$f":"IF(C345=\"\",\"\",IFERROR(MATCH(G345&H345,ValVoorNamen&ValNamen,0),\"Fout\")+1)","v":42}]
[null,null,"2019-12-12","PALL MEP",43811.614583333336,43811.979166666664,"Jeroen","Post","",{"$f":"IF(C346=\"\",\"\",INDEX(Validatie!$Q$2:$Q$6,MATCH(MOD(E346,1),Validatie!$P$2:$P$6,1)))","v":"Laat"},"-","Jeroen Post",{"$f":"IF(C346=\"\",\"\",IFERROR(MATCH(G346&H346,ValVoorNamen&ValNamen,0),\"Fout\")+1)","v":56}]
[null,null,"2019-12-12","PALL Rweg",43811.614583333336,43811.979166666664,"Akela","van Dijk","",{"$f":"IF(C347=\"\",\"\",INDEX(Validatie!$Q$2:$Q$6,MATCH(MOD(E347,1),Validatie!$P$2:$P$6,1)))","v":"Laat"},"-","Akela van Dijk",{"$f":"IF(C347=\"\",\"\",IFERROR(MATCH(G347&H347,ValVoorNamen&ValNamen,0),\"Fout\")+1)","v":6}]
[null,null,"2019-12-12","PALL Rweg",43811.614583333336,43811.979166666664,"Karrar","Kuiper","",{"$f":"IF(C348=\"\",\"\",INDEX(Validatie!$Q$2:$Q$6,MATCH(MOD(E348,1),Validatie!$P$2:$P$6,1)))","v":"Laat"},"-","Karrar Kuiper",{"$f":"IF(C348=\"\",\"\",IFERROR(MATCH(G348&H348,ValVoorNamen&ValNamen,0),\"Fout\")+1)","v":57}]
[null,null,"2019-12-12","PALL Rweg",43811.614583333336,43811.979166666664,"Chevindio","Brouwer","",{"$f":"IF(C349=\"\",\"\",INDEX(Validatie!$Q$2:$Q$6,MATCH(MOD(E349,1),Validatie!$P$2:$P$6,1)))","v":"Laat"},"-","Chevindio Brouwer",{"$f":"IF(C349=\"\",\"\",IFERROR(MATCH(G349&H349,ValVoorNamen&ValNamen,0),\"Fout\")+1)","v":21}]
[null,null,"2019-12-12","PALL Rweg",43811.614583333336,43811.979166666664,"Haben","Willems","",{"$f":"IF(C350=\"\",\"\",INDEX(Validatie!$Q$2:$Q$6,MATCH(MOD(E350,1),Validatie!$P$2:$P$6,1)))","v":"Laat"},"-","Haben Willems",{"$f":"IF(C350=\"\",\"\",IFERROR(MATCH(G350&H350,ValVoorNamen&ValNamen,0),\"Fout\")+1)","v":40}]
[null,null,"2019-12-12","PALL Rweg",43811.614583333336,43811.979166666664,"Harry","Maas","",{"$f":"IF(C351=\"\",\"\",INDEX(Validatie!$Q$2:$Q$6,MATCH(MOD(E351,1),Validatie!$P$2:$P$6,1)))","v":"Laat"},"-","Harry Maas",{"$f":"IF(C351=\"\",\"\",IFERROR(MATCH(G351&H351,ValVoorNamen&ValNamen,0),\"Fout\")+1)","v":44}]
[null,null,"2019-12-12","PALL Rweg",43811.614583333336,43811.979166666664,"Apollonia","Meijer","",{"$f":"IF(C352=\"\",\"\",INDEX(Validatie!$Q$2:$Q$6,MATCH(MOD(E352,1),Validatie!$P$2:$P$6,1)))","v":"Laat"},"-","Apollonia Meijer",{"$f":"IF(C352=\"\",\"\",IFERROR(MATCH(G352&H352,ValVoorNamen&ValNamen,0),\"Fout\")+1)","v":11}]
[null,null,"2019-12-12","PALL Rweg",43811.614583333336,43811.979166666664,"Dennis","de Graaf","",{"$f":"IF(C353=\"\",\"\",INDEX(Validatie!$Q$2:$Q$6,MATCH(MOD(E353,1),Validatie!$P$2:$P$6,1)))","v":"Laat"},"-","Dennis de Graaf",{"$f":"IF(C353=\"\",\"\",IFERROR(MATCH(G353&H353,ValVoorNamen&ValNamen,0),\"Fout\")+1)","v":25}]
[null,null,"2019-12-12","PALL Rweg",43811.614583333336,43811.979166666664,"Agathe","van de Berg ","",{"$f":"IF(C354=\"\",\"\",INDEX(Validatie!$Q$2:$Q$6,MATCH(MOD(E354,1),Validatie!$P$2:$P$6,1)))","v":"Laat"},"-","Agathe van de Berg ",{"$f":"IF(C354=\"\",\"\",IFERROR(MATCH(G354&H354,ValVoorNamen&ValNamen,0),\"Fout\")+1)","v":5}]
[null,null,"2019-12-12","PALL Rweg",43811.614583333336,43811.979166666664,"Tomas","Koolen","",{"$f":"IF(C355=\"\",\"\",INDEX(Validatie!$Q$2:$Q$6,MATCH(MOD(E355,1),Validatie!$P$2:$P$6,1)))","v":"Laat"},"-","Tomas Koolen",{"$f":"IF(C355=\"\",\"\",IFERROR(MATCH(G355&H355,ValVoorNamen&ValNamen,0),\"Fout\")+1)","v":102}]
[null,null,"2019-12-12","PALL Rweg",43811.614583333336,43811.979166666664,"Heruy","van de Wal ","",{"$f":"IF(C356=\"\",\"\",INDEX(Validatie!$Q$2:$Q$6,MATCH(MOD(E356,1),Validatie!$P$2:$P$6,1)))","v":"Laat"},"-","Heruy van de Wal ",{"$f":"IF(C356=\"\",\"\",IFERROR(MATCH(G356&H356,ValVoorNamen&ValNamen,0),\"Fout\")+1)","v":48}]
[null,null,"2019-12-12","PALL Rweg",43811.614583333336,43811.979166666664,"Hassan","Verhoeven","",{"$f":"IF(C357=\"\",\"\",INDEX(Validatie!$Q$2:$Q$6,MATCH(MOD(E357,1),Validatie!$P$2:$P$6,1)))","v":"Laat"},"-","Hassan Verhoeven",{"$f":"IF(C357=\"\",\"\",IFERROR(MATCH(G357&H357,ValVoorNamen&ValNamen,0),\"Fout\")+1)","v":45}]
[null,null,"2019-12-12","PALL Rweg",43811.614583333336,43811.979166666664,"Samantha","Sanders","",{"$f":"IF(C358=\"\",\"\",INDEX(Validatie!$Q$2:$Q$6,MATCH(MOD(E358,1),Validatie!$P$2:$P$6,1)))","v":"Laat"},"-","Samantha Sanders",{"$f":"IF(C358=\"\",\"\",IFERROR(MATCH(G358&H358,ValVoorNamen&ValNamen,0),\"Fout\")+1)","v":94}]
[null,null,"2019-12-12","PALL Rweg",43811.614583333336,43811.979166666664,"Sied"," van der Pol","",{"$f":"IF(C359=\"\",\"\",INDEX(Validatie!$Q$2:$Q$6,MATCH(MOD(E359,1),Validatie!$P$2:$P$6,1)))","v":"Laat"},"-","Sied  van der Pol",{"$f":"IF(C359=\"\",\"\",IFERROR(MATCH(G359&H359,ValVoorNamen&ValNamen,0),\"Fout\")+1)","v":99}]
[null,null,"2019-12-12","PALL Rweg",43811.614583333336,43811.979166666664,"Laszlo","Scholten","",{"$f":"IF(C360=\"\",\"\",INDEX(Validatie!$Q$2:$Q$6,MATCH(MOD(E360,1),Validatie!$P$2:$P$6,1)))","v":"Laat"},"-","Laszlo Scholten",{"$f":"IF(C360=\"\",\"\",IFERROR(MATCH(G360&H360,ValVoorNamen&ValNamen,0),\"Fout\")+1)","v":61}]
[null,null,"2019-12-12","PALL Rweg",43811.614583333336,43811.979166666664,"Atobhran","de Groot","",{"$f":"IF(C361=\"\",\"\",INDEX(Validatie!$Q$2:$Q$6,MATCH(MOD(E361,1),Validatie!$P$2:$P$6,1)))","v":"Laat"},"-","Atobhran de Groot",{"$f":"IF(C361=\"\",\"\",IFERROR(MATCH(G361&H361,ValVoorNamen&ValNamen,0),\"Fout\")+1)","v":14}]
[null,null,"2019-12-12","PALL Rweg",43811.614583333336,43811.979166666664,"Abdul","Jansen","",{"$f":"IF(C362=\"\",\"\",INDEX(Validatie!$Q$2:$Q$6,MATCH(MOD(E362,1),Validatie!$P$2:$P$6,1)))","v":"Laat"},"-","Abdul Jansen",{"$f":"IF(C362=\"\",\"\",IFERROR(MATCH(G362&H362,ValVoorNamen&ValNamen,0),\"Fout\")+1)","v":3}]
[null,null,"2019-12-12","PALL Rweg",43811.614583333336,43811.979166666664,"Naoufel","van de Velde ","",{"$f":"IF(C363=\"\",\"\",INDEX(Validatie!$Q$2:$Q$6,MATCH(MOD(E363,1),Validatie!$P$2:$P$6,1)))","v":"Laat"},"-","Naoufel van de Velde ",{"$f":"IF(C363=\"\",\"\",IFERROR(MATCH(G363&H363,ValVoorNamen&ValNamen,0),\"Fout\")+1)","v":73}]
[null,null,"2019-12-12","PALL Rweg",43811.614583333336,43811.979166666664,"Jarek","Kuipers","",{"$f":"IF(C364=\"\",\"\",INDEX(Validatie!$Q$2:$Q$6,MATCH(MOD(E364,1),Validatie!$P$2:$P$6,1)))","v":"Laat"},"-","Jarek Kuipers",{"$f":"IF(C364=\"\",\"\",IFERROR(MATCH(G364&H364,ValVoorNamen&ValNamen,0),\"Fout\")+1)","v":54}]
[null,null,"2019-12-12","PALL Rweg",43811.614583333336,43811.979166666664,"Martijn","de Ruiter","",{"$f":"IF(C365=\"\",\"\",INDEX(Validatie!$Q$2:$Q$6,MATCH(MOD(E365,1),Validatie!$P$2:$P$6,1)))","v":"Laat"},"-","Martijn de Ruiter",{"$f":"IF(C365=\"\",\"\",IFERROR(MATCH(G365&H365,ValVoorNamen&ValNamen,0),\"Fout\")+1)","v":66}]
[null,null,"2019-12-12","PALL Rweg",43811.614583333336,43811.979166666664,"Mark","Vink","",{"$f":"IF(C366=\"\",\"\",INDEX(Validatie!$Q$2:$Q$6,MATCH(MOD(E366,1),Validatie!$P$2:$P$6,1)))","v":"Laat"},"-","Mark Vink",{"$f":"IF(C366=\"\",\"\",IFERROR(MATCH(G366&H366,ValVoorNamen&ValNamen,0),\"Fout\")+1)","v":65}]
[null,null,"2019-12-12","PALL Rweg",43811.614583333336,43811.979166666664,"Abdiqadir","de Jong","",{"$f":"IF(C367=\"\",\"\",INDEX(Validatie!$Q$2:$Q$6,MATCH(MOD(E367,1),Validatie!$P$2:$P$6,1)))","v":"Laat"},"-","Abdiqadir de Jong",{"$f":"IF(C367=\"\",\"\",IFERROR(MATCH(G367&H367,ValVoorNamen&ValNamen,0),\"Fout\")+1)","v":2}]
[null,null,"2019-12-12","PALL Rweg",43811.614583333336,43811.979166666664,"Nexhmedi","Willemsen","",{"$f":"IF(C368=\"\",\"\",INDEX(Validatie!$Q$2:$Q$6,MATCH(MOD(E368,1),Validatie!$P$2:$P$6,1)))","v":"Laat"},"-","Nexhmedi Willemsen",{"$f":"IF(C368=\"\",\"\",IFERROR(MATCH(G368&H368,ValVoorNamen&ValNamen,0),\"Fout\")+1)","v":74}]
[null,null,"2019-12-12","Reserve middag",43811.614583333336,43811.979166666664,"Sebastian","Kuijpers","",{"$f":"IF(C369=\"\",\"\",INDEX(Validatie!$Q$2:$Q$6,MATCH(MOD(E369,1),Validatie!$P$2:$P$6,1)))","v":"Laat"},"-","Sebastian Kuijpers",{"$f":"IF(C369=\"\",\"\",IFERROR(MATCH(G369&H369,ValVoorNamen&ValNamen,0),\"Fout\")+1)","v":97}]
[null,null,"2019-12-12","Reserve middag",43811.614583333336,43811.979166666664,"Amanuel","Janssen","",{"$f":"IF(C370=\"\",\"\",INDEX(Validatie!$Q$2:$Q$6,MATCH(MOD(E370,1),Validatie!$P$2:$P$6,1)))","v":"Laat"},"-","Amanuel Janssen",{"$f":"IF(C370=\"\",\"\",IFERROR(MATCH(G370&H370,ValVoorNamen&ValNamen,0),\"Fout\")+1)","v":8}]
[null,null,"2019-12-12","SCHM",43811.614583333336,43811.979166666664,"Erik","de Haan","",{"$f":"IF(C371=\"\",\"\",INDEX(Validatie!$Q$2:$Q$6,MATCH(MOD(E371,1),Validatie!$P$2:$P$6,1)))","v":"Laat"},"SCHM","Erik de Haan",{"$f":"IF(C371=\"\",\"\",IFERROR(MATCH(G371&H371,ValVoorNamen&ValNamen,0),\"Fout\")+1)","v":30}]
[null,null,"2019-12-12","SCHM",43811.614583333336,43811.979166666664,"Patrick","Bosch","",{"$f":"IF(C372=\"\",\"\",INDEX(Validatie!$Q$2:$Q$6,MATCH(MOD(E372,1),Validatie!$P$2:$P$6,1)))","v":"Laat"},"SCHM","Patrick Bosch",{"$f":"IF(C372=\"\",\"\",IFERROR(MATCH(G372&H372,ValVoorNamen&ValNamen,0),\"Fout\")+1)","v":78}]
[null,null,"2019-12-12","SCHM",43811.614583333336,43811.979166666664,"Rolinka","van den Bosch","",{"$f":"IF(C373=\"\",\"\",INDEX(Validatie!$Q$2:$Q$6,MATCH(MOD(E373,1),Validatie!$P$2:$P$6,1)))","v":"Laat"},"SCHM","Rolinka van den Bosch",{"$f":"IF(C373=\"\",\"\",IFERROR(MATCH(G373&H373,ValVoorNamen&ValNamen,0),\"Fout\")+1)","v":89}]
[null,null,"2019-12-12","SCHM AFV",43811.614583333336,43811.979166666664,"Miquel","van Loon","",{"$f":"IF(C374=\"\",\"\",INDEX(Validatie!$Q$2:$Q$6,MATCH(MOD(E374,1),Validatie!$P$2:$P$6,1)))","v":"Laat"},"AFV","Miquel van Loon",{"$f":"IF(C374=\"\",\"\",IFERROR(MATCH(G374&H374,ValVoorNamen&ValNamen,0),\"Fout\")+1)","v":71}]
[null,null,"2019-12-12","SCHM AFV",43811.614583333336,43811.979166666664,"Paul","van Dongen","",{"$f":"IF(C375=\"\",\"\",INDEX(Validatie!$Q$2:$Q$6,MATCH(MOD(E375,1),Validatie!$P$2:$P$6,1)))","v":"Laat"},"AFV","Paul van Dongen",{"$f":"IF(C375=\"\",\"\",IFERROR(MATCH(G375&H375,ValVoorNamen&ValNamen,0),\"Fout\")+1)","v":79}]
[null,null,"2019-12-12","SCHM AFV",43811.614583333336,43811.979166666664,"Sebastiaan","Mol","",{"$f":"IF(C376=\"\",\"\",INDEX(Validatie!$Q$2:$Q$6,MATCH(MOD(E376,1),Validatie!$P$2:$P$6,1)))","v":"Laat"},"AFV","Sebastiaan Mol",{"$f":"IF(C376=\"\",\"\",IFERROR(MATCH(G376&H376,ValVoorNamen&ValNamen,0),\"Fout\")+1)","v":96}]
[null,null,"2019-12-12","SCHM AFV",43811.614583333336,43811.979166666664,"Baki","Bos","",{"$f":"IF(C377=\"\",\"\",INDEX(Validatie!$Q$2:$Q$6,MATCH(MOD(E377,1),Validatie!$P$2:$P$6,1)))","v":"Laat"},"AFV","Baki Bos",{"$f":"IF(C377=\"\",\"\",IFERROR(MATCH(G377&H377,ValVoorNamen&ValNamen,0),\"Fout\")+1)","v":15}]
[null,null,"2019-12-12","SCHM AFV",43811.614583333336,43811.979166666664,"Ilker","Peeters","",{"$f":"IF(C378=\"\",\"\",INDEX(Validatie!$Q$2:$Q$6,MATCH(MOD(E378,1),Validatie!$P$2:$P$6,1)))","v":"Laat"},"AFV","Ilker Peeters",{"$f":"IF(C378=\"\",\"\",IFERROR(MATCH(G378&H378,ValVoorNamen&ValNamen,0),\"Fout\")+1)","v":52}]
[null,null,"2019-12-12","SCHM AFV",43811.614583333336,43811.979166666664,"Flavi","van der Heyden","",{"$f":"IF(C379=\"\",\"\",INDEX(Validatie!$Q$2:$Q$6,MATCH(MOD(E379,1),Validatie!$P$2:$P$6,1)))","v":"Laat"},"AFV","Flavi van der Heyden",{"$f":"IF(C379=\"\",\"\",IFERROR(MATCH(G379&H379,ValVoorNamen&ValNamen,0),\"Fout\")+1)","v":37}]
[null,null,"2019-12-12","TRSP",43811.614583333336,43811.979166666664,"Emsud","Kok","",{"$f":"IF(C380=\"\",\"\",INDEX(Validatie!$Q$2:$Q$6,MATCH(MOD(E380,1),Validatie!$P$2:$P$6,1)))","v":"Laat"},"?","Emsud Kok",{"$f":"IF(C380=\"\",\"\",IFERROR(MATCH(G380&H380,ValVoorNamen&ValNamen,0),\"Fout\")+1)","v":28}]
[null,null,"2019-12-12","TRSP",43811.614583333336,43811.979166666664,"Reinder","Koning","",{"$f":"IF(C381=\"\",\"\",INDEX(Validatie!$Q$2:$Q$6,MATCH(MOD(E381,1),Validatie!$P$2:$P$6,1)))","v":"Laat"},"?","Reinder Koning",{"$f":"IF(C381=\"\",\"\",IFERROR(MATCH(G381&H381,ValVoorNamen&ValNamen,0),\"Fout\")+1)","v":83}]
[null,null,"2019-12-12","SCHM HAS",43811.697916666664,43811.9375,"Norbert","de Lange","",{"$f":"IF(C382=\"\",\"\",INDEX(Validatie!$Q$2:$Q$6,MATCH(MOD(E382,1),Validatie!$P$2:$P$6,1)))","v":"Laat"},"HAS","Norbert de Lange",{"$f":"IF(C382=\"\",\"\",IFERROR(MATCH(G382&H382,ValVoorNamen&ValNamen,0),\"Fout\")+1)","v":76}]
[null,null,"2019-12-12","SCHM",43811.916666666664,43812.28125,"Rachid","van der Laan","",{"$f":"IF(C383=\"\",\"\",INDEX(Validatie!$Q$2:$Q$6,MATCH(MOD(E383,1),Validatie!$P$2:$P$6,1)))","v":"Nacht"},"SCHM","Rachid van der Laan",{"$f":"IF(C383=\"\",\"\",IFERROR(MATCH(G383&H383,ValVoorNamen&ValNamen,0),\"Fout\")+1)","v":82}]
[null,null,"2019-12-12","SCHM",43811.916666666664,43812.28125,"Evans","Vermeulen","",{"$f":"IF(C384=\"\",\"\",INDEX(Validatie!$Q$2:$Q$6,MATCH(MOD(E384,1),Validatie!$P$2:$P$6,1)))","v":"Nacht"},"SCHM","Evans Vermeulen",{"$f":"IF(C384=\"\",\"\",IFERROR(MATCH(G384&H384,ValVoorNamen&ValNamen,0),\"Fout\")+1)","v":31}]
[null,null,"2019-12-12","SCHM",43811.916666666664,43812.28125,"Kevin","Veenstra","",{"$f":"IF(C385=\"\",\"\",INDEX(Validatie!$Q$2:$Q$6,MATCH(MOD(E385,1),Validatie!$P$2:$P$6,1)))","v":"Nacht"},"SCHM","Kevin Veenstra",{"$f":"IF(C385=\"\",\"\",IFERROR(MATCH(G385&H385,ValVoorNamen&ValNamen,0),\"Fout\")+1)","v":58}]
[null,null,"2019-12-13","ABB ochtend ",43812.25,43812.614583333336,"Trienko","Spooren","",{"$f":"IF(C386=\"\",\"\",INDEX(Validatie!$Q$2:$Q$6,MATCH(MOD(E386,1),Validatie!$P$2:$P$6,1)))","v":"Vroeg"},"ABB","Trienko Spooren",{"$f":"IF(C386=\"\",\"\",IFERROR(MATCH(G386&H386,ValVoorNamen&ValNamen,0),\"Fout\")+1)","v":103}]
[null,null,"2019-12-13","AFV HAS",43812.25,43812.40625,"Paul","van Dongen","",{"$f":"IF(C387=\"\",\"\",INDEX(Validatie!$Q$2:$Q$6,MATCH(MOD(E387,1),Validatie!$P$2:$P$6,1)))","v":"Vroeg"},"HAS","Paul van Dongen",{"$f":"IF(C387=\"\",\"\",IFERROR(MATCH(G387&H387,ValVoorNamen&ValNamen,0),\"Fout\")+1)","v":79}]
[null,null,"2019-12-13","AFV MEP",43812.25,43812.614583333336,"Rudolf","Hofman","",{"$f":"IF(C388=\"\",\"\",INDEX(Validatie!$Q$2:$Q$6,MATCH(MOD(E388,1),Validatie!$P$2:$P$6,1)))","v":"Vroeg"},"MEP","Rudolf Hofman",{"$f":"IF(C388=\"\",\"\",IFERROR(MATCH(G388&H388,ValVoorNamen&ValNamen,0),\"Fout\")+1)","v":91}]
[null,null,"2019-12-13","LCR ochtend",43812.25,43812.614583333336,"Sami","van der Horst","",{"$f":"IF(C389=\"\",\"\",INDEX(Validatie!$Q$2:$Q$6,MATCH(MOD(E389,1),Validatie!$P$2:$P$6,1)))","v":"Vroeg"},"LCR","Sami van der Horst",{"$f":"IF(C389=\"\",\"\",IFERROR(MATCH(G389&H389,ValVoorNamen&ValNamen,0),\"Fout\")+1)","v":95}]
[null,null,"2019-12-13","LCR ochtend",43812.25,43812.614583333336,"Wolter","De bolder",{"$f":"IF(H390=\"\",\"\",IF(SUMPRODUCT(--(ValVerlofVoornaam=G390),--(ValVerlofNaam=H390),--(ValVerlofVan<=C390),--(ValVerlofTot>=C390)*(1))>0,\"V\",\"\"))","v":""},{"$f":"IF(C390=\"\",\"\",INDEX(Validatie!$Q$2:$Q$6,MATCH(MOD(E390,1),Validatie!$P$2:$P$6,1)))","v":"Vroeg"},{"$f":"IF(C390=\"\",\"\",IFERROR(VLOOKUP(D390,DataMijnAfdeling,2,0),\"?\"))","v":"LCR"},"Wolter De bolder",{"$f":"IF(C390=\"\",\"\",IFERROR(MATCH(G390&H390,ValVoorNamen&ValNamen,0),\"Fout\")+1)","v":107}]
[null,null,"2019-12-13","PALL HAS",43812.25,43812.614583333336,"Henk","Koster","",{"$f":"IF(C391=\"\",\"\",INDEX(Validatie!$Q$2:$Q$6,MATCH(MOD(E391,1),Validatie!$P$2:$P$6,1)))","v":"Vroeg"},"-",{"$f":"IF(C391=\"\",\"\",CONCATENATE(G391,\" \",H391))","v":"Henk Koster"},{"$f":"IF(C391=\"\",\"\",IFERROR(MATCH(G391&H391,ValVoorNamen&ValNamen,0),\"Fout\")+1)","v":46}]
[null,null,"2019-12-13","PALL MEP",43812.25,43812.614583333336,"Wenaron","Kurkema","",{"$f":"IF(C392=\"\",\"\",INDEX(Validatie!$Q$2:$Q$6,MATCH(MOD(E392,1),Validatie!$P$2:$P$6,1)))","v":"Vroeg"},"-","Wenaron Kurkema",{"$f":"IF(C392=\"\",\"\",IFERROR(MATCH(G392&H392,ValVoorNamen&ValNamen,0),\"Fout\")+1)","v":105}]
[null,null,"2019-12-13","PALL MEP",43812.25,43812.614583333336,"Salahadin","Wolters","",{"$f":"IF(C393=\"\",\"\",INDEX(Validatie!$Q$2:$Q$6,MATCH(MOD(E393,1),Validatie!$P$2:$P$6,1)))","v":"Vroeg"},"-","Salahadin Wolters",{"$f":"IF(C393=\"\",\"\",IFERROR(MATCH(G393&H393,ValVoorNamen&ValNamen,0),\"Fout\")+1)","v":93}]
[null,null,"2019-12-13","PALL MEP",43812.25,43812.614583333336,"Dikkie","van der Meer","",{"$f":"IF(C394=\"\",\"\",INDEX(Validatie!$Q$2:$Q$6,MATCH(MOD(E394,1),Validatie!$P$2:$P$6,1)))","v":"Vroeg"},"-","Dikkie van der Meer",{"$f":"IF(C394=\"\",\"\",IFERROR(MATCH(G394&H394,ValVoorNamen&ValNamen,0),\"Fout\")+1)","v":26}]
[null,null,"2019-12-13","PALL MEP",43812.25,43812.614583333336,"Rene","van der Velden","",{"$f":"IF(C395=\"\",\"\",INDEX(Validatie!$Q$2:$Q$6,MATCH(MOD(E395,1),Validatie!$P$2:$P$6,1)))","v":"Vroeg"},"-","Rene van der Velden",{"$f":"IF(C395=\"\",\"\",IFERROR(MATCH(G395&H395,ValVoorNamen&ValNamen,0),\"Fout\")+1)","v":84}]
[null,null,"2019-12-13","PALL MEP",43812.25,43812.614583333336,"Richard","Driessen","",{"$f":"IF(C396=\"\",\"\",INDEX(Validatie!$Q$2:$Q$6,MATCH(MOD(E396,1),Validatie!$P$2:$P$6,1)))","v":"Vroeg"},"-","Richard Driessen",{"$f":"IF(C396=\"\",\"\",IFERROR(MATCH(G396&H396,ValVoorNamen&ValNamen,0),\"Fout\")+1)","v":85}]
[null,null,"2019-12-13","PALL Rweg",43812.25,43812.614583333336,"Felicia","van den Broek","",{"$f":"IF(C397=\"\",\"\",INDEX(Validatie!$Q$2:$Q$6,MATCH(MOD(E397,1),Validatie!$P$2:$P$6,1)))","v":"Vroeg"},"-","Felicia van den Broek",{"$f":"IF(C397=\"\",\"\",IFERROR(MATCH(G397&H397,ValVoorNamen&ValNamen,0),\"Fout\")+1)","v":34}]
[null,null,"2019-12-13","PALL Rweg",43812.25,43812.614583333336,"Jelte","van Veen","",{"$f":"IF(C398=\"\",\"\",INDEX(Validatie!$Q$2:$Q$6,MATCH(MOD(E398,1),Validatie!$P$2:$P$6,1)))","v":"Vroeg"},"-","Jelte van Veen",{"$f":"IF(C398=\"\",\"\",IFERROR(MATCH(G398&H398,ValVoorNamen&ValNamen,0),\"Fout\")+1)","v":55}]
[null,null,"2019-12-13","PALL Rweg",43812.25,43812.614583333336,"Shawn","Molenaar","",{"$f":"IF(C399=\"\",\"\",INDEX(Validatie!$Q$2:$Q$6,MATCH(MOD(E399,1),Validatie!$P$2:$P$6,1)))","v":"Vroeg"},"-","Shawn Molenaar",{"$f":"IF(C399=\"\",\"\",IFERROR(MATCH(G399&H399,ValVoorNamen&ValNamen,0),\"Fout\")+1)","v":98}]
[null,null,"2019-12-13","PALL Rweg",43812.25,43812.614583333336,"Elroy","van der Linden","",{"$f":"IF(C400=\"\",\"\",INDEX(Validatie!$Q$2:$Q$6,MATCH(MOD(E400,1),Validatie!$P$2:$P$6,1)))","v":"Vroeg"},"-","Elroy van der Linden",{"$f":"IF(C400=\"\",\"\",IFERROR(MATCH(G400&H400,ValVoorNamen&ValNamen,0),\"Fout\")+1)","v":27}]
[null,null,"2019-12-13","PALL Rweg",43812.25,43812.614583333336,"Arsenio","Mulder","",{"$f":"IF(C401=\"\",\"\",INDEX(Validatie!$Q$2:$Q$6,MATCH(MOD(E401,1),Validatie!$P$2:$P$6,1)))","v":"Vroeg"},"-","Arsenio Mulder",{"$f":"IF(C401=\"\",\"\",IFERROR(MATCH(G401&H401,ValVoorNamen&ValNamen,0),\"Fout\")+1)","v":13}]
[null,null,"2019-12-13","PALL Rweg",43812.25,43812.614583333336,"Viorel","Triest","",{"$f":"IF(C402=\"\",\"\",INDEX(Validatie!$Q$2:$Q$6,MATCH(MOD(E402,1),Validatie!$P$2:$P$6,1)))","v":"Vroeg"},"-","Viorel Triest",{"$f":"IF(C402=\"\",\"\",IFERROR(MATCH(G402&H402,ValVoorNamen&ValNamen,0),\"Fout\")+1)","v":104}]
[null,null,"2019-12-13","PALL Rweg",43812.25,43812.614583333336,"Sebastiaan","Mol","",{"$f":"IF(C403=\"\",\"\",INDEX(Validatie!$Q$2:$Q$6,MATCH(MOD(E403,1),Validatie!$P$2:$P$6,1)))","v":"Vroeg"},"-","Sebastiaan Mol",{"$f":"IF(C403=\"\",\"\",IFERROR(MATCH(G403&H403,ValVoorNamen&ValNamen,0),\"Fout\")+1)","v":96}]
[null,null,"2019-12-13","PALL Rweg",43812.25,43812.614583333336,"Amadou","Bakker","",{"$f":"IF(C404=\"\",\"\",INDEX(Validatie!$Q$2:$Q$6,MATCH(MOD(E404,1),Validatie!$P$2:$P$6,1)))","v":"Vroeg"},"-","Amadou Bakker",{"$f":"IF(C404=\"\",\"\",IFERROR(MATCH(G404&H404,ValVoorNamen&ValNamen,0),\"Fout\")+1)","v":7}]
[null,null,"2019-12-13","PALL Rweg",43812.25,43812.614583333336,"Wout","Van Goud","",{"$f":"IF(C405=\"\",\"\",INDEX(Validatie!$Q$2:$Q$6,MATCH(MOD(E405,1),Validatie!$P$2:$P$6,1)))","v":"Vroeg"},"-","Wout Van Goud",{"$f":"IF(C405=\"\",\"\",IFERROR(MATCH(G405&H405,ValVoorNamen&ValNamen,0),\"Fout\")+1)","v":108}]
[null,null,"2019-12-13","PALL Rweg",43812.25,43812.614583333336,"Fars","van de Veen","",{"$f":"IF(C406=\"\",\"\",INDEX(Validatie!$Q$2:$Q$6,MATCH(MOD(E406,1),Validatie!$P$2:$P$6,1)))","v":"Vroeg"},"-","Fars van de Veen",{"$f":"IF(C406=\"\",\"\",IFERROR(MATCH(G406&H406,ValVoorNamen&ValNamen,0),\"Fout\")+1)","v":33}]
[null,null,"2019-12-13","PALL Rweg",43812.25,43812.614583333336,"Magdalena","Postma","",{"$f":"IF(C407=\"\",\"\",INDEX(Validatie!$Q$2:$Q$6,MATCH(MOD(E407,1),Validatie!$P$2:$P$6,1)))","v":"Vroeg"},"-","Magdalena Postma",{"$f":"IF(C407=\"\",\"\",IFERROR(MATCH(G407&H407,ValVoorNamen&ValNamen,0),\"Fout\")+1)","v":63}]
[null,null,"2019-12-13","PALL Rweg",43812.25,43812.614583333336,"Charles","Dekker","",{"$f":"IF(C408=\"\",\"\",INDEX(Validatie!$Q$2:$Q$6,MATCH(MOD(E408,1),Validatie!$P$2:$P$6,1)))","v":"Vroeg"},"-","Charles Dekker",{"$f":"IF(C408=\"\",\"\",IFERROR(MATCH(G408&H408,ValVoorNamen&ValNamen,0),\"Fout\")+1)","v":20}]
[null,null,"2019-12-13","PALL Rweg",43812.25,43812.614583333336,"Ko","van de Brink","",{"$f":"IF(C409=\"\",\"\",INDEX(Validatie!$Q$2:$Q$6,MATCH(MOD(E409,1),Validatie!$P$2:$P$6,1)))","v":"Vroeg"},"-","Ko van de Brink",{"$f":"IF(C409=\"\",\"\",IFERROR(MATCH(G409&H409,ValVoorNamen&ValNamen,0),\"Fout\")+1)","v":60}]
[null,null,"2019-12-13","PALL Rweg",43812.25,43812.614583333336,"Robin","Evers","",{"$f":"IF(C410=\"\",\"\",INDEX(Validatie!$Q$2:$Q$6,MATCH(MOD(E410,1),Validatie!$P$2:$P$6,1)))","v":"Vroeg"},"-","Robin Evers",{"$f":"IF(C410=\"\",\"\",IFERROR(MATCH(G410&H410,ValVoorNamen&ValNamen,0),\"Fout\")+1)","v":88}]
[null,null,"2019-12-13","PALL Rweg",43812.25,43812.614583333336,"Gerrit","van Beek","",{"$f":"IF(C411=\"\",\"\",INDEX(Validatie!$Q$2:$Q$6,MATCH(MOD(E411,1),Validatie!$P$2:$P$6,1)))","v":"Vroeg"},"-","Gerrit van Beek",{"$f":"IF(C411=\"\",\"\",IFERROR(MATCH(G411&H411,ValVoorNamen&ValNamen,0),\"Fout\")+1)","v":39}]
[null,null,"2019-12-13","PALL Rweg",43812.25,43812.614583333336,"Everon","van den Heuvel","",{"$f":"IF(C412=\"\",\"\",INDEX(Validatie!$Q$2:$Q$6,MATCH(MOD(E412,1),Validatie!$P$2:$P$6,1)))","v":"Vroeg"},"-","Everon van den Heuvel",{"$f":"IF(C412=\"\",\"\",IFERROR(MATCH(G412&H412,ValVoorNamen&ValNamen,0),\"Fout\")+1)","v":32}]
[null,null,"2019-12-13","PALL Rweg",43812.25,43812.614583333336,"Davood","Smits","",{"$f":"IF(C413=\"\",\"\",INDEX(Validatie!$Q$2:$Q$6,MATCH(MOD(E413,1),Validatie!$P$2:$P$6,1)))","v":"Vroeg"},"-","Davood Smits",{"$f":"IF(C413=\"\",\"\",IFERROR(MATCH(G413&H413,ValVoorNamen&ValNamen,0),\"Fout\")+1)","v":24}]
[null,null,"2019-12-13","PALL Rweg",43812.25,43812.614583333336,"Swen","de Leeuw","",{"$f":"IF(C414=\"\",\"\",INDEX(Validatie!$Q$2:$Q$6,MATCH(MOD(E414,1),Validatie!$P$2:$P$6,1)))","v":"Vroeg"},"-","Swen de Leeuw",{"$f":"IF(C414=\"\",\"\",IFERROR(MATCH(G414&H414,ValVoorNamen&ValNamen,0),\"Fout\")+1)","v":100}]
[null,null,"2019-12-13","PALL Rweg",43812.25,43812.614583333336,"Saidou","Bosman","",{"$f":"IF(C415=\"\",\"\",INDEX(Validatie!$Q$2:$Q$6,MATCH(MOD(E415,1),Validatie!$P$2:$P$6,1)))","v":"Vroeg"},"-","Saidou Bosman",{"$f":"IF(C415=\"\",\"\",IFERROR(MATCH(G415&H415,ValVoorNamen&ValNamen,0),\"Fout\")+1)","v":92}]
[null,null,"2019-12-13","PALL Rweg",43812.25,43812.614583333336,"Wim","Vogel","",{"$f":"IF(C416=\"\",\"\",INDEX(Validatie!$Q$2:$Q$6,MATCH(MOD(E416,1),Validatie!$P$2:$P$6,1)))","v":"Vroeg"},"-","Wim Vogel",{"$f":"IF(C416=\"\",\"\",IFERROR(MATCH(G416&H416,ValVoorNamen&ValNamen,0),\"Fout\")+1)","v":106}]
[null,null,"2019-12-13","PALL Rweg",43812.25,43812.614583333336,"Quincy","de Koning","",{"$f":"IF(C417=\"\",\"\",INDEX(Validatie!$Q$2:$Q$6,MATCH(MOD(E417,1),Validatie!$P$2:$P$6,1)))","v":"Vroeg"},"-","Quincy de Koning",{"$f":"IF(C417=\"\",\"\",IFERROR(MATCH(G417&H417,ValVoorNamen&ValNamen,0),\"Fout\")+1)","v":81}]
[null,null,"2019-12-13","PALL Rweg",43812.25,43812.614583333336,"Henk","Koster","",{"$f":"IF(C418=\"\",\"\",INDEX(Validatie!$Q$2:$Q$6,MATCH(MOD(E418,1),Validatie!$P$2:$P$6,1)))","v":"Vroeg"},"-","Henk Koster",{"$f":"IF(C418=\"\",\"\",IFERROR(MATCH(G418&H418,ValVoorNamen&ValNamen,0),\"Fout\")+1)","v":46}]
[null,null,"2019-12-13","Reserve ochtend",43812.25,43812.614583333336,"Olcay","de Vos","",{"$f":"IF(C419=\"\",\"\",INDEX(Validatie!$Q$2:$Q$6,MATCH(MOD(E419,1),Validatie!$P$2:$P$6,1)))","v":"Vroeg"},"-","Olcay de Vos",{"$f":"IF(C419=\"\",\"\",IFERROR(MATCH(G419&H419,ValVoorNamen&ValNamen,0),\"Fout\")+1)","v":77}]
[null,null,"2019-12-13","Reserve ochtend",43812.25,43812.614583333336,"Mebrathu","Timmermans","",{"$f":"IF(C420=\"\",\"\",INDEX(Validatie!$Q$2:$Q$6,MATCH(MOD(E420,1),Validatie!$P$2:$P$6,1)))","v":"Vroeg"},"-","Mebrathu Timmermans",{"$f":"IF(C420=\"\",\"\",IFERROR(MATCH(G420&H420,ValVoorNamen&ValNamen,0),\"Fout\")+1)","v":67}]
[null,null,"2019-12-13","Reserve ochtend",43812.25,43812.614583333336,"Daniel","Dijkstra","",{"$f":"IF(C421=\"\",\"\",INDEX(Validatie!$Q$2:$Q$6,MATCH(MOD(E421,1),Validatie!$P$2:$P$6,1)))","v":"Vroeg"},"-","Daniel Dijkstra",{"$f":"IF(C421=\"\",\"\",IFERROR(MATCH(G421&H421,ValVoorNamen&ValNamen,0),\"Fout\")+1)","v":23}]
[null,null,"2019-12-13","SCHM",43812.25,43812.614583333336,"Marjolein","Martens","",{"$f":"IF(C422=\"\",\"\",INDEX(Validatie!$Q$2:$Q$6,MATCH(MOD(E422,1),Validatie!$P$2:$P$6,1)))","v":"Vroeg"},"SCHM","Marjolein Martens",{"$f":"IF(C422=\"\",\"\",IFERROR(MATCH(G422&H422,ValVoorNamen&ValNamen,0),\"Fout\")+1)","v":64}]
[null,null,"2019-12-13","SCHM",43812.25,43812.614583333336,"Piet","Schipper","",{"$f":"IF(C423=\"\",\"\",INDEX(Validatie!$Q$2:$Q$6,MATCH(MOD(E423,1),Validatie!$P$2:$P$6,1)))","v":"Vroeg"},"SCHM","Piet Schipper",{"$f":"IF(C423=\"\",\"\",IFERROR(MATCH(G423&H423,ValVoorNamen&ValNamen,0),\"Fout\")+1)","v":80}]
[null,null,"2019-12-13","SCHM",43812.25,43812.614583333336,"Roy","van der Meulen","",{"$f":"IF(C424=\"\",\"\",INDEX(Validatie!$Q$2:$Q$6,MATCH(MOD(E424,1),Validatie!$P$2:$P$6,1)))","v":"Vroeg"},"SCHM","Roy van der Meulen",{"$f":"IF(C424=\"\",\"\",IFERROR(MATCH(G424&H424,ValVoorNamen&ValNamen,0),\"Fout\")+1)","v":90}]
[null,null,"2019-12-13","SCHM AFV",43812.25,43812.614583333336,"Christiaan","de Wit","",{"$f":"IF(C425=\"\",\"\",INDEX(Validatie!$Q$2:$Q$6,MATCH(MOD(E425,1),Validatie!$P$2:$P$6,1)))","v":"Vroeg"},"AFV","Christiaan de Wit",{"$f":"IF(C425=\"\",\"\",IFERROR(MATCH(G425&H425,ValVoorNamen&ValNamen,0),\"Fout\")+1)","v":22}]
[null,null,"2019-12-13","SCHM AFV",43812.25,43812.614583333336,"Henri","van Dam","",{"$f":"IF(C426=\"\",\"\",INDEX(Validatie!$Q$2:$Q$6,MATCH(MOD(E426,1),Validatie!$P$2:$P$6,1)))","v":"Vroeg"},"AFV","Henri van Dam",{"$f":"IF(C426=\"\",\"\",IFERROR(MATCH(G426&H426,ValVoorNamen&ValNamen,0),\"Fout\")+1)","v":47}]
[null,null,"2019-12-13","SCHM AFV",43812.25,43812.614583333336,"Jan","de Jonge","",{"$f":"IF(C427=\"\",\"\",INDEX(Validatie!$Q$2:$Q$6,MATCH(MOD(E427,1),Validatie!$P$2:$P$6,1)))","v":"Vroeg"},"AFV","Jan de Jonge",{"$f":"IF(C427=\"\",\"\",IFERROR(MATCH(G427&H427,ValVoorNamen&ValNamen,0),\"Fout\")+1)","v":53}]
[null,null,"2019-12-13","SCHM AFV",43812.25,43812.614583333336,"Boyan","van Leeuwen","",{"$f":"IF(C428=\"\",\"\",INDEX(Validatie!$Q$2:$Q$6,MATCH(MOD(E428,1),Validatie!$P$2:$P$6,1)))","v":"Vroeg"},"AFV","Boyan van Leeuwen",{"$f":"IF(C428=\"\",\"\",IFERROR(MATCH(G428&H428,ValVoorNamen&ValNamen,0),\"Fout\")+1)","v":19}]
[null,null,"2019-12-13","SCHM AFV",43812.25,43812.614583333336,"Michel","Jonker","",{"$f":"IF(C429=\"\",\"\",INDEX(Validatie!$Q$2:$Q$6,MATCH(MOD(E429,1),Validatie!$P$2:$P$6,1)))","v":"Vroeg"},"AFV","Michel Jonker",{"$f":"IF(C429=\"\",\"\",IFERROR(MATCH(G429&H429,ValVoorNamen&ValNamen,0),\"Fout\")+1)","v":70}]
[null,null,"2019-12-13","TRSP",43812.25,43812.614583333336,"Anton","Smit","",{"$f":"IF(C430=\"\",\"\",INDEX(Validatie!$Q$2:$Q$6,MATCH(MOD(E430,1),Validatie!$P$2:$P$6,1)))","v":"Vroeg"},"?","Anton Smit",{"$f":"IF(C430=\"\",\"\",IFERROR(MATCH(G430&H430,ValVoorNamen&ValNamen,0),\"Fout\")+1)","v":10}]
[null,null,"2019-12-13","TRSP",43812.25,43812.614583333336,"Henk","Koster","",{"$f":"IF(C431=\"\",\"\",INDEX(Validatie!$Q$2:$Q$6,MATCH(MOD(E431,1),Validatie!$P$2:$P$6,1)))","v":"Vroeg"},"?","Henk Koster",{"$f":"IF(C431=\"\",\"\",IFERROR(MATCH(G431&H431,ValVoorNamen&ValNamen,0),\"Fout\")+1)","v":46}]
[null,null,"2019-12-13","AFV MEP",43812.291666666664,43812.65625,"Rijk","van Doorn","",{"$f":"IF(C432=\"\",\"\",INDEX(Validatie!$Q$2:$Q$6,MATCH(MOD(E432,1),Validatie!$P$2:$P$6,1)))","v":"Vroeg"},"MEP","Rijk van Doorn",{"$f":"IF(C432=\"\",\"\",IFERROR(MATCH(G432&H432,ValVoorNamen&ValNamen,0),\"Fout\")+1)","v":86}]
[null,null,"2019-12-13","Teamleider PALL",43812.3125,43812.677083333336,"Hilko","Prins","",{"$f":"IF(C433=\"\",\"\",INDEX(Validatie!$Q$2:$Q$6,MATCH(MOD(E433,1),Validatie!$P$2:$P$6,1)))","v":"Vroeg"},"?","Hilko Prins",{"$f":"IF(C433=\"\",\"\",IFERROR(MATCH(G433&H433,ValVoorNamen&ValNamen,0),\"Fout\")+1)","v":49}]
[null,null,"2019-12-13","TRSP",43812.333333333336,43812.697916666664,"Harrie","Hoekstra","",{"$f":"IF(C434=\"\",\"\",INDEX(Validatie!$Q$2:$Q$6,MATCH(MOD(E434,1),Validatie!$P$2:$P$6,1)))","v":"Vroeg"},"?","Harrie Hoekstra",{"$f":"IF(C434=\"\",\"\",IFERROR(MATCH(G434&H434,ValVoorNamen&ValNamen,0),\"Fout\")+1)","v":43}]
[null,null,"2019-12-13","SCHM HAS",43812.40625,43812.614583333336,"Paul","van Dongen","",{"$f":"IF(C435=\"\",\"\",INDEX(Validatie!$Q$2:$Q$6,MATCH(MOD(E435,1),Validatie!$P$2:$P$6,1)))","v":"Vroeg"},"HAS","Paul van Dongen",{"$f":"IF(C435=\"\",\"\",IFERROR(MATCH(G435&H435,ValVoorNamen&ValNamen,0),\"Fout\")+1)","v":79}]
[null,null,"2019-12-13","ABB middag",43812.572916666664,43812.9375,"Bile","Hendriks","",{"$f":"IF(C436=\"\",\"\",INDEX(Validatie!$Q$2:$Q$6,MATCH(MOD(E436,1),Validatie!$P$2:$P$6,1)))","v":"Laat"},"ABB","Bile Hendriks",{"$f":"IF(C436=\"\",\"\",IFERROR(MATCH(G436&H436,ValVoorNamen&ValNamen,0),\"Fout\")+1)","v":18}]
[null,null,"2019-12-13","AFV HAS",43812.572916666664,43812.697916666664,"Norbert","de Lange","",{"$f":"IF(C437=\"\",\"\",INDEX(Validatie!$Q$2:$Q$6,MATCH(MOD(E437,1),Validatie!$P$2:$P$6,1)))","v":"Laat"},"HAS","Norbert de Lange",{"$f":"IF(C437=\"\",\"\",IFERROR(MATCH(G437&H437,ValVoorNamen&ValNamen,0),\"Fout\")+1)","v":76}]
[null,null,"2019-12-13","AFV MEP",43812.572916666664,43812.9375,"Houcin","Huisman","",{"$f":"IF(C438=\"\",\"\",INDEX(Validatie!$Q$2:$Q$6,MATCH(MOD(E438,1),Validatie!$P$2:$P$6,1)))","v":"Laat"},"MEP","Houcin Huisman",{"$f":"IF(C438=\"\",\"\",IFERROR(MATCH(G438&H438,ValVoorNamen&ValNamen,0),\"Fout\")+1)","v":51}]
[null,null,"2019-12-13","LCR middag",43812.572916666664,43812.9375,"Klaas","Kramer","",{"$f":"IF(C439=\"\",\"\",INDEX(Validatie!$Q$2:$Q$6,MATCH(MOD(E439,1),Validatie!$P$2:$P$6,1)))","v":"Laat"},"LCR","Klaas Kramer",{"$f":"IF(C439=\"\",\"\",IFERROR(MATCH(G439&H439,ValVoorNamen&ValNamen,0),\"Fout\")+1)","v":59}]
[null,null,"2019-12-13","PALL MEP",43812.614583333336,43812.979166666664,"Latie","van Wijk","",{"$f":"IF(C440=\"\",\"\",INDEX(Validatie!$Q$2:$Q$6,MATCH(MOD(E440,1),Validatie!$P$2:$P$6,1)))","v":"Laat"},"-","Latie van Wijk",{"$f":"IF(C440=\"\",\"\",IFERROR(MATCH(G440&H440,ValVoorNamen&ValNamen,0),\"Fout\")+1)","v":62}]
[null,null,"2019-12-13","PALL MEP",43812.614583333336,43812.979166666664,"Abdurahman Ibrahim","de Vries","",{"$f":"IF(C441=\"\",\"\",INDEX(Validatie!$Q$2:$Q$6,MATCH(MOD(E441,1),Validatie!$P$2:$P$6,1)))","v":"Laat"},"-","Abdurahman Ibrahim de Vries",{"$f":"IF(C441=\"\",\"\",IFERROR(MATCH(G441&H441,ValVoorNamen&ValNamen,0),\"Fout\")+1)","v":4}]
[null,null,"2019-12-13","PALL MEP",43812.614583333336,43812.979166666664,"Michael","Gerritsen","",{"$f":"IF(C442=\"\",\"\",INDEX(Validatie!$Q$2:$Q$6,MATCH(MOD(E442,1),Validatie!$P$2:$P$6,1)))","v":"Laat"},"-","Michael Gerritsen",{"$f":"IF(C442=\"\",\"\",IFERROR(MATCH(G442&H442,ValVoorNamen&ValNamen,0),\"Fout\")+1)","v":69}]
[null,null,"2019-12-13","PALL MEP",43812.614583333336,43812.979166666664,"Hans","van de Ven ","",{"$f":"IF(C443=\"\",\"\",INDEX(Validatie!$Q$2:$Q$6,MATCH(MOD(E443,1),Validatie!$P$2:$P$6,1)))","v":"Laat"},"-","Hans van de Ven ",{"$f":"IF(C443=\"\",\"\",IFERROR(MATCH(G443&H443,ValVoorNamen&ValNamen,0),\"Fout\")+1)","v":42}]
[null,null,"2019-12-13","PALL MEP",43812.614583333336,43812.979166666664,"Jeroen","Post","",{"$f":"IF(C444=\"\",\"\",INDEX(Validatie!$Q$2:$Q$6,MATCH(MOD(E444,1),Validatie!$P$2:$P$6,1)))","v":"Laat"},"-","Jeroen Post",{"$f":"IF(C444=\"\",\"\",IFERROR(MATCH(G444&H444,ValVoorNamen&ValNamen,0),\"Fout\")+1)","v":56}]
[null,null,"2019-12-13","PALL Rweg",43812.614583333336,43812.979166666664,"Akela","van Dijk","",{"$f":"IF(C445=\"\",\"\",INDEX(Validatie!$Q$2:$Q$6,MATCH(MOD(E445,1),Validatie!$P$2:$P$6,1)))","v":"Laat"},"-","Akela van Dijk",{"$f":"IF(C445=\"\",\"\",IFERROR(MATCH(G445&H445,ValVoorNamen&ValNamen,0),\"Fout\")+1)","v":6}]
[null,null,"2019-12-13","PALL Rweg",43812.614583333336,43812.979166666664,"Karrar","Kuiper","",{"$f":"IF(C446=\"\",\"\",INDEX(Validatie!$Q$2:$Q$6,MATCH(MOD(E446,1),Validatie!$P$2:$P$6,1)))","v":"Laat"},"-","Karrar Kuiper",{"$f":"IF(C446=\"\",\"\",IFERROR(MATCH(G446&H446,ValVoorNamen&ValNamen,0),\"Fout\")+1)","v":57}]
[null,null,"2019-12-13","PALL Rweg",43812.614583333336,43812.979166666664,"Sebastian","Kuijpers","",{"$f":"IF(C447=\"\",\"\",INDEX(Validatie!$Q$2:$Q$6,MATCH(MOD(E447,1),Validatie!$P$2:$P$6,1)))","v":"Laat"},"-","Sebastian Kuijpers",{"$f":"IF(C447=\"\",\"\",IFERROR(MATCH(G447&H447,ValVoorNamen&ValNamen,0),\"Fout\")+1)","v":97}]
[null,null,"2019-12-13","PALL Rweg",43812.614583333336,43812.979166666664,"Harry","Maas","",{"$f":"IF(C448=\"\",\"\",INDEX(Validatie!$Q$2:$Q$6,MATCH(MOD(E448,1),Validatie!$P$2:$P$6,1)))","v":"Laat"},"-","Harry Maas",{"$f":"IF(C448=\"\",\"\",IFERROR(MATCH(G448&H448,ValVoorNamen&ValNamen,0),\"Fout\")+1)","v":44}]
[null,null,"2019-12-13","PALL Rweg",43812.614583333336,43812.979166666664,"Apollonia","Meijer","",{"$f":"IF(C449=\"\",\"\",INDEX(Validatie!$Q$2:$Q$6,MATCH(MOD(E449,1),Validatie!$P$2:$P$6,1)))","v":"Laat"},"-","Apollonia Meijer",{"$f":"IF(C449=\"\",\"\",IFERROR(MATCH(G449&H449,ValVoorNamen&ValNamen,0),\"Fout\")+1)","v":11}]
[null,null,"2019-12-13","PALL Rweg",43812.614583333336,43812.979166666664,"Dennis","de Graaf","",{"$f":"IF(C450=\"\",\"\",INDEX(Validatie!$Q$2:$Q$6,MATCH(MOD(E450,1),Validatie!$P$2:$P$6,1)))","v":"Laat"},"-","Dennis de Graaf",{"$f":"IF(C450=\"\",\"\",IFERROR(MATCH(G450&H450,ValVoorNamen&ValNamen,0),\"Fout\")+1)","v":25}]
[null,null,"2019-12-13","PALL Rweg",43812.614583333336,43812.979166666664,"Agathe","van de Berg ","",{"$f":"IF(C451=\"\",\"\",INDEX(Validatie!$Q$2:$Q$6,MATCH(MOD(E451,1),Validatie!$P$2:$P$6,1)))","v":"Laat"},"-","Agathe van de Berg ",{"$f":"IF(C451=\"\",\"\",IFERROR(MATCH(G451&H451,ValVoorNamen&ValNamen,0),\"Fout\")+1)","v":5}]
[null,null,"2019-12-13","PALL Rweg",43812.614583333336,43812.979166666664,"Hagos","van Vliet","",{"$f":"IF(C452=\"\",\"\",INDEX(Validatie!$Q$2:$Q$6,MATCH(MOD(E452,1),Validatie!$P$2:$P$6,1)))","v":"Laat"},"-","Hagos van Vliet",{"$f":"IF(C452=\"\",\"\",IFERROR(MATCH(G452&H452,ValVoorNamen&ValNamen,0),\"Fout\")+1)","v":41}]
[null,null,"2019-12-13","PALL Rweg",43812.614583333336,43812.979166666664,"Heruy","van de Wal ","",{"$f":"IF(C453=\"\",\"\",INDEX(Validatie!$Q$2:$Q$6,MATCH(MOD(E453,1),Validatie!$P$2:$P$6,1)))","v":"Laat"},"-","Heruy van de Wal ",{"$f":"IF(C453=\"\",\"\",IFERROR(MATCH(G453&H453,ValVoorNamen&ValNamen,0),\"Fout\")+1)","v":48}]
[null,null,"2019-12-13","PALL Rweg",43812.614583333336,43812.979166666664,"Hassan","Verhoeven",{"$f":"IF(H454=\"\",\"\",IF(SUMPRODUCT(--(ValVerlofVoornaam=G454),--(ValVerlofNaam=H454),--(ValVerlofVan<=C454),--(ValVerlofTot>=C454)*(1))>0,\"V\",\"\"))","v":""},{"$f":"IF(C454=\"\",\"\",INDEX(Validatie!$Q$2:$Q$6,MATCH(MOD(E454,1),Validatie!$P$2:$P$6,1)))","v":"Laat"},{"$f":"IF(C454=\"\",\"\",IFERROR(VLOOKUP(D454,DataMijnAfdeling,2,0),\"?\"))","v":"-"},"Hassan Verhoeven",{"$f":"IF(C454=\"\",\"\",IFERROR(MATCH(G454&H454,ValVoorNamen&ValNamen,0),\"Fout\")+1)","v":45}]
[null,null,"2019-12-13","PALL Rweg",43812.614583333336,43812.979166666664,"Samantha","Sanders","",{"$f":"IF(C455=\"\",\"\",INDEX(Validatie!$Q$2:$Q$6,MATCH(MOD(E455,1),Validatie!$P$2:$P$6,1)))","v":"Laat"},"-",{"$f":"IF(C455=\"\",\"\",CONCATENATE(G455,\" \",H455))","v":"Samantha Sanders"},{"$f":"IF(C455=\"\",\"\",IFERROR(MATCH(G455&H455,ValVoorNamen&ValNamen,0),\"Fout\")+1)","v":94}]
[null,null,"2019-12-13","PALL Rweg",43812.614583333336,43812.979166666664,"Sied"," van der Pol","",{"$f":"IF(C456=\"\",\"\",INDEX(Validatie!$Q$2:$Q$6,MATCH(MOD(E456,1),Validatie!$P$2:$P$6,1)))","v":"Laat"},"-","Sied  van der Pol",{"$f":"IF(C456=\"\",\"\",IFERROR(MATCH(G456&H456,ValVoorNamen&ValNamen,0),\"Fout\")+1)","v":99}]
[null,null,"2019-12-13","PALL Rweg",43812.614583333336,43812.979166666664,"Laszlo","Scholten","",{"$f":"IF(C457=\"\",\"\",INDEX(Validatie!$Q$2:$Q$6,MATCH(MOD(E457,1),Validatie!$P$2:$P$6,1)))","v":"Laat"},"-","Laszlo Scholten",{"$f":"IF(C457=\"\",\"\",IFERROR(MATCH(G457&H457,ValVoorNamen&ValNamen,0),\"Fout\")+1)","v":61}]
[null,null,"2019-12-13","PALL Rweg",43812.614583333336,43812.979166666664,"Atobhran","de Groot","",{"$f":"IF(C458=\"\",\"\",INDEX(Validatie!$Q$2:$Q$6,MATCH(MOD(E458,1),Validatie!$P$2:$P$6,1)))","v":"Laat"},"-","Atobhran de Groot",{"$f":"IF(C458=\"\",\"\",IFERROR(MATCH(G458&H458,ValVoorNamen&ValNamen,0),\"Fout\")+1)","v":14}]
[null,null,"2019-12-13","PALL Rweg",43812.614583333336,43812.979166666664,"Abdul","Jansen","",{"$f":"IF(C459=\"\",\"\",INDEX(Validatie!$Q$2:$Q$6,MATCH(MOD(E459,1),Validatie!$P$2:$P$6,1)))","v":"Laat"},"-","Abdul Jansen",{"$f":"IF(C459=\"\",\"\",IFERROR(MATCH(G459&H459,ValVoorNamen&ValNamen,0),\"Fout\")+1)","v":3}]
[null,null,"2019-12-13","PALL Rweg",43812.614583333336,43812.979166666664,"Naoufel","van de Velde ","",{"$f":"IF(C460=\"\",\"\",INDEX(Validatie!$Q$2:$Q$6,MATCH(MOD(E460,1),Validatie!$P$2:$P$6,1)))","v":"Laat"},"-","Naoufel van de Velde ",{"$f":"IF(C460=\"\",\"\",IFERROR(MATCH(G460&H460,ValVoorNamen&ValNamen,0),\"Fout\")+1)","v":73}]
[null,null,"2019-12-13","PALL Rweg",43812.614583333336,43812.979166666664,"Jarek","Kuipers","",{"$f":"IF(C461=\"\",\"\",INDEX(Validatie!$Q$2:$Q$6,MATCH(MOD(E461,1),Validatie!$P$2:$P$6,1)))","v":"Laat"},"-","Jarek Kuipers",{"$f":"IF(C461=\"\",\"\",IFERROR(MATCH(G461&H461,ValVoorNamen&ValNamen,0),\"Fout\")+1)","v":54}]
[null,null,"2019-12-13","PALL Rweg",43812.614583333336,43812.979166666664,"Martijn","de Ruiter","",{"$f":"IF(C462=\"\",\"\",INDEX(Validatie!$Q$2:$Q$6,MATCH(MOD(E462,1),Validatie!$P$2:$P$6,1)))","v":"Laat"},"-","Martijn de Ruiter",{"$f":"IF(C462=\"\",\"\",IFERROR(MATCH(G462&H462,ValVoorNamen&ValNamen,0),\"Fout\")+1)","v":66}]
[null,null,"2019-12-13","PALL Rweg",43812.614583333336,43812.979166666664,"Mark","Vink","",{"$f":"IF(C463=\"\",\"\",INDEX(Validatie!$Q$2:$Q$6,MATCH(MOD(E463,1),Validatie!$P$2:$P$6,1)))","v":"Laat"},"-","Mark Vink",{"$f":"IF(C463=\"\",\"\",IFERROR(MATCH(G463&H463,ValVoorNamen&ValNamen,0),\"Fout\")+1)","v":65}]
[null,null,"2019-12-13","PALL Rweg",43812.614583333336,43812.979166666664,"Abdiqadir","de Jong","",{"$f":"IF(C464=\"\",\"\",INDEX(Validatie!$Q$2:$Q$6,MATCH(MOD(E464,1),Validatie!$P$2:$P$6,1)))","v":"Laat"},"-","Abdiqadir de Jong",{"$f":"IF(C464=\"\",\"\",IFERROR(MATCH(G464&H464,ValVoorNamen&ValNamen,0),\"Fout\")+1)","v":2}]
[null,null,"2019-12-13","PALL Rweg",43812.614583333336,43812.979166666664,"Nexhmedi","Willemsen","",{"$f":"IF(C465=\"\",\"\",INDEX(Validatie!$Q$2:$Q$6,MATCH(MOD(E465,1),Validatie!$P$2:$P$6,1)))","v":"Laat"},"-","Nexhmedi Willemsen",{"$f":"IF(C465=\"\",\"\",IFERROR(MATCH(G465&H465,ValVoorNamen&ValNamen,0),\"Fout\")+1)","v":74}]
[null,null,"2019-12-13","SCHM",43812.614583333336,43812.979166666664,"Erik","de Haan","",{"$f":"IF(C466=\"\",\"\",INDEX(Validatie!$Q$2:$Q$6,MATCH(MOD(E466,1),Validatie!$P$2:$P$6,1)))","v":"Laat"},"SCHM","Erik de Haan",{"$f":"IF(C466=\"\",\"\",IFERROR(MATCH(G466&H466,ValVoorNamen&ValNamen,0),\"Fout\")+1)","v":30}]
[null,null,"2019-12-13","SCHM",43812.614583333336,43812.979166666664,"Patrick","Bosch","",{"$f":"IF(C467=\"\",\"\",INDEX(Validatie!$Q$2:$Q$6,MATCH(MOD(E467,1),Validatie!$P$2:$P$6,1)))","v":"Laat"},"SCHM","Patrick Bosch",{"$f":"IF(C467=\"\",\"\",IFERROR(MATCH(G467&H467,ValVoorNamen&ValNamen,0),\"Fout\")+1)","v":78}]
[null,null,"2019-12-13","SCHM",43812.614583333336,43812.979166666664,"Rolinka","van den Bosch","",{"$f":"IF(C468=\"\",\"\",INDEX(Validatie!$Q$2:$Q$6,MATCH(MOD(E468,1),Validatie!$P$2:$P$6,1)))","v":"Laat"},"SCHM","Rolinka van den Bosch",{"$f":"IF(C468=\"\",\"\",IFERROR(MATCH(G468&H468,ValVoorNamen&ValNamen,0),\"Fout\")+1)","v":89}]
[null,null,"2019-12-13","SCHM AFV",43812.614583333336,43812.979166666664,"Miquel","van Loon","",{"$f":"IF(C469=\"\",\"\",INDEX(Validatie!$Q$2:$Q$6,MATCH(MOD(E469,1),Validatie!$P$2:$P$6,1)))","v":"Laat"},"AFV","Miquel van Loon",{"$f":"IF(C469=\"\",\"\",IFERROR(MATCH(G469&H469,ValVoorNamen&ValNamen,0),\"Fout\")+1)","v":71}]
[null,null,"2019-12-13","SCHM AFV",43812.614583333336,43812.979166666664,"Paul","van Dongen","",{"$f":"IF(C470=\"\",\"\",INDEX(Validatie!$Q$2:$Q$6,MATCH(MOD(E470,1),Validatie!$P$2:$P$6,1)))","v":"Laat"},"AFV","Paul van Dongen",{"$f":"IF(C470=\"\",\"\",IFERROR(MATCH(G470&H470,ValVoorNamen&ValNamen,0),\"Fout\")+1)","v":79}]
[null,null,"2019-12-13","SCHM AFV",43812.614583333336,43812.979166666664,"Sebastiaan","Mol","",{"$f":"IF(C471=\"\",\"\",INDEX(Validatie!$Q$2:$Q$6,MATCH(MOD(E471,1),Validatie!$P$2:$P$6,1)))","v":"Laat"},"AFV","Sebastiaan Mol",{"$f":"IF(C471=\"\",\"\",IFERROR(MATCH(G471&H471,ValVoorNamen&ValNamen,0),\"Fout\")+1)","v":96}]
[null,null,"2019-12-13","SCHM AFV",43812.614583333336,43812.979166666664,"Baki","Bos","",{"$f":"IF(C472=\"\",\"\",INDEX(Validatie!$Q$2:$Q$6,MATCH(MOD(E472,1),Validatie!$P$2:$P$6,1)))","v":"Laat"},"AFV","Baki Bos",{"$f":"IF(C472=\"\",\"\",IFERROR(MATCH(G472&H472,ValVoorNamen&ValNamen,0),\"Fout\")+1)","v":15}]
[null,null,"2019-12-13","SCHM AFV",43812.614583333336,43812.979166666664,"Ilker","Peeters","",{"$f":"IF(C473=\"\",\"\",INDEX(Validatie!$Q$2:$Q$6,MATCH(MOD(E473,1),Validatie!$P$2:$P$6,1)))","v":"Laat"},"AFV","Ilker Peeters",{"$f":"IF(C473=\"\",\"\",IFERROR(MATCH(G473&H473,ValVoorNamen&ValNamen,0),\"Fout\")+1)","v":52}]
[null,null,"2019-12-13","SCHM AFV",43812.614583333336,43812.979166666664,"Flavi","van der Heyden","",{"$f":"IF(C474=\"\",\"\",INDEX(Validatie!$Q$2:$Q$6,MATCH(MOD(E474,1),Validatie!$P$2:$P$6,1)))","v":"Laat"},"AFV","Flavi van der Heyden",{"$f":"IF(C474=\"\",\"\",IFERROR(MATCH(G474&H474,ValVoorNamen&ValNamen,0),\"Fout\")+1)","v":37}]
[null,null,"2019-12-13","TRSP",43812.614583333336,43812.979166666664,"Emsud","Kok","",{"$f":"IF(C475=\"\",\"\",INDEX(Validatie!$Q$2:$Q$6,MATCH(MOD(E475,1),Validatie!$P$2:$P$6,1)))","v":"Laat"},"?","Emsud Kok",{"$f":"IF(C475=\"\",\"\",IFERROR(MATCH(G475&H475,ValVoorNamen&ValNamen,0),\"Fout\")+1)","v":28}]
[null,null,"2019-12-13","TRSP",43812.614583333336,43812.979166666664,"Reinder","Koning","",{"$f":"IF(C476=\"\",\"\",INDEX(Validatie!$Q$2:$Q$6,MATCH(MOD(E476,1),Validatie!$P$2:$P$6,1)))","v":"Laat"},"?","Reinder Koning",{"$f":"IF(C476=\"\",\"\",IFERROR(MATCH(G476&H476,ValVoorNamen&ValNamen,0),\"Fout\")+1)","v":83}]
[null,null,"2019-12-13","PALL Rweg",43812.645833333336,43812.979166666664,"Amanuel","Janssen","",{"$f":"IF(C477=\"\",\"\",INDEX(Validatie!$Q$2:$Q$6,MATCH(MOD(E477,1),Validatie!$P$2:$P$6,1)))","v":"Laat"},"-","Amanuel Janssen",{"$f":"IF(C477=\"\",\"\",IFERROR(MATCH(G477&H477,ValVoorNamen&ValNamen,0),\"Fout\")+1)","v":8}]
[null,null,"2019-12-13","Reserve middag",43812.666666666664,43812.979166666664,"Bereket","Peters","",{"$f":"IF(C478=\"\",\"\",INDEX(Validatie!$Q$2:$Q$6,MATCH(MOD(E478,1),Validatie!$P$2:$P$6,1)))","v":"Laat"},"-","Bereket Peters",{"$f":"IF(C478=\"\",\"\",IFERROR(MATCH(G478&H478,ValVoorNamen&ValNamen,0),\"Fout\")+1)","v":17}]
[null,null,"2019-12-13","Reserve middag",43812.666666666664,43812.979166666664,"Gebrehiwet","Schouten","",{"$f":"IF(C479=\"\",\"\",INDEX(Validatie!$Q$2:$Q$6,MATCH(MOD(E479,1),Validatie!$P$2:$P$6,1)))","v":"Laat"},"-","Gebrehiwet Schouten",{"$f":"IF(C479=\"\",\"\",IFERROR(MATCH(G479&H479,ValVoorNamen&ValNamen,0),\"Fout\")+1)","v":38}]
[null,null,"2019-12-13","Reserve middag",43812.666666666664,43812.979166666664,"Robel","Hermans","",{"$f":"IF(C480=\"\",\"\",INDEX(Validatie!$Q$2:$Q$6,MATCH(MOD(E480,1),Validatie!$P$2:$P$6,1)))","v":"Laat"},"-","Robel Hermans",{"$f":"IF(C480=\"\",\"\",IFERROR(MATCH(G480&H480,ValVoorNamen&ValNamen,0),\"Fout\")+1)","v":87}]
[null,null,"2019-12-13","SCHM HAS",43812.697916666664,43812.9375,"Norbert","de Lange","",{"$f":"IF(C481=\"\",\"\",INDEX(Validatie!$Q$2:$Q$6,MATCH(MOD(E481,1),Validatie!$P$2:$P$6,1)))","v":"Laat"},"HAS","Norbert de Lange",{"$f":"IF(C481=\"\",\"\",IFERROR(MATCH(G481&H481,ValVoorNamen&ValNamen,0),\"Fout\")+1)","v":76}]
[null,null,"2019-12-14","ABB weekenddienst",43813.333333333336,43813.875,"Niek","Smeets","",{"$f":"IF(C482=\"\",\"\",INDEX(Validatie!$Q$2:$Q$6,MATCH(MOD(E482,1),Validatie!$P$2:$P$6,1)))","v":"Vroeg"},"ABB","Niek Smeets",{"$f":"IF(C482=\"\",\"\",IFERROR(MATCH(G482&H482,ValVoorNamen&ValNamen,0),\"Fout\")+1)","v":75}]
[null,null,null,null,null,null,null,null,"",{"$f":"IF(C483=\"\",\"\",INDEX(Validatie!$Q$2:$Q$6,MATCH(MOD(E483,1),Validatie!$P$2:$P$6,1)))","v":""},"","",{"$f":"IF(C483=\"\",\"\",IFERROR(MATCH(G483&H483,ValVoorNamen&ValNamen,0),\"Fout\")+1)","v":""}]
[null,null,null,null,null,null,null,null,"",{"$f":"IF(C484=\"\",\"\",INDEX(Validatie!$Q$2:$Q$6,MATCH(MOD(E484,1),Validatie!$P$2:$P$6,1)))","v":""},"","",{"$f":"IF(C484=\"\",\"\",IFERROR(MATCH(G484&H484,ValVoorNamen&ValNamen,0),\"Fout\")+1)","v":""}]
[null,null,null,null,null,null,null,null,"",{"$f":"IF(C485=\"\",\"\",INDEX(Validatie!$Q$2:$Q$6,MATCH(MOD(E485,1),Validatie!$P$2:$P$6,1)))","v":""},"","",{"$f":"IF(C485=\"\",\"\",IFERROR(MATCH(G485&H485,ValVoorNamen&ValNamen,0),\"Fout\")+1)","v":""}]
[null,null,null,null,null,null,null,null,"",{"$f":"IF(C486=\"\",\"\",INDEX(Validatie!$Q$2:$Q$6,MATCH(MOD(E486,1),Validatie!$P$2:$P$6,1)))","v":""},"","",{"$f":"IF(C486=\"\",\"\",IFERROR(MATCH(G486&H486,ValVoorNamen&ValNamen,0),\"Fout\")+1)","v":""}]
[null,null,null,null,null,null,null,null,"",{"$f":"IF(C487=\"\",\"\",INDEX(Validatie!$Q$2:$Q$6,MATCH(MOD(E487,1),Validatie!$P$2:$P$6,1)))","v":""},"","",{"$f":"IF(C487=\"\",\"\",IFERROR(MATCH(G487&H487,ValVoorNamen&ValNamen,0),\"Fout\")+1)","v":""}]
[null,null,null,null,null,null,null,null,"",{"$f":"IF(C488=\"\",\"\",INDEX(Validatie!$Q$2:$Q$6,MATCH(MOD(E488,1),Validatie!$P$2:$P$6,1)))","v":""},"","",{"$f":"IF(C488=\"\",\"\",IFERROR(MATCH(G488&H488,ValVoorNamen&ValNamen,0),\"Fout\")+1)","v":""}]
[null,null,null,null,null,null,null,null,"",{"$f":"IF(C489=\"\",\"\",INDEX(Validatie!$Q$2:$Q$6,MATCH(MOD(E489,1),Validatie!$P$2:$P$6,1)))","v":""},"","",{"$f":"IF(C489=\"\",\"\",IFERROR(MATCH(G489&H489,ValVoorNamen&ValNamen,0),\"Fout\")+1)","v":""}]
[null,null,null,null,null,null,null,null,"",{"$f":"IF(C490=\"\",\"\",INDEX(Validatie!$Q$2:$Q$6,MATCH(MOD(E490,1),Validatie!$P$2:$P$6,1)))","v":""},"","",{"$f":"IF(C490=\"\",\"\",IFERROR(MATCH(G490&H490,ValVoorNamen&ValNamen,0),\"Fout\")+1)","v":""}]
[null,null,null,null,null,null,null,null,"",{"$f":"IF(C491=\"\",\"\",INDEX(Validatie!$Q$2:$Q$6,MATCH(MOD(E491,1),Validatie!$P$2:$P$6,1)))","v":""},"","",{"$f":"IF(C491=\"\",\"\",IFERROR(MATCH(G491&H491,ValVoorNamen&ValNamen,0),\"Fout\")+1)","v":""}]
[null,null,null,null,null,null,null,null,"",{"$f":"IF(C492=\"\",\"\",INDEX(Validatie!$Q$2:$Q$6,MATCH(MOD(E492,1),Validatie!$P$2:$P$6,1)))","v":""},"","",{"$f":"IF(C492=\"\",\"\",IFERROR(MATCH(G492&H492,ValVoorNamen&ValNamen,0),\"Fout\")+1)","v":""}]
[null,null,null,null,null,null,null,null,"",{"$f":"IF(C493=\"\",\"\",INDEX(Validatie!$Q$2:$Q$6,MATCH(MOD(E493,1),Validatie!$P$2:$P$6,1)))","v":""},"","",{"$f":"IF(C493=\"\",\"\",IFERROR(MATCH(G493&H493,ValVoorNamen&ValNamen,0),\"Fout\")+1)","v":""}]
[null,null,null,null,null,null,null,null,"",{"$f":"IF(C494=\"\",\"\",INDEX(Validatie!$Q$2:$Q$6,MATCH(MOD(E494,1),Validatie!$P$2:$P$6,1)))","v":""},"","",{"$f":"IF(C494=\"\",\"\",IFERROR(MATCH(G494&H494,ValVoorNamen&ValNamen,0),\"Fout\")+1)","v":""}]
[null,null,null,null,null,null,null,null,"",{"$f":"IF(C495=\"\",\"\",INDEX(Validatie!$Q$2:$Q$6,MATCH(MOD(E495,1),Validatie!$P$2:$P$6,1)))","v":""},"","",{"$f":"IF(C495=\"\",\"\",IFERROR(MATCH(G495&H495,ValVoorNamen&ValNamen,0),\"Fout\")+1)","v":""}]
[null,null,null,null,null,null,null,null,"",{"$f":"IF(C496=\"\",\"\",INDEX(Validatie!$Q$2:$Q$6,MATCH(MOD(E496,1),Validatie!$P$2:$P$6,1)))","v":""},"","",{"$f":"IF(C496=\"\",\"\",IFERROR(MATCH(G496&H496,ValVoorNamen&ValNamen,0),\"Fout\")+1)","v":""}]
[null,null,null,null,null,null,null,null,"",{"$f":"IF(C497=\"\",\"\",INDEX(Validatie!$Q$2:$Q$6,MATCH(MOD(E497,1),Validatie!$P$2:$P$6,1)))","v":""},"","",{"$f":"IF(C497=\"\",\"\",IFERROR(MATCH(G497&H497,ValVoorNamen&ValNamen,0),\"Fout\")+1)","v":""}]
[null,null,null,null,null,null,null,null,"",{"$f":"IF(C498=\"\",\"\",INDEX(Validatie!$Q$2:$Q$6,MATCH(MOD(E498,1),Validatie!$P$2:$P$6,1)))","v":""},"","",{"$f":"IF(C498=\"\",\"\",IFERROR(MATCH(G498&H498,ValVoorNamen&ValNamen,0),\"Fout\")+1)","v":""}]
[null,null,null,null,null,null,null,null,"",{"$f":"IF(C499=\"\",\"\",INDEX(Validatie!$Q$2:$Q$6,MATCH(MOD(E499,1),Validatie!$P$2:$P$6,1)))","v":""},"","",{"$f":"IF(C499=\"\",\"\",IFERROR(MATCH(G499&H499,ValVoorNamen&ValNamen,0),\"Fout\")+1)","v":""}]
[null,null,null,null,null,null,null,null,"",{"$f":"IF(C500=\"\",\"\",INDEX(Validatie!$Q$2:$Q$6,MATCH(MOD(E500,1),Validatie!$P$2:$P$6,1)))","v":""},"","",{"$f":"IF(C500=\"\",\"\",IFERROR(MATCH(G500&H500,ValVoorNamen&ValNamen,0),\"Fout\")+1)","v":""}]
[null,null,null,null,null,null,null,null,"",{"$f":"IF(C501=\"\",\"\",INDEX(Validatie!$Q$2:$Q$6,MATCH(MOD(E501,1),Validatie!$P$2:$P$6,1)))","v":""},"","",{"$f":"IF(C501=\"\",\"\",IFERROR(MATCH(G501&H501,ValVoorNamen&ValNamen,0),\"Fout\")+1)","v":""}]
[null,null,null,null,null,null,null,null,"",{"$f":"IF(C502=\"\",\"\",INDEX(Validatie!$Q$2:$Q$6,MATCH(MOD(E502,1),Validatie!$P$2:$P$6,1)))","v":""},"","",{"$f":"IF(C502=\"\",\"\",IFERROR(MATCH(G502&H502,ValVoorNamen&ValNamen,0),\"Fout\")+1)","v":""}]
[null,null,null,null,null,null,null,null,"",{"$f":"IF(C503=\"\",\"\",INDEX(Validatie!$Q$2:$Q$6,MATCH(MOD(E503,1),Validatie!$P$2:$P$6,1)))","v":""},"","",{"$f":"IF(C503=\"\",\"\",IFERROR(MATCH(G503&H503,ValVoorNamen&ValNamen,0),\"Fout\")+1)","v":""}]
[null,null,null,null,null,null,null,null,"",{"$f":"IF(C504=\"\",\"\",INDEX(Validatie!$Q$2:$Q$6,MATCH(MOD(E504,1),Validatie!$P$2:$P$6,1)))","v":""},"","",{"$f":"IF(C504=\"\",\"\",IFERROR(MATCH(G504&H504,ValVoorNamen&ValNamen,0),\"Fout\")+1)","v":""}]
[null,null,null,null,null,null,null,null,"",{"$f":"IF(C505=\"\",\"\",INDEX(Validatie!$Q$2:$Q$6,MATCH(MOD(E505,1),Validatie!$P$2:$P$6,1)))","v":""},"","",{"$f":"IF(C505=\"\",\"\",IFERROR(MATCH(G505&H505,ValVoorNamen&ValNamen,0),\"Fout\")+1)","v":""}]
[null,null,null,null,null,null,null,null,"",{"$f":"IF(C506=\"\",\"\",INDEX(Validatie!$Q$2:$Q$6,MATCH(MOD(E506,1),Validatie!$P$2:$P$6,1)))","v":""},"","",{"$f":"IF(C506=\"\",\"\",IFERROR(MATCH(G506&H506,ValVoorNamen&ValNamen,0),\"Fout\")+1)","v":""}]
[null,null,null,null,null,null,null,null,"",{"$f":"IF(C507=\"\",\"\",INDEX(Validatie!$Q$2:$Q$6,MATCH(MOD(E507,1),Validatie!$P$2:$P$6,1)))","v":""},"","",{"$f":"IF(C507=\"\",\"\",IFERROR(MATCH(G507&H507,ValVoorNamen&ValNamen,0),\"Fout\")+1)","v":""}]
[null,null,null,null,null,null,null,null,"",{"$f":"IF(C508=\"\",\"\",INDEX(Validatie!$Q$2:$Q$6,MATCH(MOD(E508,1),Validatie!$P$2:$P$6,1)))","v":""},"","",{"$f":"IF(C508=\"\",\"\",IFERROR(MATCH(G508&H508,ValVoorNamen&ValNamen,0),\"Fout\")+1)","v":""}]
[null,null,null,null,null,null,null,null,"",{"$f":"IF(C509=\"\",\"\",INDEX(Validatie!$Q$2:$Q$6,MATCH(MOD(E509,1),Validatie!$P$2:$P$6,1)))","v":""},"","",{"$f":"IF(C509=\"\",\"\",IFERROR(MATCH(G509&H509,ValVoorNamen&ValNamen,0),\"Fout\")+1)","v":""}]
[null,null,null,null,null,null,null,null,"",{"$f":"IF(C510=\"\",\"\",INDEX(Validatie!$Q$2:$Q$6,MATCH(MOD(E510,1),Validatie!$P$2:$P$6,1)))","v":""},"","",{"$f":"IF(C510=\"\",\"\",IFERROR(MATCH(G510&H510,ValVoorNamen&ValNamen,0),\"Fout\")+1)","v":""}]
[null,null,null,null,null,null,null,null,"",{"$f":"IF(C511=\"\",\"\",INDEX(Validatie!$Q$2:$Q$6,MATCH(MOD(E511,1),Validatie!$P$2:$P$6,1)))","v":""},"","",{"$f":"IF(C511=\"\",\"\",IFERROR(MATCH(G511&H511,ValVoorNamen&ValNamen,0),\"Fout\")+1)","v":""}]
[null,null,null,null,null,null,null,null,"",{"$f":"IF(C512=\"\",\"\",INDEX(Validatie!$Q$2:$Q$6,MATCH(MOD(E512,1),Validatie!$P$2:$P$6,1)))","v":""},"","",{"$f":"IF(C512=\"\",\"\",IFERROR(MATCH(G512&H512,ValVoorNamen&ValNamen,0),\"Fout\")+1)","v":""}]
[null,null,null,null,null,null,null,null,"",{"$f":"IF(C513=\"\",\"\",INDEX(Validatie!$Q$2:$Q$6,MATCH(MOD(E513,1),Validatie!$P$2:$P$6,1)))","v":""},"","",{"$f":"IF(C513=\"\",\"\",IFERROR(MATCH(G513&H513,ValVoorNamen&ValNamen,0),\"Fout\")+1)","v":""}]
[null,null,null,null,null,null,null,null,"",{"$f":"IF(C514=\"\",\"\",INDEX(Validatie!$Q$2:$Q$6,MATCH(MOD(E514,1),Validatie!$P$2:$P$6,1)))","v":""},"","",{"$f":"IF(C514=\"\",\"\",IFERROR(MATCH(G514&H514,ValVoorNamen&ValNamen,0),\"Fout\")+1)","v":""}]
[null,null,null,null,null,null,null,null,"",{"$f":"IF(C515=\"\",\"\",INDEX(Validatie!$Q$2:$Q$6,MATCH(MOD(E515,1),Validatie!$P$2:$P$6,1)))","v":""},"","",{"$f":"IF(C515=\"\",\"\",IFERROR(MATCH(G515&H515,ValVoorNamen&ValNamen,0),\"Fout\")+1)","v":""}]
[null,null,null,null,null,null,null,null,"",{"$f":"IF(C516=\"\",\"\",INDEX(Validatie!$Q$2:$Q$6,MATCH(MOD(E516,1),Validatie!$P$2:$P$6,1)))","v":""},"","",{"$f":"IF(C516=\"\",\"\",IFERROR(MATCH(G516&H516,ValVoorNamen&ValNamen,0),\"Fout\")+1)","v":""}]
[null,null,null,null,null,null,null,null,"",{"$f":"IF(C517=\"\",\"\",INDEX(Validatie!$Q$2:$Q$6,MATCH(MOD(E517,1),Validatie!$P$2:$P$6,1)))","v":""},"","",{"$f":"IF(C517=\"\",\"\",IFERROR(MATCH(G517&H517,ValVoorNamen&ValNamen,0),\"Fout\")+1)","v":""}]
[null,null,null,null,null,null,null,null,{"$f":"IF(H518=\"\",\"\",IF(SUMPRODUCT(--(ValVerlofVoornaam=G518),--(ValVerlofNaam=H518),--(ValVerlofVan<=C518),--(ValVerlofTot>=C518)*(1))>0,\"V\",\"\"))","v":""},{"$f":"IF(C518=\"\",\"\",INDEX(Validatie!$Q$2:$Q$6,MATCH(MOD(E518,1),Validatie!$P$2:$P$6,1)))","v":""},{"$f":"IF(C518=\"\",\"\",IFERROR(VLOOKUP(D518,DataMijnAfdeling,2,0),\"?\"))","v":""},"",{"$f":"IF(C518=\"\",\"\",IFERROR(MATCH(G518&H518,ValVoorNamen&ValNamen,0),\"Fout\")+1)","v":""}]
[null,null,null,null,null,null,null,null,"",{"$f":"IF(C519=\"\",\"\",INDEX(Validatie!$Q$2:$Q$6,MATCH(MOD(E519,1),Validatie!$P$2:$P$6,1)))","v":""},"",{"$f":"IF(C519=\"\",\"\",CONCATENATE(G519,\" \",H519))","v":""},{"$f":"IF(C519=\"\",\"\",IFERROR(MATCH(G519&H519,ValVoorNamen&ValNamen,0),\"Fout\")+1)","v":""}]
[null,null,null,null,null,null,null,null,"",{"$f":"IF(C520=\"\",\"\",INDEX(Validatie!$Q$2:$Q$6,MATCH(MOD(E520,1),Validatie!$P$2:$P$6,1)))","v":""},"","",{"$f":"IF(C520=\"\",\"\",IFERROR(MATCH(G520&H520,ValVoorNamen&ValNamen,0),\"Fout\")+1)","v":""}]
[null,null,null,null,null,null,null,null,"",{"$f":"IF(C521=\"\",\"\",INDEX(Validatie!$Q$2:$Q$6,MATCH(MOD(E521,1),Validatie!$P$2:$P$6,1)))","v":""},"","",{"$f":"IF(C521=\"\",\"\",IFERROR(MATCH(G521&H521,ValVoorNamen&ValNamen,0),\"Fout\")+1)","v":""}]
[null,null,null,null,null,null,null,null,"",{"$f":"IF(C522=\"\",\"\",INDEX(Validatie!$Q$2:$Q$6,MATCH(MOD(E522,1),Validatie!$P$2:$P$6,1)))","v":""},"","",{"$f":"IF(C522=\"\",\"\",IFERROR(MATCH(G522&H522,ValVoorNamen&ValNamen,0),\"Fout\")+1)","v":""}]
[null,null,null,null,null,null,null,null,"",{"$f":"IF(C523=\"\",\"\",INDEX(Validatie!$Q$2:$Q$6,MATCH(MOD(E523,1),Validatie!$P$2:$P$6,1)))","v":""},"","",{"$f":"IF(C523=\"\",\"\",IFERROR(MATCH(G523&H523,ValVoorNamen&ValNamen,0),\"Fout\")+1)","v":""}]
[null,null,null,null,null,null,null,null,"",{"$f":"IF(C524=\"\",\"\",INDEX(Validatie!$Q$2:$Q$6,MATCH(MOD(E524,1),Validatie!$P$2:$P$6,1)))","v":""},"","",{"$f":"IF(C524=\"\",\"\",IFERROR(MATCH(G524&H524,ValVoorNamen&ValNamen,0),\"Fout\")+1)","v":""}]
[null,null,null,null,null,null,null,null,"",{"$f":"IF(C525=\"\",\"\",INDEX(Validatie!$Q$2:$Q$6,MATCH(MOD(E525,1),Validatie!$P$2:$P$6,1)))","v":""},"","",{"$f":"IF(C525=\"\",\"\",IFERROR(MATCH(G525&H525,ValVoorNamen&ValNamen,0),\"Fout\")+1)","v":""}]
[null,null,null,null,null,null,null,null,"",{"$f":"IF(C526=\"\",\"\",INDEX(Validatie!$Q$2:$Q$6,MATCH(MOD(E526,1),Validatie!$P$2:$P$6,1)))","v":""},"","",{"$f":"IF(C526=\"\",\"\",IFERROR(MATCH(G526&H526,ValVoorNamen&ValNamen,0),\"Fout\")+1)","v":""}]
[null,null,null,null,null,null,null,null,"",{"$f":"IF(C527=\"\",\"\",INDEX(Validatie!$Q$2:$Q$6,MATCH(MOD(E527,1),Validatie!$P$2:$P$6,1)))","v":""},"","",{"$f":"IF(C527=\"\",\"\",IFERROR(MATCH(G527&H527,ValVoorNamen&ValNamen,0),\"Fout\")+1)","v":""}]
[null,null,null,null,null,null,null,null,"",{"$f":"IF(C528=\"\",\"\",INDEX(Validatie!$Q$2:$Q$6,MATCH(MOD(E528,1),Validatie!$P$2:$P$6,1)))","v":""},"","",{"$f":"IF(C528=\"\",\"\",IFERROR(MATCH(G528&H528,ValVoorNamen&ValNamen,0),\"Fout\")+1)","v":""}]
[null,null,null,null,null,null,null,null,"",{"$f":"IF(C529=\"\",\"\",INDEX(Validatie!$Q$2:$Q$6,MATCH(MOD(E529,1),Validatie!$P$2:$P$6,1)))","v":""},"","",{"$f":"IF(C529=\"\",\"\",IFERROR(MATCH(G529&H529,ValVoorNamen&ValNamen,0),\"Fout\")+1)","v":""}]
[null,null,null,null,null,null,null,null,"",{"$f":"IF(C530=\"\",\"\",INDEX(Validatie!$Q$2:$Q$6,MATCH(MOD(E530,1),Validatie!$P$2:$P$6,1)))","v":""},"","",{"$f":"IF(C530=\"\",\"\",IFERROR(MATCH(G530&H530,ValVoorNamen&ValNamen,0),\"Fout\")+1)","v":""}]
[null,null,null,null,null,null,null,null,"",{"$f":"IF(C531=\"\",\"\",INDEX(Validatie!$Q$2:$Q$6,MATCH(MOD(E531,1),Validatie!$P$2:$P$6,1)))","v":""},"","",{"$f":"IF(C531=\"\",\"\",IFERROR(MATCH(G531&H531,ValVoorNamen&ValNamen,0),\"Fout\")+1)","v":""}]
[null,null,null,null,null,null,null,null,"",{"$f":"IF(C532=\"\",\"\",INDEX(Validatie!$Q$2:$Q$6,MATCH(MOD(E532,1),Validatie!$P$2:$P$6,1)))","v":""},"","",{"$f":"IF(C532=\"\",\"\",IFERROR(MATCH(G532&H532,ValVoorNamen&ValNamen,0),\"Fout\")+1)","v":""}]
[null,null,null,null,null,null,null,null,"",{"$f":"IF(C533=\"\",\"\",INDEX(Validatie!$Q$2:$Q$6,MATCH(MOD(E533,1),Validatie!$P$2:$P$6,1)))","v":""},"","",{"$f":"IF(C533=\"\",\"\",IFERROR(MATCH(G533&H533,ValVoorNamen&ValNamen,0),\"Fout\")+1)","v":""}]
[null,null,null,null,null,null,null,null,"",{"$f":"IF(C534=\"\",\"\",INDEX(Validatie!$Q$2:$Q$6,MATCH(MOD(E534,1),Validatie!$P$2:$P$6,1)))","v":""},"","",{"$f":"IF(C534=\"\",\"\",IFERROR(MATCH(G534&H534,ValVoorNamen&ValNamen,0),\"Fout\")+1)","v":""}]
[null,null,null,null,null,null,null,null,"",{"$f":"IF(C535=\"\",\"\",INDEX(Validatie!$Q$2:$Q$6,MATCH(MOD(E535,1),Validatie!$P$2:$P$6,1)))","v":""},"","",{"$f":"IF(C535=\"\",\"\",IFERROR(MATCH(G535&H535,ValVoorNamen&ValNamen,0),\"Fout\")+1)","v":""}]
[null,null,null,null,null,null,null,null,"",{"$f":"IF(C536=\"\",\"\",INDEX(Validatie!$Q$2:$Q$6,MATCH(MOD(E536,1),Validatie!$P$2:$P$6,1)))","v":""},"","",{"$f":"IF(C536=\"\",\"\",IFERROR(MATCH(G536&H536,ValVoorNamen&ValNamen,0),\"Fout\")+1)","v":""}]
[null,null,null,null,null,null,null,null,"",{"$f":"IF(C537=\"\",\"\",INDEX(Validatie!$Q$2:$Q$6,MATCH(MOD(E537,1),Validatie!$P$2:$P$6,1)))","v":""},"","",{"$f":"IF(C537=\"\",\"\",IFERROR(MATCH(G537&H537,ValVoorNamen&ValNamen,0),\"Fout\")+1)","v":""}]
[null,null,null,null,null,null,null,null,"",{"$f":"IF(C538=\"\",\"\",INDEX(Validatie!$Q$2:$Q$6,MATCH(MOD(E538,1),Validatie!$P$2:$P$6,1)))","v":""},"","",{"$f":"IF(C538=\"\",\"\",IFERROR(MATCH(G538&H538,ValVoorNamen&ValNamen,0),\"Fout\")+1)","v":""}]
[null,null,null,null,null,null,null,null,"",{"$f":"IF(C539=\"\",\"\",INDEX(Validatie!$Q$2:$Q$6,MATCH(MOD(E539,1),Validatie!$P$2:$P$6,1)))","v":""},"","",{"$f":"IF(C539=\"\",\"\",IFERROR(MATCH(G539&H539,ValVoorNamen&ValNamen,0),\"Fout\")+1)","v":""}]
[null,null,null,null,null,null,null,null,"",{"$f":"IF(C540=\"\",\"\",INDEX(Validatie!$Q$2:$Q$6,MATCH(MOD(E540,1),Validatie!$P$2:$P$6,1)))","v":""},"","",{"$f":"IF(C540=\"\",\"\",IFERROR(MATCH(G540&H540,ValVoorNamen&ValNamen,0),\"Fout\")+1)","v":""}]
[null,null,null,null,null,null,null,null,"",{"$f":"IF(C541=\"\",\"\",INDEX(Validatie!$Q$2:$Q$6,MATCH(MOD(E541,1),Validatie!$P$2:$P$6,1)))","v":""},"","",{"$f":"IF(C541=\"\",\"\",IFERROR(MATCH(G541&H541,ValVoorNamen&ValNamen,0),\"Fout\")+1)","v":""}]
[null,null,null,null,null,null,null,null,"",{"$f":"IF(C542=\"\",\"\",INDEX(Validatie!$Q$2:$Q$6,MATCH(MOD(E542,1),Validatie!$P$2:$P$6,1)))","v":""},"","",{"$f":"IF(C542=\"\",\"\",IFERROR(MATCH(G542&H542,ValVoorNamen&ValNamen,0),\"Fout\")+1)","v":""}]
[null,null,null,null,null,null,null,null,"",{"$f":"IF(C543=\"\",\"\",INDEX(Validatie!$Q$2:$Q$6,MATCH(MOD(E543,1),Validatie!$P$2:$P$6,1)))","v":""},"","",{"$f":"IF(C543=\"\",\"\",IFERROR(MATCH(G543&H543,ValVoorNamen&ValNamen,0),\"Fout\")+1)","v":""}]
[null,null,null,null,null,null,null,null,"",{"$f":"IF(C544=\"\",\"\",INDEX(Validatie!$Q$2:$Q$6,MATCH(MOD(E544,1),Validatie!$P$2:$P$6,1)))","v":""},"","",{"$f":"IF(C544=\"\",\"\",IFERROR(MATCH(G544&H544,ValVoorNamen&ValNamen,0),\"Fout\")+1)","v":""}]
[null,null,null,null,null,null,null,null,"",{"$f":"IF(C545=\"\",\"\",INDEX(Validatie!$Q$2:$Q$6,MATCH(MOD(E545,1),Validatie!$P$2:$P$6,1)))","v":""},"","",{"$f":"IF(C545=\"\",\"\",IFERROR(MATCH(G545&H545,ValVoorNamen&ValNamen,0),\"Fout\")+1)","v":""}]
[null,null,null,null,null,null,null,null,"",{"$f":"IF(C546=\"\",\"\",INDEX(Validatie!$Q$2:$Q$6,MATCH(MOD(E546,1),Validatie!$P$2:$P$6,1)))","v":""},"","",{"$f":"IF(C546=\"\",\"\",IFERROR(MATCH(G546&H546,ValVoorNamen&ValNamen,0),\"Fout\")+1)","v":""}]
[null,null,null,null,null,null,null,null,"",{"$f":"IF(C547=\"\",\"\",INDEX(Validatie!$Q$2:$Q$6,MATCH(MOD(E547,1),Validatie!$P$2:$P$6,1)))","v":""},"","",{"$f":"IF(C547=\"\",\"\",IFERROR(MATCH(G547&H547,ValVoorNamen&ValNamen,0),\"Fout\")+1)","v":""}]
[null,null,null,null,null,null,null,null,"",{"$f":"IF(C548=\"\",\"\",INDEX(Validatie!$Q$2:$Q$6,MATCH(MOD(E548,1),Validatie!$P$2:$P$6,1)))","v":""},"","",{"$f":"IF(C548=\"\",\"\",IFERROR(MATCH(G548&H548,ValVoorNamen&ValNamen,0),\"Fout\")+1)","v":""}]
[null,null,null,null,null,null,null,null,"",{"$f":"IF(C549=\"\",\"\",INDEX(Validatie!$Q$2:$Q$6,MATCH(MOD(E549,1),Validatie!$P$2:$P$6,1)))","v":""},"","",{"$f":"IF(C549=\"\",\"\",IFERROR(MATCH(G549&H549,ValVoorNamen&ValNamen,0),\"Fout\")+1)","v":""}]
[null,null,null,null,null,null,null,null,"",{"$f":"IF(C550=\"\",\"\",INDEX(Validatie!$Q$2:$Q$6,MATCH(MOD(E550,1),Validatie!$P$2:$P$6,1)))","v":""},"","",{"$f":"IF(C550=\"\",\"\",IFERROR(MATCH(G550&H550,ValVoorNamen&ValNamen,0),\"Fout\")+1)","v":""}]
[null,null,null,null,null,null,null,null,"",{"$f":"IF(C551=\"\",\"\",INDEX(Validatie!$Q$2:$Q$6,MATCH(MOD(E551,1),Validatie!$P$2:$P$6,1)))","v":""},"","",{"$f":"IF(C551=\"\",\"\",IFERROR(MATCH(G551&H551,ValVoorNamen&ValNamen,0),\"Fout\")+1)","v":""}]
[null,null,null,null,null,null,null,null,"",{"$f":"IF(C552=\"\",\"\",INDEX(Validatie!$Q$2:$Q$6,MATCH(MOD(E552,1),Validatie!$P$2:$P$6,1)))","v":""},"","",{"$f":"IF(C552=\"\",\"\",IFERROR(MATCH(G552&H552,ValVoorNamen&ValNamen,0),\"Fout\")+1)","v":""}]
[null,null,null,null,null,null,null,null,"",{"$f":"IF(C553=\"\",\"\",INDEX(Validatie!$Q$2:$Q$6,MATCH(MOD(E553,1),Validatie!$P$2:$P$6,1)))","v":""},"","",{"$f":"IF(C553=\"\",\"\",IFERROR(MATCH(G553&H553,ValVoorNamen&ValNamen,0),\"Fout\")+1)","v":""}]
[null,null,null,null,null,null,null,null,"",{"$f":"IF(C554=\"\",\"\",INDEX(Validatie!$Q$2:$Q$6,MATCH(MOD(E554,1),Validatie!$P$2:$P$6,1)))","v":""},"","",{"$f":"IF(C554=\"\",\"\",IFERROR(MATCH(G554&H554,ValVoorNamen&ValNamen,0),\"Fout\")+1)","v":""}]
[null,null,null,null,null,null,null,null,"",{"$f":"IF(C555=\"\",\"\",INDEX(Validatie!$Q$2:$Q$6,MATCH(MOD(E555,1),Validatie!$P$2:$P$6,1)))","v":""},"","",{"$f":"IF(C555=\"\",\"\",IFERROR(MATCH(G555&H555,ValVoorNamen&ValNamen,0),\"Fout\")+1)","v":""}]
[null,null,null,null,null,null,null,null,"",{"$f":"IF(C556=\"\",\"\",INDEX(Validatie!$Q$2:$Q$6,MATCH(MOD(E556,1),Validatie!$P$2:$P$6,1)))","v":""},"","",{"$f":"IF(C556=\"\",\"\",IFERROR(MATCH(G556&H556,ValVoorNamen&ValNamen,0),\"Fout\")+1)","v":""}]
[null,null,null,null,null,null,null,null,"",{"$f":"IF(C557=\"\",\"\",INDEX(Validatie!$Q$2:$Q$6,MATCH(MOD(E557,1),Validatie!$P$2:$P$6,1)))","v":""},"","",{"$f":"IF(C557=\"\",\"\",IFERROR(MATCH(G557&H557,ValVoorNamen&ValNamen,0),\"Fout\")+1)","v":""}]
[null,null,null,null,null,null,null,null,"",{"$f":"IF(C558=\"\",\"\",INDEX(Validatie!$Q$2:$Q$6,MATCH(MOD(E558,1),Validatie!$P$2:$P$6,1)))","v":""},"","",{"$f":"IF(C558=\"\",\"\",IFERROR(MATCH(G558&H558,ValVoorNamen&ValNamen,0),\"Fout\")+1)","v":""}]
[null,null,null,null,null,null,null,null,"",{"$f":"IF(C559=\"\",\"\",INDEX(Validatie!$Q$2:$Q$6,MATCH(MOD(E559,1),Validatie!$P$2:$P$6,1)))","v":""},"","",{"$f":"IF(C559=\"\",\"\",IFERROR(MATCH(G559&H559,ValVoorNamen&ValNamen,0),\"Fout\")+1)","v":""}]
[null,null,null,null,null,null,null,null,"",{"$f":"IF(C560=\"\",\"\",INDEX(Validatie!$Q$2:$Q$6,MATCH(MOD(E560,1),Validatie!$P$2:$P$6,1)))","v":""},"","",{"$f":"IF(C560=\"\",\"\",IFERROR(MATCH(G560&H560,ValVoorNamen&ValNamen,0),\"Fout\")+1)","v":""}]
[null,null,null,null,null,null,null,null,"",{"$f":"IF(C561=\"\",\"\",INDEX(Validatie!$Q$2:$Q$6,MATCH(MOD(E561,1),Validatie!$P$2:$P$6,1)))","v":""},"","",{"$f":"IF(C561=\"\",\"\",IFERROR(MATCH(G561&H561,ValVoorNamen&ValNamen,0),\"Fout\")+1)","v":""}]
[null,null,null,null,null,null,null,null,"",{"$f":"IF(C562=\"\",\"\",INDEX(Validatie!$Q$2:$Q$6,MATCH(MOD(E562,1),Validatie!$P$2:$P$6,1)))","v":""},"","",{"$f":"IF(C562=\"\",\"\",IFERROR(MATCH(G562&H562,ValVoorNamen&ValNamen,0),\"Fout\")+1)","v":""}]
[null,null,null,null,null,null,null,null,"",{"$f":"IF(C563=\"\",\"\",INDEX(Validatie!$Q$2:$Q$6,MATCH(MOD(E563,1),Validatie!$P$2:$P$6,1)))","v":""},"","",{"$f":"IF(C563=\"\",\"\",IFERROR(MATCH(G563&H563,ValVoorNamen&ValNamen,0),\"Fout\")+1)","v":""}]
[null,null,null,null,null,null,null,null,"",{"$f":"IF(C564=\"\",\"\",INDEX(Validatie!$Q$2:$Q$6,MATCH(MOD(E564,1),Validatie!$P$2:$P$6,1)))","v":""},"","",{"$f":"IF(C564=\"\",\"\",IFERROR(MATCH(G564&H564,ValVoorNamen&ValNamen,0),\"Fout\")+1)","v":""}]
[null,null,null,null,null,null,null,null,"",{"$f":"IF(C565=\"\",\"\",INDEX(Validatie!$Q$2:$Q$6,MATCH(MOD(E565,1),Validatie!$P$2:$P$6,1)))","v":""},"","",{"$f":"IF(C565=\"\",\"\",IFERROR(MATCH(G565&H565,ValVoorNamen&ValNamen,0),\"Fout\")+1)","v":""}]
[null,null,null,null,null,null,null,null,"",{"$f":"IF(C566=\"\",\"\",INDEX(Validatie!$Q$2:$Q$6,MATCH(MOD(E566,1),Validatie!$P$2:$P$6,1)))","v":""},"","",{"$f":"IF(C566=\"\",\"\",IFERROR(MATCH(G566&H566,ValVoorNamen&ValNamen,0),\"Fout\")+1)","v":""}]
[null,null,null,null,null,null,null,null,"",{"$f":"IF(C567=\"\",\"\",INDEX(Validatie!$Q$2:$Q$6,MATCH(MOD(E567,1),Validatie!$P$2:$P$6,1)))","v":""},"","",{"$f":"IF(C567=\"\",\"\",IFERROR(MATCH(G567&H567,ValVoorNamen&ValNamen,0),\"Fout\")+1)","v":""}]
[null,null,null,null,null,null,null,null,"",{"$f":"IF(C568=\"\",\"\",INDEX(Validatie!$Q$2:$Q$6,MATCH(MOD(E568,1),Validatie!$P$2:$P$6,1)))","v":""},"","",{"$f":"IF(C568=\"\",\"\",IFERROR(MATCH(G568&H568,ValVoorNamen&ValNamen,0),\"Fout\")+1)","v":""}]
[null,null,null,null,null,null,null,null,"",{"$f":"IF(C569=\"\",\"\",INDEX(Validatie!$Q$2:$Q$6,MATCH(MOD(E569,1),Validatie!$P$2:$P$6,1)))","v":""},"","",{"$f":"IF(C569=\"\",\"\",IFERROR(MATCH(G569&H569,ValVoorNamen&ValNamen,0),\"Fout\")+1)","v":""}]
[null,null,null,null,null,null,null,null,"",{"$f":"IF(C570=\"\",\"\",INDEX(Validatie!$Q$2:$Q$6,MATCH(MOD(E570,1),Validatie!$P$2:$P$6,1)))","v":""},"","",{"$f":"IF(C570=\"\",\"\",IFERROR(MATCH(G570&H570,ValVoorNamen&ValNamen,0),\"Fout\")+1)","v":""}]
[null,null,null,null,null,null,null,null,"",{"$f":"IF(C571=\"\",\"\",INDEX(Validatie!$Q$2:$Q$6,MATCH(MOD(E571,1),Validatie!$P$2:$P$6,1)))","v":""},"","",{"$f":"IF(C571=\"\",\"\",IFERROR(MATCH(G571&H571,ValVoorNamen&ValNamen,0),\"Fout\")+1)","v":""}]
[null,null,null,null,null,null,null,null,"",{"$f":"IF(C572=\"\",\"\",INDEX(Validatie!$Q$2:$Q$6,MATCH(MOD(E572,1),Validatie!$P$2:$P$6,1)))","v":""},"","",{"$f":"IF(C572=\"\",\"\",IFERROR(MATCH(G572&H572,ValVoorNamen&ValNamen,0),\"Fout\")+1)","v":""}]
[null,null,null,null,null,null,null,null,"",{"$f":"IF(C573=\"\",\"\",INDEX(Validatie!$Q$2:$Q$6,MATCH(MOD(E573,1),Validatie!$P$2:$P$6,1)))","v":""},"","",{"$f":"IF(C573=\"\",\"\",IFERROR(MATCH(G573&H573,ValVoorNamen&ValNamen,0),\"Fout\")+1)","v":""}]
[null,null,null,null,null,null,null,null,"",{"$f":"IF(C574=\"\",\"\",INDEX(Validatie!$Q$2:$Q$6,MATCH(MOD(E574,1),Validatie!$P$2:$P$6,1)))","v":""},"","",{"$f":"IF(C574=\"\",\"\",IFERROR(MATCH(G574&H574,ValVoorNamen&ValNamen,0),\"Fout\")+1)","v":""}]
[null,null,null,null,null,null,null,null,"",{"$f":"IF(C575=\"\",\"\",INDEX(Validatie!$Q$2:$Q$6,MATCH(MOD(E575,1),Validatie!$P$2:$P$6,1)))","v":""},"","",{"$f":"IF(C575=\"\",\"\",IFERROR(MATCH(G575&H575,ValVoorNamen&ValNamen,0),\"Fout\")+1)","v":""}]
[null,null,null,null,null,null,null,null,"",{"$f":"IF(C576=\"\",\"\",INDEX(Validatie!$Q$2:$Q$6,MATCH(MOD(E576,1),Validatie!$P$2:$P$6,1)))","v":""},"","",{"$f":"IF(C576=\"\",\"\",IFERROR(MATCH(G576&H576,ValVoorNamen&ValNamen,0),\"Fout\")+1)","v":""}]
[null,null,null,null,null,null,null,null,"",{"$f":"IF(C577=\"\",\"\",INDEX(Validatie!$Q$2:$Q$6,MATCH(MOD(E577,1),Validatie!$P$2:$P$6,1)))","v":""},"","",{"$f":"IF(C577=\"\",\"\",IFERROR(MATCH(G577&H577,ValVoorNamen&ValNamen,0),\"Fout\")+1)","v":""}]
[null,null,null,null,null,null,null,null,"",{"$f":"IF(C578=\"\",\"\",INDEX(Validatie!$Q$2:$Q$6,MATCH(MOD(E578,1),Validatie!$P$2:$P$6,1)))","v":""},"","",{"$f":"IF(C578=\"\",\"\",IFERROR(MATCH(G578&H578,ValVoorNamen&ValNamen,0),\"Fout\")+1)","v":""}]
[null,null,null,null,null,null,null,null,"",{"$f":"IF(C579=\"\",\"\",INDEX(Validatie!$Q$2:$Q$6,MATCH(MOD(E579,1),Validatie!$P$2:$P$6,1)))","v":""},"","",{"$f":"IF(C579=\"\",\"\",IFERROR(MATCH(G579&H579,ValVoorNamen&ValNamen,0),\"Fout\")+1)","v":""}]
[null,null,null,null,null,null,null,null,"",{"$f":"IF(C580=\"\",\"\",INDEX(Validatie!$Q$2:$Q$6,MATCH(MOD(E580,1),Validatie!$P$2:$P$6,1)))","v":""},"","",{"$f":"IF(C580=\"\",\"\",IFERROR(MATCH(G580&H580,ValVoorNamen&ValNamen,0),\"Fout\")+1)","v":""}]
[null,null,null,null,null,null,null,null,"",{"$f":"IF(C581=\"\",\"\",INDEX(Validatie!$Q$2:$Q$6,MATCH(MOD(E581,1),Validatie!$P$2:$P$6,1)))","v":""},"","",{"$f":"IF(C581=\"\",\"\",IFERROR(MATCH(G581&H581,ValVoorNamen&ValNamen,0),\"Fout\")+1)","v":""}]
[null,null,null,null,null,null,null,null,{"$f":"IF(H582=\"\",\"\",IF(SUMPRODUCT(--(ValVerlofVoornaam=G582),--(ValVerlofNaam=H582),--(ValVerlofVan<=C582),--(ValVerlofTot>=C582)*(1))>0,\"V\",\"\"))","v":""},{"$f":"IF(C582=\"\",\"\",INDEX(Validatie!$Q$2:$Q$6,MATCH(MOD(E582,1),Validatie!$P$2:$P$6,1)))","v":""},{"$f":"IF(C582=\"\",\"\",IFERROR(VLOOKUP(D582,DataMijnAfdeling,2,0),\"?\"))","v":""},"",{"$f":"IF(C582=\"\",\"\",IFERROR(MATCH(G582&H582,ValVoorNamen&ValNamen,0),\"Fout\")+1)","v":""}]
[null,null,null,null,null,null,null,null,"",{"$f":"IF(C583=\"\",\"\",INDEX(Validatie!$Q$2:$Q$6,MATCH(MOD(E583,1),Validatie!$P$2:$P$6,1)))","v":""},"",{"$f":"IF(C583=\"\",\"\",CONCATENATE(G583,\" \",H583))","v":""},{"$f":"IF(C583=\"\",\"\",IFERROR(MATCH(G583&H583,ValVoorNamen&ValNamen,0),\"Fout\")+1)","v":""}]
[null,null,null,null,null,null,null,null,"",{"$f":"IF(C584=\"\",\"\",INDEX(Validatie!$Q$2:$Q$6,MATCH(MOD(E584,1),Validatie!$P$2:$P$6,1)))","v":""},"","",{"$f":"IF(C584=\"\",\"\",IFERROR(MATCH(G584&H584,ValVoorNamen&ValNamen,0),\"Fout\")+1)","v":""}]
[null,null,null,null,null,null,null,null,"",{"$f":"IF(C585=\"\",\"\",INDEX(Validatie!$Q$2:$Q$6,MATCH(MOD(E585,1),Validatie!$P$2:$P$6,1)))","v":""},"","",{"$f":"IF(C585=\"\",\"\",IFERROR(MATCH(G585&H585,ValVoorNamen&ValNamen,0),\"Fout\")+1)","v":""}]
[null,null,null,null,null,null,null,null,"",{"$f":"IF(C586=\"\",\"\",INDEX(Validatie!$Q$2:$Q$6,MATCH(MOD(E586,1),Validatie!$P$2:$P$6,1)))","v":""},"","",{"$f":"IF(C586=\"\",\"\",IFERROR(MATCH(G586&H586,ValVoorNamen&ValNamen,0),\"Fout\")+1)","v":""}]
[null,null,null,null,null,null,null,null,"",{"$f":"IF(C587=\"\",\"\",INDEX(Validatie!$Q$2:$Q$6,MATCH(MOD(E587,1),Validatie!$P$2:$P$6,1)))","v":""},"","",{"$f":"IF(C587=\"\",\"\",IFERROR(MATCH(G587&H587,ValVoorNamen&ValNamen,0),\"Fout\")+1)","v":""}]
[null,null,null,null,null,null,null,null,"",{"$f":"IF(C588=\"\",\"\",INDEX(Validatie!$Q$2:$Q$6,MATCH(MOD(E588,1),Validatie!$P$2:$P$6,1)))","v":""},"","",{"$f":"IF(C588=\"\",\"\",IFERROR(MATCH(G588&H588,ValVoorNamen&ValNamen,0),\"Fout\")+1)","v":""}]
[null,null,null,null,null,null,null,null,"",{"$f":"IF(C589=\"\",\"\",INDEX(Validatie!$Q$2:$Q$6,MATCH(MOD(E589,1),Validatie!$P$2:$P$6,1)))","v":""},"","",{"$f":"IF(C589=\"\",\"\",IFERROR(MATCH(G589&H589,ValVoorNamen&ValNamen,0),\"Fout\")+1)","v":""}]
[null,null,null,null,null,null,null,null,"",{"$f":"IF(C590=\"\",\"\",INDEX(Validatie!$Q$2:$Q$6,MATCH(MOD(E590,1),Validatie!$P$2:$P$6,1)))","v":""},"","",{"$f":"IF(C590=\"\",\"\",IFERROR(MATCH(G590&H590,ValVoorNamen&ValNamen,0),\"Fout\")+1)","v":""}]
[null,null,null,null,null,null,null,null,"",{"$f":"IF(C591=\"\",\"\",INDEX(Validatie!$Q$2:$Q$6,MATCH(MOD(E591,1),Validatie!$P$2:$P$6,1)))","v":""},"","",{"$f":"IF(C591=\"\",\"\",IFERROR(MATCH(G591&H591,ValVoorNamen&ValNamen,0),\"Fout\")+1)","v":""}]
[null,null,null,null,null,null,null,null,"",{"$f":"IF(C592=\"\",\"\",INDEX(Validatie!$Q$2:$Q$6,MATCH(MOD(E592,1),Validatie!$P$2:$P$6,1)))","v":""},"","",{"$f":"IF(C592=\"\",\"\",IFERROR(MATCH(G592&H592,ValVoorNamen&ValNamen,0),\"Fout\")+1)","v":""}]
[null,null,null,null,null,null,null,null,"",{"$f":"IF(C593=\"\",\"\",INDEX(Validatie!$Q$2:$Q$6,MATCH(MOD(E593,1),Validatie!$P$2:$P$6,1)))","v":""},"","",{"$f":"IF(C593=\"\",\"\",IFERROR(MATCH(G593&H593,ValVoorNamen&ValNamen,0),\"Fout\")+1)","v":""}]
[null,null,null,null,null,null,null,null,"",{"$f":"IF(C594=\"\",\"\",INDEX(Validatie!$Q$2:$Q$6,MATCH(MOD(E594,1),Validatie!$P$2:$P$6,1)))","v":""},"","",{"$f":"IF(C594=\"\",\"\",IFERROR(MATCH(G594&H594,ValVoorNamen&ValNamen,0),\"Fout\")+1)","v":""}]
[null,null,null,null,null,null,null,null,"",{"$f":"IF(C595=\"\",\"\",INDEX(Validatie!$Q$2:$Q$6,MATCH(MOD(E595,1),Validatie!$P$2:$P$6,1)))","v":""},"","",{"$f":"IF(C595=\"\",\"\",IFERROR(MATCH(G595&H595,ValVoorNamen&ValNamen,0),\"Fout\")+1)","v":""}]
[null,null,null,null,null,null,null,null,"",{"$f":"IF(C596=\"\",\"\",INDEX(Validatie!$Q$2:$Q$6,MATCH(MOD(E596,1),Validatie!$P$2:$P$6,1)))","v":""},"","",{"$f":"IF(C596=\"\",\"\",IFERROR(MATCH(G596&H596,ValVoorNamen&ValNamen,0),\"Fout\")+1)","v":""}]
[null,null,null,null,null,null,null,null,"",{"$f":"IF(C597=\"\",\"\",INDEX(Validatie!$Q$2:$Q$6,MATCH(MOD(E597,1),Validatie!$P$2:$P$6,1)))","v":""},"","",{"$f":"IF(C597=\"\",\"\",IFERROR(MATCH(G597&H597,ValVoorNamen&ValNamen,0),\"Fout\")+1)","v":""}]
[null,null,null,null,null,null,null,null,"",{"$f":"IF(C598=\"\",\"\",INDEX(Validatie!$Q$2:$Q$6,MATCH(MOD(E598,1),Validatie!$P$2:$P$6,1)))","v":""},"","",{"$f":"IF(C598=\"\",\"\",IFERROR(MATCH(G598&H598,ValVoorNamen&ValNamen,0),\"Fout\")+1)","v":""}]
[null,null,null,null,null,null,null,null,"",{"$f":"IF(C599=\"\",\"\",INDEX(Validatie!$Q$2:$Q$6,MATCH(MOD(E599,1),Validatie!$P$2:$P$6,1)))","v":""},"","",{"$f":"IF(C599=\"\",\"\",IFERROR(MATCH(G599&H599,ValVoorNamen&ValNamen,0),\"Fout\")+1)","v":""}]
[null,null,null,null,null,null,null,null,"",{"$f":"IF(C600=\"\",\"\",INDEX(Validatie!$Q$2:$Q$6,MATCH(MOD(E600,1),Validatie!$P$2:$P$6,1)))","v":""},"","",{"$f":"IF(C600=\"\",\"\",IFERROR(MATCH(G600&H600,ValVoorNamen&ValNamen,0),\"Fout\")+1)","v":""}]

{"sheet":"Validatie","index":4,"n_rows":109,"n_cols":17,"rows_kept":109,"cut":false,"hidden":false,"merged":[]}
["Weken",null,"Jaren",null,null,null,null,"Mijn afdelingen","Planning afdeling ",null,null,null,"Voornaam","Naam",null,"Post",0]
[1,null,2018,null,null,null,null,"ABB weekenddienst","ABB",null,null,null,"Abdiqadir","de Jong",null,0]
[2,null,2019,null,null,null,null,"ABB middag","ABB",null,null,null,"Abdul","Jansen",null,0.24,"Vroeg"]
[3,null,2020,null,null,null,null,"ABB ochtend ","ABB",null,null,null,"Abdurahman Ibrahim","de Vries",null,0.5,"Laat"]
[4,null,2021,null,null,null,null,"AFV MEP","MEP",null,null,null,"Agathe","van de Berg ",null,0.83333333333333337,"Nacht"]
[5,null,2022,null,null,null,null,"SCHM AFV","AFV",null,null,null,"Akela","van Dijk",null,0.99930555555555556,"Nacht"]
[6,null,2023,null,null,null,null,"SCHM","SCHM",null,null,null,"Amadou","Bakker"]
[7,null,2024,null,null,null,null,"AFV HAS","HAS",null,null,null,"Amanuel","Janssen"]
[8,null,2025,null,null,null,null,"SCHM HAS","HAS",null,null,null,"Ambroise","Visser"]
[9,null,null,null,null,null,null,"LCR middag","LCR",null,null,null,"Anton","Smit"]
[10,null,null,null,null,null,null,"LCR ochtend","LCR",null,null,null,"Apollonia","Meijer"]
[11,null,null,null,null,null,null,null,null,null,null,null,"Arkan","de Boer"]
[12,null,null,null,null,null,null,null,null,null,null,null,"Arsenio","Mulder"]
[13,null,null,null,null,null,null,null,null,null,null,null,"Atobhran","de Groot"]
[14,null,null,null,null,null,null,"NIET mijn afdelingen","-",null,null,null,"Baki","Bos"]
[15,null,null,null,null,null,null,"PALL HAS","-",null,null,null,"Barend","Vos"]
[16,null,null,null,null,null,null,"PALL MEP","-",null,null,null,"Bereket","Peters"]
[17,null,null,null,null,null,null,"PALL Rweg","-",null,null,null,"Bile","Hendriks"]
[18,null,null,null,null,null,null,"Reserve ochtend","-",null,null,null,"Boyan","van Leeuwen"]
[19,null,null,null,null,null,null,"Reserve middag","-",null,null,null,"Charles","Dekker"]
[20,null,null,null,null,null,null,null,null,null,null,null,"Chevindio","Brouwer"]
[21,null,null,null,null,null,null,null,null,null,null,null,"Christiaan","de Wit"]
[22,null,null,null,null,null,null,null,null,null,null,null,"Daniel","Dijkstra"]
[23,null,null,null,null,null,null,null,null,null,null,null,"Davood","Smits"]
[24,null,null,null,null,null,null,null,null,null,null,null,"Dennis","de Graaf"]
[25,null,null,null,null,null,null,null,null,null,null,null,"Dikkie","van der Meer"]
[26,null,null,null,null,null,null,null,null,null,null,null,"Elroy","van der Linden"]
[27,null,null,null,null,null,null,null,null,null,null,null,"Emsud","Kok"]
[28,null,null,null,null,null,null,null,null,null,null,null,"Engin","Jacobs"]
[29,null,null,null,null,null,null,null,null,null,null,null,"Erik","de Haan"]
[30,null,null,null,null,null,null,null,null,null,null,null,"Evans","Vermeulen"]
[31,null,null,null,null,null,null,null,null,null,null,null,"Everon","van den Heuvel"]
[32,null,null,null,null,null,null,null,null,null,null,null,"Fars","van de Veen"]
[33,null,null,null,null,null,null,null,null,null,null,null,"Felicia","van den Broek"]
[34,null,null,null,null,null,null,null,null,null,null,null,"Fetehawi","de Bruyn"]
[35,null,null,null,null,null,null,null,null,null,null,null,"Filimon","de Bruin"]
[36,null,null,null,null,null,null,null,null,null,null,null,"Flavi","van der Heyden"]
[37,null,null,null,null,null,null,null,null,null,null,null,"Gebrehiwet","Schouten"]
[38,null,null,null,null,null,null,null,null,null,null,null,"Gerrit","van Beek"]
[39,null,null,null,null,null,null,null,null,null,null,null,"Haben","Willems"]
[40,null,null,null,null,null,null,null,null,null,null,null,"Hagos","van Vliet"]
[41,null,null,null,null,null,null,null,null,null,null,null,"Hans","van de Ven "]
[42,null,null,null,null,null,null,null,null,null,null,null,"Harrie","Hoekstra"]
[43,null,null,null,null,null,null,null,null,null,null,null,"Harry","Maas"]
[44,null,null,null,null,null,null,null,null,null,null,null,"Hassan","Verhoeven"]
[45,null,null,null,null,null,null,null,null,null,null,null,"Henk","Koster"]
[46,null,null,null,null,null,null,null,null,null,null,null,"Henri","van Dam"]
[47,null,null,null,null,null,null,null,null,null,null,null,"Heruy","van de Wal "]
[48,null,null,null,null,null,null,null,null,null,null,null,"Hilko","Prins"]
[49,null,null,null,null,null,null,null,null,null,null,null,"Hishelu","Blom"]
[50,null,null,null,null,null,null,null,null,null,null,null,"Houcin","Huisman"]
[51,null,null,null,null,null,null,null,null,null,null,null,"Ilker","Peeters"]
[52,null,null,null,null,null,null,null,null,null,null,null,"Jan","de Jonge"]
[53,null,null,null,null,null,null,null,null,null,null,null,"Jarek","Kuipers"]
[null,null,null,null,null,null,null,null,null,null,null,null,"Jelte","van Veen"]
[null,null,null,null,null,null,null,null,null,null,null,null,"Jeroen","Post"]
[null,null,null,null,null,null,null,null,null,null,null,null,"Karrar","Kuiper"]
[null,null,null,null,null,null,null,null,null,null,null,null,"Kevin","Veenstra"]
[null,null,null,null,null,null,null,null,null,null,null,null,"Klaas","Kramer"]
[null,null,null,null,null,null,null,null,null,null,null,null,"Ko","van de Brink"]
[null,null,null,null,null,null,null,null,null,null,null,null,"Laszlo","Scholten"]
[null,null,null,null,null,null,null,null,null,null,null,null,"Latie","van Wijk"]
[null,null,null,null,null,null,null,null,null,null,null,null,"Magdalena","Postma"]
[null,null,null,null,null,null,null,null,null,null,null,null,"Marjolein","Martens"]
[null,null,null,null,null,null,null,null,null,null,null,null,"Mark","Vink"]
[null,null,null,null,null,null,null,null,null,null,null,null,"Martijn","de Ruiter"]
[null,null,null,null,null,null,null,null,null,null,null,null,"Mebrathu","Timmermans"]
[null,null,null,null,null,null,null,null,null,null,null,null,"Merhawi","Groen"]
[null,null,null,null,null,null,null,null,null,null,null,null,"Michael","Gerritsen"]
[null,null,null,null,null,null,null,null,null,null,null,null,"Michel","Jonker"]
[null,null,null,null,null,null,null,null,null,null,null,null,"Miquel","van Loon"]
[null,null,null,null,null,null,null,null,null,null,null,null,"Moussa","Boer"]
[null,null,null,null,null,null,null,null,null,null,null,null,"Naoufel","van de Velde "]
[null,null,null,null,null,null,null,null,null,null,null,null,"Nexhmedi","Willemsen"]
[null,null,null,null,null,null,null,null,null,null,null,null,"Niek","Smeets"]
[null,null,null,null,null,null,null,null,null,null,null,null,"Norbert","de Lange"]
[null,null,null,null,null,null,null,null,null,null,null,null,"Olcay","de Vos"]
[null,null,null,null,null,null,null,null,null,null,null,null,"Patrick","Bosch"]
[null,null,null,null,null,null,null,null,null,null,null,null,"Paul","van Dongen"]
[null,null,null,null,null,null,null,null,null,null,null,null,"Piet","Schipper"]
[null,null,null,null,null,null,null,null,null,null,null,null,"Quincy","de Koning"]
[null,null,null,null,null,null,null,null,null,null,null,null,"Rachid","van der Laan"]
[null,null,null,null,null,null,null,null,null,null,null,null,"Reinder","Koning"]
[null,null,null,null,null,null,null,null,null,null,null,null,"Rene","van der Velden"]
[null,null,null,null,null,null,null,null,null,null,null,null,"Richard","Driessen"]
[null,null,null,null,null,null,null,null,null,null,null,null,"Rijk","van Doorn"]
[null,null,null,null,null,null,null,null,null,null,null,null,"Robel","Hermans"]
[null,null,null,null,null,null,null,null,null,null,null,null,"Robin","Evers"]
[null,null,null,null,null,null,null,null,null,null,null,null,"Rolinka","van den Bosch"]
[null,null,null,null,null,null,null,null,null,null,null,null,"Roy","van der Meulen"]
[null,null,null,null,null,null,null,null,null,null,null,null,"Rudolf","Hofman"]
[null,null,null,null,null,null,null,null,null,null,null,null,"Saidou","Bosman"]
[null,null,null,null,null,null,null,null,null,null,null,null,"Salahadin","Wolters"]
[null,null,null,null,null,null,null,null,null,null,null,null,"Samantha","Sanders"]
[null,null,null,null,null,null,null,null,null,null,null,null,"Sami","van der Horst"]
[null,null,null,null,null,null,null,null,null,null,null,null,"Sebastiaan","Mol"]
[null,null,null,null,null,null,null,null,null,null,null,null,"Sebastian","Kuijpers"]
[null,null,null,null,null,null,null,null,null,null,null,null,"Shawn","Molenaar"]
[null,null,null,null,null,null,null,null,null,null,null,null,"Sied"," van der Pol"]
[null,null,null,null,null,null,null,null,null,null,null,null,"Swen","de Leeuw"]
[null,null,null,null,null,null,null,null,null,null,null,null,"Tesfaldet","Verbeek"]
[null,null,null,null,null,null,null,null,null,null,null,null,"Tomas","Koolen"]
[null,null,null,null,null,null,null,null,null,null,null,null,"Trienko","Spooren"]
[null,null,null,null,null,null,null,null,null,null,null,null,"Viorel","Triest"]
[null,null,null,null,null,null,null,null,null,null,null,null,"Wenaron","Kurkema"]
[null,null,null,null,null,null,null,null,null,null,null,null,"Wim","Vogel"]
[null,null,null,null,null,null,null,null,null,null,null,null,"Wolter","De bolder"]
[null,null,null,null,null,null,null,null,null,null,null,null,"Wout","Van Goud"]
[null,null,null,null,null,null,null,null,null,null,null,null,"Yemane","Masout"]

{"sheet":"CalPopUp","index":5,"n_rows":20,"n_cols":8,"rows_kept":20,"cut":false,"hidden":true,"merged":[]}
[{"$f":"TODAY()","v":"2019-12-11"},{"$f":"IF(WEEKDAY(DATE(CalYear,MATCH($A$4,CalMonths,0),1))=1,DATE(CalYear,MATCH($A$4,CalMonths,0),1),\"\")","v":"2019-12-01"},{"$f":"IF(B1<>\"\",B1+1,IF(WEEKDAY(DATE(CalYear,MATCH($A$4,CalMonths,0),1))=2,DATE(CalYear,MATCH($A$4,CalMonths,0),1),\"\"))","v":"2019-12-02"},{"$f":"IF(C1<>\"\",C1+1,IF(WEEKDAY(DATE(CalYear,MATCH($A$4,CalMonths,0),1))=3,DATE(CalYear,MATCH($A$4,CalMonths,0),1),\"\"))","v":"2019-12-03"},{"$f":"IF(D1<>\"\",D1+1,IF(WEEKDAY(DATE(CalYear,MATCH($A$4,CalMonths,0),1))=4,DATE(CalYear,MATCH($A$4,CalMonths,0),1),\"\"))","v":"2019-12-04"},{"$f":"IF(E1<>\"\",E1+1,IF(WEEKDAY(DATE(CalYear,MATCH($A$4,CalMonths,0),1))=5,DATE(CalYear,MATCH($A$4,CalMonths,0),1),\"\"))","v":"2019-12-05"},{"$f":"IF(F1<>\"\",F1+1,IF(WEEKDAY(DATE(CalYear,MATCH($A$4,CalMonths,0),1))=6,DATE(CalYear,MATCH($A$4,CalMonths,0),1),\"\"))","v":"2019-12-06"},{"$f":"IF(G1<>\"\",G1+1,IF(WEEKDAY(DATE(CalYear,MATCH($A$4,CalMonths,0),1))=7,DATE(CalYear,MATCH($A$4,CalMonths,0),1),\"\"))","v":"2019-12-07"}]
[2019,{"$f":"H1+1","v":"2019-12-08"},{"$f":"B2+1","v":"2019-12-09"},{"$f":"C2+1","v":"2019-12-10"},"2019-12-11","2019-12-12","2019-12-13","2019-12-14"]
[12,{"$f":"H2+1","v":"2019-12-15"},{"$f":"B3+1","v":"2019-12-16"},"2019-12-17","2019-12-18","2019-12-19","2019-12-20","2019-12-21"]
[{"$f":"INDEX(CalMonths,A3,)","v":"December"},"2019-12-22","2019-12-23","2019-12-24","2019-12-25","2019-12-26","2019-12-27","2019-12-28"]
[{"$f":"A4&\" \"&CalYear","v":"December 2019"},{"$f":"IF(OR(H4=\"\",MONTH(H4+1)<>$A$3),\"\",H4+1)","v":"2019-12-29"},{"$f":"IFERROR(IF(MONTH(B5+1)<>$A$3,\"\",B5+1),\"\")","v":"2019-12-30"},{"$f":"IFERROR(IF(MONTH(C5+1)<>$A$3,\"\",C5+1),\"\")","v":"2019-12-31"},"","","",""]
[{"$f":"SUM(B6:H6)","v":0},{"$f":"IFERROR(IF(OR(H5=\"\",MONTH(H5+1)<>$A$3),\"\",H5+1),\"\")","v":""},{"$f":"IFERROR(F(MONTH(I5+1)<>$A$3,\"\",I5+1),\"\")","v":""},{"$f":"IFERROR(F(MONTH(J5+1)<>$A$3,\"\",J5+1),\"\")","v":""},{"$f":"IFERROR(F(MONTH(K5+1)<>$A$3,\"\",K5+1),\"\")","v":""},{"$f":"IFERROR(F(MONTH(L5+1)<>$A$3,\"\",L5+1),\"\")","v":""},{"$f":"IFERROR(F(MONTH(M5+1)<>$A$3,\"\",M5+1),\"\")","v":""},{"$f":"IFERROR(F(MONTH(N5+1)<>$A$3,\"\",N5+1),\"\")","v":""}]
["$E$8",1,2,3,4,5,6,7]
["January",8,9,10,11,12,13,14]
["February",15,16,17,18,19,20,21]
["March",22,23,24,25,26,27,28]
["April",29,30,31,32,33,34,35]
["May",36,37,38,39,40,41,42]
["June"]
["July"]
["August"]
["September"]
["October"]
["November"]
["December"]
[33]