{"text_format":"1","workbook":"xlsx","n_sheets":6,"sheets":["Verlof","InfoUitzendburo","WEEKPLANNING","PlanningsFilter","Validatie","CalPopUp"],"not_rendered":{"charts":0,"images":2,"macros":1,"external_links":2,"defined_names":24,"comments":0,"pivot_tables":0},"unopened":[],"bounds":{"document_bytes":16777216,"sheet_cells":100000,"rows_first":2000,"rows_last":500,"rows_between":2000,"halvings":0,"cell_chars":16384,"cell_head_chars":4096},"cells_cut":0,"cells_raw":0,"read":"whole","date_system":"1900"}

{"sheet":"Verlof","index":0,"n_rows":8,"n_cols":5,"rows_kept":8,"cut":false,"hidden":false,"merged":[]}
[]
[null,"Vul hier de afwezige dagen (periode) in"]
[null,"VoorNaam","Naam","van","tot en met"]
[null,"Flavi","van der Heyden","2019-12-02","2019-12-02"]
[null,"Akela","van Dijk","2019-12-10","2019-12-08"]
[null,"Amadou","Bakker","2019-12-04","2019-12-05"]
{"$rows_left_out":3}
{"sheet":"InfoUitzendburo","index":1,"n_rows":939,"n_cols":15,"rows_kept":939,"cut":false,"hidden":false,"merged":[]}
[null,null,null,null,null,null,null,null,null,null,"Mijn afdelingen","Planning afdeling ",null,"NIET mijn afdelingen"]
["Info","Functie","Starttijd","Eindtijd","Voornaam","Achternaam",null,null,null,null,"ABB weekenddienst","ABB",null,"PALL HAS"]
["2019-12-01","ABB middag",43800.604166666664,43800.875,"Baki","Bos",null,null,null,null,"ABB middag","ABB",null,"PALL MEP"]
["2019-12-01","SCHM",43800.999305555553,43801.364583333336,"Rolinka","van den Bosch",null,null,null,null,"ABB ochtend ","ABB",null,"PALL Rweg"]
["2019-12-01","SCHM",43800.999305555553,43801.364583333336,"Erik","de Haan",null,null,null,null,null,null,null,"Reserve ochtend"]
["2019-12-02","ABB ochtend ",43801.25,43801.614583333336,"Flavi","van der Heyden",null,null,null,null,"AFV MEP","MEP",null,"Reserve middag"]
{"$rows_left_out":934}
{"sheet":"WEEKPLANNING","index":2,"n_rows":38,"n_cols":24,"rows_kept":38,"cut":false,"hidden":false,"merged":[[2,21,2,23],[2,3,2,5],[2,6,2,8],[2,9,2,11],[2,12,2,14],[2,15,2,17],[2,18,2,20]]}
[null,null,null,null,null,"Planning"]
["Jaar","WEEK",null,{"$f":"D3","v":"2019-12-09"},{"$f":"D2","v":43808},{"$f":"D2","v":43808},{"$f":"G3","v":43809},{"$f":"G2","v":43809},{"$f":"G2","v":43809},{"$f":"J3","v":43810},{"$f":"J2","v":43810},{"$f":"J2","v":43810},{"$f":"M3","v":43811},{"$f":"M2","v":43811},{"$f":"M2","v":43811},{"$f":"P3","v":43812},{"$f":"P2","v":43812},{"$f":"P2","v":43812},{"$f":"S3","v":43813},{"$f":"S2","v":43813},{"$f":"S2","v":43813},{"$f":"V3","v":43814},{"$f":"V2","v":43814},{"$f":"V2","v":43814}]
[2019,50,null,{"$f":"DATE($A$3,1,4)-WEEKDAY(DATE($A$3,1,4),2)+1+(($B$3-1)*7)","v":"2019-12-09"},null,null,{"$f":"D3+1","v":"2019-12-10"},null,null,{"$f":"G3+1","v":"2019-12-11"},null,null,{"$f":"J3+1","v":"2019-12-12"},null,null,{"$f":"M3+1","v":"2019-12-13"},null,null,{"$f":"P3+1","v":"2019-12-14"},null,null,{"$f":"S3+1","v":"2019-12-15"}]
["Afdeling",null,"FTE","Vroeg","Laat","Nacht","Vroeg","Laat","Nacht","Vroeg","Laat","Nacht","Vroeg","Laat","Nacht","Vroeg","Laat","Nacht","Vroeg","Laat","Nacht","Vroeg","Laat","Nacht"]
["WERKTIJDEN",null,null,"06:00/14:45","14:45/23:30",null,"06:00/14:45","14:45/23:30",null,"06:00/14:45","14:45/23:30",null,"06:00/14:45","14:45/23:30",null,"06:00/14:45","14:45/23:30",null,"06:00/14:45","14:45/23:30",null,"06:00/14:45","14:45/23:30"]
["AFV",null,1,{"$f":"IFERROR(INDEX(PlanningsFilter!$L$6:$L$1000,SMALL(IF(PlanningsFilter!$K$6:$K$1000=$A6,IF(PlanningsFilter!$C$6:$C$1000=D$2,IF(PlanningsFilter!$J$6:$J$1000=D$4,IF(PlanningsFilter!$I$6:$I$1000=\"\",ROW(PlanningsFilter!$I$6:$I$1000)-ROW($I$6)+1)))),$C6)),\"\")","v":"Christiaan de Wit"},{"$f":"IFERROR(INDEX(PlanningsFilter!$L$6:$L$1000,SMALL(IF(PlanningsFilter!$K$6:$K$1000=$A6,IF(PlanningsFilter!$C$6:$C$1000=E$2,IF(PlanningsFilter!$J$6:$J$1000=E$4,IF(PlanningsFilter!$I$6:$I$1000=\"\",ROW(PlanningsFilter!$I$6:$I$1000)-ROW($I$6)+1)))),$C6)),\"\")","v":"Miquel van Loon"},{"$f":"IFERROR(INDEX(PlanningsFilter!$L$6:$L$1000,SMALL(IF(PlanningsFilter!$K$6:$K$1000=$A6,IF(PlanningsFilter!$C$6:$C$1000=F$2,IF(PlanningsFilter!$J$6:$J$1000=F$4,IF(PlanningsFilter!$I$6:$I$1000=\"\",ROW(PlanningsFilter!$I$6:$I$1000)-ROW($I$6)+1)))),$C6)),\"\")","v":""},{"$f":"IFERROR(INDEX(PlanningsFilter!$L$6:$L$1000,SMALL(IF(PlanningsFilter!$K$6:$K$1000=$A6,IF(PlanningsFilter!$C$6:$C$1000=G$2,IF(PlanningsFilter!$J$6:$J$1000=G$4,IF(PlanningsFilter!$I$6:$I$1000=\"\",ROW(PlanningsFilter!$I$6:$I$1000)-ROW($I$6)+1)))),$C6)),\"\")","v":"Christiaan de Wit"},{"$f":"IFERROR(INDEX(PlanningsFilter!$L$6:$L$1000,SMALL(IF(PlanningsFilter!$K$6:$K$1000=$A6,IF(PlanningsFilter!$C$6:$C$1000=H$2,IF(PlanningsFilter!$J$6:$J$1000=H$4,IF(PlanningsFilter!$I$6:$I$1000=\"\",ROW(PlanningsFilter!$I$6:$I$1000)-ROW($I$6)+1)))),$C6)),\"\")","v":"Miquel van Loon"},{"$f":"IFERROR(INDEX(PlanningsFilter!$L$6:$L$1000,SMALL(IF(PlanningsFilter!$K$6:$K$1000=$A6,IF(PlanningsFilter!$C$6:$C$1000=I$2,IF(PlanningsFilter!$J$6:$J$1000=I$4,IF(PlanningsFilter!$I$6:$I$1000=\"\",ROW(PlanningsFilter!$I$6:$I$1000)-ROW($I$6)+1)))),$C6)),\"\")","v":""},{"$f":"IFERROR(INDEX(PlanningsFilter!$L$6:$L$1000,SMALL(IF(PlanningsFilter!$K$6:$K$1000=$A6,IF(PlanningsFilter!$C$6:$C$1000=J$2,IF(PlanningsFilter!$J$6:$J$1000=J$4,IF(PlanningsFilter!$I$6:$I$1000=\"\",ROW(PlanningsFilter!$I$6:$I$1000)-ROW($I$6)+1)))),$C6)),\"\")","v":"Christiaan de Wit"},{"$f":"IFERROR(INDEX(PlanningsFilter!$L$6:$L$1000,SMALL(IF(PlanningsFilter!$K$6:$K$1000=$A6,IF(PlanningsFilter!$C$6:$C$1000=K$2,IF(PlanningsFilter!$J$6:$J$1000=K$4,IF(PlanningsFilter!$I$6:$I$1000=\"\",ROW(PlanningsFilter!$I$6:$I$1000)-ROW($I$6)+1)))),$C6)),\"\")","v":"Paul van Dongen"},{"$f":"IFERROR(INDEX(PlanningsFilter!$L$6:$L$1000,SMALL(IF(PlanningsFilter!$K$6:$K$1000=$A6,IF(PlanningsFilter!$C$6:$C$1000=L$2,IF(PlanningsFilter!$J$6:$J$1000=L$4,IF(PlanningsFilter!$I$6:$I$1000=\"\",ROW(PlanningsFilter!$I$6:$I$1000)-ROW($I$6)+1)))),$C6)),\"\")","v":""},{"$f":"IFERROR(INDEX(PlanningsFilter!$L$6:$L$1000,SMALL(IF(PlanningsFilter!$K$6:$K$1000=$A6,IF(PlanningsFilter!$C$6:$C$1000=M$2,IF(PlanningsFilter!$J$6:$J$1000=M$4,IF(PlanningsFilter!$I$6:$I$1000=\"\",ROW(PlanningsFilter!$I$6:$I$1000)-ROW($I$6)+1)))),$C6)),\"\")","v":"Christiaan de Wit"},{"$f":"IFERROR(INDEX(PlanningsFilter!$L$6:$L$1000,SMALL(IF(PlanningsFilter!$K$6:$K$1000=$A6,IF(PlanningsFilter!$C$6:$C$1000=N$2,IF(PlanningsFilter!$J$6:$J$1000=N$4,IF(PlanningsFilter!$I$6:$I$1000=\"\",ROW(PlanningsFilter!$I$6:$I$1000)-ROW($I$6)+1)))),$C6)),\"\")","v":"Miquel van Loon"},{"$f":"IFERROR(INDEX(PlanningsFilter!$L$6:$L$1000,SMALL(IF(PlanningsFilter!$K$6:$K$1000=$A6,IF(PlanningsFilter!$C$6:$C$1000=O$2,IF(PlanningsFilter!$J$6:$J$1000=O$4,IF(PlanningsFilter!$I$6:$I$1000=\"\",ROW(PlanningsFilter!$I$6:$I$1000)-ROW($I$6)+1)))),$C6)),\"\")","v":""},{"$f":"IFERROR(INDEX(PlanningsFilter!$L$6:$L$1000,SMALL(IF(PlanningsFilter!$K$6:$K$1000=$A6,IF(PlanningsFilter!$C$6:$C$1000=P$2,IF(PlanningsFilter!$J$6:$J$1000=P$4,IF(PlanningsFilter!$I$6:$I$1000=\"\",ROW(PlanningsFilter!$I$6:$I$1000)-ROW($I$6)+1)))),$C6)),\"\")","v":"Christiaan de Wit"},{"$f":"IFERROR(INDEX(PlanningsFilter!$L$6:$L$1000,SMALL(IF(PlanningsFilter!$K$6:$K$1000=$A6,IF(PlanningsFilter!$C$6:$C$1000=Q$2,IF(PlanningsFilter!$J$6:$J$1000=Q$4,IF(PlanningsFilter!$I$6:$I$1000=\"\",ROW(PlanningsFilter!$I$6:$I$1000)-ROW($I$6)+1)))),$C6)),\"\")","v":"Miquel van Loon"},{"$f":"IFERROR(INDEX(PlanningsFilter!$L$6:$L$1000,SMALL(IF(PlanningsFilter!$K$6:$K$1000=$A6,IF(PlanningsFilter!$C$6:$C$1000=R$2,IF(PlanningsFilter!$J$6:$J$1000=R$4,IF(PlanningsFilter!$I$6:$I$1000=\"\",ROW(PlanningsFilter!$I$6:$I$1000)-ROW($I$6)+1)))),$C6)),\"\")","v":""},{"$f":"IFERROR(INDEX(PlanningsFilter!$L$6:$L$1000,SMALL(IF(PlanningsFilter!$K$6:$K$1000=$A6,IF(PlanningsFilter!$C$6:$C$1000=S$2,IF(PlanningsFilter!$J$6:$J$1000=S$4,IF(PlanningsFilter!$I$6:$I$1000=\"\",ROW(PlanningsFilter!$I$6:$I$1000)-ROW($I$6)+1)))),$C6)),\"\")","v":""},{"$f":"IFERROR(INDEX(PlanningsFilter!$L$6:$L$1000,SMALL(IF(PlanningsFilter!$K$6:$K$1000=$A6,IF(PlanningsFilter!$C$6:$C$1000=T$2,IF(PlanningsFilter!$J$6:$J$1000=T$4,IF(PlanningsFilter!$I$6:$I$1000=\"\",ROW(PlanningsFilter!$I$6:$I$1000)-ROW($I$6)+1)))),$C6)),\"\")","v":""},{"$f":"IFERROR(INDEX(PlanningsFilter!$L$6:$L$1000,SMALL(IF(PlanningsFilter!$K$6:$K$1000=$A6,IF(PlanningsFilter!$C$6:$C$1000=U$2,IF(PlanningsFilter!$J$6:$J$1000=U$4,IF(PlanningsFilter!$I$6:$I$1000=\"\",ROW(PlanningsFilter!$I$6:$I$1000)-ROW($I$6)+1)))),$C6)),\"\")","v":""},{"$f":"IFERROR(INDEX(PlanningsFilter!$L$6:$L$1000,SMALL(IF(PlanningsFilter!$K$6:$K$1000=$A6,IF(PlanningsFilter!$C$6:$C$1000=V$2,IF(PlanningsFilter!$J$6:$J$1000=V$4,IF(PlanningsFilter!$I$6:$I$1000=\"\",ROW(PlanningsFilter!$I$6:$I$1000)-ROW($I$6)+1)))),$C6)),\"\")","v":""},{"$f":"IFERROR(INDEX(PlanningsFilter!$L$6:$L$1000,SMALL(IF(PlanningsFilter!$K$6:$K$1000=$A6,IF(PlanningsFilter!$C$6:$C$1000=W$2,IF(PlanningsFilter!$J$6:$J$1000=W$4,IF(PlanningsFilter!$I$6:$I$1000=\"\",ROW(PlanningsFilter!$I$6:$I$1000)-ROW($I$6)+1)))),$C6)),\"\")","v":""},{"$f":"IFERROR(INDEX(PlanningsFilter!$L$6:$L$1000,SMALL(IF(PlanningsFilter!$K$6:$K$1000=$A6,IF(PlanningsFilter!$C$6:$C$1000=X$2,IF(PlanningsFilter!$J$6:$J$1000=X$4,IF(PlanningsFilter!$I$6:$I$1000=\"\",ROW(PlanningsFilter!$I$6:$I$1000)-ROW($I$6)+1)))),$C6)),\"\")","v":""}]
{"$rows_left_out":33}
{"sheet":"PlanningsFilter","index":3,"n_rows":600,"n_cols":13,"rows_kept":600,"cut":false,"hidden":false,"merged":[]}
[null,"Info","Info","Functie","Starttijd","Eindtijd","Voornaam","Achternaam"]
[null,">43807","<43815"]
[]
[]
[null,null,"Info","Functie","Starttijd","Eindtijd","Voornaam","Achternaam","Verlof","Post","PA","Vn & A","Naam exist"]
[null,null,"2019-12-09","ABB ochtend ",43808.25,43808.614583333336,"Trienko","Spooren",{"$f":"IF(H6=\"\",\"\",IF(SUMPRODUCT(--(ValVerlofVoornaam=G6),--(ValVerlofNaam=H6),--(ValVerlofVan<=C6),--(ValVerlofTot>=C6)*(1))>0,\"V\",\"\"))","v":"V"},{"$f":"IF(C6=\"\",\"\",INDEX(Validatie!$Q$2:$Q$6,MATCH(MOD(E6,1),Validatie!$P$2:$P$6,1)))","v":"Vroeg"},{"$f":"IF(C6=\"\",\"\",IFERROR(VLOOKUP(D6,DataMijnAfdeling,2,0),\"?\"))","v":"ABB"},{"$f":"IF(C6=\"\",\"\",CONCATENATE(G6,\" \",H6))","v":"Trienko Spooren"},{"$f":"IF(C6=\"\",\"\",IFERROR(MATCH(G6&H6,ValVoorNamen&ValNamen,0),\"Fout\")+1)","v":103}]
{"$rows_left_out":595}
{"sheet":"Validatie","index":4,"n_rows":109,"n_cols":17,"rows_kept":109,"cut":false,"hidden":false,"merged":[]}
["Weken",null,"Jaren",null,null,null,null,"Mijn afdelingen","Planning afdeling ",null,null,null,"Voornaam","Naam",null,"Post",0]
[1,null,2018,null,null,null,null,"ABB weekenddienst","ABB",null,null,null,"Abdiqadir","de Jong",null,0]
[2,null,2019,null,null,null,null,"ABB middag","ABB",null,null,null,"Abdul","Jansen",null,0.24,"Vroeg"]
[3,null,2020,null,null,null,null,"ABB ochtend ","ABB",null,null,null,"Abdurahman Ibrahim","de Vries",null,0.5,"Laat"]
[4,null,2021,null,null,null,null,"AFV MEP","MEP",null,null,null,"Agathe","van de Berg ",null,0.83333333333333337,"Nacht"]
[5,null,2022,null,null,null,null,"SCHM AFV","AFV",null,null,null,"Akela","van Dijk",null,0.99930555555555556,"Nacht"]
{"$rows_left_out":104}
{"sheet":"CalPopUp","index":5,"n_rows":20,"n_cols":8,"rows_kept":20,"cut":false,"hidden":true,"merged":[]}
[{"$f":"TODAY()","v":"2019-12-11"},{"$f":"IF(WEEKDAY(DATE(CalYear,MATCH($A$4,CalMonths,0),1))=1,DATE(CalYear,MATCH($A$4,CalMonths,0),1),\"\")","v":"2019-12-01"},{"$f":"IF(B1<>\"\",B1+1,IF(WEEKDAY(DATE(CalYear,MATCH($A$4,CalMonths,0),1))=2,DATE(CalYear,MATCH($A$4,CalMonths,0),1),\"\"))","v":"2019-12-02"},{"$f":"IF(C1<>\"\",C1+1,IF(WEEKDAY(DATE(CalYear,MATCH($A$4,CalMonths,0),1))=3,DATE(CalYear,MATCH($A$4,CalMonths,0),1),\"\"))","v":"2019-12-03"},{"$f":"IF(D1<>\"\",D1+1,IF(WEEKDAY(DATE(CalYear,MATCH($A$4,CalMonths,0),1))=4,DATE(CalYear,MATCH($A$4,CalMonths,0),1),\"\"))","v":"2019-12-04"},{"$f":"IF(E1<>\"\",E1+1,IF(WEEKDAY(DATE(CalYear,MATCH($A$4,CalMonths,0),1))=5,DATE(CalYear,MATCH($A$4,CalMonths,0),1),\"\"))","v":"2019-12-05"},{"$f":"IF(F1<>\"\",F1+1,IF(WEEKDAY(DATE(CalYear,MATCH($A$4,CalMonths,0),1))=6,DATE(CalYear,MATCH($A$4,CalMonths,0),1),\"\"))","v":"2019-12-06"},{"$f":"IF(G1<>\"\",G1+1,IF(WEEKDAY(DATE(CalYear,MATCH($A$4,CalMonths,0),1))=7,DATE(CalYear,MATCH($A$4,CalMonths,0),1),\"\"))","v":"2019-12-07"}]
[2019,{"$f":"H1+1","v":"2019-12-08"},{"$f":"B2+1","v":"2019-12-09"},{"$f":"C2+1","v":"2019-12-10"},"2019-12-11","2019-12-12","2019-12-13","2019-12-14"]
[12,{"$f":"H2+1","v":"2019-12-15"},{"$f":"B3+1","v":"2019-12-16"},"2019-12-17","2019-12-18","2019-12-19","2019-12-20","2019-12-21"]
[{"$f":"INDEX(CalMonths,A3,)","v":"December"},"2019-12-22","2019-12-23","2019-12-24","2019-12-25","2019-12-26","2019-12-27","2019-12-28"]
[{"$f":"A4&\" \"&CalYear","v":"December 2019"},{"$f":"IF(OR(H4=\"\",MONTH(H4+1)<>$A$3),\"\",H4+1)","v":"2019-12-29"},{"$f":"IFERROR(IF(MONTH(B5+1)<>$A$3,\"\",B5+1),\"\")","v":"2019-12-30"},{"$f":"IFERROR(IF(MONTH(C5+1)<>$A$3,\"\",C5+1),\"\")","v":"2019-12-31"},"","","",""]
[{"$f":"SUM(B6:H6)","v":0},{"$f":"IFERROR(IF(OR(H5=\"\",MONTH(H5+1)<>$A$3),\"\",H5+1),\"\")","v":""},{"$f":"IFERROR(F(MONTH(I5+1)<>$A$3,\"\",I5+1),\"\")","v":""},{"$f":"IFERROR(F(MONTH(J5+1)<>$A$3,\"\",J5+1),\"\")","v":""},{"$f":"IFERROR(F(MONTH(K5+1)<>$A$3,\"\",K5+1),\"\")","v":""},{"$f":"IFERROR(F(MONTH(L5+1)<>$A$3,\"\",L5+1),\"\")","v":""},{"$f":"IFERROR(F(MONTH(M5+1)<>$A$3,\"\",M5+1),\"\")","v":""},{"$f":"IFERROR(F(MONTH(N5+1)<>$A$3,\"\",N5+1),\"\")","v":""}]
{"$rows_left_out":14}