{"text_format":"1","workbook":"xlsx","n_sheets":7,"sheets":["Weekplanning","Verlof","Jaaroverzicht","Info uitzendburo","EMB weekplanning","EMB verlof","EMB jaaroverzicht"],"not_rendered":{"charts":0,"images":10,"macros":1,"external_links":0,"defined_names":11,"comments":0,"pivot_tables":0},"unopened":[],"bounds":{"document_bytes":16777216,"sheet_cells":100000,"rows_first":2000,"rows_last":500,"rows_between":2000,"halvings":0,"cell_chars":16384,"cell_head_chars":4096},"cells_cut":0,"cells_raw":0,"read":"whole","date_system":"1900"}

{"sheet":"Weekplanning","index":0,"n_rows":119,"n_cols":24,"rows_kept":119,"cut":false,"hidden":false,"merged":[]}
[null,null,null,"PLANNING","2019-12-20"]
[null,{"$f":"WEEKNUM(E2) & \"/\" & YEAR(E2)","v":"50/2019"},null,{"$f":"WEEKDAY(E2)","v":"1900-01-01"},"2019-12-08",{"$f":"\"Week nr.\" & WEEKNUM(E2)","v":"Week nr.50"},{"$f":"WEEKDAY(H2)","v":"1900-01-02"},"2019-12-09",{"$f":"\"Week nr.\" & WEEKNUM(H2)","v":"Week nr.50"},{"$f":"WEEKDAY(K2)","v":"1900-01-03"},"2019-12-10",{"$f":"\"Week nr.\" & WEEKNUM(K2)","v":"Week nr.50"},{"$f":"WEEKDAY(N2)","v":"1900-01-04"},"2019-12-11",{"$f":"\"Week nr.\" & WEEKNUM(N2)","v":"Week nr.50"},{"$f":"WEEKDAY(Q2)","v":"1900-01-05"},"2019-12-12",{"$f":"\"Week nr.\" & WEEKNUM(Q2)","v":"Week nr.50"},{"$f":"WEEKDAY(T2)","v":"1900-01-06"},"2019-12-13",{"$f":"\"Week nr.\" & WEEKNUM(T2)","v":"Week nr.50"},{"$f":"WEEKDAY(W2)","v":"1900-01-07"},"2019-12-14",{"$f":"\"Week nr.\" & WEEKNUM(W2)","v":"Week nr.50"}]
["Afdeling","Verlof","FTE","Vroeg","Laat","Nacht","Vroeg","Laat","Nacht","Vroeg","Laat","Nacht","Vroeg","Laat","Nacht","Vroeg","Laat","Nacht","Vroeg","Laat","Nacht","Vroeg","Laat","Nacht"]
["AFV",null,null,"06:00/14:45","14:45/23:30","22:00/06:45","06:00/14:45","14:45/23:30","22:00/06:45","06:00/14:45","14:45/23:30","22:00/06:45","06:00/14:45","14:45/23:30","22:00/06:45","06:00/14:45","14:45/23:30","22:00/06:45","06:00/14:45","14:45/23:30","22:00/06:45","06:00/14:45","14:45/23:30","22:00/06:45"]
[null,null,1,null,null,null,"Christiaan Achternaam51","Miquel Achternaam39",null,"Christiaan Achternaam51","Miquel Achternaam39",null,"Christiaan Achternaam51","Paul Achternaam49",null,"Christiaan Achternaam51","Miquel Achternaam39",null,"Christiaan Achternaam51","Miquel Achternaam39"]
[null,null,2,null,null,null,"Henri Achternaam82","Paul Achternaam49",null,"Henri Achternaam82","Paul Achternaam49",null,"Henri Achternaam82","Baki Achternaam2",null,"Henri Achternaam82","Paul Achternaam49",null,"Henri Achternaam82","Paul Achternaam49"]
[null,null,3,null,null,null,"Jan Achternaam79","Sebastiaan Achternaam41",null,"Jan Achternaam79","Sebastiaan Achternaam41",null,"Jan Achternaam79","Ilker Achternaam38",null,"Jan Achternaam79","Sebastiaan Achternaam41",null,"Jan Achternaam79","Sebastiaan Achternaam41"]
[null,null,4,null,null,null,"Boyan Achternaam80","Baki Achternaam2",null,"Boyan Achternaam80","Baki Achternaam2",null,"Boyan Achternaam80","Flavi Achternaam1",null,"Boyan Achternaam80","Baki Achternaam2",null,"Boyan Achternaam80","Baki Achternaam2"]
[null,null,5,null,null,null,"Michel Achternaam83","Ilker Achternaam38",null,"Michel Achternaam83","Ilker Achternaam38",null,"Michel Achternaam83",null,null,"Michel Achternaam83","Ilker Achternaam38",null,"Michel Achternaam83","Ilker Achternaam38"]
[null,null,6,null,null,null,null,null,null,null,null,null,null,null,null,null,"Flavi Achternaam1",null,null,"Flavi Achternaam1"]
[null,null,7]
[null,null,8]
["SCHM",null,"WERKTIIJDEN","06:00/14:45","14:45/23:30","22:00/06:45","06:00/14:45","14:45/23:30","22:00/06:45","06:00/14:45","14:45/23:30","22:00/06:45","06:00/14:45","14:45/23:30","22:00/06:45","06:00/14:45","14:45/23:30","22:00/06:45","06:00/14:45","14:45/23:30","22:00/06:45","06:00/14:45","14:45/23:30","22:00/06:45"]
[null,null,1,null,null,"Rachid Achternaam34","Marjolein Achternaam76","Erik Achternaam4","Rachid Achternaam34","Marjolein Achternaam76","Erik Achternaam4","Rachid Achternaam34","Marjolein Achternaam76","Erik Achternaam4","Rachid Achternaam34","Marjolein Achternaam76","Erik Achternaam4","Rachid Achternaam34","Marjolein Achternaam76","Erik Achternaam4"]
[null,null,2,null,null,"Evans Achternaam35","Piet Achternaam78","Patrick Achternaam88","Evans Achternaam35","Piet Achternaam78","Patrick Achternaam88","Evans Achternaam35","Piet Achternaam78","Patrick Achternaam88","Evans Achternaam35","Piet Achternaam78","Patrick Achternaam88","Evans Achternaam35","Piet Achternaam78","Patrick Achternaam88"]
[null,null,3,null,null,"Kevin Achternaam36","Roy Achternaam77","Rolinka Achternaam3","Kevin Achternaam36","Roy Achternaam77","Rolinka Achternaam3","Kevin Achternaam36","Roy Achternaam77","Rolinka Achternaam3","Kevin Achternaam36","Roy Achternaam77","Rolinka Achternaam3","Kevin Achternaam36","Roy Achternaam77","Rolinka Achternaam3"]
[null,null,4]
[null,null,5]
[null,null,6]
[null,null,7]
[null,null,8]
["HAS",null,"WERKTIIJDEN","06:00/14:45","13:45/22:30","22:00/06:45","06:00/14:45","13:45/22:30","22:00/06:45","06:00/14:45","13:45/22:30","22:00/06:45","06:00/14:45","13:45/22:30","22:00/06:45","06:00/14:45","13:45/22:30","22:00/06:45","06:00/14:45","13:45/22:30","22:00/06:45","06:00/14:45","13:45/22:30","22:00/06:45"]
[null,null,1,null,null,null,"Paul Achternaam49","Norbert Achternaam6",null,"Paul Achternaam49","Norbert Achternaam6",null,"Paul Achternaam49","Norbert Achternaam6",null,"Paul Achternaam49","Norbert Achternaam6",null,"Paul Achternaam49","Norbert Achternaam6"]
[null,null,2,null,null,null,"Paul Achternaam49",null,null,"Paul Achternaam49","Norbert Achternaam6",null,"Paul Achternaam49",null,null,"Paul Achternaam49",null,null,"Paul Achternaam49","Norbert Achternaam6"]
[null,null,3]
[null,null,4]
[null,null,5]
[null,null,6]
[null,null,7]
["LCR",null,null,"06:00/14:45","14:45/23:30","22:00/06:45","06:00/14:45","14:45/23:30","22:00/06:45","06:00/14:45","14:45/23:30","22:00/06:45","06:00/14:45","14:45/23:30","22:00/06:45","06:00/14:45","14:45/23:30","22:00/06:45","06:00/14:45","14:45/23:30","22:00/06:45","06:00/14:45","14:45/23:30","22:00/06:45"]
[null,null,1,null,null,null,"Sami Achternaam81","Klaas Achternaam40",null,"Sami Achternaam81","Klaas Achternaam40",null,"Sami Achternaam81","Sebastiaan Achternaam41",null,"Sami Achternaam81","Klaas Achternaam40",null,"Sami Achternaam81","Klaas Achternaam40"]
[null,null,2,null,null,null,"Wolter Achternaam8",null,null,"Wolter Achternaam8",null,null,"Wolter Achternaam8",null,null,null,null,null,"Wolter Achternaam8"]
[null,null,3]
[null,null,4]
[null,null,5]
[null,null,6]
[null,null,7]
["ABB",null,null,{"$f":"IF(WEEKDAY(E2)=7,\"08:00/21:00 \",IF(WEEKDAY(E2)=1,\"08:00/14:45\",\"06:00/14:45\"))","v":"08:00/14:45"},{"$f":"IF(WEEKDAY(E2)=1,\"13:45/22:30\",\"14:45/23:30\")","v":"13:45/22:30"},{"$f":"IF(OR(WEEKDAY(E2)=7,WEEKDAY(E2)=1),\" \",\"22:00/06:45\")","v":" "},{"$f":"IF(WEEKDAY(H2)=7,\"08:00/21:00 \",IF(WEEKDAY(H2)=1,\"08:00/14:45\",\"06:00/14:45\"))","v":"06:00/14:45"},{"$f":"IF(WEEKDAY(H2)=1,\"13:45/22:30\",\"14:45/23:30\")","v":"14:45/23:30"},{"$f":"IF(OR(WEEKDAY(H2)=7,WEEKDAY(H2)=1),\" \",\"22:00/06:45\")","v":"22:00/06:45"},{"$f":"IF(WEEKDAY(K2)=7,\"08:00/21:00 \",IF(WEEKDAY(K2)=1,\"08:00/14:45\",\"06:00/14:45\"))","v":"06:00/14:45"},{"$f":"IF(WEEKDAY(K2)=1,\"13:45/22:30\",\"14:45/23:30\")","v":"14:45/23:30"},{"$f":"IF(OR(WEEKDAY(K2)=7,WEEKDAY(K2)=1),\" \",\"22:00/06:45\")","v":"22:00/06:45"},{"$f":"IF(WEEKDAY(N2)=7,\"08:00/21:00 \",IF(WEEKDAY(N2)=1,\"08:00/14:45\",\"06:00/14:45\"))","v":"06:00/14:45"},{"$f":"IF(WEEKDAY(N2)=1,\"13:45/22:30\",\"14:45/23:30\")","v":"14:45/23:30"},{"$f":"IF(OR(WEEKDAY(N2)=7,WEEKDAY(N2)=1),\" \",\"22:00/06:45\")","v":"22:00/06:45"},{"$f":"IF(WEEKDAY(Q2)=7,\"08:00/21:00 \",IF(WEEKDAY(Q2)=1,\"08:00/14:45\",\"06:00/14:45\"))","v":"06:00/14:45"},{"$f":"IF(WEEKDAY(Q2)=1,\"13:45/22:30\",\"14:45/23:30\")","v":"14:45/23:30"},{"$f":"IF(OR(WEEKDAY(Q2)=7,WEEKDAY(Q2)=1),\" \",\"22:00/06:45\")","v":"22:00/06:45"},{"$f":"IF(WEEKDAY(T2)=7,\"08:00/21:00 \",IF(WEEKDAY(T2)=1,\"08:00/14:45\",\"06:00/14:45\"))","v":"06:00/14:45"},{"$f":"IF(WEEKDAY(T2)=1,\"13:45/22:30\",\"14:45/23:30\")","v":"14:45/23:30"},{"$f":"IF(OR(WEEKDAY(T2)=7,WEEKDAY(T2)=1),\" \",\"22:00/06:45\")","v":"22:00/06:45"},{"$f":"IF(WEEKDAY(W2)=7,\"08:00/21:00 \",IF(WEEKDAY(W2)=1,\"08:00/14:45\",\"06:00/14:45\"))","v":"08:00/21:00 "},{"$f":"IF(WEEKDAY(W2)=1,\"13:45/22:30\",\"14:45/23:30\")","v":"14:45/23:30"},{"$f":"IF(OR(WEEKDAY(W2)=7,WEEKDAY(W2)=1),\" \",\"22:00/06:45\")","v":" "}]
[null,null,1,"Baki Achternaam2","Flavi Achternaam1",null,"Trienko Achternaam48","Bile Achternaam508",null,"Trienko Achternaam48","Bile Achternaam508",null,"Trienko Achternaam48","Bile Achternaam508",null,"Trienko Achternaam48","Bile Achternaam508",null,"Trienko Achternaam48","Bile Achternaam508",null,"Niek Achternaam937"]
[null,null,2,null,null,null,null,"Flavi Achternaam1",null,null,"Flavi Achternaam1"]
[null,null,3]
[null,null,4]
[null,null,5]
[null,null,6]
[null,null,7]
["MEP",null,null,"06:00/14:45","14:45/23:30","22:00/06:45","06:00/14:45","14:45/23:30","22:00/06:45","06:00/14:45","14:45/23:30","22:00/06:45","06:00/14:45","14:45/23:30","22:00/06:45","06:00/14:45","14:45/23:30","22:00/06:45","06:00/14:45","14:45/23:30","22:00/06:45","06:00/14:45","14:45/23:30","22:00/06:45"]
[null,null,1,null,null,null,"Rudolf Achternaam44","Houcin Achternaam7",null,"Rudolf Achternaam44","Houcin Achternaam7",null,"Rudolf Achternaam44","Houcin Achternaam7",null,"Rudolf Achternaam44","Houcin Achternaam7",null,"Rudolf Achternaam44","Houcin Achternaam7"]
[null,null,2,null,null,null,"Rijk Achternaam50",null,null,"Rijk Achternaam50",null,null,"Rijk Achternaam50",null,null,"Rijk Achternaam50",null,null,"Rijk Achternaam50"]
[null,null,3]
[null,null,4]
[null,null,5]
[null,null,6]
[]
[]
[]
[]
[]
[]
[]
[]
[]
[]
[]
[]
[]
[]
[]
[]
[]
[]
[]
[]
[]
[]
[null,null,null,{"$f":"WEEKDAY(E75)","v":"1900-01-07"},"2019-11-30",{"$f":"\"Week nr.\" & WEEKNUM(E75)","v":"Week nr.48"}]
[null,null,null,"Vroeg","Laat","Nacht"]
[null,null,null,"06:00/14:45","14:45/23:30","22:00/06:45"]
[]
[]
[]
[]
[]
[]
[]
[]
[null,null,null,"06:00/14:45","14:45/23:30","22:00/06:45"]
[]
[]
[]
[]
[]
[]
[]
[]
[null,null,null,"06:00/14:45","13:45/22:30","22:00/06:45"]
[]
[]
[]
[]
[]
[]
[]
[null,null,null,"06:00/14:45","14:45/23:30","22:00/06:45"]
[]
[]
[]
[]
[]
[]
[]
[null,null,null,{"$f":"IF(WEEKDAY(E75)=7,\"08:00/21:00 \",IF(WEEKDAY(E75)=1,\"08:00/14:45\",\"06:00/14:45\"))","v":"08:00/21:00 "},{"$f":"IF(WEEKDAY(E75)=1,\"13:45/22:30\",\"14:45/23:30\")","v":"14:45/23:30"},{"$f":"IF(OR(WEEKDAY(E75)=7,WEEKDAY(E75)=1),\" \",\"22:00/06:45\")","v":" "}]
[]
[]
[]
[]
[]
[]
[]
[null,null,null,"06:00/14:45","14:45/23:30","22:00/06:45"]

{"sheet":"Verlof","index":1,"n_rows":234,"n_cols":6,"rows_kept":234,"cut":false,"hidden":false,"merged":[]}
["Weeknummer","Datum","Naam","Afdeling","aantal dagen","Goedgekeurd/ afgekeurd (reden)"]
[{"$f":"IF(B2<>\"\",WEEKNUM(B2),\"\")","v":48},"2019-11-30","Flavi Achternaam1",{"$f":"IF(C2<>\"\",VLOOKUP(C2,verlof,2,0),\"\")","v":"ABB weekenddienst"},20,"goedgekeurd"]
[49,"2019-12-01","Baki Achternaam2","ABB middag",15,"afgekeurd, teveel verlof"]
[49,"2019-12-01","Rolinka Achternaam3","SCHM",10,"afgekeurd, werkt te traag"]
[49,"2019-12-01","Erik Achternaam4","SCHM",3,"goedgekeurd"]
[48,"2019-11-24","Wolter Achternaam8","LCR ochtend",5,"goedgekeurd"]
[{"$f":"IF(B7<>\"\",WEEKNUM(B7),\"\")","v":51},"2019-12-15","Rolinka Achternaam3",{"$f":"IF(C7<>\"\",VLOOKUP(C7,verlof,2,0),\"\")","v":"SCHM"},8]
[{"$f":"IF(B8<>\"\",WEEKNUM(B8),\"\")","v":46},"2019-11-16","Norbert Achternaam6",{"$f":"IF(C8<>\"\",VLOOKUP(C8,verlof,2,0),\"\")","v":"AFV HAS"},2,"afgekeurd, teveel verlof"]
[{"$f":"IF(B9<>\"\",WEEKNUM(B9),\"\")","v":51},"2019-12-18","Baki Achternaam2",{"$f":"IF(C9<>\"\",VLOOKUP(C9,verlof,2,0),\"\")","v":"ABB middag"},2,"goedgekeurd"]
[{"$f":"IF(B10<>\"\",WEEKNUM(B10),\"\")","v":51},"2019-12-20","Rolinka Achternaam3",{"$f":"IF(C10<>\"\",VLOOKUP(C10,verlof,2,0),\"\")","v":"SCHM"},2]
[{"$f":"IF(B11<>\"\",WEEKNUM(B11),\"\")","v":51},"2019-12-15","Rolinka Achternaam3",{"$f":"IF(C11<>\"\",VLOOKUP(C11,verlof,2,0),\"\")","v":"SCHM"},3]
["",null,null,""]
["",null,null,""]
[""]
["",null,null,""]
["",null,null,""]
["",null,null,""]
["",null,null,""]
["",null,null,""]
["",null,null,""]
["",null,null,""]
["",null,null,""]
["",null,null,""]
["",null,null,""]
["",null,null,""]
["",null,null,""]
["",null,null,""]
["",null,null,""]
["",null,null,""]
["",null,null,""]
["",null,null,""]
["",null,null,""]
["",null,null,""]
["",null,null,""]
["",null,null,""]
["",null,null,""]
["",null,null,""]
["",null,null,""]
["",null,null,""]
["",null,null,""]
["",null,null,""]
["",null,null,""]
["",null,null,""]
["",null,null,""]
["",null,null,""]
["",null,null,""]
["",null,null,""]
["",null,null,""]
["",null,null,""]
["",null,null,""]
["",null,null,""]
["",null,null,""]
["",null,null,""]
["",null,null,""]
["",null,null,""]
["",null,null,""]
["",null,null,""]
["",null,null,""]
["",null,null,""]
["",null,null,""]
["",null,null,""]
[{"$f":"IF(B62<>\"\",WEEKNUM(B62),\"\")","v":""},null,null,""]
["",null,null,""]
["",null,null,""]
["",null,null,""]
["",null,null,{"$f":"IF(C66<>\"\",VLOOKUP(C66,verlof,2,0),\"\")","v":""}]
["",null,null,""]
["",null,null,""]
["",null,null,""]
["",null,null,""]
["",null,null,""]
["",null,null,""]
["",null,null,""]
["",null,null,""]
["",null,null,""]
["",null,null,""]
["",null,null,""]
["",null,null,""]
["",null,null,""]
["",null,null,""]
["",null,null,""]
["",null,null,""]
["",null,null,""]
["",null,null,""]
["",null,null,""]
["",null,null,""]
["",null,null,""]
["",null,null,""]
["",null,null,""]
["",null,null,""]
["",null,null,""]
["",null,null,""]
["",null,null,""]
["",null,null,""]
["",null,null,""]
["",null,null,""]
["",null,null,""]
["",null,null,""]
["",null,null,""]
["",null,null,""]
["",null,null,""]
["",null,null,""]
["",null,null,""]
["",null,null,""]
["",null,null,""]
["",null,null,""]
["",null,null,""]
["",null,null,""]
["",null,null,""]
["",null,null,""]
["",null,null,""]
["",null,null,""]
["",null,null,""]
["",null,null,""]
["",null,null,""]
["",null,null,""]
["",null,null,""]
["",null,null,""]
["",null,null,""]
["",null,null,""]
["",null,null,""]
["",null,null,""]
["",null,null,""]
["",null,null,""]
["",null,null,""]
[{"$f":"IF(B126<>\"\",WEEKNUM(B126),\"\")","v":""},null,null,""]
["",null,null,""]
["",null,null,""]
["",null,null,""]
["",null,null,{"$f":"IF(C130<>\"\",VLOOKUP(C130,verlof,2,0),\"\")","v":""}]
["",null,null,""]
["",null,null,""]
["",null,null,""]
["",null,null,""]
["",null,null,""]
["",null,null,""]
["",null,null,""]
["",null,null,""]
["",null,null,""]
["",null,null,""]
["",null,null,""]
["",null,null,""]
["",null,null,""]
["",null,null,""]
["",null,null,""]
["",null,null,""]
["",null,null,""]
["",null,null,""]
["",null,null,""]
["",null,null,""]
["",null,null,""]
["",null,null,""]
["",null,null,""]
["",null,null,""]
["",null,null,""]
["",null,null,""]
["",null,null,""]
["",null,null,""]
["",null,null,""]
["",null,null,""]
["",null,null,""]
["",null,null,""]
["",null,null,""]
["",null,null,""]
["",null,null,""]
["",null,null,""]
["",null,null,""]
["",null,null,""]
["",null,null,""]
["",null,null,""]
["",null,null,""]
["",null,null,""]
["",null,null,""]
["",null,null,""]
["",null,null,""]
["",null,null,""]
["",null,null,""]
["",null,null,""]
["",null,null,""]
["",null,null,""]
["",null,null,""]
["",null,null,""]
["",null,null,""]
["",null,null,""]
["",null,null,""]
["",null,null,""]
["",null,null,""]
["",null,null,""]
["",null,null,""]
[{"$f":"IF(B190<>\"\",WEEKNUM(B190),\"\")","v":""},null,null,""]
["",null,null,""]
["",null,null,""]
["",null,null,""]
["",null,null,{"$f":"IF(C194<>\"\",VLOOKUP(C194,verlof,2,0),\"\")","v":""}]
["",null,null,""]
["",null,null,""]
["",null,null,""]
["",null,null,""]
["",null,null,""]
["",null,null,""]
["",null,null,""]
["",null,null,""]
["",null,null,""]
["",null,null,""]
["",null,null,""]
["",null,null,""]
["",null,null,""]
["",null,null,""]
["",null,null,""]
["",null,null,""]
["",null,null,""]
["",null,null,""]
["",null,null,""]
["",null,null,""]
["",null,null,""]
["",null,null,""]
["",null,null,""]
["",null,null,""]
["",null,null,""]
["",null,null,""]
["",null,null,""]
["",null,null,""]
["",null,null,""]
["",null,null,""]
["",null,null,""]
["",null,null,""]
["",null,null,""]
["",null,null,""]
["",null,null,""]
["",null,null,""]
["",null,null,""]
["",null,null,""]
["",null,null,""]
["",null,null,""]

{"sheet":"Jaaroverzicht","index":2,"n_rows":156,"n_cols":24,"rows_kept":156,"cut":false,"hidden":false,"merged":[]}
[null,null,null,"JAARPLANNING"]
[null,null,null,{"$f":"WEEKDAY(E2)","v":"1900-01-01"},"2019-12-01",{"$f":"\"Week nr.\" & WEEKNUM(E2)","v":"Week nr.49"},{"$f":"WEEKDAY(H2)","v":"1900-01-02"},"2019-12-02",{"$f":"\"Week nr.\" & WEEKNUM(H2)","v":"Week nr.49"},{"$f":"WEEKDAY(K2)","v":"1900-01-03"},"2019-12-03",{"$f":"\"Week nr.\" & WEEKNUM(K2)","v":"Week nr.49"},{"$f":"WEEKDAY(N2)","v":"1900-01-04"},"2019-12-04",{"$f":"\"Week nr.\" & WEEKNUM(N2)","v":"Week nr.49"},{"$f":"WEEKDAY(Q2)","v":"1900-01-05"},"2019-12-05",{"$f":"\"Week nr.\" & WEEKNUM(Q2)","v":"Week nr.49"},{"$f":"WEEKDAY(T2)","v":"1900-01-06"},"2019-12-06",{"$f":"\"Week nr.\" & WEEKNUM(T2)","v":"Week nr.49"},{"$f":"WEEKDAY(W2)","v":"1900-01-07"},"2019-12-07",{"$f":"\"Week nr.\" & WEEKNUM(W2)","v":"Week nr.49"}]
["Afdeling","Verlof","FTE","Vroeg","Laat","Nacht","Vroeg","Laat","Nacht","Vroeg","Laat","Nacht","Vroeg","Laat","Nacht","Vroeg","Laat","Nacht","Vroeg","Laat","Nacht","Vroeg","Laat","Nacht"]
["AFV",null,null,"06:00/14:45","14:45/23:30","22:00/06:45","06:00/14:45","14:45/23:30","22:00/06:45","06:00/14:45","14:45/23:30","22:00/06:45","06:00/14:45","14:45/23:30","22:00/06:45","06:00/14:45","14:45/23:30","22:00/06:45","06:00/14:45","14:45/23:30","22:00/06:45","06:00/14:45","14:45/23:30","22:00/06:45"]
[null,null,1,null,null,null,"Baki Achternaam2","Jan Achternaam79",null,"Baki Achternaam2","Jan Achternaam79",null,"Baki Achternaam2","Jan Achternaam79",null,"Baki Achternaam2","Jan Achternaam79",null,"Baki Achternaam2","Jan Achternaam79"]
[null,null,2,null,null,null,"Ilker Achternaam38","Boyan Achternaam80",null,"Ilker Achternaam38","Boyan Achternaam80",null,"Ilker Achternaam38","Boyan Achternaam80",null,"Ilker Achternaam38","Boyan Achternaam80",null,"Ilker Achternaam38","Boyan Achternaam80"]
[null,null,3,null,null,null,"Miquel Achternaam39","Sami Achternaam81",null,"Miquel Achternaam39","Sami Achternaam81",null,"Miquel Achternaam39","Sami Achternaam81",null,"Miquel Achternaam39","Sami Achternaam81",null,"Miquel Achternaam39","Sami Achternaam81"]
[null,null,4,null,null,null,null,"Henri Achternaam82",null,"Klaas Achternaam40","Henri Achternaam82",null,"Klaas Achternaam40","Henri Achternaam82",null,"Klaas Achternaam40","Henri Achternaam82",null,"Klaas Achternaam40","Henri Achternaam82"]
[null,null,5,null,null,null,null,"Michel Achternaam83",null,null,"Michel Achternaam83",null,null,"Michel Achternaam83",null,null,"Michel Achternaam83",null,null,"Michel Achternaam83"]
[null,null,6]
[null,null,7]
[null,null,8]
["SCHM",null,"WERKTIIJDEN","06:00/14:45","14:45/23:30","22:00/06:45","06:00/14:45","14:45/23:30","22:00/06:45","06:00/14:45","14:45/23:30","22:00/06:45","06:00/14:45","14:45/23:30","22:00/06:45","06:00/14:45","14:45/23:30","22:00/06:45","06:00/14:45","14:45/23:30","22:00/06:45","06:00/14:45","14:45/23:30","22:00/06:45"]
[null,null,1,null,null,"Rolinka Achternaam3","Rachid Achternaam34","Marjolein Achternaam76","Patrick Achternaam88","Rachid Achternaam34","Marjolein Achternaam76","Patrick Achternaam88","Rachid Achternaam34","Marjolein Achternaam76","Patrick Achternaam88","Rachid Achternaam34","Roy Achternaam77","Patrick Achternaam88","Rachid Achternaam34","Roy Achternaam77"]
[null,null,2,null,null,"Erik Achternaam4","Evans Achternaam35","Roy Achternaam77","Rolinka Achternaam3","Evans Achternaam35","Roy Achternaam77","Rolinka Achternaam3","Evans Achternaam35","Roy Achternaam77","Rolinka Achternaam3","Evans Achternaam35",null,"Rolinka Achternaam3","Evans Achternaam35","Piet Achternaam78"]
[null,null,3,null,null,null,"Kevin Achternaam36","Piet Achternaam78","Erik Achternaam4","Kevin Achternaam36","Piet Achternaam78","Erik Achternaam4","Kevin Achternaam36","Piet Achternaam78","Erik Achternaam4","Kevin Achternaam36",null,"Erik Achternaam4","Kevin Achternaam36"]
[null,null,4]
[null,null,5]
[null,null,6]
[null,null,7]
[null,null,8]
["HAS",null,"WERKTIIJDEN","06:00/14:45","13:45/22:30","22:00/06:45","06:00/14:45","13:45/22:30","22:00/06:45","06:00/14:45","13:45/22:30","22:00/06:45","06:00/14:45","13:45/22:30","22:00/06:45","06:00/14:45","13:45/22:30","22:00/06:45","06:00/14:45","13:45/22:30","22:00/06:45","06:00/14:45","13:45/22:30","22:00/06:45"]
[null,null,1,null,null,null,"Norbert Achternaam6","Paul Achternaam49",null,"Norbert Achternaam6","Paul Achternaam49",null,"Norbert Achternaam6","Paul Achternaam49",null,"Norbert Achternaam6","Paul Achternaam49",null,"Norbert Achternaam6","Paul Achternaam49"]
[null,null,2,null,null,null,"Norbert Achternaam6","Paul Achternaam49",null,"Norbert Achternaam6","Paul Achternaam49",null,"Norbert Achternaam6","Paul Achternaam49",null,"Norbert Achternaam6","Paul Achternaam49",null,"Norbert Achternaam6","Paul Achternaam49"]
[null,null,3]
[null,null,4]
[null,null,5]
[null,null,6]
[null,null,7]
["LCR",null,null,"06:00/14:45","14:45/23:30","22:00/06:45","06:00/14:45","14:45/23:30","22:00/06:45","06:00/14:45","14:45/23:30","22:00/06:45","06:00/14:45","14:45/23:30","22:00/06:45","06:00/14:45","14:45/23:30","22:00/06:45","06:00/14:45","14:45/23:30","22:00/06:45","06:00/14:45","14:45/23:30","22:00/06:45"]
[null,null,1,null,null,null,"Wolter Achternaam8","Christiaan Achternaam51",null,"Wolter Achternaam8","Christiaan Achternaam51",null,"Wolter Achternaam8","Christiaan Achternaam51",null,"Wolter Achternaam8","Christiaan Achternaam51",null,"Wolter Achternaam8","Christiaan Achternaam51"]
[null,null,2]
[null,null,3]
[null,null,4]
[null,null,5]
[null,null,6]
[null,null,7]
["ABB",null,null,{"$f":"IF(WEEKDAY(E2)=7,\"08:00/21:00 \",IF(WEEKDAY(E2)=1,\"08:00/14:45\",\"06:00/14:45\"))","v":"08:00/14:45"},{"$f":"IF(WEEKDAY(E2)=1,\"13:45/22:30\",\"14:45/23:30\")","v":"13:45/22:30"},{"$f":"IF(OR(WEEKDAY(E2)=7,WEEKDAY(E2)=1),\" \",\"22:00/06:45\")","v":" "},{"$f":"IF(WEEKDAY(H2)=7,\"08:00/21:00 \",IF(WEEKDAY(H2)=1,\"08:00/14:45\",\"06:00/14:45\"))","v":"06:00/14:45"},{"$f":"IF(WEEKDAY(H2)=1,\"13:45/22:30\",\"14:45/23:30\")","v":"14:45/23:30"},{"$f":"IF(OR(WEEKDAY(H2)=7,WEEKDAY(H2)=1),\" \",\"22:00/06:45\")","v":"22:00/06:45"},{"$f":"IF(WEEKDAY(K2)=7,\"08:00/21:00 \",IF(WEEKDAY(K2)=1,\"08:00/14:45\",\"06:00/14:45\"))","v":"06:00/14:45"},{"$f":"IF(WEEKDAY(K2)=1,\"13:45/22:30\",\"14:45/23:30\")","v":"14:45/23:30"},{"$f":"IF(OR(WEEKDAY(K2)=7,WEEKDAY(K2)=1),\" \",\"22:00/06:45\")","v":"22:00/06:45"},{"$f":"IF(WEEKDAY(N2)=7,\"08:00/21:00 \",IF(WEEKDAY(N2)=1,\"08:00/14:45\",\"06:00/14:45\"))","v":"06:00/14:45"},{"$f":"IF(WEEKDAY(N2)=1,\"13:45/22:30\",\"14:45/23:30\")","v":"14:45/23:30"},{"$f":"IF(OR(WEEKDAY(N2)=7,WEEKDAY(N2)=1),\" \",\"22:00/06:45\")","v":"22:00/06:45"},{"$f":"IF(WEEKDAY(Q2)=7,\"08:00/21:00 \",IF(WEEKDAY(Q2)=1,\"08:00/14:45\",\"06:00/14:45\"))","v":"06:00/14:45"},{"$f":"IF(WEEKDAY(Q2)=1,\"13:45/22:30\",\"14:45/23:30\")","v":"14:45/23:30"},{"$f":"IF(OR(WEEKDAY(Q2)=7,WEEKDAY(Q2)=1),\" \",\"22:00/06:45\")","v":"22:00/06:45"},{"$f":"IF(WEEKDAY(T2)=7,\"08:00/21:00 \",IF(WEEKDAY(T2)=1,\"08:00/14:45\",\"06:00/14:45\"))","v":"06:00/14:45"},{"$f":"IF(WEEKDAY(T2)=1,\"13:45/22:30\",\"14:45/23:30\")","v":"14:45/23:30"},{"$f":"IF(OR(WEEKDAY(T2)=7,WEEKDAY(T2)=1),\" \",\"22:00/06:45\")","v":"22:00/06:45"},{"$f":"IF(WEEKDAY(W2)=7,\"08:00/21:00 \",IF(WEEKDAY(W2)=1,\"08:00/14:45\",\"06:00/14:45\"))","v":"08:00/21:00 "},{"$f":"IF(WEEKDAY(W2)=1,\"13:45/22:30\",\"14:45/23:30\")","v":"14:45/23:30"},{"$f":"IF(OR(WEEKDAY(W2)=7,WEEKDAY(W2)=1),\" \",\"22:00/06:45\")","v":" "}]
[null,"Flavi Achternaam1",1,"Flavi Achternaam1","Baki Achternaam2",null,"Flavi Achternaam1","Trienko Achternaam48",null,"Flavi Achternaam1","Trienko Achternaam48",null,"Flavi Achternaam1","Trienko Achternaam48",null,"Flavi Achternaam1","Trienko Achternaam48",null,"Flavi Achternaam1","Trienko Achternaam48",null,"Arkan Achternaam455"]
[null,null,2]
[null,null,3]
[null,null,4]
[null,null,5]
[null,null,6]
[null,null,7]
["MEP",null,null,"06:00/14:45","14:45/23:30","22:00/06:45","06:00/14:45","14:45/23:30","22:00/06:45","06:00/14:45","14:45/23:30","22:00/06:45","06:00/14:45","14:45/23:30","22:00/06:45","06:00/14:45","14:45/23:30","22:00/06:45","06:00/14:45","14:45/23:30","22:00/06:45","06:00/14:45","14:45/23:30","22:00/06:45"]
[null,null,1,null,null,null,"Houcin Achternaam7","Rijk Achternaam50",null,"Houcin Achternaam7","Rijk Achternaam50",null,"Houcin Achternaam7","Rijk Achternaam50",null,"Houcin Achternaam7","Rijk Achternaam50",null,"Houcin Achternaam7","Rijk Achternaam50"]
[null,null,2,null,null,null,"Rudolf Achternaam44",null,null,"Rudolf Achternaam44",null,null,"Rudolf Achternaam44",null,null,"Rudolf Achternaam44",null,null,"Rudolf Achternaam44"]
[null,null,3]
[null,null,4]
[null,null,5]
[null,null,6]
[]
[null,"50/2019",null,"1900-01-01","2019-12-08","Week nr.50","1900-01-02","2019-12-09","Week nr.50","1900-01-03","2019-12-10","Week nr.50","1900-01-04","2019-12-11","Week nr.50","1900-01-05","2019-12-12","Week nr.50","1900-01-06","2019-12-13","Week nr.50","1900-01-07","2019-12-14","Week nr.50"]
["Afdeling","Verlof","FTE","Vroeg","Laat","Nacht","Vroeg","Laat","Nacht","Vroeg","Laat","Nacht","Vroeg","Laat","Nacht","Vroeg","Laat","Nacht","Vroeg","Laat","Nacht","Vroeg","Laat","Nacht"]
["AFV",null,null,"06:00/14:45","14:45/23:30","22:00/06:45","06:00/14:45","14:45/23:30","22:00/06:45","06:00/14:45","14:45/23:30","22:00/06:45","06:00/14:45","14:45/23:30","22:00/06:45","06:00/14:45","14:45/23:30","22:00/06:45","06:00/14:45","14:45/23:30","22:00/06:45","06:00/14:45","14:45/23:30","22:00/06:45"]
[null,null,1,null,null,null,"Christiaan Achternaam51","Miquel Achternaam39",null,"Christiaan Achternaam51","Miquel Achternaam39",null,"Christiaan Achternaam51","Paul Achternaam49",null,"Christiaan Achternaam51","Miquel Achternaam39",null,"Christiaan Achternaam51","Miquel Achternaam39"]
[null,null,2,null,null,null,"Henri Achternaam82","Paul Achternaam49",null,"Henri Achternaam82","Paul Achternaam49",null,"Henri Achternaam82","Baki Achternaam2",null,"Henri Achternaam82","Paul Achternaam49",null,"Henri Achternaam82","Paul Achternaam49"]
[null,null,3,null,null,null,"Jan Achternaam79","Sebastiaan Achternaam41",null,"Jan Achternaam79","Sebastiaan Achternaam41",null,"Jan Achternaam79","Ilker Achternaam38",null,"Jan Achternaam79","Sebastiaan Achternaam41",null,"Jan Achternaam79","Sebastiaan Achternaam41"]
[null,"Flavi Achternaam1",4,null,null,null,"Boyan Achternaam80","Baki Achternaam2",null,"Boyan Achternaam80","Baki Achternaam2",null,"Boyan Achternaam80","Flavi Achternaam1",null,"Boyan Achternaam80","Baki Achternaam2",null,"Boyan Achternaam80","Baki Achternaam2"]
[null,null,5,null,null,null,"Michel Achternaam83","Ilker Achternaam38",null,"Michel Achternaam83","Ilker Achternaam38",null,"Michel Achternaam83",null,null,"Michel Achternaam83","Ilker Achternaam38",null,"Michel Achternaam83","Ilker Achternaam38"]
[null,"Flavi Achternaam1",6,null,null,null,null,null,null,null,null,null,null,null,null,null,"Flavi Achternaam1",null,null,"Flavi Achternaam1"]
[null,null,7]
[null,null,8]
["SCHM",null,"WERKTIIJDEN","06:00/14:45","14:45/23:30","22:00/06:45","06:00/14:45","14:45/23:30","22:00/06:45","06:00/14:45","14:45/23:30","22:00/06:45","06:00/14:45","14:45/23:30","22:00/06:45","06:00/14:45","14:45/23:30","22:00/06:45","06:00/14:45","14:45/23:30","22:00/06:45","06:00/14:45","14:45/23:30","22:00/06:45"]
[null,null,1,null,null,"Rachid Achternaam34","Piet Achternaam78","Erik Achternaam4","Rachid Achternaam34","Marjolein Achternaam76","Erik Achternaam4","Rachid Achternaam34","Marjolein Achternaam76","Erik Achternaam4","Rachid Achternaam34","Marjolein Achternaam76","Erik Achternaam4","Rachid Achternaam34","Marjolein Achternaam76","Erik Achternaam4"]
[null,null,2,null,null,"Evans Achternaam35","Roy Achternaam77","Patrick Achternaam88","Evans Achternaam35","Piet Achternaam78","Patrick Achternaam88","Evans Achternaam35","Piet Achternaam78","Patrick Achternaam88","Evans Achternaam35","Piet Achternaam78","Patrick Achternaam88","Kevin Achternaam36","Piet Achternaam78","Patrick Achternaam88"]
[null,null,3,null,null,"Kevin Achternaam36",null,"Rolinka Achternaam3","Kevin Achternaam36","Roy Achternaam77","Rolinka Achternaam3","Kevin Achternaam36","Roy Achternaam77","Rolinka Achternaam3","Kevin Achternaam36","Roy Achternaam77","Rolinka Achternaam3",null,"Roy Achternaam77","Rolinka Achternaam3"]
[null,null,4]
[null,null,5]
[null,null,6]
[null,null,7]
[null,null,8]
["HAS",null,"WERKTIIJDEN","06:00/14:45","13:45/22:30","22:00/06:45","06:00/14:45","13:45/22:30","22:00/06:45","06:00/14:45","13:45/22:30","22:00/06:45","06:00/14:45","13:45/22:30","22:00/06:45","06:00/14:45","13:45/22:30","22:00/06:45","06:00/14:45","13:45/22:30","22:00/06:45","06:00/14:45","13:45/22:30","22:00/06:45"]
[null,null,1,null,null,null,"Paul Achternaam49","Norbert Achternaam6",null,"Paul Achternaam49","Norbert Achternaam6",null,"Paul Achternaam49","Norbert Achternaam6",null,"Paul Achternaam49","Norbert Achternaam6",null,"Paul Achternaam49","Norbert Achternaam6"]
[null,null,2,null,null,null,"Paul Achternaam49",null,null,"Paul Achternaam49","Norbert Achternaam6",null,"Paul Achternaam49",null,null,"Paul Achternaam49","Norbert Achternaam6",null,"Paul Achternaam49","Norbert Achternaam6"]
[null,null,3]
[null,null,4]
[null,null,5]
[null,null,6]
[null,null,7]
["LCR",null,null,"06:00/14:45","14:45/23:30","22:00/06:45","06:00/14:45","14:45/23:30","22:00/06:45","06:00/14:45","14:45/23:30","22:00/06:45","06:00/14:45","14:45/23:30","22:00/06:45","06:00/14:45","14:45/23:30","22:00/06:45","06:00/14:45","14:45/23:30","22:00/06:45","06:00/14:45","14:45/23:30","22:00/06:45"]
[null,null,1,null,null,null,"Sami Achternaam81","Klaas Achternaam40",null,"Sami Achternaam81","Klaas Achternaam40",null,"Sami Achternaam81","Sebastiaan Achternaam41",null,"Sami Achternaam81","Klaas Achternaam40",null,"Sami Achternaam81","Klaas Achternaam40"]
[null,null,2,null,null,null,"Wolter Achternaam8",null,null,"Wolter Achternaam8",null,null,"Wolter Achternaam8",null,null,null,null,null,"Wolter Achternaam8"]
[null,null,3]
[null,null,4]
[null,null,5]
[null,null,6]
[null,null,7]
["ABB",null,null,"08:00/14:45","13:45/22:30"," ","06:00/14:45","14:45/23:30","22:00/06:45","06:00/14:45","14:45/23:30","22:00/06:45","06:00/14:45","14:45/23:30","22:00/06:45","06:00/14:45","14:45/23:30","22:00/06:45","06:00/14:45","14:45/23:30","22:00/06:45","08:00/21:00 ","14:45/23:30"," "]
[null,"Flavi Achternaam1",1,"Baki Achternaam2","Flavi Achternaam1",null,"Trienko Achternaam48","Bile Achternaam508",null,"Trienko Achternaam48","Bile Achternaam508",null,"Trienko Achternaam48","Bile Achternaam508",null,"Trienko Achternaam48","Bile Achternaam508",null,"Trienko Achternaam48","Bile Achternaam508",null,"Niek Achternaam937"]
[null,"Flavi Achternaam1",2,null,null,null,null,"Flavi Achternaam1",null,null,"Flavi Achternaam1"]
[null,null,3]
[null,null,4]
[null,null,5]
[null,null,6]
[null,null,7]
["MEP",null,null,"06:00/14:45","14:45/23:30","22:00/06:45","06:00/14:45","14:45/23:30","22:00/06:45","06:00/14:45","14:45/23:30","22:00/06:45","06:00/14:45","14:45/23:30","22:00/06:45","06:00/14:45","14:45/23:30","22:00/06:45","06:00/14:45","14:45/23:30","22:00/06:45","06:00/14:45","14:45/23:30","22:00/06:45"]
[null,null,1,null,null,null,"Rudolf Achternaam44","Houcin Achternaam7",null,"Rudolf Achternaam44","Houcin Achternaam7",null,"Rudolf Achternaam44","Houcin Achternaam7",null,"Rudolf Achternaam44","Houcin Achternaam7",null,"Rudolf Achternaam44","Houcin Achternaam7"]
[null,null,2,null,null,null,"Rijk Achternaam50",null,null,"Rijk Achternaam50",null,null,"Rijk Achternaam50",null,null,"Rijk Achternaam50",null,null,"Rijk Achternaam50"]
[null,null,3]
[null,null,4]
[null,null,5]
[null,null,6]
[]
[null,"50/2019",null,"1900-01-02","2019-12-09","Week nr.50","1900-01-03","2019-12-10","Week nr.50","1900-01-04","2019-12-11","Week nr.50","1900-01-05","2019-12-12","Week nr.50","1900-01-06","2019-12-13","Week nr.50"]
["Afdeling","Verlof","FTE","Vroeg","Laat","Nacht","Vroeg","Laat","Nacht","Vroeg","Laat","Nacht","Vroeg","Laat","Nacht","Vroeg","Laat","Nacht"]
["TLPALL",null,null,"06:00/14:45","14:45/23:30","22:00/06:45","06:00/14:45","14:45/23:30","22:00/06:45","06:00/14:45","14:45/23:30","22:00/06:45","06:00/14:45","14:45/23:30","22:00/06:45","06:00/14:45","14:45/23:30","22:00/06:45"]
[null,null,1,"Hilko Achternaam505",null,null,"Hilko Achternaam596",null,null,"Hilko Achternaam696",null,null,"Hilko Achternaam790",null,null,"Hilko Achternaam888"]
[null,null,2]
[null,null,3]
[null,null,4]
[null,null,5]
[null,null,6]
[null,null,7]
[null,null,8]
["PALME",null,"WERKTIIJDEN","06:00/14:45","14:45/23:30","22:00/06:45","06:00/14:45","14:45/23:30","22:00/06:45","06:00/14:45","14:45/23:30","22:00/06:45","06:00/14:45","14:45/23:30","22:00/06:45","06:00/14:45","14:45/23:30","22:00/06:45"]
[null,null,1,"Wenaron Achternaam467","Latie Achternaam513",null,"Wenaron Achternaam561","Latie Achternaam605",null,"Wenaron Achternaam656","Latie Achternaam703",null,"Wenaron Achternaam753","Latie Achternaam797",null,"Wenaron Achternaam847","Latie Achternaam895"]
[null,null,2,"Salahadin Achternaam468","Abdurahman Ibrahim Achternaam514",null,"Salahadin Achternaam562","Abdurahman Ibrahim Achternaam606",null,"Salahadin Achternaam657","Abdurahman Ibrahim Achternaam704",null,"Salahadin Achternaam754","Abdurahman Ibrahim Achternaam798",null,"Salahadin Achternaam848","Abdurahman Ibrahim Achternaam896"]
[null,null,3,"Dikkie Achternaam469","Michael Achternaam515",null,"Dikkie Achternaam563","Michael Achternaam607",null,"Dikkie Achternaam658","Michael Achternaam705",null,"Dikkie Achternaam755","Michael Achternaam799",null,"Dikkie Achternaam849","Michael Achternaam897"]
[null,null,4,"Rene Achternaam470","Hans Achternaam516",null,"Rene Achternaam564","Hans Achternaam608",null,"Rene Achternaam659","Hans Achternaam706",null,"Rene Achternaam756","Hans Achternaam800",null,"Rene Achternaam850","Hans Achternaam898"]
[null,null,5,"Richard Achternaam471","Jeroen Achternaam517",null,"Richard Achternaam565","Jeroen Achternaam609",null,"Richard Achternaam660","Jeroen Achternaam707",null,"Richard Achternaam757","Jeroen Achternaam801",null,"Richard Achternaam851","Jeroen Achternaam899"]
[null,null,6]
[null,null,7]
[null,null,8]
["PALRW",null,"WERKTIIJDEN","06:00/14:45","13:45/22:30","22:00/06:45","06:00/14:45","13:45/22:30","22:00/06:45","06:00/14:45","13:45/22:30","22:00/06:45","06:00/14:45","13:45/22:30","22:00/06:45","06:00/14:45","13:45/22:30","22:00/06:45"]
[null,null,1,"Felicia Achternaam472","Akela Achternaam518",null,"Shawn Achternaam566","Akela Achternaam610",null,"Felicia Achternaam661","Akela Achternaam708",null,"Elroy Achternaam758","Akela Achternaam802",null,"Felicia Achternaam852","Akela Achternaam900"]
[null,null,2,"Shawn Achternaam473","Karrar Achternaam519",null,"Elroy Achternaam567","Karrar Achternaam611",null,"Elroy Achternaam662","Karrar Achternaam709",null,"Arsenio Achternaam759","Karrar Achternaam803",null,"Jelte Achternaam853","Karrar Achternaam901"]
[null,null,3,"Elroy Achternaam474","Sebastian Achternaam520",null,"Arsenio Achternaam568","Sebastian Achternaam612",null,"Arsenio Achternaam663","Sebastian Achternaam710",null,"Viorel Achternaam760","Chevindio Achternaam804",null,"Shawn Achternaam854","Sebastian Achternaam902"]
[null,null,4,"Swen Achternaam475","Harry Achternaam521",null,"Viorel Achternaam569","Chevindio Achternaam613",null,"Viorel Achternaam664","Chevindio Achternaam711",null,"Olcay Achternaam761","Haben Achternaam805",null,"Elroy Achternaam855","Harry Achternaam903"]
[null,null,5,"Arsenio Achternaam476","Apollonia Achternaam522",null,"Olcay Achternaam570","Harry Achternaam614",null,"Olcay Achternaam665","Harry Achternaam712",null,"Sebastiaan Achternaam762","Harry Achternaam806",null,"Arsenio Achternaam856","Apollonia Achternaam904"]
[null,null,6,"Henk Achternaam492","Gebrehiwet Achternaam549",null,"Henk Achternaam584","Amanuel Achternaam641",null,"Henk Achternaam681","Nexhmedi Achternaam729",null,"Henk Achternaam778","Nexhmedi Achternaam823",null,"Henk Achternaam873","Amanuel Achternaam932"]
[null,null,7]
["TRSP",null,null,"06:00/14:45","14:45/23:30","22:00/06:45","06:00/14:45","14:45/23:30","22:00/06:45","06:00/14:45","14:45/23:30","22:00/06:45","06:00/14:45","14:45/23:30","22:00/06:45","06:00/14:45","14:45/23:30","22:00/06:45"]
[null,"Anton Achternaam502",1,"Anton Achternaam502","Emsud Achternaam546",null,"Anton Achternaam593","Emsud Achternaam639",null,"Anton Achternaam693","Emsud Achternaam742",null,"Anton Achternaam787","Emsud Achternaam835",null,"Anton Achternaam885","Emsud Achternaam930"]
[null,null,2,"Henk Achternaam503","Reinder Achternaam547",null,"Henk Achternaam594","Reinder Achternaam640",null,"Henk Achternaam694","Reinder Achternaam743",null,"Henk Achternaam788","Reinder Achternaam836",null,"Henk Achternaam886","Reinder Achternaam931"]
[null,null,3,"Harrie Achternaam506",null,null,"Harrie Achternaam597",null,null,"Harrie Achternaam697",null,null,"Harrie Achternaam791",null,null,"Harrie Achternaam889"]
[null,null,4]
[null,null,5]
[null,null,6]
[null,null,7]
["PALHAS",null,null,"06:00/14:45","14:45/23:30","22:00/06:45","06:00/14:45","14:45/23:30","22:00/06:45","06:00/14:45","14:45/23:30","22:00/06:45","06:00/14:45","14:45/23:30","22:00/06:45","06:00/14:45","14:45/23:30","22:00/06:45"]
[null,null,1,"Henk Achternaam466",null,null,"Henk Achternaam560",null,null,"Henk Achternaam655",null,null,"Henk Achternaam752",null,null,"Henk Achternaam846"]
[null,null,2]
[null,null,3]
[null,null,4]
[null,null,5]
[null,null,6]
[null,null,7]
["RESER",null,null,"06:00/14:45","14:45/23:30","22:00/06:45","06:00/14:45","14:45/23:30","22:00/06:45","06:00/14:45","14:45/23:30","22:00/06:45","06:00/14:45","14:45/23:30","22:00/06:45","06:00/14:45","14:45/23:30","22:00/06:45"]
[null,null,1,"Robin Achternaam493","Bereket Achternaam550",null,"Fars Achternaam599","Haben Achternaam642",null,"Shawn Achternaam682","Tomas Achternaam730",null,null,"Sebastian Achternaam824",null,"Olcay Achternaam874","Bereket Achternaam933"]
[null,null,2,null,null,null,null,"Bereket Achternaam643",null,"Fars Achternaam683","Heruy Achternaam731",null,null,"Amanuel Achternaam825",null,"Mebrathu Achternaam875","Robel Achternaam935"]
[null,null,3,null,null,null,null,"Robel Achternaam645",null,"Mebrathu Achternaam684","Tesfaldet Achternaam732",null,null,null,null,"Daniel Achternaam876"]
[null,null,4,null,null,null,null,null,null,null,"Laszlo Achternaam733"]
[null,null,5,null,null,null,null,null,null,null,"Gebrehiwet Achternaam734"]
[null,null,6]

{"sheet":"Info uitzendburo","index":3,"n_rows":483,"n_cols":23,"rows_kept":483,"cut":false,"hidden":false,"merged":[]}
[1,"Functie","Starttijd","Eindtijd","Voornaam","Achternaam",null,null,null,null,"Mijn afdelingen","Planning afdeling ",null,"NIET mijn afdelingen",null,null,null,null,"personeel",null,null,"personeel EMB"]
["2019-12-08","ABBweekenddienst",43807.333333333336,43807.614583333336,"Baki","Achternaam2",null,null,null,null,"ABBweekenddienst","ABB",null,"PALL HAS",null,null,null,null,"Flavi Achternaam1","ABB weekenddienst",null,"Henk Achternaam886","TRSP"]
["2019-12-08","ABBmiddag",43807.572916666664,43807.9375,"Flavi","Achternaam1",null,null,null,null,"ABBmiddag","ABB",null,"PALL MEP",null,null,null,null,"Baki Achternaam2","ABB middag",null,"Wenaron Achternaam847","PALME"]
["2019-12-08","SCHM",43807.999305555553,43808.364583333336,"Rachid","Achternaam34",null,null,null,null,"ABBochtend","ABB",null,"PALL Rweg",null,null,null,null,"Rolinka Achternaam3","SCHM",null,"Salahadin Achternaam848","PALME"]
["2019-12-08","SCHM",43807.999305555553,43808.364583333336,"Evans","Achternaam35",null,null,null,null,null,null,null,"Reserve ochtend",null,null,null,null,"Erik Achternaam4","SCHM",null,"Dikkie Achternaam849","PALME"]
["2019-12-08","SCHM",43807.999305555553,43808.364583333336,"Kevin","Achternaam36",null,null,null,null,"AFVMEP","MEP",null,"Reserve middag",null,null,null,null,"Norbert Achternaam6","AFV HAS",null,"Rene Achternaam850","PALME"]
["2019-12-09","ABBochtend",43808.25,43808.614583333336,"Trienko","Achternaam48",null,null,null,null,null,null,null,null,null,null,null,null,"Houcin Achternaam7","AFV MEP",null,"Richard Achternaam851","PALME"]
["2019-12-09","AFVHAS",43808.25,43808.40625,"Paul","Achternaam49",null,null,null,null,"SCHMAFV","AFV",null,null,null,null,null,null,"Wolter Achternaam8","LCR ochtend",null,"Felicia Achternaam852","PALRW"]
["2019-12-09","AFVMEP",43808.25,43808.614583333336,"Rudolf","Achternaam44",null,null,null,null,null,null,null,null,null,null,null,null,"Rachid Achternaam34","SCHM",null,"Shawn Achternaam854","PALRW"]
["2019-12-09","LCRochtend",43808.25,43808.614583333336,"Sami","Achternaam81",null,null,null,null,"SCHM","SCHM",null,"In de planning ",null,null,null,null,"Evans Achternaam35","SCHM",null,"Elroy Achternaam855","PALRW"]
["2019-12-09","LCRochtend",43808.25,43808.614583333336,"Wolter","Achternaam8",null,null,null,null,null,null,null,"06:00/14:45","14:45/23:30",null,null,null,"Kevin Achternaam36","SCHM",null,"Swen Achternaam869","PALRW"]
["2019-12-09","PALLHAS",43808.25,43808.614583333336,"Henk","Achternaam466",null,null,null,null,"AFVHAS","HAS",null,"Voornaam + achternaam","Voornaam + achternaam",null,null,null,"Ilker Achternaam38","SCHM AFV",null,"Arsenio Achternaam856","PALRW"]
["2019-12-09","PALLMEP",43808.25,43808.614583333336,"Wenaron","Achternaam467",null,null,null,null,"SCHMHAS","HAS",null,null,null,null,null,null,"Miquel Achternaam39","SCHM AFV",null,"Viorel Achternaam857","PALRW"]
["2019-12-09","PALLMEP",43808.25,43808.614583333336,"Salahadin","Achternaam468",null,null,null,null,null,null,null,null,null,null,null,null,"Klaas Achternaam40","SCHM AFV",null,"Olcay Achternaam874","RESER"]
["2019-12-09","PALLMEP",43808.25,43808.614583333336,"Dikkie","Achternaam469",null,null,null,null,"LCRmiddag","LCR",null,null,null,null,null,null,"Sebastiaan Achternaam41","SCHM AFV",null,"Sebastiaan Achternaam858","PALRW"]
["2019-12-09","PALLMEP",43808.25,43808.614583333336,"Rene","Achternaam470",null,null,null,null,"LCRochtend","LCR",null,null,null,null,null,null,"Rudolf Achternaam44","AFV MEP",null,"Amadou Achternaam859","PALRW"]
["2019-12-09","PALLMEP",43808.25,43808.614583333336,"Richard","Achternaam471",null,null,null,null,null,null,null,null,null,null,null,null,"Trienko Achternaam48","ABB middag",null,"Wout Achternaam860","PALRW"]
["2019-12-09","PALLRweg",43808.25,43808.614583333336,"Felicia","Achternaam472",null,null,null,null,null,null,null,null,null,null,null,null,"Paul Achternaam49","AFV HAS",null,"Fars Achternaam861","PALRW"]
["2019-12-09","PALLRweg",43808.25,43808.614583333336,"Shawn","Achternaam473",null,null,null,null,null,null,null,null,null,null,null,null,"Rijk Achternaam50","AFV MEP",null,"Magdalena Achternaam862","PALRW"]
["2019-12-09","PALLRweg",43808.25,43808.614583333336,"Elroy","Achternaam474",null,null,null,null,null,null,null,null,null,null,null,null,"Christiaan Achternaam51","LCR middag",null,"Charles Achternaam863","PALRW"]
["2019-12-09","PALLRweg",43808.25,43808.614583333336,"Swen","Achternaam475",null,null,null,"Overige afdelingen EMB",null,null,null,null,null,null,null,null,"Marjolein Achternaam76","SCHM",null,"Ko Achternaam864","PALRW"]
["2019-12-09","PALLRweg",43808.25,43808.614583333336,"Arsenio","Achternaam476",null,null,null,null,"TeamleiderPALL","TLPALL",null,null,null,null,null,null,"Roy Achternaam77","SCHM",null,"Gerrit Achternaam866","PALRW"]
["2019-12-09","PALLRweg",43808.25,43808.614583333336,"Viorel","Achternaam477",null,null,null,null,"PALLMEP","PALME",null,null,null,null,null,null,"Piet Achternaam78","SCHM",null,"Everon Achternaam867","PALRW"]
["2019-12-09","PALLRweg",43808.25,43808.614583333336,"Olcay","Achternaam478",null,null,null,null,"PALLRweg","PALRW",null,null,null,null,null,null,"Jan Achternaam79","SCHM AFV",null,"Davood Achternaam868","PALRW"]
["2019-12-09","PALLRweg",43808.25,43808.614583333336,"Sebastiaan","Achternaam479",null,null,null,null,"TRSP","TRSP",null,null,null,null,null,null,"Boyan Achternaam80","SCHM AFV",null,"Saidou Achternaam870","PALRW"]
["2019-12-09","PALLRweg",43808.25,43808.614583333336,"Amadou","Achternaam480",null,null,null,null,"PALLHAS","PALHAS",null,null,null,null,null,null,"Sami Achternaam81","SCHM AFV",null,"Wim Achternaam871","PALRW"]
["2019-12-09","PALLRweg",43808.25,43808.614583333336,"Wout","Achternaam481",null,null,null,null,"Reserveochtend","RESER",null,null,null,null,null,null,"Henri Achternaam82","SCHM AFV",null,"Quincy Achternaam872","PALRW"]
["2019-12-09","PALLRweg",43808.25,43808.614583333336,"Fars","Achternaam482",null,null,null,null,"Reservemiddag","RESER",null,null,null,null,null,null,"Michel Achternaam83","SCHM AFV",null,"Robin Achternaam865","PALRW"]
["2019-12-09","PALLRweg",43808.25,43808.614583333336,"Magdalena","Achternaam483",null,null,null,null,null,null,null,null,null,null,null,null,"Patrick Achternaam88","SCHM",null,"Anton Achternaam885","TRSP"]
["2019-12-09","PALLRweg",43808.25,43808.614583333336,"Charles","Achternaam484",null,null,null,null,null,null,null,null,null,null,null,null,"Arkan Achternaam455","ABB weekenddienst",null,"Hilko Achternaam888","TLPALL"]
["2019-12-09","PALLRweg",43808.25,43808.614583333336,"Ko","Achternaam485",null,null,null,null,null,null,null,null,null,null,null,null,"Bile Achternaam508","ABB middag",null,"Harrie Achternaam889","TRSP"]
["2019-12-09","PALLRweg",43808.25,43808.614583333336,"Gerrit","Achternaam486",null,null,null,null,null,null,null,null,null,null,null,null,"Niek Achternaam937","ABB weekenddienst",null,"Latie Achternaam895","PALME"]
["2019-12-09","PALLRweg",43808.25,43808.614583333336,"Everon","Achternaam487",null,null,null,null,null,null,null,null,null,null,null,null,null,null,null,"Abdurahman Ibrahim Achternaam896","PALME"]
["2019-12-09","PALLRweg",43808.25,43808.614583333336,"Davood","Achternaam488",null,null,null,null,null,null,null,null,null,null,null,null,null,null,null,"Michael Achternaam897","PALME"]
["2019-12-09","PALLRweg",43808.25,43808.614583333336,"Saidou","Achternaam489",null,null,null,null,null,null,null,null,null,null,null,null,null,null,null,"Hans Achternaam898","PALME"]
["2019-12-09","PALLRweg",43808.25,43808.614583333336,"Wim","Achternaam490",null,null,null,null,null,null,null,null,null,null,null,null,null,null,null,"Jeroen Achternaam899","PALME"]
["2019-12-09","PALLRweg",43808.25,43808.614583333336,"Quincy","Achternaam491",null,null,null,null,null,null,null,null,null,null,null,null,null,null,null,"Akela Achternaam900","PALRW"]
["2019-12-09","PALLRweg",43808.25,43808.614583333336,"Henk","Achternaam492",null,null,null,null,null,null,null,null,null,null,null,null,null,null,null,"Karrar Achternaam901","PALRW"]
["2019-12-09","Reserveochtend",43808.25,43808.614583333336,"Robin","Achternaam493",null,null,null,null,null,null,null,null,null,null,null,null,null,null,null,"Sebastian Achternaam902","PALRW"]
["2019-12-09","SCHM",43808.25,43808.614583333336,"Marjolein","Achternaam76",null,null,null,null,null,null,null,null,null,null,null,null,null,null,null,"Harry Achternaam903","PALRW"]
["2019-12-09","SCHM",43808.25,43808.614583333336,"Piet","Achternaam78",null,null,null,null,null,null,null,null,null,null,null,null,null,null,null,"Apollonia Achternaam904","PALRW"]
["2019-12-09","SCHM",43808.25,43808.614583333336,"Roy","Achternaam77",null,null,null,null,null,null,null,null,null,null,null,null,null,null,null,"Agathe Achternaam906","PALRW"]
["2019-12-09","SCHMAFV",43808.25,43808.614583333336,"Christiaan","Achternaam51",null,null,null,null,null,null,null,null,null,null,null,null,null,null,null,"Heruy Achternaam908","PALRW"]
["2019-12-09","SCHMAFV",43808.25,43808.614583333336,"Henri","Achternaam82",null,null,null,null,null,null,null,null,null,null,null,null,null,null,null,"Hassan Achternaam909","PALRW"]
["2019-12-09","SCHMAFV",43808.25,43808.614583333336,"Jan","Achternaam79",null,null,null,null,null,null,null,null,null,null,null,null,null,null,null,"Samantha Achternaam910","PALRW"]
["2019-12-09","SCHMAFV",43808.25,43808.614583333336,"Boyan","Achternaam80",null,null,null,null,null,null,null,null,null,null,null,null,null,null,null,"Sied Achternaam911","PALRW"]
["2019-12-09","SCHMAFV",43808.25,43808.614583333336,"Michel","Achternaam83",null,null,null,null,null,null,null,null,null,null,null,null,null,null,null,"Laszlo Achternaam912","PALRW"]
["2019-12-09","TRSP",43808.25,43808.614583333336,"Anton","Achternaam502",null,null,null,null,null,null,null,null,null,null,null,null,null,null,null,"Atobhran Achternaam913","PALRW"]
["2019-12-09","TRSP",43808.25,43808.614583333336,"Henk","Achternaam503",null,null,null,null,null,null,null,null,null,null,null,null,null,null,null,"Abdul Achternaam914","PALRW"]
["2019-12-09","AFVMEP",43808.291666666664,43808.65625,"Rijk","Achternaam50",null,null,null,null,null,null,null,null,null,null,null,null,null,null,null,"Naoufel Achternaam915","PALRW"]
["2019-12-09","TeamleiderPALL",43808.3125,43808.677083333336,"Hilko","Achternaam505",null,null,null,null,null,null,null,null,null,null,null,null,null,null,null,"Niek Achternaam724","PALRW"]
["2019-12-09","TRSP",43808.333333333336,43808.697916666664,"Harrie","Achternaam506",null,null,null,null,null,null,null,null,null,null,null,null,null,null,null,"Jarek Achternaam916","PALRW"]
["2019-12-09","SCHMHAS",43808.40625,43808.614583333336,"Paul","Achternaam49",null,null,null,null,null,null,null,null,null,null,null,null,null,null,null,"Martijn Achternaam917","PALRW"]
["2019-12-09","ABBmiddag",43808.572916666664,43808.9375,"Bile","Achternaam508",null,null,null,null,null,null,null,null,null,null,null,null,null,null,null,"Mark Achternaam918","PALRW"]
["2019-12-09","ABBmiddag",43808.572916666664,43808.9375,"Flavi","Achternaam1",null,null,null,null,null,null,null,null,null,null,null,null,null,null,null,"Abdiqadir Achternaam919","PALRW"]
["2019-12-09","AFVHAS",43808.572916666664,43808.697916666664,"Norbert","Achternaam6",null,null,null,null,null,null,null,null,null,null,null,null,null,null,null,"Nexhmedi Achternaam920","PALRW"]
["2019-12-09","AFVMEP",43808.572916666664,43808.9375,"Houcin","Achternaam7",null,null,null,null,null,null,null,null,null,null,null,null,null,null,null,"Emsud Achternaam930","TRSP"]
["2019-12-09","LCRmiddag",43808.572916666664,43808.9375,"Klaas","Achternaam40",null,null,null,null,null,null,null,null,null,null,null,null,null,null,null,"Reinder Achternaam931","TRSP"]
["2019-12-09","PALLMEP",43808.614583333336,43808.979166666664,"Latie","Achternaam513",null,null,null,null,null,null,null,null,null,null,null,null,null,null,null,"Amanuel Achternaam932","PALRW"]
["2019-12-09","PALLMEP",43808.614583333336,43808.979166666664,"Abdurahman Ibrahim","Achternaam514",null,null,null,null,null,null,null,null,null,null,null,null,null,null,null,"Gebrehiwet Achternaam734","RESER"]
["2019-12-09","PALLMEP",43808.614583333336,43808.979166666664,"Michael","Achternaam515",null,null,null,null,null,null,null,null,null,null,null,null,null,null,null,"Bereket Achternaam933","RESER"]
["2019-12-09","PALLMEP",43808.614583333336,43808.979166666664,"Hans","Achternaam516",null,null,null,null,null,null,null,null,null,null,null,null,null,null,null,"Chevindio Achternaam804","PALRW"]
["2019-12-09","PALLMEP",43808.614583333336,43808.979166666664,"Jeroen","Achternaam517",null,null,null,null,null,null,null,null,null,null,null,null,null,null,null,"Dennis Achternaam905","PALRW"]
["2019-12-09","PALLRweg",43808.614583333336,43808.979166666664,"Akela","Achternaam518",null,null,null,null,null,null,null,null,null,null,null,null,null,null,null,"Haben Achternaam805","PALRW"]
["2019-12-09","PALLRweg",43808.614583333336,43808.979166666664,"Karrar","Achternaam519",null,null,null,null,null,null,null,null,null,null,null,null,null,null,null,"Robel Achternaam935","RESER"]
["2019-12-09","PALLRweg",43808.614583333336,43808.979166666664,"Sebastian","Achternaam520",null,null,null,null,null,null,null,null,null,null,null,null,null,null,null,"Daniel Achternaam876","RESER"]
["2019-12-09","PALLRweg",43808.614583333336,43808.979166666664,"Harry","Achternaam521",null,null,null,null,null,null,null,null,null,null,null,null,null,null,null,"Mebrathu Achternaam875","RESER"]
["2019-12-09","PALLRweg",43808.614583333336,43808.979166666664,"Apollonia","Achternaam522",null,null,null,null,null,null,null,null,null,null,null,null,null,null,null,"Jelte Achternaam853","PALRW"]
["2019-12-09","PALLRweg",43808.614583333336,43808.979166666664,"Agathe","Achternaam523",null,null,null,null,null,null,null,null,null,null,null,null,null,null,null,"Ambroise Achternaam720","PALRW"]
["2019-12-09","PALLRweg",43808.614583333336,43808.979166666664,"Heruy","Achternaam524",null,null,null,null,null,null,null,null,null,null,null,null,null,null,null,"Tomas Achternaam810","PALRW"]
["2019-12-09","PALLRweg",43808.614583333336,43808.979166666664,"Hassan","Achternaam525",null,null,null,null,null,null,null,null,null,null,null,null,null,null,null,"Tesfaldet Achternaam732","RESER"]
["2019-12-09","PALLRweg",43808.614583333336,43808.979166666664,"Samantha","Achternaam526",null,null,null,null,null,null,null,null,null,null,null,null,null,null,null,"Hagos Achternaam907","PALRW"]
["2019-12-09","PALLRweg",43808.614583333336,43808.979166666664,"Sied","Achternaam527"]
["2019-12-09","PALLRweg",43808.614583333336,43808.979166666664,"Laszlo","Achternaam528"]
["2019-12-09","PALLRweg",43808.614583333336,43808.979166666664,"Atobhran","Achternaam529"]
["2019-12-09","PALLRweg",43808.614583333336,43808.979166666664,"Abdul","Achternaam530"]
["2019-12-09","PALLRweg",43808.614583333336,43808.979166666664,"Naoufel","Achternaam531"]
["2019-12-09","PALLRweg",43808.614583333336,43808.979166666664,"Niek","Achternaam532"]
["2019-12-09","PALLRweg",43808.614583333336,43808.979166666664,"Jarek","Achternaam533"]
["2019-12-09","PALLRweg",43808.614583333336,43808.979166666664,"Martijn","Achternaam534"]
["2019-12-09","PALLRweg",43808.614583333336,43808.979166666664,"Mark","Achternaam535"]
["2019-12-09","PALLRweg",43808.614583333336,43808.979166666664,"Abdiqadir","Achternaam536"]
["2019-12-09","PALLRweg",43808.614583333336,43808.979166666664,"Nexhmedi","Achternaam537"]
["2019-12-09","SCHM",43808.614583333336,43808.979166666664,"Erik","Achternaam4"]
["2019-12-09","SCHM",43808.614583333336,43808.979166666664,"Patrick","Achternaam88"]
["2019-12-09","SCHM",43808.614583333336,43808.979166666664,"Rolinka","Achternaam3"]
["2019-12-09","SCHMAFV",43808.614583333336,43808.979166666664,"Miquel","Achternaam39"]
["2019-12-09","SCHMAFV",43808.614583333336,43808.979166666664,"Paul","Achternaam49"]
["2019-12-09","SCHMAFV",43808.614583333336,43808.979166666664,"Sebastiaan","Achternaam41"]
["2019-12-09","SCHMAFV",43808.614583333336,43808.979166666664,"Baki","Achternaam2"]
["2019-12-09","SCHMAFV",43808.614583333336,43808.979166666664,"Ilker","Achternaam38"]
["2019-12-09","TRSP",43808.614583333336,43808.979166666664,"Emsud","Achternaam546"]
["2019-12-09","TRSP",43808.614583333336,43808.979166666664,"Reinder","Achternaam547"]
["2019-12-09","PALLRweg",43808.645833333336,43808.979166666664,"Amanuel","Achternaam548"]
["2019-12-09","PALLRweg",43808.666666666664,43808.979166666664,"Gebrehiwet","Achternaam549"]
["2019-12-09","Reservemiddag",43808.666666666664,43808.979166666664,"Bereket","Achternaam550"]
["2019-12-09","LCH",43808.697916666664,43808.9375,"Norbert","Achternaam6"]
["2019-12-09","SCHM",43808.916666666664,43809.28125,"Rachid","Achternaam34"]
["2019-12-09","SCHM",43808.916666666664,43809.28125,"Evans","Achternaam35"]
["2019-12-09","SCHM",43808.916666666664,43809.28125,"Kevin","Achternaam36"]
["2019-12-10","ABBochtend",43809.25,43809.614583333336,"Trienko","Achternaam48"]
["2019-12-10","AFVHAS",43809.25,43809.40625,"Paul","Achternaam49"]
["2019-12-10","AFVMEP",43809.25,43809.614583333336,"Rudolf","Achternaam44"]
["2019-12-10","LCRochtend",43809.25,43809.614583333336,"Sami","Achternaam81"]
["2019-12-10","LCRochtend",43809.25,43809.614583333336,"Wolter","Achternaam8"]
["2019-12-10","PALLHAS",43809.25,43809.614583333336,"Henk","Achternaam560"]
["2019-12-10","PALLMEP",43809.25,43809.614583333336,"Wenaron","Achternaam561"]
["2019-12-10","PALLMEP",43809.25,43809.614583333336,"Salahadin","Achternaam562"]
["2019-12-10","PALLMEP",43809.25,43809.614583333336,"Dikkie","Achternaam563"]
["2019-12-10","PALLMEP",43809.25,43809.614583333336,"Rene","Achternaam564"]
["2019-12-10","PALLMEP",43809.25,43809.614583333336,"Richard","Achternaam565"]
["2019-12-10","PALLRweg",43809.25,43809.614583333336,"Shawn","Achternaam566"]
["2019-12-10","PALLRweg",43809.25,43809.614583333336,"Elroy","Achternaam567"]
["2019-12-10","PALLRweg",43809.25,43809.614583333336,"Arsenio","Achternaam568"]
["2019-12-10","PALLRweg",43809.25,43809.614583333336,"Viorel","Achternaam569"]
["2019-12-10","PALLRweg",43809.25,43809.614583333336,"Olcay","Achternaam570"]
["2019-12-10","PALLRweg",43809.25,43809.614583333336,"Amadou","Achternaam571"]
["2019-12-10","PALLRweg",43809.25,43809.614583333336,"Wout","Achternaam572"]
["2019-12-10","PALLRweg",43809.25,43809.614583333336,"Magdalena","Achternaam573"]
["2019-12-10","PALLRweg",43809.25,43809.614583333336,"Charles","Achternaam574"]
["2019-12-10","PALLRweg",43809.25,43809.614583333336,"Ko","Achternaam575"]
["2019-12-10","PALLRweg",43809.25,43809.614583333336,"Robin","Achternaam576"]
["2019-12-10","PALLRweg",43809.25,43809.614583333336,"Gerrit","Achternaam577"]
["2019-12-10","PALLRweg",43809.25,43809.614583333336,"Everon","Achternaam578"]
["2019-12-10","PALLRweg",43809.25,43809.614583333336,"Davood","Achternaam579"]
["2019-12-10","PALLRweg",43809.25,43809.614583333336,"Swen","Achternaam580"]
["2019-12-10","PALLRweg",43809.25,43809.614583333336,"Saidou","Achternaam581"]
["2019-12-10","PALLRweg",43809.25,43809.614583333336,"Wim","Achternaam582"]
["2019-12-10","PALLRweg",43809.25,43809.614583333336,"Quincy","Achternaam583"]
["2019-12-10","PALLRweg",43809.25,43809.614583333336,"Henk","Achternaam584"]
["2019-12-10","SCHM",43809.25,43809.614583333336,"Marjolein","Achternaam76"]
["2019-12-10","SCHM",43809.25,43809.614583333336,"Piet","Achternaam78"]
["2019-12-10","SCHM",43809.25,43809.614583333336,"Roy","Achternaam77"]
["2019-12-10","SCHMAFV",43809.25,43809.614583333336,"Christiaan","Achternaam51"]
["2019-12-10","SCHMAFV",43809.25,43809.614583333336,"Henri","Achternaam82"]
["2019-12-10","SCHMAFV",43809.25,43809.614583333336,"Jan","Achternaam79"]
["2019-12-10","SCHMAFV",43809.25,43809.614583333336,"Boyan","Achternaam80"]
["2019-12-10","SCHMAFV",43809.25,43809.614583333336,"Michel","Achternaam83"]
["2019-12-10","TRSP",43809.25,43809.614583333336,"Anton","Achternaam593"]
["2019-12-10","TRSP",43809.25,43809.614583333336,"Henk","Achternaam594"]
["2019-12-10","AFVMEP",43809.291666666664,43809.65625,"Rijk","Achternaam50"]
["2019-12-10","TeamleiderPALL",43809.3125,43809.677083333336,"Hilko","Achternaam596"]
["2019-12-10","TRSP",43809.333333333336,43809.697916666664,"Harrie","Achternaam597"]
["2019-12-10","SCHMHAS",43809.40625,43809.614583333336,"Paul","Achternaam49"]
["2019-12-10","Reserveochtend",43809.458333333336,43809.614583333336,"Fars","Achternaam599"]
["2019-12-10","ABBmiddag",43809.572916666664,43809.9375,"Bile","Achternaam508"]
["2019-12-10","ABBmiddag",43809.572916666664,43809.9375,"Flavi","Achternaam1"]
["2019-12-10","AFVHAS",43809.572916666664,43809.697916666664,"Norbert","Achternaam6"]
["2019-12-10","AFVMEP",43809.572916666664,43809.9375,"Houcin","Achternaam7"]
["2019-12-10","LCRmiddag",43809.572916666664,43809.9375,"Klaas","Achternaam40"]
["2019-12-10","PALLMEP",43809.614583333336,43809.979166666664,"Latie","Achternaam605"]
["2019-12-10","PALLMEP",43809.614583333336,43809.979166666664,"Abdurahman Ibrahim","Achternaam606"]
["2019-12-10","PALLMEP",43809.614583333336,43809.979166666664,"Michael","Achternaam607"]
["2019-12-10","PALLMEP",43809.614583333336,43809.979166666664,"Hans","Achternaam608"]
["2019-12-10","PALLMEP",43809.614583333336,43809.979166666664,"Jeroen","Achternaam609"]
["2019-12-10","PALLRweg",43809.614583333336,43809.979166666664,"Akela","Achternaam610"]
["2019-12-10","PALLRweg",43809.614583333336,43809.979166666664,"Karrar","Achternaam611"]
["2019-12-10","PALLRweg",43809.614583333336,43809.979166666664,"Sebastian","Achternaam612"]
["2019-12-10","PALLRweg",43809.614583333336,43809.979166666664,"Chevindio","Achternaam613"]
["2019-12-10","PALLRweg",43809.614583333336,43809.979166666664,"Harry","Achternaam614"]
["2019-12-10","PALLRweg",43809.614583333336,43809.979166666664,"Apollonia","Achternaam615"]
["2019-12-10","PALLRweg",43809.614583333336,43809.979166666664,"Dennis","Achternaam616"]
["2019-12-10","PALLRweg",43809.614583333336,43809.979166666664,"Agathe","Achternaam617"]
["2019-12-10","PALLRweg",43809.614583333336,43809.979166666664,"Heruy","Achternaam618"]
["2019-12-10","PALLRweg",43809.614583333336,43809.979166666664,"Hassan","Achternaam619"]
["2019-12-10","PALLRweg",43809.614583333336,43809.979166666664,"Samantha","Achternaam620"]
["2019-12-10","PALLRweg",43809.614583333336,43809.979166666664,"Sied","Achternaam621"]
["2019-12-10","PALLRweg",43809.614583333336,43809.979166666664,"Atobhran","Achternaam622"]
["2019-12-10","PALLRweg",43809.614583333336,43809.979166666664,"Abdul","Achternaam623"]
["2019-12-10","PALLRweg",43809.614583333336,43809.979166666664,"Naoufel","Achternaam624"]
["2019-12-10","PALLRweg",43809.614583333336,43809.979166666664,"Niek","Achternaam625"]
["2019-12-10","PALLRweg",43809.614583333336,43809.979166666664,"Jarek","Achternaam626"]
["2019-12-10","PALLRweg",43809.614583333336,43809.979166666664,"Martijn","Achternaam627"]
["2019-12-10","PALLRweg",43809.614583333336,43809.979166666664,"Mark","Achternaam628"]
["2019-12-10","PALLRweg",43809.614583333336,43809.979166666664,"Abdiqadir","Achternaam629"]
["2019-12-10","PALLRweg",43809.614583333336,43809.979166666664,"Nexhmedi","Achternaam630"]
["2019-12-10","SCHM",43809.614583333336,43809.979166666664,"Erik","Achternaam4"]
["2019-12-10","SCHM",43809.614583333336,43809.979166666664,"Patrick","Achternaam88"]
["2019-12-10","SCHM",43809.614583333336,43809.979166666664,"Rolinka","Achternaam3"]
["2019-12-10","SCHMAFV",43809.614583333336,43809.979166666664,"Miquel","Achternaam39"]
["2019-12-10","SCHMAFV",43809.614583333336,43809.979166666664,"Paul","Achternaam49"]
["2019-12-10","SCHMAFV",43809.614583333336,43809.979166666664,"Sebastiaan","Achternaam41"]
["2019-12-10","SCHMAFV",43809.614583333336,43809.979166666664,"Baki","Achternaam2"]
["2019-12-10","SCHMAFV",43809.614583333336,43809.979166666664,"Ilker","Achternaam38"]
["2019-12-10","TRSP",43809.614583333336,43809.979166666664,"Emsud","Achternaam639"]
["2019-12-10","TRSP",43809.614583333336,43809.979166666664,"Reinder","Achternaam640"]
["2019-12-10","PALLRweg",43809.645833333336,43809.979166666664,"Amanuel","Achternaam641"]
["2019-12-10","Reservemiddag",43809.666666666664,43809.979166666664,"Haben","Achternaam642"]
["2019-12-10","Reservemiddag",43809.666666666664,43809.979166666664,"Bereket","Achternaam643"]
["2019-12-10","BakiAchternaam2",43809.666666666664,43809.979166666664,"Gebrehiwet","Achternaam644"]
["2019-12-10","Reservemiddag",43809.666666666664,43809.979166666664,"Robel","Achternaam645"]
["2019-12-10","SCHMHAS",43809.697916666664,43809.9375,"Norbert","Achternaam6"]
["2019-12-10","SCHM",43809.916666666664,43810.28125,"Rachid","Achternaam34"]
["2019-12-10","SCHM",43809.916666666664,43810.28125,"Evans","Achternaam35"]
["2019-12-10","SCHM",43809.916666666664,43810.28125,"Kevin","Achternaam36"]
["2019-12-11","ABBochtend",43810.25,43810.614583333336,"Trienko","Achternaam48"]
["2019-12-11","AFVHAS",43810.25,43810.40625,"Paul","Achternaam49"]
["2019-12-11","AFVMEP",43810.25,43810.614583333336,"Rudolf","Achternaam44"]
["2019-12-11","LCRochtend",43810.25,43810.614583333336,"Sami","Achternaam81"]
["2019-12-11","LCRochtend",43810.25,43810.614583333336,"Wolter","Achternaam8"]
["2019-12-11","PALLHAS",43810.25,43810.614583333336,"Henk","Achternaam655"]
["2019-12-11","PALLMEP",43810.25,43810.614583333336,"Wenaron","Achternaam656"]
["2019-12-11","PALLMEP",43810.25,43810.614583333336,"Salahadin","Achternaam657"]
["2019-12-11","PALLMEP",43810.25,43810.614583333336,"Dikkie","Achternaam658"]
["2019-12-11","PALLMEP",43810.25,43810.614583333336,"Rene","Achternaam659"]
["2019-12-11","PALLMEP",43810.25,43810.614583333336,"Richard","Achternaam660"]
["2019-12-11","PALLRweg",43810.25,43810.614583333336,"Felicia","Achternaam661"]
["2019-12-11","PALLRweg",43810.25,43810.614583333336,"Elroy","Achternaam662"]
["2019-12-11","PALLRweg",43810.25,43810.614583333336,"Arsenio","Achternaam663"]
["2019-12-11","PALLRweg",43810.25,43810.614583333336,"Viorel","Achternaam664"]
["2019-12-11","PALLRweg",43810.25,43810.614583333336,"Olcay","Achternaam665"]
["2019-12-11","PALLRweg",43810.25,43810.614583333336,"Sebastiaan","Achternaam666"]
["2019-12-11","PALLRweg",43810.25,43810.614583333336,"Amadou","Achternaam667"]
["2019-12-11","PALLRweg",43810.25,43810.614583333336,"Wout","Achternaam668"]
["2019-12-11","PALLRweg",43810.25,43810.614583333336,"Magdalena","Achternaam669"]
["2019-12-11","PALLRweg",43810.25,43810.614583333336,"Charles","Achternaam670"]
["2019-12-11","PALLRweg",43810.25,43810.614583333336,"Ko","Achternaam671"]
["2019-12-11","PALLRweg",43810.25,43810.614583333336,"Robin","Achternaam672"]
["2019-12-11","PALLRweg",43810.25,43810.614583333336,"Gerrit","Achternaam673"]
["2019-12-11","PALLRweg",43810.25,43810.614583333336,"Everon","Achternaam674"]
["2019-12-11","PALLRweg",43810.25,43810.614583333336,"Davood","Achternaam675"]
["2019-12-11","PALLRweg",43810.25,43810.614583333336,"Swen","Achternaam676"]
["2019-12-11","PALLRweg",43810.25,43810.614583333336,"Saidou","Achternaam677"]
["2019-12-11","PALLRweg",43810.25,43810.614583333336,"Wim","Achternaam678"]
["2019-12-11","PALLRweg",43810.25,43810.614583333336,"Quincy","Achternaam679"]
["2019-12-11","PALLRweg",43810.25,43810.614583333336,"Daniel","Achternaam680"]
["2019-12-11","PALLRweg",43810.25,43810.614583333336,"Henk","Achternaam681"]
["2019-12-11","Reserveochtend",43810.25,43810.614583333336,"Shawn","Achternaam682"]
["2019-12-11","Reserveochtend",43810.25,43810.614583333336,"Fars","Achternaam683"]
["2019-12-11","Reserveochtend",43810.25,43810.614583333336,"Mebrathu","Achternaam684"]
["2019-12-11","SCHM",43810.25,43810.614583333336,"Marjolein","Achternaam76"]
["2019-12-11","SCHM",43810.25,43810.614583333336,"Piet","Achternaam78"]
["2019-12-11","SCHM",43810.25,43810.614583333336,"Roy","Achternaam77"]
["2019-12-11","SCHMAFV",43810.25,43810.614583333336,"Christiaan","Achternaam51"]
["2019-12-11","SCHMAFV",43810.25,43810.614583333336,"Henri","Achternaam82"]
["2019-12-11","SCHMAFV",43810.25,43810.614583333336,"Jan","Achternaam79"]
["2019-12-11","SCHMAFV",43810.25,43810.614583333336,"Boyan","Achternaam80"]
["2019-12-11","SCHMAFV",43810.25,43810.614583333336,"Michel","Achternaam83"]
["2019-12-11","TRSP",43810.25,43810.614583333336,"Anton","Achternaam693"]
["2019-12-11","TRSP",43810.25,43810.614583333336,"Henk","Achternaam694"]
["2019-12-11","AFVMEP",43810.291666666664,43810.65625,"Rijk","Achternaam50"]
["2019-12-11","TeamleiderPALL",43810.3125,43810.677083333336,"Hilko","Achternaam696"]
["2019-12-11","TRSP",43810.333333333336,43810.697916666664,"Harrie","Achternaam697"]
["2019-12-11","SCHMHAS",43810.40625,43810.614583333336,"Paul","Achternaam49"]
["2019-12-11","ABBmiddag",43810.572916666664,43810.9375,"Bile","Achternaam508"]
["2019-12-11","AFVHAS",43810.572916666664,43810.697916666664,"Norbert","Achternaam6"]
["2019-12-11","AFVMEP",43810.572916666664,43810.9375,"Houcin","Achternaam7"]
["2019-12-11","LCRmiddag",43810.572916666664,43810.9375,"Sebastiaan","Achternaam41"]
["2019-12-11","PALLMEP",43810.614583333336,43810.979166666664,"Latie","Achternaam703"]
["2019-12-11","PALLMEP",43810.614583333336,43810.979166666664,"Abdurahman Ibrahim","Achternaam704"]
["2019-12-11","PALLMEP",43810.614583333336,43810.979166666664,"Michael","Achternaam705"]
["2019-12-11","PALLMEP",43810.614583333336,43810.979166666664,"Hans","Achternaam706"]
["2019-12-11","PALLMEP",43810.614583333336,43810.979166666664,"Jeroen","Achternaam707"]
["2019-12-11","PALLRweg",43810.614583333336,43810.979166666664,"Akela","Achternaam708"]
["2019-12-11","PALLRweg",43810.614583333336,43810.979166666664,"Karrar","Achternaam709"]
["2019-12-11","PALLRweg",43810.614583333336,43810.979166666664,"Sebastian","Achternaam710"]
["2019-12-11","PALLRweg",43810.614583333336,43810.979166666664,"Chevindio","Achternaam711"]
["2019-12-11","PALLRweg",43810.614583333336,43810.979166666664,"Harry","Achternaam712"]
["2019-12-11","PALLRweg",43810.614583333336,43810.979166666664,"Dennis","Achternaam713"]
["2019-12-11","PALLRweg",43810.614583333336,43810.979166666664,"Jelte","Achternaam714"]
["2019-12-11","PALLRweg",43810.614583333336,43810.979166666664,"Agathe","Achternaam715"]
["2019-12-11","PALLRweg",43810.614583333336,43810.979166666664,"Amanuel","Achternaam716"]
["2019-12-11","PALLRweg",43810.614583333336,43810.979166666664,"Hassan","Achternaam717"]
["2019-12-11","PALLRweg",43810.614583333336,43810.979166666664,"Samantha","Achternaam718"]
["2019-12-11","PALLRweg",43810.614583333336,43810.979166666664,"Sied","Achternaam719"]
["2019-12-11","PALLRweg",43810.614583333336,43810.979166666664,"Ambroise","Achternaam720"]
["2019-12-11","PALLRweg",43810.614583333336,43810.979166666664,"Atobhran","Achternaam721"]
["2019-12-11","PALLRweg",43810.614583333336,43810.979166666664,"Abdul","Achternaam722"]
["2019-12-11","PALLRweg",43810.614583333336,43810.979166666664,"Naoufel","Achternaam723"]
["2019-12-11","PALLRweg",43810.614583333336,43810.979166666664,"Niek","Achternaam724"]
["2019-12-11","PALLRweg",43810.614583333336,43810.979166666664,"Jarek","Achternaam725"]
["2019-12-11","PALLRweg",43810.614583333336,43810.979166666664,"Martijn","Achternaam726"]
["2019-12-11","PALLRweg",43810.614583333336,43810.979166666664,"Mark","Achternaam727"]
["2019-12-11","PALLRweg",43810.614583333336,43810.979166666664,"Abdiqadir","Achternaam728"]
["2019-12-11","PALLRweg",43810.614583333336,43810.979166666664,"Nexhmedi","Achternaam729"]
["2019-12-11","Reservemiddag",43810.614583333336,43810.979166666664,"Tomas","Achternaam730"]
["2019-12-11","Reservemiddag",43810.614583333336,43810.979166666664,"Heruy","Achternaam731"]
["2019-12-11","Reservemiddag",43810.614583333336,43810.979166666664,"Tesfaldet","Achternaam732"]
["2019-12-11","Reservemiddag",43810.614583333336,43810.979166666664,"Laszlo","Achternaam733"]
["2019-12-11","Reservemiddag",43810.614583333336,43810.979166666664,"Gebrehiwet","Achternaam734"]
["2019-12-11","SCHM",43810.614583333336,43810.979166666664,"Erik","Achternaam4"]
["2019-12-11","SCHM",43810.614583333336,43810.979166666664,"Patrick","Achternaam88"]
["2019-12-11","SCHM",43810.614583333336,43810.979166666664,"Rolinka","Achternaam3"]
["2019-12-11","SCHMAFV",43810.614583333336,43810.979166666664,"Paul","Achternaam49"]
["2019-12-11","SCHMAFV",43810.614583333336,43810.979166666664,"Baki","Achternaam2"]
["2019-12-11","SCHMAFV",43810.614583333336,43810.979166666664,"Ilker","Achternaam38"]
["2019-12-11","SCHMAFV",43810.614583333336,43810.979166666664,"Flavi","Achternaam1"]
["2019-12-11","TRSP",43810.614583333336,43810.979166666664,"Emsud","Achternaam742"]
["2019-12-11","TRSP",43810.614583333336,43810.979166666664,"Reinder","Achternaam743"]
["2019-12-11","LCR",43810.697916666664,43810.9375,"Norbert","Achternaam6"]
["2019-12-11","SCHM",43810.916666666664,43811.28125,"Rachid","Achternaam34"]
["2019-12-11","SCHM",43810.916666666664,43811.28125,"Evans","Achternaam35"]
["2019-12-11","SCHM",43810.916666666664,43811.28125,"Kevin","Achternaam36"]
["2019-12-12","ABBochtend",43811.25,43811.614583333336,"Trienko","Achternaam48"]
["2019-12-12","AFVHAS",43811.25,43811.40625,"Paul","Achternaam49"]
["2019-12-12","AFVMEP",43811.25,43811.614583333336,"Rudolf","Achternaam44"]
["2019-12-12","LCRochtend",43811.25,43811.614583333336,"Sami","Achternaam81"]
["2019-12-12","PALLHAS",43811.25,43811.614583333336,"Henk","Achternaam752"]
["2019-12-12","PALLMEP",43811.25,43811.614583333336,"Wenaron","Achternaam753"]
["2019-12-12","PALLMEP",43811.25,43811.614583333336,"Salahadin","Achternaam754"]
["2019-12-12","PALLMEP",43811.25,43811.614583333336,"Dikkie","Achternaam755"]
["2019-12-12","PALLMEP",43811.25,43811.614583333336,"Rene","Achternaam756"]
["2019-12-12","PALLMEP",43811.25,43811.614583333336,"Richard","Achternaam757"]
["2019-12-12","PALLRweg",43811.25,43811.614583333336,"Elroy","Achternaam758"]
["2019-12-12","PALLRweg",43811.25,43811.614583333336,"Arsenio","Achternaam759"]
["2019-12-12","PALLRweg",43811.25,43811.614583333336,"Viorel","Achternaam760"]
["2019-12-12","PALLRweg",43811.25,43811.614583333336,"Olcay","Achternaam761"]
["2019-12-12","PALLRweg",43811.25,43811.614583333336,"Sebastiaan","Achternaam762"]
["2019-12-12","PALLRweg",43811.25,43811.614583333336,"Amadou","Achternaam763"]
["2019-12-12","PALLRweg",43811.25,43811.614583333336,"Wout","Achternaam764"]
["2019-12-12","PALLRweg",43811.25,43811.614583333336,"Fars","Achternaam765"]
["2019-12-12","PALLRweg",43811.25,43811.614583333336,"Magdalena","Achternaam766"]
["2019-12-12","PALLRweg",43811.25,43811.614583333336,"Charles","Achternaam767"]
["2019-12-12","PALLRweg",43811.25,43811.614583333336,"Ko","Achternaam768"]
["2019-12-12","PALLRweg",43811.25,43811.614583333336,"Robin","Achternaam769"]
["2019-12-12","PALLRweg",43811.25,43811.614583333336,"Gerrit","Achternaam770"]
["2019-12-12","PALLRweg",43811.25,43811.614583333336,"Everon","Achternaam771"]
["2019-12-12","PALLRweg",43811.25,43811.614583333336,"Davood","Achternaam772"]
["2019-12-12","PALLRweg",43811.25,43811.614583333336,"Swen","Achternaam773"]
["2019-12-12","PALLRweg",43811.25,43811.614583333336,"Saidou","Achternaam774"]
["2019-12-12","PALLRweg",43811.25,43811.614583333336,"Wim","Achternaam775"]
["2019-12-12","PALLRweg",43811.25,43811.614583333336,"Quincy","Achternaam776"]
["2019-12-12","PALLRweg",43811.25,43811.614583333336,"Daniel","Achternaam777"]
["2019-12-12","PALLRweg",43811.25,43811.614583333336,"Henk","Achternaam778"]
["2019-12-12","SCHM",43811.25,43811.614583333336,"Marjolein","Achternaam76"]
["2019-12-12","SCHM",43811.25,43811.614583333336,"Piet","Achternaam78"]
["2019-12-12","SCHM",43811.25,43811.614583333336,"Roy","Achternaam77"]
["2019-12-12","SCHMAFV",43811.25,43811.614583333336,"Christiaan","Achternaam51"]
["2019-12-12","SCHMAFV",43811.25,43811.614583333336,"Henri","Achternaam82"]
["2019-12-12","SCHMAFV",43811.25,43811.614583333336,"Jan","Achternaam79"]
["2019-12-12","SCHMAFV",43811.25,43811.614583333336,"Boyan","Achternaam80"]
["2019-12-12","SCHMAFV",43811.25,43811.614583333336,"Michel","Achternaam83"]
["2019-12-12","TRSP",43811.25,43811.614583333336,"Anton","Achternaam787"]
["2019-12-12","TRSP",43811.25,43811.614583333336,"Henk","Achternaam788"]
["2019-12-12","AFVMEP",43811.291666666664,43811.65625,"Rijk","Achternaam50"]
["2019-12-12","TeamleiderPALL",43811.3125,43811.677083333336,"Hilko","Achternaam790"]
["2019-12-12","TRSP",43811.333333333336,43811.697916666664,"Harrie","Achternaam791"]
["2019-12-12","SCHMHAS",43811.40625,43811.614583333336,"Paul","Achternaam49"]
["2019-12-12","ABBmiddag",43811.572916666664,43811.9375,"Bile","Achternaam508"]
["2019-12-12","AFVHAS",43811.572916666664,43811.697916666664,"Norbert","Achternaam6"]
["2019-12-12","AFVMEP",43811.572916666664,43811.9375,"Houcin","Achternaam7"]
["2019-12-12","LCRmiddag",43811.572916666664,43811.9375,"Klaas","Achternaam40"]
["2019-12-12","PALLMEP",43811.614583333336,43811.979166666664,"Latie","Achternaam797"]
["2019-12-12","PALLMEP",43811.614583333336,43811.979166666664,"Abdurahman Ibrahim","Achternaam798"]
["2019-12-12","PALLMEP",43811.614583333336,43811.979166666664,"Michael","Achternaam799"]
["2019-12-12","PALLMEP",43811.614583333336,43811.979166666664,"Hans","Achternaam800"]
["2019-12-12","PALLMEP",43811.614583333336,43811.979166666664,"Jeroen","Achternaam801"]
["2019-12-12","PALLRweg",43811.614583333336,43811.979166666664,"Akela","Achternaam802"]
["2019-12-12","PALLRweg",43811.614583333336,43811.979166666664,"Karrar","Achternaam803"]
["2019-12-12","PALLRweg",43811.614583333336,43811.979166666664,"Chevindio","Achternaam804"]
["2019-12-12","PALLRweg",43811.614583333336,43811.979166666664,"Haben","Achternaam805"]
["2019-12-12","PALLRweg",43811.614583333336,43811.979166666664,"Harry","Achternaam806"]
["2019-12-12","PALLRweg",43811.614583333336,43811.979166666664,"Apollonia","Achternaam807"]
["2019-12-12","PALLRweg",43811.614583333336,43811.979166666664,"Dennis","Achternaam808"]
["2019-12-12","PALLRweg",43811.614583333336,43811.979166666664,"Agathe","Achternaam809"]
["2019-12-12","PALLRweg",43811.614583333336,43811.979166666664,"Tomas","Achternaam810"]
["2019-12-12","PALLRweg",43811.614583333336,43811.979166666664,"Heruy","Achternaam811"]
["2019-12-12","PALLRweg",43811.614583333336,43811.979166666664,"Hassan","Achternaam812"]
["2019-12-12","PALLRweg",43811.614583333336,43811.979166666664,"Samantha","Achternaam813"]
["2019-12-12","PALLRweg",43811.614583333336,43811.979166666664,"Sied","Achternaam814"]
["2019-12-12","PALLRweg",43811.614583333336,43811.979166666664,"Laszlo","Achternaam815"]
["2019-12-12","PALLRweg",43811.614583333336,43811.979166666664,"Atobhran","Achternaam816"]
["2019-12-12","PALLRweg",43811.614583333336,43811.979166666664,"Abdul","Achternaam817"]
["2019-12-12","PALLRweg",43811.614583333336,43811.979166666664,"Naoufel","Achternaam818"]
["2019-12-12","PALLRweg",43811.614583333336,43811.979166666664,"Jarek","Achternaam819"]
["2019-12-12","PALLRweg",43811.614583333336,43811.979166666664,"Martijn","Achternaam820"]
["2019-12-12","PALLRweg",43811.614583333336,43811.979166666664,"Mark","Achternaam821"]
["2019-12-12","PALLRweg",43811.614583333336,43811.979166666664,"Abdiqadir","Achternaam822"]
["2019-12-12","PALLRweg",43811.614583333336,43811.979166666664,"Nexhmedi","Achternaam823"]
["2019-12-12","Reservemiddag",43811.614583333336,43811.979166666664,"Sebastian","Achternaam824"]
["2019-12-12","Reservemiddag",43811.614583333336,43811.979166666664,"Amanuel","Achternaam825"]
["2019-12-12","SCHM",43811.614583333336,43811.979166666664,"Erik","Achternaam4"]
["2019-12-12","SCHM",43811.614583333336,43811.979166666664,"Patrick","Achternaam88"]
["2019-12-12","SCHM",43811.614583333336,43811.979166666664,"Rolinka","Achternaam3"]
["2019-12-12","SCHMAFV",43811.614583333336,43811.979166666664,"Miquel","Achternaam39"]
["2019-12-12","SCHMAFV",43811.614583333336,43811.979166666664,"Paul","Achternaam49"]
["2019-12-12","SCHMAFV",43811.614583333336,43811.979166666664,"Sebastiaan","Achternaam41"]
["2019-12-12","SCHMAFV",43811.614583333336,43811.979166666664,"Baki","Achternaam2"]
["2019-12-12","SCHMAFV",43811.614583333336,43811.979166666664,"Ilker","Achternaam38"]
["2019-12-12","SCHMAFV",43811.614583333336,43811.979166666664,"Flavi","Achternaam1"]
["2019-12-12","TRSP",43811.614583333336,43811.979166666664,"Emsud","Achternaam835"]
["2019-12-12","TRSP",43811.614583333336,43811.979166666664,"Reinder","Achternaam836"]
["2019-12-12","LCR",43811.697916666664,43811.9375,"Norbert","Achternaam6"]
["2019-12-12","SCHM",43811.916666666664,43812.28125,"Rachid","Achternaam34"]
["2019-12-12","SCHM",43811.916666666664,43812.28125,"Evans","Achternaam35"]
["2019-12-12","SCHM",43811.916666666664,43812.28125,"Kevin","Achternaam36"]
["2019-12-13","ABBochtend",43812.25,43812.614583333336,"Trienko","Achternaam48"]
["2019-12-13","AFVHAS",43812.25,43812.40625,"Paul","Achternaam49"]
["2019-12-13","AFVMEP",43812.25,43812.614583333336,"Rudolf","Achternaam44"]
["2019-12-13","LCRochtend",43812.25,43812.614583333336,"Sami","Achternaam81"]
["2019-12-13","LCRochtend",43812.25,43812.614583333336,"Wolter","Achternaam8"]
["2019-12-13","PALLHAS",43812.25,43812.614583333336,"Henk","Achternaam846"]
["2019-12-13","PALLMEP",43812.25,43812.614583333336,"Wenaron","Achternaam847"]
["2019-12-13","PALLMEP",43812.25,43812.614583333336,"Salahadin","Achternaam848"]
["2019-12-13","PALLMEP",43812.25,43812.614583333336,"Dikkie","Achternaam849"]
["2019-12-13","PALLMEP",43812.25,43812.614583333336,"Rene","Achternaam850"]
["2019-12-13","PALLMEP",43812.25,43812.614583333336,"Richard","Achternaam851"]
["2019-12-13","PALLRweg",43812.25,43812.614583333336,"Felicia","Achternaam852"]
["2019-12-13","PALLRweg",43812.25,43812.614583333336,"Jelte","Achternaam853"]
["2019-12-13","PALLRweg",43812.25,43812.614583333336,"Shawn","Achternaam854"]
["2019-12-13","PALLRweg",43812.25,43812.614583333336,"Elroy","Achternaam855"]
["2019-12-13","PALLRweg",43812.25,43812.614583333336,"Arsenio","Achternaam856"]
["2019-12-13","PALLRweg",43812.25,43812.614583333336,"Viorel","Achternaam857"]
["2019-12-13","PALLRweg",43812.25,43812.614583333336,"Sebastiaan","Achternaam858"]
["2019-12-13","PALLRweg",43812.25,43812.614583333336,"Amadou","Achternaam859"]
["2019-12-13","PALLRweg",43812.25,43812.614583333336,"Wout","Achternaam860"]
["2019-12-13","PALLRweg",43812.25,43812.614583333336,"Fars","Achternaam861"]
["2019-12-13","PALLRweg",43812.25,43812.614583333336,"Magdalena","Achternaam862"]
["2019-12-13","PALLRweg",43812.25,43812.614583333336,"Charles","Achternaam863"]
["2019-12-13","PALLRweg",43812.25,43812.614583333336,"Ko","Achternaam864"]
["2019-12-13","PALLRweg",43812.25,43812.614583333336,"Robin","Achternaam865"]
["2019-12-13","PALLRweg",43812.25,43812.614583333336,"Gerrit","Achternaam866"]
["2019-12-13","PALLRweg",43812.25,43812.614583333336,"Everon","Achternaam867"]
["2019-12-13","PALLRweg",43812.25,43812.614583333336,"Davood","Achternaam868"]
["2019-12-13","PALLRweg",43812.25,43812.614583333336,"Swen","Achternaam869"]
["2019-12-13","PALLRweg",43812.25,43812.614583333336,"Saidou","Achternaam870"]
["2019-12-13","PALLRweg",43812.25,43812.614583333336,"Wim","Achternaam871"]
["2019-12-13","PALLRweg",43812.25,43812.614583333336,"Quincy","Achternaam872"]
["2019-12-13","PALLRweg",43812.25,43812.614583333336,"Henk","Achternaam873"]
["2019-12-13","Reserveochtend",43812.25,43812.614583333336,"Olcay","Achternaam874"]
["2019-12-13","Reserveochtend",43812.25,43812.614583333336,"Mebrathu","Achternaam875"]
["2019-12-13","Reserveochtend",43812.25,43812.614583333336,"Daniel","Achternaam876"]
["2019-12-13","SCHM",43812.25,43812.614583333336,"Marjolein","Achternaam76"]
["2019-12-13","SCHM",43812.25,43812.614583333336,"Piet","Achternaam78"]
["2019-12-13","SCHM",43812.25,43812.614583333336,"Roy","Achternaam77"]
["2019-12-13","SCHMAFV",43812.25,43812.614583333336,"Christiaan","Achternaam51"]
["2019-12-13","SCHMAFV",43812.25,43812.614583333336,"Henri","Achternaam82"]
["2019-12-13","SCHMAFV",43812.25,43812.614583333336,"Jan","Achternaam79"]
["2019-12-13","SCHMAFV",43812.25,43812.614583333336,"Boyan","Achternaam80"]
["2019-12-13","SCHMAFV",43812.25,43812.614583333336,"Michel","Achternaam83"]
["2019-12-13","TRSP",43812.25,43812.614583333336,"Anton","Achternaam885"]
["2019-12-13","TRSP",43812.25,43812.614583333336,"Henk","Achternaam886"]
["2019-12-13","AFVMEP",43812.291666666664,43812.65625,"Rijk","Achternaam50"]
["2019-12-13","TeamleiderPALL",43812.3125,43812.677083333336,"Hilko","Achternaam888"]
["2019-12-13","TRSP",43812.333333333336,43812.697916666664,"Harrie","Achternaam889"]
["2019-12-13","SCHMHAS",43812.40625,43812.614583333336,"Paul","Achternaam49"]
["2019-12-13","ABBmiddag",43812.572916666664,43812.9375,"Bile","Achternaam508"]
["2019-12-13","AFVHAS",43812.572916666664,43812.697916666664,"Norbert","Achternaam6"]
["2019-12-13","AFVMEP",43812.572916666664,43812.9375,"Houcin","Achternaam7"]
["2019-12-13","LCRmiddag",43812.572916666664,43812.9375,"Klaas","Achternaam40"]
["2019-12-13","PALLMEP",43812.614583333336,43812.979166666664,"Latie","Achternaam895"]
["2019-12-13","PALLMEP",43812.614583333336,43812.979166666664,"Abdurahman Ibrahim","Achternaam896"]
["2019-12-13","PALLMEP",43812.614583333336,43812.979166666664,"Michael","Achternaam897"]
["2019-12-13","PALLMEP",43812.614583333336,43812.979166666664,"Hans","Achternaam898"]
["2019-12-13","PALLMEP",43812.614583333336,43812.979166666664,"Jeroen","Achternaam899"]
["2019-12-13","PALLRweg",43812.614583333336,43812.979166666664,"Akela","Achternaam900"]
["2019-12-13","PALLRweg",43812.614583333336,43812.979166666664,"Karrar","Achternaam901"]
["2019-12-13","PALLRweg",43812.614583333336,43812.979166666664,"Sebastian","Achternaam902"]
["2019-12-13","PALLRweg",43812.614583333336,43812.979166666664,"Harry","Achternaam903"]
["2019-12-13","PALLRweg",43812.614583333336,43812.979166666664,"Apollonia","Achternaam904"]
["2019-12-13","PALLRweg",43812.614583333336,43812.979166666664,"Dennis","Achternaam905"]
["2019-12-13","PALLRweg",43812.614583333336,43812.979166666664,"Agathe","Achternaam906"]
["2019-12-13","PALLRweg",43812.614583333336,43812.979166666664,"Hagos","Achternaam907"]
["2019-12-13","PALLRweg",43812.614583333336,43812.979166666664,"Heruy","Achternaam908"]
["2019-12-13","PALLRweg",43812.614583333336,43812.979166666664,"Hassan","Achternaam909"]
["2019-12-13","PALLRweg",43812.614583333336,43812.979166666664,"Samantha","Achternaam910"]
["2019-12-13","PALLRweg",43812.614583333336,43812.979166666664,"Sied","Achternaam911"]
["2019-12-13","PALLRweg",43812.614583333336,43812.979166666664,"Laszlo","Achternaam912"]
["2019-12-13","PALLRweg",43812.614583333336,43812.979166666664,"Atobhran","Achternaam913"]
["2019-12-13","PALLRweg",43812.614583333336,43812.979166666664,"Abdul","Achternaam914"]
["2019-12-13","PALLRweg",43812.614583333336,43812.979166666664,"Naoufel","Achternaam915"]
["2019-12-13","PALLRweg",43812.614583333336,43812.979166666664,"Jarek","Achternaam916"]
["2019-12-13","PALLRweg",43812.614583333336,43812.979166666664,"Martijn","Achternaam917"]
["2019-12-13","PALLRweg",43812.614583333336,43812.979166666664,"Mark","Achternaam918"]
["2019-12-13","PALLRweg",43812.614583333336,43812.979166666664,"Abdiqadir","Achternaam919"]
["2019-12-13","PALLRweg",43812.614583333336,43812.979166666664,"Nexhmedi","Achternaam920"]
["2019-12-13","SCHM",43812.614583333336,43812.979166666664,"Erik","Achternaam4"]
["2019-12-13","SCHM",43812.614583333336,43812.979166666664,"Patrick","Achternaam88"]
["2019-12-13","SCHM",43812.614583333336,43812.979166666664,"Rolinka","Achternaam3"]
["2019-12-13","SCHMAFV",43812.614583333336,43812.979166666664,"Miquel","Achternaam39"]
["2019-12-13","SCHMAFV",43812.614583333336,43812.979166666664,"Paul","Achternaam49"]
["2019-12-13","SCHMAFV",43812.614583333336,43812.979166666664,"Sebastiaan","Achternaam41"]
["2019-12-13","SCHMAFV",43812.614583333336,43812.979166666664,"Baki","Achternaam2"]
["2019-12-13","SCHMAFV",43812.614583333336,43812.979166666664,"Ilker","Achternaam38"]
["2019-12-13","SCHMAFV",43812.614583333336,43812.979166666664,"Flavi","Achternaam1"]
["2019-12-13","TRSP",43812.614583333336,43812.979166666664,"Emsud","Achternaam930"]
["2019-12-13","TRSP",43812.614583333336,43812.979166666664,"Reinder","Achternaam931"]
["2019-12-13","PALLRweg",43812.645833333336,43812.979166666664,"Amanuel","Achternaam932"]
["2019-12-13","Reservemiddag",43812.666666666664,43812.979166666664,"Bereket","Achternaam933"]
["2019-12-13","BakiAchternaam2",43812.666666666664,43812.979166666664,"Gebrehiwet","Achternaam934"]
["2019-12-13","Reservemiddag",43812.666666666664,43812.979166666664,"Robel","Achternaam935"]
["2019-12-13","SCHMHAS",43812.697916666664,43812.9375,"Norbert","Achternaam6"]
["2019-12-14","ABBweekenddienst",43813.333333333336,43813.875,"Niek","Achternaam937"]

{"sheet":"EMB weekplanning","index":4,"n_rows":119,"n_cols":18,"rows_kept":119,"cut":false,"hidden":false,"merged":[]}
[null,null,null,"PLANNING EMB"]
[null,{"$f":"WEEKNUM(E2) & \"/\" & YEAR(E2)","v":"50/2019"},null,{"$f":"WEEKDAY(E2)","v":"1900-01-02"},"2019-12-09",{"$f":"\"Week nr.\" & WEEKNUM(E2)","v":"Week nr.50"},{"$f":"WEEKDAY(H2)","v":"1900-01-03"},"2019-12-10",{"$f":"\"Week nr.\" & WEEKNUM(H2)","v":"Week nr.50"},{"$f":"WEEKDAY(K2)","v":"1900-01-04"},"2019-12-11",{"$f":"\"Week nr.\" & WEEKNUM(K2)","v":"Week nr.50"},{"$f":"WEEKDAY(N2)","v":"1900-01-05"},"2019-12-12",{"$f":"\"Week nr.\" & WEEKNUM(N2)","v":"Week nr.50"},{"$f":"WEEKDAY(Q2)","v":"1900-01-06"},"2019-12-13",{"$f":"\"Week nr.\" & WEEKNUM(Q2)","v":"Week nr.50"}]
["Afdeling","Verlof","FTE","Vroeg","Laat","Nacht","Vroeg","Laat","Nacht","Vroeg","Laat","Nacht","Vroeg","Laat","Nacht","Vroeg","Laat","Nacht"]
["TLPALL",null,null,"06:00/14:45","14:45/23:30","22:00/06:45","06:00/14:45","14:45/23:30","22:00/06:45","06:00/14:45","14:45/23:30","22:00/06:45","06:00/14:45","14:45/23:30","22:00/06:45","06:00/14:45","14:45/23:30","22:00/06:45"]
[null,null,1,"Hilko Achternaam505",null,null,"Hilko Achternaam596",null,null,"Hilko Achternaam696",null,null,"Hilko Achternaam790",null,null,"Hilko Achternaam888"]
[null,null,2]
[null,null,3]
[null,null,4]
[null,null,5]
[null,null,6]
[null,null,7]
[null,null,8]
["PALME",null,"WERKTIIJDEN","06:00/14:45","14:45/23:30","22:00/06:45","06:00/14:45","14:45/23:30","22:00/06:45","06:00/14:45","14:45/23:30","22:00/06:45","06:00/14:45","14:45/23:30","22:00/06:45","06:00/14:45","14:45/23:30","22:00/06:45"]
[null,null,1,"Wenaron Achternaam467","Latie Achternaam513",null,"Wenaron Achternaam561","Latie Achternaam605",null,"Wenaron Achternaam656","Latie Achternaam703",null,"Wenaron Achternaam753","Latie Achternaam797",null,"Wenaron Achternaam847","Latie Achternaam895"]
[null,null,2,"Salahadin Achternaam468","Abdurahman Ibrahim Achternaam514",null,"Salahadin Achternaam562","Abdurahman Ibrahim Achternaam606",null,"Salahadin Achternaam657","Abdurahman Ibrahim Achternaam704",null,"Salahadin Achternaam754","Abdurahman Ibrahim Achternaam798",null,"Salahadin Achternaam848","Abdurahman Ibrahim Achternaam896"]
[null,null,3,"Dikkie Achternaam469","Michael Achternaam515",null,"Dikkie Achternaam563","Michael Achternaam607",null,"Dikkie Achternaam658","Michael Achternaam705",null,"Dikkie Achternaam755","Michael Achternaam799",null,"Dikkie Achternaam849","Michael Achternaam897"]
[null,null,4,"Rene Achternaam470","Hans Achternaam516",null,"Rene Achternaam564","Hans Achternaam608",null,"Rene Achternaam659","Hans Achternaam706",null,"Rene Achternaam756","Hans Achternaam800",null,"Rene Achternaam850","Hans Achternaam898"]
[null,null,5,"Richard Achternaam471","Jeroen Achternaam517",null,"Richard Achternaam565","Jeroen Achternaam609",null,"Richard Achternaam660","Jeroen Achternaam707",null,"Richard Achternaam757","Jeroen Achternaam801",null,"Richard Achternaam851","Jeroen Achternaam899"]
[null,null,6]
[null,null,7]
[null,null,8]
["PALRW",null,"WERKTIIJDEN","06:00/14:45","13:45/22:30","22:00/06:45","06:00/14:45","13:45/22:30","22:00/06:45","06:00/14:45","13:45/22:30","22:00/06:45","06:00/14:45","13:45/22:30","22:00/06:45","06:00/14:45","13:45/22:30","22:00/06:45"]
[null,null,1,"Felicia Achternaam472","Akela Achternaam518",null,"Shawn Achternaam566","Akela Achternaam610",null,"Felicia Achternaam661","Akela Achternaam708",null,"Elroy Achternaam758","Akela Achternaam802",null,"Felicia Achternaam852","Akela Achternaam900"]
[null,null,2,"Shawn Achternaam473","Karrar Achternaam519",null,"Elroy Achternaam567","Karrar Achternaam611",null,"Elroy Achternaam662","Karrar Achternaam709",null,"Arsenio Achternaam759","Karrar Achternaam803",null,"Jelte Achternaam853","Karrar Achternaam901"]
[null,null,3,"Elroy Achternaam474","Sebastian Achternaam520",null,"Arsenio Achternaam568","Sebastian Achternaam612",null,"Arsenio Achternaam663","Sebastian Achternaam710",null,"Viorel Achternaam760","Chevindio Achternaam804",null,"Shawn Achternaam854","Sebastian Achternaam902"]
[null,null,4,"Swen Achternaam475","Harry Achternaam521",null,"Viorel Achternaam569","Chevindio Achternaam613",null,"Viorel Achternaam664","Chevindio Achternaam711",null,"Olcay Achternaam761","Haben Achternaam805",null,"Elroy Achternaam855","Harry Achternaam903"]
[null,null,5,"Arsenio Achternaam476","Apollonia Achternaam522",null,"Olcay Achternaam570","Harry Achternaam614",null,"Olcay Achternaam665","Harry Achternaam712",null,"Sebastiaan Achternaam762","Harry Achternaam806",null,"Arsenio Achternaam856","Apollonia Achternaam904"]
[null,null,6,"Henk Achternaam492","Gebrehiwet Achternaam549",null,"Henk Achternaam584","Amanuel Achternaam641",null,"Henk Achternaam681","Nexhmedi Achternaam729",null,"Henk Achternaam778","Nexhmedi Achternaam823",null,"Henk Achternaam873","Amanuel Achternaam932"]
[null,null,7]
["TRSP",null,null,"06:00/14:45","14:45/23:30","22:00/06:45","06:00/14:45","14:45/23:30","22:00/06:45","06:00/14:45","14:45/23:30","22:00/06:45","06:00/14:45","14:45/23:30","22:00/06:45","06:00/14:45","14:45/23:30","22:00/06:45"]
[null,null,1,"Anton Achternaam502","Emsud Achternaam546",null,"Anton Achternaam593","Emsud Achternaam639",null,"Anton Achternaam693","Emsud Achternaam742",null,"Anton Achternaam787","Emsud Achternaam835",null,"Anton Achternaam885","Emsud Achternaam930"]
[null,null,2,"Henk Achternaam503","Reinder Achternaam547",null,"Henk Achternaam594","Reinder Achternaam640",null,"Henk Achternaam694","Reinder Achternaam743",null,"Henk Achternaam788","Reinder Achternaam836",null,"Henk Achternaam886","Reinder Achternaam931"]
[null,null,3,"Harrie Achternaam506",null,null,"Harrie Achternaam597",null,null,"Harrie Achternaam697",null,null,"Harrie Achternaam791",null,null,"Harrie Achternaam889"]
[null,null,4]
[null,null,5]
[null,null,6]
[null,null,7]
["PALHAS",null,null,{"$f":"IF(WEEKDAY(E2)=7,\"08:00/21:00 \",IF(WEEKDAY(E2)=1,\"08:00/14:45\",\"06:00/14:45\"))","v":"06:00/14:45"},{"$f":"IF(WEEKDAY(E2)=1,\"13:45/22:30\",\"14:45/23:30\")","v":"14:45/23:30"},{"$f":"IF(OR(WEEKDAY(E2)=7,WEEKDAY(E2)=1),\" \",\"22:00/06:45\")","v":"22:00/06:45"},{"$f":"IF(WEEKDAY(H2)=7,\"08:00/21:00 \",IF(WEEKDAY(H2)=1,\"08:00/14:45\",\"06:00/14:45\"))","v":"06:00/14:45"},{"$f":"IF(WEEKDAY(H2)=1,\"13:45/22:30\",\"14:45/23:30\")","v":"14:45/23:30"},{"$f":"IF(OR(WEEKDAY(H2)=7,WEEKDAY(H2)=1),\" \",\"22:00/06:45\")","v":"22:00/06:45"},{"$f":"IF(WEEKDAY(K2)=7,\"08:00/21:00 \",IF(WEEKDAY(K2)=1,\"08:00/14:45\",\"06:00/14:45\"))","v":"06:00/14:45"},{"$f":"IF(WEEKDAY(K2)=1,\"13:45/22:30\",\"14:45/23:30\")","v":"14:45/23:30"},{"$f":"IF(OR(WEEKDAY(K2)=7,WEEKDAY(K2)=1),\" \",\"22:00/06:45\")","v":"22:00/06:45"},{"$f":"IF(WEEKDAY(N2)=7,\"08:00/21:00 \",IF(WEEKDAY(N2)=1,\"08:00/14:45\",\"06:00/14:45\"))","v":"06:00/14:45"},{"$f":"IF(WEEKDAY(N2)=1,\"13:45/22:30\",\"14:45/23:30\")","v":"14:45/23:30"},{"$f":"IF(OR(WEEKDAY(N2)=7,WEEKDAY(N2)=1),\" \",\"22:00/06:45\")","v":"22:00/06:45"},{"$f":"IF(WEEKDAY(Q2)=7,\"08:00/21:00 \",IF(WEEKDAY(Q2)=1,\"08:00/14:45\",\"06:00/14:45\"))","v":"06:00/14:45"},{"$f":"IF(WEEKDAY(Q2)=1,\"13:45/22:30\",\"14:45/23:30\")","v":"14:45/23:30"},{"$f":"IF(OR(WEEKDAY(Q2)=7,WEEKDAY(Q2)=1),\" \",\"22:00/06:45\")","v":"22:00/06:45"}]
[null,null,1,"Henk Achternaam466",null,null,"Henk Achternaam560",null,null,"Henk Achternaam655",null,null,"Henk Achternaam752",null,null,"Henk Achternaam846"]
[null,null,2]
[null,null,3]
[null,null,4]
[null,null,5]
[null,null,6]
[null,null,7]
["RESER",null,null,"06:00/14:45","14:45/23:30","22:00/06:45","06:00/14:45","14:45/23:30","22:00/06:45","06:00/14:45","14:45/23:30","22:00/06:45","06:00/14:45","14:45/23:30","22:00/06:45","06:00/14:45","14:45/23:30","22:00/06:45"]
[null,null,1,"Robin Achternaam493","Bereket Achternaam550",null,"Fars Achternaam599","Haben Achternaam642",null,"Shawn Achternaam682","Tomas Achternaam730",null,null,"Sebastian Achternaam824",null,"Olcay Achternaam874","Bereket Achternaam933"]
[null,null,2,null,null,null,null,"Bereket Achternaam643",null,"Fars Achternaam683","Heruy Achternaam731",null,null,"Amanuel Achternaam825",null,"Mebrathu Achternaam875","Robel Achternaam935"]
[null,null,3,null,null,null,null,"Robel Achternaam645",null,"Mebrathu Achternaam684","Tesfaldet Achternaam732",null,null,null,null,"Daniel Achternaam876"]
[null,null,4,null,null,null,null,null,null,null,"Laszlo Achternaam733"]
[null,null,5,null,null,null,null,null,null,null,"Gebrehiwet Achternaam734"]
[null,null,6]
[]
[]
[]
[]
[]
[]
[]
[]
[]
[]
[]
[]
[]
[]
[]
[]
[]
[]
[]
[]
[]
[]
[null,null,null,{"$f":"WEEKDAY(E75)","v":"1900-01-07"},"2019-11-30",{"$f":"\"Week nr.\" & WEEKNUM(E75)","v":"Week nr.48"}]
[null,null,null,"Vroeg","Laat","Nacht"]
[null,null,null,"06:00/14:45","14:45/23:30","22:00/06:45"]
[]
[]
[]
[]
[]
[]
[]
[]
[null,null,null,"06:00/14:45","14:45/23:30","22:00/06:45"]
[]
[]
[]
[]
[]
[]
[]
[]
[null,null,null,"06:00/14:45","13:45/22:30","22:00/06:45"]
[]
[]
[]
[]
[]
[]
[]
[null,null,null,"06:00/14:45","14:45/23:30","22:00/06:45"]
[]
[]
[]
[]
[]
[]
[]
[null,null,null,{"$f":"IF(WEEKDAY(E75)=7,\"08:00/21:00 \",IF(WEEKDAY(E75)=1,\"08:00/14:45\",\"06:00/14:45\"))","v":"08:00/21:00 "},{"$f":"IF(WEEKDAY(E75)=1,\"13:45/22:30\",\"14:45/23:30\")","v":"14:45/23:30"},{"$f":"IF(OR(WEEKDAY(E75)=7,WEEKDAY(E75)=1),\" \",\"22:00/06:45\")","v":" "}]
[]
[]
[]
[]
[]
[]
[]
[null,null,null,"06:00/14:45","14:45/23:30","22:00/06:45"]

{"sheet":"EMB verlof","index":5,"n_rows":250,"n_cols":6,"rows_kept":250,"cut":false,"hidden":false,"merged":[]}
["Weeknummer","Datum","Naam","Afdeling","aantal dagen","Goedgekeurd/ afgekeurd (reden)"]
[{"$f":"IF(B2<>\"\",WEEKNUM(B2),\"\")","v":50},"2019-12-12","Henk Achternaam466",{"$f":"IF(C2<>\"\",VLOOKUP(C2,verlofEMB,2,0),\"\")","v":{"$error":"#N/A"}},5,"goedgekeurd"]
[{"$f":"IF(B3<>\"\",WEEKNUM(B3),\"\")","v":50},"2019-12-10","Rene Achternaam470",{"$f":"IF(C3<>\"\",VLOOKUP(C3,verlofEMB,2,0),\"\")","v":{"$error":"#N/A"}},20,"afgekeurd, te veel werk"]
[50,"2019-12-14","Felicia Achternaam472",{"$f":"IF(C4<>\"\",VLOOKUP(C4,verlofEMB,2,0),\"\")","v":{"$error":"#N/A"}},5,"goedgekeurd"]
[49,"2019-12-05","Anton Achternaam502",{"$f":"IF(C5<>\"\",VLOOKUP(C5,verlofEMB,2,0),\"\")","v":{"$error":"#N/A"}},10,"goedgekeurd"]
["",null,null,{"$f":"IF(C6<>\"\",VLOOKUP(C6,verlofEMB,2,0),\"\")","v":""}]
[{"$f":"IF(B7<>\"\",WEEKNUM(B7),\"\")","v":""},null,null,{"$f":"IF(C7<>\"\",VLOOKUP(C7,verlofEMB,2,0),\"\")","v":""}]
[{"$f":"IF(B8<>\"\",WEEKNUM(B8),\"\")","v":""},null,null,{"$f":"IF(C8<>\"\",VLOOKUP(C8,verlofEMB,2,0),\"\")","v":""}]
[{"$f":"IF(B9<>\"\",WEEKNUM(B9),\"\")","v":""},null,null,{"$f":"IF(C9<>\"\",VLOOKUP(C9,verlofEMB,2,0),\"\")","v":""}]
[{"$f":"IF(B10<>\"\",WEEKNUM(B10),\"\")","v":""},null,null,{"$f":"IF(C10<>\"\",VLOOKUP(C10,verlofEMB,2,0),\"\")","v":""}]
[{"$f":"IF(B11<>\"\",WEEKNUM(B11),\"\")","v":""},null,null,{"$f":"IF(C11<>\"\",VLOOKUP(C11,verlofEMB,2,0),\"\")","v":""}]
["",null,null,{"$f":"IF(C12<>\"\",VLOOKUP(C12,verlofEMB,2,0),\"\")","v":""}]
["",null,null,{"$f":"IF(C13<>\"\",VLOOKUP(C13,verlofEMB,2,0),\"\")","v":""}]
["",null,null,{"$f":"IF(C14<>\"\",VLOOKUP(C14,verlofEMB,2,0),\"\")","v":""}]
["",null,null,{"$f":"IF(C15<>\"\",VLOOKUP(C15,verlofEMB,2,0),\"\")","v":""}]
["",null,null,{"$f":"IF(C16<>\"\",VLOOKUP(C16,verlofEMB,2,0),\"\")","v":""}]
["",null,null,{"$f":"IF(C17<>\"\",VLOOKUP(C17,verlofEMB,2,0),\"\")","v":""}]
["",null,null,{"$f":"IF(C18<>\"\",VLOOKUP(C18,verlofEMB,2,0),\"\")","v":""}]
["",null,null,{"$f":"IF(C19<>\"\",VLOOKUP(C19,verlofEMB,2,0),\"\")","v":""}]
["",null,null,{"$f":"IF(C20<>\"\",VLOOKUP(C20,verlofEMB,2,0),\"\")","v":""}]
["",null,null,{"$f":"IF(C21<>\"\",VLOOKUP(C21,verlofEMB,2,0),\"\")","v":""}]
["",null,null,{"$f":"IF(C22<>\"\",VLOOKUP(C22,verlofEMB,2,0),\"\")","v":""}]
["",null,null,{"$f":"IF(C23<>\"\",VLOOKUP(C23,verlofEMB,2,0),\"\")","v":""}]
["",null,null,{"$f":"IF(C24<>\"\",VLOOKUP(C24,verlofEMB,2,0),\"\")","v":""}]
["",null,null,{"$f":"IF(C25<>\"\",VLOOKUP(C25,verlofEMB,2,0),\"\")","v":""}]
["",null,null,{"$f":"IF(C26<>\"\",VLOOKUP(C26,verlofEMB,2,0),\"\")","v":""}]
["",null,null,{"$f":"IF(C27<>\"\",VLOOKUP(C27,verlofEMB,2,0),\"\")","v":""}]
["",null,null,{"$f":"IF(C28<>\"\",VLOOKUP(C28,verlofEMB,2,0),\"\")","v":""}]
["",null,null,{"$f":"IF(C29<>\"\",VLOOKUP(C29,verlofEMB,2,0),\"\")","v":""}]
["",null,null,{"$f":"IF(C30<>\"\",VLOOKUP(C30,verlofEMB,2,0),\"\")","v":""}]
["",null,null,{"$f":"IF(C31<>\"\",VLOOKUP(C31,verlofEMB,2,0),\"\")","v":""}]
["",null,null,{"$f":"IF(C32<>\"\",VLOOKUP(C32,verlofEMB,2,0),\"\")","v":""}]
["",null,null,{"$f":"IF(C33<>\"\",VLOOKUP(C33,verlofEMB,2,0),\"\")","v":""}]
["",null,null,{"$f":"IF(C34<>\"\",VLOOKUP(C34,verlofEMB,2,0),\"\")","v":""}]
["",null,null,{"$f":"IF(C35<>\"\",VLOOKUP(C35,verlofEMB,2,0),\"\")","v":""}]
["",null,null,{"$f":"IF(C36<>\"\",VLOOKUP(C36,verlofEMB,2,0),\"\")","v":""}]
["",null,null,{"$f":"IF(C37<>\"\",VLOOKUP(C37,verlofEMB,2,0),\"\")","v":""}]
["",null,null,{"$f":"IF(C38<>\"\",VLOOKUP(C38,verlofEMB,2,0),\"\")","v":""}]
["",null,null,{"$f":"IF(C39<>\"\",VLOOKUP(C39,verlofEMB,2,0),\"\")","v":""}]
["",null,null,{"$f":"IF(C40<>\"\",VLOOKUP(C40,verlofEMB,2,0),\"\")","v":""}]
["",null,null,{"$f":"IF(C41<>\"\",VLOOKUP(C41,verlofEMB,2,0),\"\")","v":""}]
["",null,null,{"$f":"IF(C42<>\"\",VLOOKUP(C42,verlofEMB,2,0),\"\")","v":""}]
["",null,null,{"$f":"IF(C43<>\"\",VLOOKUP(C43,verlofEMB,2,0),\"\")","v":""}]
["",null,null,{"$f":"IF(C44<>\"\",VLOOKUP(C44,verlofEMB,2,0),\"\")","v":""}]
["",null,null,{"$f":"IF(C45<>\"\",VLOOKUP(C45,verlofEMB,2,0),\"\")","v":""}]
["",null,null,{"$f":"IF(C46<>\"\",VLOOKUP(C46,verlofEMB,2,0),\"\")","v":""}]
["",null,null,{"$f":"IF(C47<>\"\",VLOOKUP(C47,verlofEMB,2,0),\"\")","v":""}]
["",null,null,{"$f":"IF(C48<>\"\",VLOOKUP(C48,verlofEMB,2,0),\"\")","v":""}]
["",null,null,{"$f":"IF(C49<>\"\",VLOOKUP(C49,verlofEMB,2,0),\"\")","v":""}]
["",null,null,{"$f":"IF(C50<>\"\",VLOOKUP(C50,verlofEMB,2,0),\"\")","v":""}]
["",null,null,{"$f":"IF(C51<>\"\",VLOOKUP(C51,verlofEMB,2,0),\"\")","v":""}]
["",null,null,{"$f":"IF(C52<>\"\",VLOOKUP(C52,verlofEMB,2,0),\"\")","v":""}]
["",null,null,{"$f":"IF(C53<>\"\",VLOOKUP(C53,verlofEMB,2,0),\"\")","v":""}]
["",null,null,{"$f":"IF(C54<>\"\",VLOOKUP(C54,verlofEMB,2,0),\"\")","v":""}]
["",null,null,{"$f":"IF(C55<>\"\",VLOOKUP(C55,verlofEMB,2,0),\"\")","v":""}]
["",null,null,{"$f":"IF(C56<>\"\",VLOOKUP(C56,verlofEMB,2,0),\"\")","v":""}]
["",null,null,{"$f":"IF(C57<>\"\",VLOOKUP(C57,verlofEMB,2,0),\"\")","v":""}]
["",null,null,{"$f":"IF(C58<>\"\",VLOOKUP(C58,verlofEMB,2,0),\"\")","v":""}]
["",null,null,{"$f":"IF(C59<>\"\",VLOOKUP(C59,verlofEMB,2,0),\"\")","v":""}]
["",null,null,{"$f":"IF(C60<>\"\",VLOOKUP(C60,verlofEMB,2,0),\"\")","v":""}]
["",null,null,{"$f":"IF(C61<>\"\",VLOOKUP(C61,verlofEMB,2,0),\"\")","v":""}]
["",null,null,{"$f":"IF(C62<>\"\",VLOOKUP(C62,verlofEMB,2,0),\"\")","v":""}]
["",null,null,{"$f":"IF(C63<>\"\",VLOOKUP(C63,verlofEMB,2,0),\"\")","v":""}]
["",null,null,{"$f":"IF(C64<>\"\",VLOOKUP(C64,verlofEMB,2,0),\"\")","v":""}]
["",null,null,{"$f":"IF(C65<>\"\",VLOOKUP(C65,verlofEMB,2,0),\"\")","v":""}]
["",null,null,{"$f":"IF(C66<>\"\",VLOOKUP(C66,verlofEMB,2,0),\"\")","v":""}]
["",null,null,{"$f":"IF(C67<>\"\",VLOOKUP(C67,verlofEMB,2,0),\"\")","v":""}]
["",null,null,{"$f":"IF(C68<>\"\",VLOOKUP(C68,verlofEMB,2,0),\"\")","v":""}]
["",null,null,{"$f":"IF(C69<>\"\",VLOOKUP(C69,verlofEMB,2,0),\"\")","v":""}]
["",null,null,{"$f":"IF(C70<>\"\",VLOOKUP(C70,verlofEMB,2,0),\"\")","v":""}]
["",null,null,{"$f":"IF(C71<>\"\",VLOOKUP(C71,verlofEMB,2,0),\"\")","v":""}]
["",null,null,{"$f":"IF(C72<>\"\",VLOOKUP(C72,verlofEMB,2,0),\"\")","v":""}]
["",null,null,{"$f":"IF(C73<>\"\",VLOOKUP(C73,verlofEMB,2,0),\"\")","v":""}]
["",null,null,{"$f":"IF(C74<>\"\",VLOOKUP(C74,verlofEMB,2,0),\"\")","v":""}]
[{"$f":"IF(B75<>\"\",WEEKNUM(B75),\"\")","v":""},null,null,{"$f":"IF(C75<>\"\",VLOOKUP(C75,verlofEMB,2,0),\"\")","v":""}]
["",null,null,{"$f":"IF(C76<>\"\",VLOOKUP(C76,verlofEMB,2,0),\"\")","v":""}]
["",null,null,{"$f":"IF(C77<>\"\",VLOOKUP(C77,verlofEMB,2,0),\"\")","v":""}]
["",null,null,{"$f":"IF(C78<>\"\",VLOOKUP(C78,verlofEMB,2,0),\"\")","v":""}]
["",null,null,{"$f":"IF(C79<>\"\",VLOOKUP(C79,verlofEMB,2,0),\"\")","v":""}]
["",null,null,{"$f":"IF(C80<>\"\",VLOOKUP(C80,verlofEMB,2,0),\"\")","v":""}]
["",null,null,{"$f":"IF(C81<>\"\",VLOOKUP(C81,verlofEMB,2,0),\"\")","v":""}]
["",null,null,{"$f":"IF(C82<>\"\",VLOOKUP(C82,verlofEMB,2,0),\"\")","v":""}]
["",null,null,{"$f":"IF(C83<>\"\",VLOOKUP(C83,verlofEMB,2,0),\"\")","v":""}]
["",null,null,{"$f":"IF(C84<>\"\",VLOOKUP(C84,verlofEMB,2,0),\"\")","v":""}]
["",null,null,{"$f":"IF(C85<>\"\",VLOOKUP(C85,verlofEMB,2,0),\"\")","v":""}]
["",null,null,{"$f":"IF(C86<>\"\",VLOOKUP(C86,verlofEMB,2,0),\"\")","v":""}]
["",null,null,{"$f":"IF(C87<>\"\",VLOOKUP(C87,verlofEMB,2,0),\"\")","v":""}]
["",null,null,{"$f":"IF(C88<>\"\",VLOOKUP(C88,verlofEMB,2,0),\"\")","v":""}]
["",null,null,{"$f":"IF(C89<>\"\",VLOOKUP(C89,verlofEMB,2,0),\"\")","v":""}]
["",null,null,{"$f":"IF(C90<>\"\",VLOOKUP(C90,verlofEMB,2,0),\"\")","v":""}]
["",null,null,{"$f":"IF(C91<>\"\",VLOOKUP(C91,verlofEMB,2,0),\"\")","v":""}]
["",null,null,{"$f":"IF(C92<>\"\",VLOOKUP(C92,verlofEMB,2,0),\"\")","v":""}]
["",null,null,{"$f":"IF(C93<>\"\",VLOOKUP(C93,verlofEMB,2,0),\"\")","v":""}]
["",null,null,{"$f":"IF(C94<>\"\",VLOOKUP(C94,verlofEMB,2,0),\"\")","v":""}]
["",null,null,{"$f":"IF(C95<>\"\",VLOOKUP(C95,verlofEMB,2,0),\"\")","v":""}]
["",null,null,{"$f":"IF(C96<>\"\",VLOOKUP(C96,verlofEMB,2,0),\"\")","v":""}]
["",null,null,{"$f":"IF(C97<>\"\",VLOOKUP(C97,verlofEMB,2,0),\"\")","v":""}]
["",null,null,{"$f":"IF(C98<>\"\",VLOOKUP(C98,verlofEMB,2,0),\"\")","v":""}]
["",null,null,{"$f":"IF(C99<>\"\",VLOOKUP(C99,verlofEMB,2,0),\"\")","v":""}]
["",null,null,{"$f":"IF(C100<>\"\",VLOOKUP(C100,verlofEMB,2,0),\"\")","v":""}]
["",null,null,{"$f":"IF(C101<>\"\",VLOOKUP(C101,verlofEMB,2,0),\"\")","v":""}]
["",null,null,{"$f":"IF(C102<>\"\",VLOOKUP(C102,verlofEMB,2,0),\"\")","v":""}]
["",null,null,{"$f":"IF(C103<>\"\",VLOOKUP(C103,verlofEMB,2,0),\"\")","v":""}]
["",null,null,{"$f":"IF(C104<>\"\",VLOOKUP(C104,verlofEMB,2,0),\"\")","v":""}]
["",null,null,{"$f":"IF(C105<>\"\",VLOOKUP(C105,verlofEMB,2,0),\"\")","v":""}]
["",null,null,{"$f":"IF(C106<>\"\",VLOOKUP(C106,verlofEMB,2,0),\"\")","v":""}]
["",null,null,{"$f":"IF(C107<>\"\",VLOOKUP(C107,verlofEMB,2,0),\"\")","v":""}]
["",null,null,{"$f":"IF(C108<>\"\",VLOOKUP(C108,verlofEMB,2,0),\"\")","v":""}]
["",null,null,{"$f":"IF(C109<>\"\",VLOOKUP(C109,verlofEMB,2,0),\"\")","v":""}]
["",null,null,{"$f":"IF(C110<>\"\",VLOOKUP(C110,verlofEMB,2,0),\"\")","v":""}]
["",null,null,{"$f":"IF(C111<>\"\",VLOOKUP(C111,verlofEMB,2,0),\"\")","v":""}]
["",null,null,{"$f":"IF(C112<>\"\",VLOOKUP(C112,verlofEMB,2,0),\"\")","v":""}]
["",null,null,{"$f":"IF(C113<>\"\",VLOOKUP(C113,verlofEMB,2,0),\"\")","v":""}]
["",null,null,{"$f":"IF(C114<>\"\",VLOOKUP(C114,verlofEMB,2,0),\"\")","v":""}]
["",null,null,{"$f":"IF(C115<>\"\",VLOOKUP(C115,verlofEMB,2,0),\"\")","v":""}]
["",null,null,{"$f":"IF(C116<>\"\",VLOOKUP(C116,verlofEMB,2,0),\"\")","v":""}]
["",null,null,{"$f":"IF(C117<>\"\",VLOOKUP(C117,verlofEMB,2,0),\"\")","v":""}]
["",null,null,{"$f":"IF(C118<>\"\",VLOOKUP(C118,verlofEMB,2,0),\"\")","v":""}]
["",null,null,{"$f":"IF(C119<>\"\",VLOOKUP(C119,verlofEMB,2,0),\"\")","v":""}]
["",null,null,{"$f":"IF(C120<>\"\",VLOOKUP(C120,verlofEMB,2,0),\"\")","v":""}]
["",null,null,{"$f":"IF(C121<>\"\",VLOOKUP(C121,verlofEMB,2,0),\"\")","v":""}]
["",null,null,{"$f":"IF(C122<>\"\",VLOOKUP(C122,verlofEMB,2,0),\"\")","v":""}]
["",null,null,{"$f":"IF(C123<>\"\",VLOOKUP(C123,verlofEMB,2,0),\"\")","v":""}]
["",null,null,{"$f":"IF(C124<>\"\",VLOOKUP(C124,verlofEMB,2,0),\"\")","v":""}]
["",null,null,{"$f":"IF(C125<>\"\",VLOOKUP(C125,verlofEMB,2,0),\"\")","v":""}]
["",null,null,{"$f":"IF(C126<>\"\",VLOOKUP(C126,verlofEMB,2,0),\"\")","v":""}]
["",null,null,{"$f":"IF(C127<>\"\",VLOOKUP(C127,verlofEMB,2,0),\"\")","v":""}]
["",null,null,{"$f":"IF(C128<>\"\",VLOOKUP(C128,verlofEMB,2,0),\"\")","v":""}]
["",null,null,{"$f":"IF(C129<>\"\",VLOOKUP(C129,verlofEMB,2,0),\"\")","v":""}]
["",null,null,{"$f":"IF(C130<>\"\",VLOOKUP(C130,verlofEMB,2,0),\"\")","v":""}]
["",null,null,{"$f":"IF(C131<>\"\",VLOOKUP(C131,verlofEMB,2,0),\"\")","v":""}]
["",null,null,{"$f":"IF(C132<>\"\",VLOOKUP(C132,verlofEMB,2,0),\"\")","v":""}]
["",null,null,{"$f":"IF(C133<>\"\",VLOOKUP(C133,verlofEMB,2,0),\"\")","v":""}]
["",null,null,{"$f":"IF(C134<>\"\",VLOOKUP(C134,verlofEMB,2,0),\"\")","v":""}]
["",null,null,{"$f":"IF(C135<>\"\",VLOOKUP(C135,verlofEMB,2,0),\"\")","v":""}]
["",null,null,{"$f":"IF(C136<>\"\",VLOOKUP(C136,verlofEMB,2,0),\"\")","v":""}]
["",null,null,{"$f":"IF(C137<>\"\",VLOOKUP(C137,verlofEMB,2,0),\"\")","v":""}]
["",null,null,{"$f":"IF(C138<>\"\",VLOOKUP(C138,verlofEMB,2,0),\"\")","v":""}]
[{"$f":"IF(B139<>\"\",WEEKNUM(B139),\"\")","v":""},null,null,{"$f":"IF(C139<>\"\",VLOOKUP(C139,verlofEMB,2,0),\"\")","v":""}]
["",null,null,{"$f":"IF(C140<>\"\",VLOOKUP(C140,verlofEMB,2,0),\"\")","v":""}]
["",null,null,{"$f":"IF(C141<>\"\",VLOOKUP(C141,verlofEMB,2,0),\"\")","v":""}]
["",null,null,{"$f":"IF(C142<>\"\",VLOOKUP(C142,verlofEMB,2,0),\"\")","v":""}]
["",null,null,{"$f":"IF(C143<>\"\",VLOOKUP(C143,verlofEMB,2,0),\"\")","v":""}]
["",null,null,{"$f":"IF(C144<>\"\",VLOOKUP(C144,verlofEMB,2,0),\"\")","v":""}]
["",null,null,{"$f":"IF(C145<>\"\",VLOOKUP(C145,verlofEMB,2,0),\"\")","v":""}]
["",null,null,{"$f":"IF(C146<>\"\",VLOOKUP(C146,verlofEMB,2,0),\"\")","v":""}]
["",null,null,{"$f":"IF(C147<>\"\",VLOOKUP(C147,verlofEMB,2,0),\"\")","v":""}]
["",null,null,{"$f":"IF(C148<>\"\",VLOOKUP(C148,verlofEMB,2,0),\"\")","v":""}]
["",null,null,{"$f":"IF(C149<>\"\",VLOOKUP(C149,verlofEMB,2,0),\"\")","v":""}]
["",null,null,{"$f":"IF(C150<>\"\",VLOOKUP(C150,verlofEMB,2,0),\"\")","v":""}]
["",null,null,{"$f":"IF(C151<>\"\",VLOOKUP(C151,verlofEMB,2,0),\"\")","v":""}]
["",null,null,{"$f":"IF(C152<>\"\",VLOOKUP(C152,verlofEMB,2,0),\"\")","v":""}]
["",null,null,{"$f":"IF(C153<>\"\",VLOOKUP(C153,verlofEMB,2,0),\"\")","v":""}]
["",null,null,{"$f":"IF(C154<>\"\",VLOOKUP(C154,verlofEMB,2,0),\"\")","v":""}]
["",null,null,{"$f":"IF(C155<>\"\",VLOOKUP(C155,verlofEMB,2,0),\"\")","v":""}]
["",null,null,{"$f":"IF(C156<>\"\",VLOOKUP(C156,verlofEMB,2,0),\"\")","v":""}]
["",null,null,{"$f":"IF(C157<>\"\",VLOOKUP(C157,verlofEMB,2,0),\"\")","v":""}]
["",null,null,{"$f":"IF(C158<>\"\",VLOOKUP(C158,verlofEMB,2,0),\"\")","v":""}]
["",null,null,{"$f":"IF(C159<>\"\",VLOOKUP(C159,verlofEMB,2,0),\"\")","v":""}]
["",null,null,{"$f":"IF(C160<>\"\",VLOOKUP(C160,verlofEMB,2,0),\"\")","v":""}]
["",null,null,{"$f":"IF(C161<>\"\",VLOOKUP(C161,verlofEMB,2,0),\"\")","v":""}]
["",null,null,{"$f":"IF(C162<>\"\",VLOOKUP(C162,verlofEMB,2,0),\"\")","v":""}]
["",null,null,{"$f":"IF(C163<>\"\",VLOOKUP(C163,verlofEMB,2,0),\"\")","v":""}]
["",null,null,{"$f":"IF(C164<>\"\",VLOOKUP(C164,verlofEMB,2,0),\"\")","v":""}]
["",null,null,{"$f":"IF(C165<>\"\",VLOOKUP(C165,verlofEMB,2,0),\"\")","v":""}]
["",null,null,{"$f":"IF(C166<>\"\",VLOOKUP(C166,verlofEMB,2,0),\"\")","v":""}]
["",null,null,{"$f":"IF(C167<>\"\",VLOOKUP(C167,verlofEMB,2,0),\"\")","v":""}]
["",null,null,{"$f":"IF(C168<>\"\",VLOOKUP(C168,verlofEMB,2,0),\"\")","v":""}]
["",null,null,{"$f":"IF(C169<>\"\",VLOOKUP(C169,verlofEMB,2,0),\"\")","v":""}]
["",null,null,{"$f":"IF(C170<>\"\",VLOOKUP(C170,verlofEMB,2,0),\"\")","v":""}]
["",null,null,{"$f":"IF(C171<>\"\",VLOOKUP(C171,verlofEMB,2,0),\"\")","v":""}]
["",null,null,{"$f":"IF(C172<>\"\",VLOOKUP(C172,verlofEMB,2,0),\"\")","v":""}]
["",null,null,{"$f":"IF(C173<>\"\",VLOOKUP(C173,verlofEMB,2,0),\"\")","v":""}]
["",null,null,{"$f":"IF(C174<>\"\",VLOOKUP(C174,verlofEMB,2,0),\"\")","v":""}]
["",null,null,{"$f":"IF(C175<>\"\",VLOOKUP(C175,verlofEMB,2,0),\"\")","v":""}]
["",null,null,{"$f":"IF(C176<>\"\",VLOOKUP(C176,verlofEMB,2,0),\"\")","v":""}]
["",null,null,{"$f":"IF(C177<>\"\",VLOOKUP(C177,verlofEMB,2,0),\"\")","v":""}]
["",null,null,{"$f":"IF(C178<>\"\",VLOOKUP(C178,verlofEMB,2,0),\"\")","v":""}]
["",null,null,{"$f":"IF(C179<>\"\",VLOOKUP(C179,verlofEMB,2,0),\"\")","v":""}]
["",null,null,{"$f":"IF(C180<>\"\",VLOOKUP(C180,verlofEMB,2,0),\"\")","v":""}]
["",null,null,{"$f":"IF(C181<>\"\",VLOOKUP(C181,verlofEMB,2,0),\"\")","v":""}]
["",null,null,{"$f":"IF(C182<>\"\",VLOOKUP(C182,verlofEMB,2,0),\"\")","v":""}]
["",null,null,{"$f":"IF(C183<>\"\",VLOOKUP(C183,verlofEMB,2,0),\"\")","v":""}]
["",null,null,{"$f":"IF(C184<>\"\",VLOOKUP(C184,verlofEMB,2,0),\"\")","v":""}]
["",null,null,{"$f":"IF(C185<>\"\",VLOOKUP(C185,verlofEMB,2,0),\"\")","v":""}]
["",null,null,{"$f":"IF(C186<>\"\",VLOOKUP(C186,verlofEMB,2,0),\"\")","v":""}]
["",null,null,{"$f":"IF(C187<>\"\",VLOOKUP(C187,verlofEMB,2,0),\"\")","v":""}]
["",null,null,{"$f":"IF(C188<>\"\",VLOOKUP(C188,verlofEMB,2,0),\"\")","v":""}]
["",null,null,{"$f":"IF(C189<>\"\",VLOOKUP(C189,verlofEMB,2,0),\"\")","v":""}]
["",null,null,{"$f":"IF(C190<>\"\",VLOOKUP(C190,verlofEMB,2,0),\"\")","v":""}]
["",null,null,{"$f":"IF(C191<>\"\",VLOOKUP(C191,verlofEMB,2,0),\"\")","v":""}]
["",null,null,{"$f":"IF(C192<>\"\",VLOOKUP(C192,verlofEMB,2,0),\"\")","v":""}]
["",null,null,{"$f":"IF(C193<>\"\",VLOOKUP(C193,verlofEMB,2,0),\"\")","v":""}]
["",null,null,{"$f":"IF(C194<>\"\",VLOOKUP(C194,verlofEMB,2,0),\"\")","v":""}]
["",null,null,{"$f":"IF(C195<>\"\",VLOOKUP(C195,verlofEMB,2,0),\"\")","v":""}]
["",null,null,{"$f":"IF(C196<>\"\",VLOOKUP(C196,verlofEMB,2,0),\"\")","v":""}]
["",null,null,{"$f":"IF(C197<>\"\",VLOOKUP(C197,verlofEMB,2,0),\"\")","v":""}]
["",null,null,{"$f":"IF(C198<>\"\",VLOOKUP(C198,verlofEMB,2,0),\"\")","v":""}]
["",null,null,{"$f":"IF(C199<>\"\",VLOOKUP(C199,verlofEMB,2,0),\"\")","v":""}]
["",null,null,{"$f":"IF(C200<>\"\",VLOOKUP(C200,verlofEMB,2,0),\"\")","v":""}]
["",null,null,{"$f":"IF(C201<>\"\",VLOOKUP(C201,verlofEMB,2,0),\"\")","v":""}]
["",null,null,{"$f":"IF(C202<>\"\",VLOOKUP(C202,verlofEMB,2,0),\"\")","v":""}]
[{"$f":"IF(B203<>\"\",WEEKNUM(B203),\"\")","v":""},null,null,{"$f":"IF(C203<>\"\",VLOOKUP(C203,verlofEMB,2,0),\"\")","v":""}]
["",null,null,{"$f":"IF(C204<>\"\",VLOOKUP(C204,verlofEMB,2,0),\"\")","v":""}]
["",null,null,{"$f":"IF(C205<>\"\",VLOOKUP(C205,verlofEMB,2,0),\"\")","v":""}]
["",null,null,{"$f":"IF(C206<>\"\",VLOOKUP(C206,verlofEMB,2,0),\"\")","v":""}]
["",null,null,{"$f":"IF(C207<>\"\",VLOOKUP(C207,verlofEMB,2,0),\"\")","v":""}]
["",null,null,{"$f":"IF(C208<>\"\",VLOOKUP(C208,verlofEMB,2,0),\"\")","v":""}]
["",null,null,{"$f":"IF(C209<>\"\",VLOOKUP(C209,verlofEMB,2,0),\"\")","v":""}]
["",null,null,{"$f":"IF(C210<>\"\",VLOOKUP(C210,verlofEMB,2,0),\"\")","v":""}]
["",null,null,{"$f":"IF(C211<>\"\",VLOOKUP(C211,verlofEMB,2,0),\"\")","v":""}]
["",null,null,{"$f":"IF(C212<>\"\",VLOOKUP(C212,verlofEMB,2,0),\"\")","v":""}]
["",null,null,{"$f":"IF(C213<>\"\",VLOOKUP(C213,verlofEMB,2,0),\"\")","v":""}]
["",null,null,{"$f":"IF(C214<>\"\",VLOOKUP(C214,verlofEMB,2,0),\"\")","v":""}]
["",null,null,{"$f":"IF(C215<>\"\",VLOOKUP(C215,verlofEMB,2,0),\"\")","v":""}]
["",null,null,{"$f":"IF(C216<>\"\",VLOOKUP(C216,verlofEMB,2,0),\"\")","v":""}]
["",null,null,{"$f":"IF(C217<>\"\",VLOOKUP(C217,verlofEMB,2,0),\"\")","v":""}]
["",null,null,{"$f":"IF(C218<>\"\",VLOOKUP(C218,verlofEMB,2,0),\"\")","v":""}]
["",null,null,{"$f":"IF(C219<>\"\",VLOOKUP(C219,verlofEMB,2,0),\"\")","v":""}]
["",null,null,{"$f":"IF(C220<>\"\",VLOOKUP(C220,verlofEMB,2,0),\"\")","v":""}]
["",null,null,{"$f":"IF(C221<>\"\",VLOOKUP(C221,verlofEMB,2,0),\"\")","v":""}]
["",null,null,{"$f":"IF(C222<>\"\",VLOOKUP(C222,verlofEMB,2,0),\"\")","v":""}]
["",null,null,{"$f":"IF(C223<>\"\",VLOOKUP(C223,verlofEMB,2,0),\"\")","v":""}]
["",null,null,{"$f":"IF(C224<>\"\",VLOOKUP(C224,verlofEMB,2,0),\"\")","v":""}]
["",null,null,{"$f":"IF(C225<>\"\",VLOOKUP(C225,verlofEMB,2,0),\"\")","v":""}]
["",null,null,{"$f":"IF(C226<>\"\",VLOOKUP(C226,verlofEMB,2,0),\"\")","v":""}]
["",null,null,{"$f":"IF(C227<>\"\",VLOOKUP(C227,verlofEMB,2,0),\"\")","v":""}]
["",null,null,{"$f":"IF(C228<>\"\",VLOOKUP(C228,verlofEMB,2,0),\"\")","v":""}]
["",null,null,{"$f":"IF(C229<>\"\",VLOOKUP(C229,verlofEMB,2,0),\"\")","v":""}]
["",null,null,{"$f":"IF(C230<>\"\",VLOOKUP(C230,verlofEMB,2,0),\"\")","v":""}]
["",null,null,{"$f":"IF(C231<>\"\",VLOOKUP(C231,verlofEMB,2,0),\"\")","v":""}]
["",null,null,{"$f":"IF(C232<>\"\",VLOOKUP(C232,verlofEMB,2,0),\"\")","v":""}]
["",null,null,{"$f":"IF(C233<>\"\",VLOOKUP(C233,verlofEMB,2,0),\"\")","v":""}]
["",null,null,{"$f":"IF(C234<>\"\",VLOOKUP(C234,verlofEMB,2,0),\"\")","v":""}]
[null,null,null,{"$f":"IF(C235<>\"\",VLOOKUP(C235,verlofEMB,2,0),\"\")","v":""}]
[null,null,null,{"$f":"IF(C236<>\"\",VLOOKUP(C236,verlofEMB,2,0),\"\")","v":""}]
[null,null,null,{"$f":"IF(C237<>\"\",VLOOKUP(C237,verlofEMB,2,0),\"\")","v":""}]
[null,null,null,{"$f":"IF(C238<>\"\",VLOOKUP(C238,verlofEMB,2,0),\"\")","v":""}]
[null,null,null,{"$f":"IF(C239<>\"\",VLOOKUP(C239,verlofEMB,2,0),\"\")","v":""}]
[null,null,null,{"$f":"IF(C240<>\"\",VLOOKUP(C240,verlofEMB,2,0),\"\")","v":""}]
[null,null,null,{"$f":"IF(C241<>\"\",VLOOKUP(C241,verlofEMB,2,0),\"\")","v":""}]
[null,null,null,{"$f":"IF(C242<>\"\",VLOOKUP(C242,verlofEMB,2,0),\"\")","v":""}]
[null,null,null,{"$f":"IF(C243<>\"\",VLOOKUP(C243,verlofEMB,2,0),\"\")","v":""}]
[null,null,null,{"$f":"IF(C244<>\"\",VLOOKUP(C244,verlofEMB,2,0),\"\")","v":""}]
[null,null,null,{"$f":"IF(C245<>\"\",VLOOKUP(C245,verlofEMB,2,0),\"\")","v":""}]
[null,null,null,{"$f":"IF(C246<>\"\",VLOOKUP(C246,verlofEMB,2,0),\"\")","v":""}]
[null,null,null,{"$f":"IF(C247<>\"\",VLOOKUP(C247,verlofEMB,2,0),\"\")","v":""}]
[null,null,null,{"$f":"IF(C248<>\"\",VLOOKUP(C248,verlofEMB,2,0),\"\")","v":""}]
[null,null,null,{"$f":"IF(C249<>\"\",VLOOKUP(C249,verlofEMB,2,0),\"\")","v":""}]
[null,null,null,{"$f":"IF(C250<>\"\",VLOOKUP(C250,verlofEMB,2,0),\"\")","v":""}]

{"sheet":"EMB jaaroverzicht","index":6,"n_rows":53,"n_cols":18,"rows_kept":53,"cut":false,"hidden":false,"merged":[]}
[]
[]
[null,"50/2019",null,"1900-01-02","2019-12-09","Week nr.50","1900-01-03","2019-12-10","Week nr.50","1900-01-04","2019-12-11","Week nr.50","1900-01-05","2019-12-12","Week nr.50","1900-01-06","2019-12-13","Week nr.50"]
["Afdeling","Verlof","FTE","Vroeg","Laat","Nacht","Vroeg","Laat","Nacht","Vroeg","Laat","Nacht","Vroeg","Laat","Nacht","Vroeg","Laat","Nacht"]
["TLPALL",null,null,"06:00/14:45","14:45/23:30","22:00/06:45","06:00/14:45","14:45/23:30","22:00/06:45","06:00/14:45","14:45/23:30","22:00/06:45","06:00/14:45","14:45/23:30","22:00/06:45","06:00/14:45","14:45/23:30","22:00/06:45"]
[null,null,1,"Hilko Achternaam505",null,null,"Hilko Achternaam596",null,null,"Hilko Achternaam696",null,null,"Hilko Achternaam790",null,null,"Hilko Achternaam888"]
[null,null,2]
[null,null,3]
[null,null,4]
[null,null,5]
[null,null,6]
[null,null,7]
[null,null,8]
["PALME",null,"WERKTIIJDEN","06:00/14:45","14:45/23:30","22:00/06:45","06:00/14:45","14:45/23:30","22:00/06:45","06:00/14:45","14:45/23:30","22:00/06:45","06:00/14:45","14:45/23:30","22:00/06:45","06:00/14:45","14:45/23:30","22:00/06:45"]
[null,null,1,"Wenaron Achternaam467","Latie Achternaam513",null,"Wenaron Achternaam561","Latie Achternaam605",null,"Wenaron Achternaam656","Latie Achternaam703",null,"Wenaron Achternaam753","Latie Achternaam797",null,"Wenaron Achternaam847","Latie Achternaam895"]
[null,null,2,"Salahadin Achternaam468","Abdurahman Ibrahim Achternaam514",null,"Salahadin Achternaam562","Abdurahman Ibrahim Achternaam606",null,"Salahadin Achternaam657","Abdurahman Ibrahim Achternaam704",null,"Salahadin Achternaam754","Abdurahman Ibrahim Achternaam798",null,"Salahadin Achternaam848","Abdurahman Ibrahim Achternaam896"]
[null,null,3,"Dikkie Achternaam469","Michael Achternaam515",null,"Dikkie Achternaam563","Michael Achternaam607",null,"Dikkie Achternaam658","Michael Achternaam705",null,"Dikkie Achternaam755","Michael Achternaam799",null,"Dikkie Achternaam849","Michael Achternaam897"]
[null,null,4,"Rene Achternaam470","Hans Achternaam516",null,"Rene Achternaam564","Hans Achternaam608",null,"Rene Achternaam659","Hans Achternaam706",null,"Rene Achternaam756","Hans Achternaam800",null,"Rene Achternaam850","Hans Achternaam898"]
[null,null,5,"Richard Achternaam471","Jeroen Achternaam517",null,"Richard Achternaam565","Jeroen Achternaam609",null,"Richard Achternaam660","Jeroen Achternaam707",null,"Richard Achternaam757","Jeroen Achternaam801",null,"Richard Achternaam851","Jeroen Achternaam899"]
[null,null,6]
[null,null,7]
[null,null,8]
["PALRW",null,"WERKTIIJDEN","06:00/14:45","13:45/22:30","22:00/06:45","06:00/14:45","13:45/22:30","22:00/06:45","06:00/14:45","13:45/22:30","22:00/06:45","06:00/14:45","13:45/22:30","22:00/06:45","06:00/14:45","13:45/22:30","22:00/06:45"]
[null,null,1,"Felicia Achternaam472","Akela Achternaam518",null,"Shawn Achternaam566","Akela Achternaam610",null,"Felicia Achternaam661","Akela Achternaam708",null,"Elroy Achternaam758","Akela Achternaam802",null,"Felicia Achternaam852","Akela Achternaam900"]
[null,null,2,"Shawn Achternaam473","Karrar Achternaam519",null,"Elroy Achternaam567","Karrar Achternaam611",null,"Elroy Achternaam662","Karrar Achternaam709",null,"Arsenio Achternaam759","Karrar Achternaam803",null,"Jelte Achternaam853","Karrar Achternaam901"]
[null,null,3,"Elroy Achternaam474","Sebastian Achternaam520",null,"Arsenio Achternaam568","Sebastian Achternaam612",null,"Arsenio Achternaam663","Sebastian Achternaam710",null,"Viorel Achternaam760","Chevindio Achternaam804",null,"Shawn Achternaam854","Sebastian Achternaam902"]
[null,null,4,"Swen Achternaam475","Harry Achternaam521",null,"Viorel Achternaam569","Chevindio Achternaam613",null,"Viorel Achternaam664","Chevindio Achternaam711",null,"Olcay Achternaam761","Haben Achternaam805",null,"Elroy Achternaam855","Harry Achternaam903"]
[null,null,5,"Arsenio Achternaam476","Apollonia Achternaam522",null,"Olcay Achternaam570","Harry Achternaam614",null,"Olcay Achternaam665","Harry Achternaam712",null,"Sebastiaan Achternaam762","Harry Achternaam806",null,"Arsenio Achternaam856","Apollonia Achternaam904"]
[null,null,6,"Henk Achternaam492","Gebrehiwet Achternaam549",null,"Henk Achternaam584","Amanuel Achternaam641",null,"Henk Achternaam681","Nexhmedi Achternaam729",null,"Henk Achternaam778","Nexhmedi Achternaam823",null,"Henk Achternaam873","Amanuel Achternaam932"]
[null,null,7]
["TRSP",null,null,"06:00/14:45","14:45/23:30","22:00/06:45","06:00/14:45","14:45/23:30","22:00/06:45","06:00/14:45","14:45/23:30","22:00/06:45","06:00/14:45","14:45/23:30","22:00/06:45","06:00/14:45","14:45/23:30","22:00/06:45"]
[null,null,1,"Anton Achternaam502","Emsud Achternaam546",null,"Anton Achternaam593","Emsud Achternaam639",null,"Anton Achternaam693","Emsud Achternaam742",null,"Anton Achternaam787","Emsud Achternaam835",null,"Anton Achternaam885","Emsud Achternaam930"]
[null,null,2,"Henk Achternaam503","Reinder Achternaam547",null,"Henk Achternaam594","Reinder Achternaam640",null,"Henk Achternaam694","Reinder Achternaam743",null,"Henk Achternaam788","Reinder Achternaam836",null,"Henk Achternaam886","Reinder Achternaam931"]
[null,null,3,"Harrie Achternaam506",null,null,"Harrie Achternaam597",null,null,"Harrie Achternaam697",null,null,"Harrie Achternaam791",null,null,"Harrie Achternaam889"]
[null,null,4]
[null,null,5]
[null,null,6]
[null,null,7]
["PALHAS",null,null,"06:00/14:45","14:45/23:30","22:00/06:45","06:00/14:45","14:45/23:30","22:00/06:45","06:00/14:45","14:45/23:30","22:00/06:45","06:00/14:45","14:45/23:30","22:00/06:45","06:00/14:45","14:45/23:30","22:00/06:45"]
[null,null,1,"Henk Achternaam466",null,null,"Henk Achternaam560",null,null,"Henk Achternaam655",null,null,"Henk Achternaam752",null,null,"Henk Achternaam846"]
[null,null,2]
[null,null,3]
[null,null,4]
[null,null,5]
[null,null,6]
[null,null,7]
["RESER",null,null,"06:00/14:45","14:45/23:30","22:00/06:45","06:00/14:45","14:45/23:30","22:00/06:45","06:00/14:45","14:45/23:30","22:00/06:45","06:00/14:45","14:45/23:30","22:00/06:45","06:00/14:45","14:45/23:30","22:00/06:45"]
[null,null,1,"Robin Achternaam493","Bereket Achternaam550",null,"Fars Achternaam599","Haben Achternaam642",null,"Shawn Achternaam682","Tomas Achternaam730",null,null,"Sebastian Achternaam824",null,"Olcay Achternaam874","Bereket Achternaam933"]
[null,null,2,null,null,null,null,"Bereket Achternaam643",null,"Fars Achternaam683","Heruy Achternaam731",null,null,"Amanuel Achternaam825",null,"Mebrathu Achternaam875","Robel Achternaam935"]
[null,null,3,null,null,null,null,"Robel Achternaam645",null,"Mebrathu Achternaam684","Tesfaldet Achternaam732",null,null,null,null,"Daniel Achternaam876"]
[null,null,4,null,null,null,null,null,null,null,"Laszlo Achternaam733"]
[null,null,5,null,null,null,null,null,null,null,"Gebrehiwet Achternaam734"]
[null,null,6]