{"text_format":"1","workbook":"xlsx","n_sheets":38,"sheets":["LadenLossen (34)","Werkuren","LadenLossen (01)","Dagtaken (01)","Dag-taken week (49)","LadenLossen (49)","LadenLossen (48)","Dag-taken week (48)","Blad1","LadenLossen (41)","Dag-taken week (41)","LadenLossen (40)","Dag-taken week (40)","LadenLossen (39)","Dag-taken week (39)","LadenLossen (38)","Dag-taken week (38)","LadenLossen (37)","Dag-taken week (37)","LadenLossen (36)","Dag-taken week (36)","LadenLossen (35)","Dag-taken week (35)","Dag-taken week (23)","Dag-taken week (24)","Dag-taken week (25)","LadenLossen (33)","Dag-taken week (34)","Dag-taken week (33)","Dag-taken week (32)","Dag-taken week (31)","Dag-taken week (30)","Dag-taken week (29)","Dag-taken week (26)","Dag-taken week (27)","Dag-taken week (28)","Landen","Blad3"],"not_rendered":{"charts":0,"images":38,"macros":1,"external_links":1,"defined_names":2,"comments":3,"pivot_tables":0},"unopened":[],"bounds":{"document_bytes":16777216,"sheet_cells":100000,"rows_first":2000,"rows_last":500,"rows_between":2000,"halvings":0,"cell_chars":16384,"cell_head_chars":4096},"cells_cut":0,"cells_raw":0,"read":"whole","date_system":"1900"}

{"sheet":"LadenLossen (34)","index":0,"n_rows":49,"n_cols":17,"rows_kept":49,"cut":false,"hidden":true,"merged":[[0,1,0,7],[0,13,0,15],[3,13,3,15],[4,1,5,4],[4,5,5,7],[6,19,6,20],[7,11,7,12],[7,17,7,18],[7,19,7,20],[8,11,8,12],[8,17,8,18],[8,19,8,20],[6,17,6,18],[9,11,9,12],[9,17,9,18],[9,19,9,20],[10,11,10,12],[10,17,10,18],[10,19,10,20],[11,11,11,12],[11,17,11,18],[11,19,11,20],[12,11,12,12],[12,17,12,18],[12,19,12,20],[13,11,13,12],[13,17,13,18],[13,19,13,20],[14,11,14,12],[14,17,14,18],[14,19,14,20],[15,11,15,12],[15,17,15,18],[15,19,15,20],[16,11,16,12],[16,17,16,18],[16,19,16,20],[17,11,17,12],[17,17,17,18],[17,19,17,20],[18,11,18,12],[18,17,18,18],[18,19,18,20],[19,11,19,12],[19,17,19,18],[19,19,19,20],[20,11,20,12],[20,17,20,18],[20,19,20,20],[21,11,21,12],[21,17,21,18],[21,19,21,20],[22,11,22,12],[22,17,22,18],[22,19,22,20],[23,11,23,12],[23,17,23,18],[23,19,23,20],[24,11,24,12],[24,17,24,18],[24,19,24,20],[25,11,25,12],[25,17,25,18],[25,19,25,20],[26,11,26,12],[26,17,26,18],[26,19,26,20],[29,11,29,12],[29,17,29,18],[29,19,29,20],[27,11,27,12],[27,17,27,18],[27,19,27,20],[28,11,28,12],[28,17,28,18],[28,19,28,20]]}
["02:00:00","Laden/lossen (beschikbaarheidstijd (behalve bij Rood ))",null,null,null,null,null,null,null,"Week 34",null,null,null,"   = zelf laden/lossen"]
[]
[]
[null,null,null,null,null,null,null,null,null,"Totaal",null,null,null,"Wachturen laden/lossen"]
[null," Laden",null,null,null,"Lossen",null,null,null,"Laden","Lossen","Totaal uren",null,"Laden",null,"Lossen","Totaal uren"]
["Nr.",null,null,null,null,null,null,null,null,{"$f":"SUM(J8:J49)","v":0.20704861110910616},{"$f":"SUM(K8:K49)","v":7.9201388893125113E-2},{"$f":"J6+K6","v":0.28625000000223128},null,{"$f":"SUM(N8:N25)","v":8.8912037036304056E-2},null,{"$f":"SUM(P8:P25)","v":0},{"$f":"N6+P6","v":8.8912037036304056E-2}]
[0,"begin",null,"eind",null,"begin",null,"eind"]
[1,null,null,null,null,"2015-08-18T10:39:08",null,"2015-08-18T10:56:11",null,{"$f":"IF(D8<>\"\",IF(D8-B8>TIME(2,0,0),TIME(2,0,0),D8-B8),\"\")","v":""},{"$f":"IF(H8<>\"\",IF((H8-F8)>TIME(2,0,0),TIME(2,0,0),H8-F8),\"\")","v":1.1840277780720498E-2},null,null,{"$f":"IF(D8-B8>TIME(2,0,0),D8-B8-TIME(2,0,0),\"\")","v":""},null,{"$f":"IF((H8-F8)>TIME(2,0,0),H8-F8-TIME(2,0,0),\"\")","v":""}]
[2,"2015-08-18T10:57:12",null,"2015-08-18T12:02:19",null,null,null,null,null,4.5219907406135462E-2,"",null,null,"",null,""]
[3,"2015-08-19T07:02:04",null,"2015-08-19T08:26:05",null,null,null,null,null,5.8344907411083113E-2,"",null,null,"",null,""]
[4,null,null,null,null,"2015-08-20T07:02:52",null,"2015-08-20T08:26:52",null,"",5.8333333334303461E-2,null,null,"",null,""]
[5,"2015-08-21T06:34:34",null,"2015-08-21T10:42:36",null,null,null,null,null,8.3333333333333329E-2,"",null,null,8.8912037036304056E-2,null,""]
[6,"2015-08-22T07:50:43",null,"2015-08-22T08:19:44",null,null,null,null,null,2.0150462958554272E-2,"",null,null,"",null,""]
[7,null,null,null,null,"2015-08-23T06:29:38",null,"2015-08-23T06:42:38",null,"",9.0277777781011537E-3,null,null,"",null,""]
[null,null,null,null,null,null,null,null,null,"","",null,null,"",null,""]
[null,null,null,null,null,null,null,null,null,{"$f":"IF(D16<>\"\",IF(D16-B16>TIME(2,0,0),TIME(2,0,0),D16-B16),\"\")","v":""},"",null,null,"",null,""]
[null,null,null,null,null,null,null,null,null,"","",null,null,"",null,""]
[null,null,null,null,null,null,null,null,null,"","",null,null,"",null,""]
[null,null,null,null,null,null,null,null,null,"","",null,null,"",null,""]
[null,null,null,null,null,null,null,null,null,"","",null,null,"",null,""]
[null,null,null,null,null,null,null,null,null,"","",null,null,"",null,""]
[null,null,null,null,null,null,null,null,null,"","",null,null,"",null,""]
[null,null,null,null,null,null,null,null,null,"","",null,null,"",null,""]
[null,null,null,null,null,null,null,null,null,"","",null,null,"",null,""]
[null,null,null,null,null,null,null,null,null,"","",{"$f":"IF(H25<>\"\",H25-F25,\"\")","v":""},null,"",null,""]
[null,null,null,null,null,null,null,null,null,{"$f":"IF(D26<>\"\",D26-B26,\"\")","v":""},{"$f":"IF(H26<>\"\",H26-F26,\"\")","v":""},""]
[null,null,null,null,null,null,null,null,null,"","",""]
[null,null,null,null,null,null,null,null,null,"","",""]
[null,null,null,null,null,null,null,null,null,"","",""]
[null,null,null,null,null,null,null,null,null,"","",""]
[null,null,null,null,null,null,null,null,null,"",""]
[null,null,null,null,null,null,null,null,null,"",""]
[null,null,null,null,null,null,null,null,null,"",""]
[null,null,null,null,null,null,null,null,null,"",""]
[null,null,null,null,null,null,null,null,null,"",""]
[null,null,null,null,null,null,null,null,null,"",""]
[null,null,null,null,null,null,null,null,null,"",""]
[null,null,null,null,null,null,null,null,null,"",""]
[null,null,null,null,null,null,null,null,null,"",""]
[null,null,null,null,null,null,null,null,null,"",""]
[null,null,null,null,null,null,null,null,null,"",""]
[null,null,null,null,null,null,null,null,null,"",""]
[null,null,null,null,null,null,null,null,null,"",""]
[null,null,null,null,null,null,null,null,null,"",""]
[null,null,null,null,null,null,null,null,null,"",""]
[null,null,null,null,null,null,null,null,null,"",""]
[null,null,null,null,null,null,null,null,null,"",""]
[null,null,null,null,null,null,null,null,null,"",""]
[null,null,null,null,null,null,null,null,null,"",""]

{"sheet":"Werkuren","index":1,"n_rows":68,"n_cols":24,"rows_kept":68,"cut":false,"hidden":false,"merged":[[1,7,3,7],[62,3,62,5],[0,22,5,22],[6,1,8,21],[0,21,5,21],[0,20,5,20],[1,16,2,16],[1,10,5,10],[1,14,5,14],[1,15,5,15],[1,12,5,12],[1,17,3,17],[3,18,5,18],[1,13,5,13],[1,5,4,5],[1,11,5,11],[1,19,5,19],[63,0,63,7],[4,7,5,7],[67,0,67,7],[65,0,65,7],[1,9,5,9],[34,3,34,5],[35,0,35,7],[37,0,37,7],[48,3,48,5],[49,0,49,7],[20,3,20,5],[21,0,21,7],[23,0,23,7],[1,8,5,8],[1,6,4,6],[51,0,51,7]]}
[3.75,null,null,null,null,1.875,"1900-01-02T02:20:00",null,"14:19:00",null,null,null,null,null,null,null,null,null,null,null,"Week  ver- bruik","Weekend- rust tekort     ( ja)    (nee)","Kilometer- stand         start rit ",1.875]
[null,null," =  ","Ziekteverzuim",null,"Start","Einde","Totaal    tijd",null,"Niet vergoede tijd","Werktijd  zelf Laden/Lossen/tanken/ duane/Les volgen","I + K    =  AT","Niet zelf Laden/Lossen Beschikbaar-heidstijd            = BT","Rest tijd = file stoppen/  starten, garage  enz….","Totale betaalde werktijd       + gewaarborgd loon","Wachttijd buiten de    2 uur bij laden/lossen, enz",null,"Nach-ten",null,"Ver-  plaat -sing",null,null,null,"ok"]
[null,3," =  ","Verlof"]
[null,null," =  ","Zaterdagen",null,null,null,null,null,null,null,null,null,null,null,null,"+  11 uur",null," rijtijd voor rest week"]
[null,null," =  ","Zon/Feestdag",null,null,null,{"$f":"NOW()","v":42368.22114386574}]
[null,"Einde land",null,"Weekdag"," =",null,"Maaltijdcheques ",null,null,null,null,null,null,null,null,null,"-  11 uur"]
[null,"                                                    "]
[]
[]
[]
[null,null,null,"Zaterdag",1,"2015-12-13T05:05:00","2015-12-13T14:00:00",{"$f":"G11-F11","v":0.37152777778101154},0.125,null,null,{"$f":"I11+K11+N11","v":0.125},null,null,{"$f":"L11+M11+P11","v":0.125},null,null,null,0.32916666666666666,1,null,"(-) 00"]
[null,null,null,"Week 01"]
[]
[null,null,null,"Maandag",1,"2016-01-05","2016-01-05",{"$f":"G14-F14","v":0},null,null,null,{"$f":"I14+K14+N14","v":0},null,null,{"$f":"L14+M14+P14","v":0},null,{"$f":"F14-G11","v":22.416666666664241},null,{"$f":"MIN(\"56:00:00\",A1-I8)","v":2.3333333333333335},1,null,{"$f":"IF(Q14<X1,X1-Q14,X2)","v":"ok"}]
[null,null,null,"Dinsdag",1,"2016-01-06","2016-01-06",0,null,null,null,{"$f":"I15+K15+N15","v":0},null,null,0,null,{"$f":"F15-G14","v":1},null,{"$f":"S14-I14","v":2.3333333333333335},{"$f":"IF(R15=1,0,1)","v":1},null,"(-) 00"]
[null,null,null,"Woensdag",1,"2016-01-07","2016-01-07",0,null,null,null,{"$f":"I16+K16+N16","v":0},null,null,0,null,1,null,2.3333333333333335,{"$f":"IF(R16=1,0,1)","v":1},null,"(-) 00"]
[null,null,null,"Donderdag",1,"2016-01-08","2016-01-08",0,null,null,null,{"$f":"I17+K17+N17","v":0},null,null,0,null,1,null,2.3333333333333335,{"$f":"IF(R17=1,0,1)","v":1},null,"(-) 00"]
[null,null,null,"Vrijdag",1,"2016-01-09","2016-01-09",0,null,null,null,{"$f":"I18+K18+N18","v":0},null,null,0,null,1,null,2.3333333333333335,{"$f":"IF(R18=1,0,1)","v":1},null,"(-) 00"]
[null,null,null,"Zaterdag",1,"2016-01-10","2016-01-10",0,null,null,null,{"$f":"(I19+K19+N19)*150%","v":0},null,null,0,null,1,null,2.3333333333333335,1,null,"(-) 00"]
[null,null,null,"Zondag",null,"2016-01-11","2016-01-11",0,null,null,null,{"$f":"I20+K20+N20","v":0},null,null,0,null,1,null,2.3333333333333335,{"$f":"IF(R20=1,0,1)","v":1},null,"(-) 00"]
[null,null,null,{"$f":"E19+E14+E15+E16+E17+E20+E18","v":6}]
["Totaal week 01",null,null,null,null,null,null,null,{"$f":"I20+I19+I18+I17+I16+I15+I14","v":0},0,0,0,0,0,0,null,null,{"$f":"R16+R20+R19+R18+R17+R14+R15","v":0},null,{"$f":"T16+T20+T19+T18+T17+T14+T15","v":7}]
[]
["uittreksel (01) Totaal (week 01) Januari '20",null,null,null,null,null,null,null,{"$f":"I22","v":0},0,0,0,0,0,{"$f":"M24+L24+P24","v":0},{"$f":"P15+P14+P16+P17+P18+P19+P20","v":0},null,{"$f":"R22","v":0},null,{"$f":"T22","v":7}]
[]
[null,null,null,"Week 02"]
[]
[null,null,null,"Maandag",1,"2016-01-12","2016-01-12",{"$f":"G28-F28","v":0},null,null,null,{"$f":"I28+K28+N28","v":0},null,null,{"$f":"L28+M28+P28","v":0},null,1.4166666666666667,null,{"$f":"MIN(\"56:00:00\",A1-I22)","v":2.3333333333333335},1,null,{"$f":"IF(Q28<X1,X1-Q28,X2)","v":0.45833333333333326}]
[null,null,null,"Dinsdag",1,"2016-01-13","2016-01-13",0,null,null,null,0,null,null,0,null,0.79166666666666663,null,{"$f":"S28-I28","v":2.3333333333333335},{"$f":"IF(R29=1,0,1)","v":1},null,{"$f":"IF(Q29>\"20:00:01\",V28,X2)","v":"ok"}]
[null,null,null,"Woensdag",1,"2016-01-14","2016-01-14",0,null,null,null,0,null,null,0,null,{"$f":"F30-G29","v":1},null,2.3333333333333335,{"$f":"IF(R30=1,0,1)","v":1},null,{"$f":"IF(Q30>\"20:00:01\",V29,X2)","v":"ok"}]
[null,null,null,"Donderdag",1,"2016-01-15","2016-01-15",0,null,null,null,0,null,null,0,null,1,null,2.3333333333333335,{"$f":"IF(R31=1,0,1)","v":1},null,{"$f":"IF(Q31>\"20:00:01\",V30,X2)","v":"ok"}]
[null,null,null,"Vrijdag",1,"2016-01-16","2016-01-16",0,null,null,null,0,null,null,0,null,1,null,2.3333333333333335,{"$f":"IF(R32=1,0,1)","v":1},null,{"$f":"IF(Q32>\"20:00:01\",V31,X2)","v":"ok"}]
[null,null,null,"Zaterdag",1,"2016-01-17","2016-01-17",0,null,null,null,0,null,null,0,null,1,null,2.3333333333333335,1,null,{"$f":"IF(Q33>\"20:00:01\",V32,X2)","v":"ok"}]
[null,null,null,"Zondag",null,"2016-01-18","2016-01-18",0,null,null,null,0,null,null,0,null,1,null,2.3333333333333335,{"$f":"IF(R34=1,0,1)","v":1},null,{"$f":"IF(Q34>\"20:00:01\",V33,X2)","v":"ok"}]
[null,null,null,{"$f":"E33+E28+E29+E30+E31+E34+E32","v":6}]
["Totaal week 02",null,null,null,null,null,null,null,{"$f":"I34+I33+I32+I31+I30+I29+I28","v":0},0,0,0,0,0,0,null,null,{"$f":"R30+R34+R33+R32+R31+R28+R29","v":0},null,{"$f":"T30+T34+T33+T32+T31+T28+T29","v":7}]
[]
["uittreksel (02) Totaal (week 02) Januari '20",null,null,null,null,null,null,null,{"$f":"I36","v":0},0,0,0,0,0,{"$f":"M38+L38+P38","v":0},{"$f":"P29+P28+P30+P31+P32+P33+P34","v":0},null,{"$f":"R36","v":0},null,{"$f":"T36","v":7}]
[]
[null,null,null,"Week 03"]
[]
[null,null,null,"Maandag",1,"2016-01-19","2016-01-19",{"$f":"G42-F42","v":0},null,null,null,{"$f":"I42+K42+N42","v":0},null,null,{"$f":"L42+M42+P42","v":0},null,{"$f":"F42-G32","v":3},null,{"$f":"MIN(\"56:00:00\",A1-I36)","v":2.3333333333333335},1,null,{"$f":"IF(Q42<X1,X1-Q42,X2)","v":"ok"}]
[null,null,null,"Dinsdag",1,"2016-01-20","2016-01-20",0,null,null,null,0,null,null,0,null,{"$f":"F43-G42","v":1},null,{"$f":"S42-I42","v":2.3333333333333335},{"$f":"IF(R43=1,0,1)","v":1},null,"(-) 00"]
[null,null,null,"Woensdag",1,"2016-01-21","2016-01-21",0,null,null,null,0,null,null,0,null,1,null,2.3333333333333335,{"$f":"IF(R44=1,0,1)","v":1},null,"(-) 00"]
[null,null,null,"Donderdag",1,"2016-01-22","2016-01-22",0,null,null,null,0,null,null,0,null,1,null,2.3333333333333335,{"$f":"IF(R45=1,0,1)","v":1},null,"(-) 00"]
[null,null,null,"Vrijdag",1,"2016-01-23","2016-01-23",0,null,null,null,0,null,null,0,null,1,null,2.3333333333333335,{"$f":"IF(R46=1,0,1)","v":1},null,"(-) 00"]
[null,null,null,"Zaterdag",1,"2016-01-24","2016-01-24",0,null,null,null,0,null,null,0,null,1,null,2.3333333333333335,1,null,"(-) 00"]
[null,null,null,"Zondag",null,"2016-01-25","2016-01-25",0,null,null,null,0,null,null,0,null,1,null,2.3333333333333335,{"$f":"IF(R48=1,0,1)","v":1},null,"(-) 00"]
[null,null,null,{"$f":"E47+E42+E43+E44+E45+E48+E46","v":6}]
["Totaal week 03",null,null,null,null,null,null,null,{"$f":"I48+I47+I46+I45+I44+I43+I42","v":0},0,0,0,0,0,0,null,null,{"$f":"R44+R48+R47+R46+R45+R42+R43","v":0},null,{"$f":"T44+T48+T47+T46+T45+T42+T43","v":7}]
[]
["uittreksel (03) Totaal (week 03) Januari '20",null,null,null,null,null,null,null,{"$f":"I50","v":0},0,0,0,0,0,{"$f":"M52+L52+P52","v":0},{"$f":"P43+P42+P44+P45+P46+P47+P48","v":0},null,{"$f":"R50","v":0},null,{"$f":"T50","v":7}]
[]
[null,null,null,"Week 04"]
[]
[null,null,null,"Maandag",1,"2016-01-26","2016-01-26",{"$f":"G56-F56","v":0},null,null,null,{"$f":"I56+K56+N56","v":0},null,null,{"$f":"L56+M56+P56","v":0},null,{"$f":"F56-G46","v":3},null,{"$f":"MIN(\"56:00:00\",A1-I50)","v":2.3333333333333335},1,null,{"$f":"IF(Q56<X1,X1-Q56,X2)","v":"ok"}]
[null,null,null,"Dinsdag",1,"2016-01-27","2016-01-27",0,null,null,null,0,null,null,0,null,{"$f":"F57-G56","v":1},null,{"$f":"S56-I56","v":2.3333333333333335},{"$f":"IF(R57=1,0,1)","v":1},null,"(-) 00"]
[null,null,null,"Woensdag",1,"2016-01-28","2016-01-28",0,null,null,null,0,null,null,0,null,1,null,2.3333333333333335,{"$f":"IF(R58=1,0,1)","v":1},null,"(-) 00"]
[null,null,null,"Donderdag",1,"2016-01-29","2016-01-29",0,null,null,null,0,null,null,0,null,1,null,2.3333333333333335,{"$f":"IF(R59=1,0,1)","v":1},null,"(-) 00"]
[null,null,null,"Vrijdag",1,"2016-01-30","2016-01-30",0,null,null,null,0,null,null,0,null,1,null,2.3333333333333335,{"$f":"IF(R60=1,0,1)","v":1},null,"(-) 00"]
[null,null,null,"Zaterdag",1,"2016-01-31","2016-01-31",0,null,null,null,0,null,null,0,null,1,null,2.3333333333333335,1,null,"(-) 00"]
[null,null,null,"Zondag",null,"2016-02-01","2016-02-01",0,null,null,null,0,null,null,0,null,1,null,2.3333333333333335,{"$f":"IF(R62=1,0,1)","v":1},null,"(-) 00"]
[null,null,null,{"$f":"E61+E56+E57+E58+E59+E62+E60","v":6}]
["Totaal week 04",null,null,null,null,null,null,null,{"$f":"I62+I61+I60+I59+I58+I57+I56","v":0},0,0,0,0,0,0,null,null,{"$f":"R58+R62+R61+R60+R59+R56+R57","v":0},null,{"$f":"T58+T62+T61+T60+T59+T56+T57","v":7}]
[]
["uittreksel (04) Totaal (week 04) Januari/Februari '20",null,null,null,null,null,null,null,{"$f":"I64","v":0},0,0,0,0,0,{"$f":"M66+L66+P66","v":0},{"$f":"P57+P56+P58+P59+P60+P61+P62","v":0},null,{"$f":"R64","v":0},null,{"$f":"T64","v":7}]
[]
["Maandgegevens  Januari '20",null,null,null,null,null,null,null,{"$f":"I66+I52+I38+I24","v":0},{"$f":"J66+J52+J38+J24","v":0},0,0,0,0,0,0,null,{"$f":"R66+R52+R38+R24","v":0},null,{"$f":"T66+T52+T38+T24","v":28}]

{"sheet":"LadenLossen (01)","index":2,"n_rows":50,"n_cols":17,"rows_kept":50,"cut":false,"hidden":false,"merged":[[6,19,6,20],[0,1,0,7],[0,13,0,15],[3,13,3,15],[4,1,5,4],[4,5,5,7],[6,17,6,18]]}
["02:00:00","Laden/lossen (beschikbaarheidstijd (behalve bij Rood ))",null,null,null,null,null,null,null,"Week 01",null,null,null,"   = zelf laden/lossen"]
[]
[]
[null,null,null,null,null,null,null,null,null,"Totaal",null,null,null,"Wachturen laden/lossen"]
[null," Laden",null,null,null,"Lossen",null,null,null,"Laden","Lossen","Totaal uren",null,"Laden",null,"Lossen","Totaal uren"]
["Nr.",null,null,null,null,null,null,null,null,{"$f":"SUM(J8:J46)","v":0},{"$f":"SUM(K8:K46)","v":0},{"$f":"J6+K6","v":0},null,{"$f":"SUM(N8:N46)","v":0},null,{"$f":"SUM(P8:P46)","v":0},{"$f":"N6+P6","v":0}]
[0,"begin",null,"eind",null,"begin",null,"eind"]
[]
[]
[]
[]
[]
[]
[null,null,null,null,null,null,null,null,null,{"$f":"IF(D14<>\"\",IF(D14-B14>TIME(2,0,0),TIME(2,0,0),D14-B14),\"\")","v":""},{"$f":"IF(H14<>\"\",IF(H14-F14>TIME(2,0,0),TIME(2,0,0),H14-F14),\"\")","v":""},null,null,{"$f":"IF(D14-B14>TIME(2,0,0),D14-B14-TIME(2,0,0),\"\")","v":""},null,{"$f":"IF((H14-F14)>TIME(2,0,0),H14-F14-TIME(2,0,0),\"\")","v":""}]
[null,null,null,null,null,null,null,null,null,"","",null,null,"",null,""]
[null,null,null,null,null,null,null,null,null,"","",null,null,""]
[null,null,null,null,null,null,null,null,null,{"$f":"IF(D17<>\"\",IF(D17-B17>TIME(2,0,0),TIME(2,0,0),D17-B17),\"\")","v":""},{"$f":"IF(H17<>\"\",IF(H17-F17>TIME(2,0,0),TIME(2,0,0),H17-F17),\"\")","v":""},null,null,{"$f":"IF(D17-B17>TIME(2,0,0),D17-B17-TIME(2,0,0),\"\")","v":""}]
[null,null,null,null,null,null,null,null,null,"","",null,null,"",null,{"$f":"IF((H18-F18)>TIME(2,0,0),H18-F18-TIME(2,0,0),\"\")","v":""}]
[null,null,null,null,null,null,null,null,null,"","",null,null,"",null,{"$f":"IF((H19-F19)>TIME(2,0,0),H19-F19-TIME(2,0,0),\"\")","v":""}]
[null,null,null,null,null,null,null,null,null,"","",null,null,"",null,{"$f":"IF((H20-F20)>TIME(2,0,0),H20-F20-TIME(2,0,0),\"\")","v":""}]
[null,null,null,null,null,null,null,null,null,"","",null,null,"",null,{"$f":"IF((H21-F21)>TIME(2,0,0),H21-F21-TIME(2,0,0),\"\")","v":""}]
[null,null,null,null,null,null,null,null,null,"","",null,null,"",null,{"$f":"IF((H22-F22)>TIME(2,0,0),H22-F22-TIME(2,0,0),\"\")","v":""}]
[null,null,null,null,null,null,null,null,null,"","",null,null,"",null,{"$f":"IF((H23-F23)>TIME(2,0,0),H23-F23-TIME(2,0,0),\"\")","v":""}]
[null,null,null,null,null,null,null,null,null,"","",null,null,"",null,""]
[null,null,null,null,null,null,null,null,null,"","",null,null,"",null,""]
[null,null,null,null,null,null,null,null,null,"","",null,null,"",null,""]
[null,null,null,null,null,null,null,null,null,"","",null,null,"",null,""]
[null,null,null,null,null,null,null,null,null,"","",null,null,"",null,""]
[null,null,null,null,null,null,null,null,null,"","",null,null,"",null,""]
[null,null,null,null,null,null,null,null,null,"","",null,null,"",null,""]
[null,null,null,null,null,null,null,null,null,"","",null,null,"",null,""]
[null,null,null,null,null,null,null,null,null,"","",null,null,"",null,""]
[null,null,null,null,null,null,null,null,null,"","",null,null,"",null,""]
[null,null,null,null,null,null,null,null,null,"","",null,null,"",null,""]
[null,null,null,null,null,null,null,null,null,"","",null,null,"",null,""]
[null,null,null,null,null,null,null,null,null,"","",null,null,"",null,""]
[null,null,null,null,null,null,null,null,null,"","",null,null,"",null,""]
[null,null,null,null,null,null,null,null,null,"","",null,null,"",null,""]
[null,null,null,null,null,null,null,null,null,"","",null,null,"",null,""]
[null,null,null,null,null,null,null,null,null,"","",null,null,"",null,""]
[null,null,null,null,null,null,null,null,null,"","",null,null,"",null,""]
[null,null,null,null,null,null,null,null,null,"","",null,null,"",null,""]
[null,null,null,null,null,null,null,null,null,"","",null,null,"",null,""]
[null,null,null,null,null,null,null,null,null,"","",null,null,"",null,""]
[null,null,null,null,null,null,null,null,null,"","",null,null,"",null,""]
[null,null,null,null,null,null,null,null,null,"","",null,null,"",null,""]
[null,null,null,null,null,null,null,null,null,"","",null,null,"",null,""]
[null,null,null,null,null,null,null,null,null,"","",null,null,"",null,""]
[null,null,null,null,null,null,null,null,null,"","",null,null,"",null,""]
[null,null,null,null,null,null,null,null,null,"","",null,null,"",null,""]

{"sheet":"Dagtaken (01)","index":3,"n_rows":400,"n_cols":22,"rows_kept":400,"cut":false,"hidden":false,"merged":[]}
[null,"samenvatting","Dag-taken ",null,null,null,null,null,null,null,null,null,null,null,null,null,null,"samenvatting"]
[null,null,"tanken",null,"aan/afkoppelen",null,"wachten instructie",null,"wachten koppelchauffeur",null,"Totaal",{"$f":"V2","v":"wachten koppelchauf"},null,null,null,null,null,"week","tanken","koppelen","wachten instructie","wachten koppelchauf"]
["week","datum","Begintijd","Eindtijd","Begintijd","Eindtijd","Begintijd","Eindtijd","Begintijd","Eindtijd","tanken","aan/afkoppelen","wachten instructie","wachten koppelchauffeur",null,null,null,1,{"$f":"IF(R3<>\"\",SUMIF($A4:$A18,$R3,K4:K18),\"\")","v":0},{"$f":"IF(S3<>\"\",SUMIF($A4:$A18,$R3,L4:L18),\"\")","v":0},0,0]
[{"$f":"IF(B4<>\"\",_xlfn.ISOWEEKNUM(B4),\"\")","v":""},null,null,null,null,null,null,null,null,null,{"$f":"IF(D4<>\"\",D4-C4,\"\")","v":""},{"$f":"IF(F4<>\"\",F4-E4,\"\")","v":""},{"$f":"IF(H4<>\"\",H4-G4,\"\")","v":""},{"$f":"IF(J4<>\"\",J4-I4,\"\")","v":""},null,null,null,2,{"$f":"IF(R4<>\"\",SUMIF($A5:$A19,$R4,K5:K19),\"\")","v":0},{"$f":"IF(S4<>\"\",SUMIF($A5:$A19,$R4,L5:L19),\"\")","v":0},{"$f":"IF(T4<>\"\",SUMIF($A5:$A19,$R4,M5:M19),\"\")","v":0},{"$f":"IF(U4<>\"\",SUMIF($A5:$A19,$R4,N5:N19),\"\")","v":0}]
[{"$f":"IF(B5<>\"\",_xlfn.ISOWEEKNUM(B5),\"\")","v":""},null,null,null,null,null,null,null,null,null,{"$f":"IF(D5<>\"\",D5-C5,\"\")","v":""},{"$f":"IF(F5<>\"\",F5-E5,\"\")","v":""},{"$f":"IF(H5<>\"\",H5-G5,\"\")","v":""},{"$f":"IF(J5<>\"\",J5-I5,\"\")","v":""},null,null,null,null,"","","",""]
["",null,null,null,null,null,null,null,null,null,"","","","",null,null,null,null,"","","",""]
["",null,null,null,null,null,null,null,null,null,"","","","",null,null,null,null,"","","",""]
["",null,null,null,null,null,null,null,null,null,"","","","",null,null,null,null,"","","",""]
["",null,null,null,null,null,null,null,null,null,"","","","",null,null,null,null,"","","",""]
["",null,null,null,null,null,null,null,null,null,"","","","",null,null,null,null,"","","",""]
["",null,null,null,null,null,null,null,null,null,"","","","",null,null,null,null,"","","",""]
["",null,null,null,null,null,null,null,null,null,"","","","",null,null,null,null,"","","",""]
["",null,null,null,null,null,null,null,null,null,"","","","",null,null,null,null,"","","",""]
["",null,null,null,null,null,null,null,null,null,null,null,"","",null,null,null,null,"","","",""]
["",null,null,null,null,null,null,null,null,null,null,null,"","",null,null,null,null,"","","",""]
["",null,null,null,null,null,null,null,null,null,null,null,"","",null,null,null,null,"","","",""]
["",null,null,null,null,null,null,null,null,null,{"$f":"IF(D17<>\"\",D17-C17,\"\")","v":""},{"$f":"IF(F17<>\"\",F17-E17,\"\")","v":""},"","",null,null,null,null,"","","",""]
["",null,null,null,null,null,null,null,null,null,"","",{"$f":"IF(H18<>\"\",H18-G18,\"\")","v":""},{"$f":"IF(J18<>\"\",J18-I18,\"\")","v":""},null,null,null,null,"","","",""]
["",null,null,null,null,null,null,null,null,null,"","","","",null,null,null,null,"","","",""]
["",null,null,null,null,null,null,null,null,null,"","","","",null,null,null,null,"","","",""]
["",null,null,null,null,null,null,null,null,null,"","","","",null,null,null,null,"","","",""]
["",null,null,null,null,null,null,null,null,null,"","","","",null,null,null,null,"","","",""]
["",null,null,null,null,null,null,null,null,null,"","","","",null,null,null,null,"","","",""]
["",null,null,null,null,null,null,null,null,null,"","","","",null,null,null,null,"","","",""]
["",null,null,null,null,null,null,null,null,null,"","","","",null,null,null,null,"","","",""]
["",null,null,null,null,null,null,null,null,null,"","","","",null,null,null,null,"","","",""]
["",null,null,null,null,null,null,null,null,null,null,null,"","",null,null,null,null,"","","",""]
["",null,null,null,null,null,null,null,null,null,null,null,"","",null,null,null,null,"","","",""]
["",null,null,null,null,null,null,null,null,null,null,null,"","",null,null,null,null,"","","",""]
["",null,null,null,null,null,null,null,null,null,{"$f":"IF(D30<>\"\",D30-C30,\"\")","v":""},{"$f":"IF(F30<>\"\",F30-E30,\"\")","v":""},"","",null,null,null,null,"","","",""]
["",null,null,null,null,null,null,null,null,null,"","","","",null,null,null,null,"","","",""]
["",null,null,null,null,null,null,null,null,null,"","","","",null,null,null,null,"","","",""]
["",null,null,null,null,null,null,null,null,null,"","","","",null,null,null,null,"","","",""]
["",null,null,null,null,null,null,null,null,null,"","","","",null,null,null,null,"","","",""]
["",null,null,null,null,null,null,null,null,null,"","","","",null,null,null,null,"","","",""]
["",null,null,null,null,null,null,null,null,null,"","","","",null,null,null,null,"","","",""]
["",null,null,null,null,null,null,null,null,null,"","","","",null,null,null,null,"","","",""]
["",null,null,null,null,null,null,null,null,null,"","","","",null,null,null,null,"","","",""]
["",null,null,null,null,null,null,null,null,null,"","","","",null,null,null,null,"","","",""]
["",null,null,null,null,null,null,null,null,null,null,null,"","",null,null,null,null,"","","",""]
["",null,null,null,null,null,null,null,null,null,null,null,"","",null,null,null,null,"","","",""]
["",null,null,null,null,null,null,null,null,null,null,null,"","",null,null,null,null,"","","",""]
["",null,null,null,null,null,null,null,null,null,{"$f":"IF(D43<>\"\",D43-C43,\"\")","v":""},{"$f":"IF(F43<>\"\",F43-E43,\"\")","v":""},"","",null,null,null,null,"","","",""]
["",null,null,null,null,null,null,null,null,null,"","","","",null,null,null,null,"","","",""]
["",null,null,null,null,null,null,null,null,null,"","","","",null,null,null,null,"","","",""]
["",null,null,null,null,null,null,null,null,null,"","","","",null,null,null,null,"","","",""]
["",null,null,null,null,null,null,null,null,null,"","","","",null,null,null,null,"","","",""]
["",null,null,null,null,null,null,null,null,null,"","","","",null,null,null,null,"","","",""]
["",null,null,null,null,null,null,null,null,null,"","","","",null,null,null,null,"","","",""]
["",null,null,null,null,null,null,null,null,null,"","","","",null,null,null,null,"","","",""]
["",null,null,null,null,null,null,null,null,null,{"$f":"IF(D51<>\"\",D51-C51,\"\")","v":""},{"$f":"IF(F51<>\"\",F51-E51,\"\")","v":""},{"$f":"IF(H51<>\"\",H51-G51,\"\")","v":""},{"$f":"IF(J51<>\"\",J51-I51,\"\")","v":""},null,null,null,null,"","","",""]
["",null,null,null,null,null,null,null,null,null,"","","","",null,null,null,null,"","","",""]
["",null,null,null,null,null,null,null,null,null,"","","","",null,null,null,null,"","","",""]
["",null,null,null,null,null,null,null,null,null,"","","","",null,null,null,null,"","","",""]
["",null,null,null,null,null,null,null,null,null,"","","","",null,null,null,null,"","","",""]
["",null,null,null,null,null,null,null,null,null,"","","","",null,null,null,null,"","","",""]
["",null,null,null,null,null,null,null,null,null,"","","","",null,null,null,null,"","","",""]
["",null,null,null,null,null,null,null,null,null,"","","","",null,null,null,null,"","","",""]
["",null,null,null,null,null,null,null,null,null,"","","","",null,null,null,null,"","","",""]
["",null,null,null,null,null,null,null,null,null,"","","","",null,null,null,null,"","","",""]
["",null,null,null,null,null,null,null,null,null,"","","","",null,null,null,null,"","","",""]
["",null,null,null,null,null,null,null,null,null,"","","","",null,null,null,null,"","","",""]
["",null,null,null,null,null,null,null,null,null,"","","","",null,null,null,null,"","","",""]
["",null,null,null,null,null,null,null,null,null,"","","","",null,null,null,null,"","","",""]
["",null,null,null,null,null,null,null,null,null,"","","","",null,null,null,null,"","","",""]
["",null,null,null,null,null,null,null,null,null,"","","","",null,null,null,null,"","","",""]
["",null,null,null,null,null,null,null,null,null,"","","","",null,null,null,null,"","","",""]
["",null,null,null,null,null,null,null,null,null,"","","","",null,null,null,null,{"$f":"IF(R68<>\"\",SUMIF($A69:$A83,$R68,K69:K83),\"\")","v":""},{"$f":"IF(S68<>\"\",SUMIF($A69:$A83,$R68,L69:L83),\"\")","v":""},{"$f":"IF(T68<>\"\",SUMIF($A69:$A83,$R68,M69:M83),\"\")","v":""},{"$f":"IF(U68<>\"\",SUMIF($A69:$A83,$R68,N69:N83),\"\")","v":""}]
[{"$f":"IF(B69<>\"\",_xlfn.ISOWEEKNUM(B69),\"\")","v":""},null,null,null,null,null,null,null,null,null,"","","","",null,null,null,null,"","","",""]
["",null,null,null,null,null,null,null,null,null,"","","","",null,null,null,null,"","","",""]
["",null,null,null,null,null,null,null,null,null,"","","","",null,null,null,null,"","","",""]
["",null,null,null,null,null,null,null,null,null,"","","","",null,null,null,null,"","","",""]
["",null,null,null,null,null,null,null,null,null,"","","","",null,null,null,null,"","","",""]
["",null,null,null,null,null,null,null,null,null,"","","","",null,null,null,null,"","","",""]
["",null,null,null,null,null,null,null,null,null,"","","","",null,null,null,null,"","","",""]
["",null,null,null,null,null,null,null,null,null,"","","","",null,null,null,null,"","","",""]
["",null,null,null,null,null,null,null,null,null,"","","","",null,null,null,null,"","","",""]
["",null,null,null,null,null,null,null,null,null,"","","","",null,null,null,null,"","","",""]
["",null,null,null,null,null,null,null,null,null,{"$f":"IF(D79<>\"\",D79-C79,\"\")","v":""},{"$f":"IF(F79<>\"\",F79-E79,\"\")","v":""},{"$f":"IF(H79<>\"\",H79-G79,\"\")","v":""},{"$f":"IF(J79<>\"\",J79-I79,\"\")","v":""},null,null,null,null,"","","",""]
["",null,null,null,null,null,null,null,null,null,"","","","",null,null,null,null,"","","",""]
["",null,null,null,null,null,null,null,null,null,"","","","",null,null,null,null,"","","",""]
["",null,null,null,null,null,null,null,null,null,"","","","",null,null,null,null,"","","",""]
["",null,null,null,null,null,null,null,null,null,"","","","",null,null,null,null,"","","",""]
["",null,null,null,null,null,null,null,null,null,"","","","",null,null,null,null,"","","",""]
["",null,null,null,null,null,null,null,null,null,"","","","",null,null,null,null,"","","",""]
["",null,null,null,null,null,null,null,null,null,"","","","",null,null,null,null,"","","",""]
["",null,null,null,null,null,null,null,null,null,"","","","",null,null,null,null,"","","",""]
["",null,null,null,null,null,null,null,null,null,"","","","",null,null,null,null,"","","",""]
["",null,null,null,null,null,null,null,null,null,"","","","",null,null,null,null,"","","",""]
["",null,null,null,null,null,null,null,null,null,"","","","",null,null,null,null,"","","",""]
["",null,null,null,null,null,null,null,null,null,"","","","",null,null,null,null,"","","",""]
["",null,null,null,null,null,null,null,null,null,"","","","",null,null,null,null,"","","",""]
["",null,null,null,null,null,null,null,null,null,"","","","",null,null,null,null,"","","",""]
["",null,null,null,null,null,null,null,null,null,"","","","",null,null,null,null,"","","",""]
["",null,null,null,null,null,null,null,null,null,"","","","",null,null,null,null,"","","",""]
["",null,null,null,null,null,null,null,null,null,"","","","",null,null,null,null,"","","",""]
["",null,null,null,null,null,null,null,null,null,"","","","",null,null,null,null,"","","",""]
["",null,null,null,null,null,null,null,null,null,"","","","",null,null,null,null,"","","",""]
["",null,null,null,null,null,null,null,null,null,"","","","",null,null,null,null,"","","",""]
["",null,null,null,null,null,null,null,null,null,"","","","",null,null,null,null,"","","",""]
["",null,null,null,null,null,null,null,null,null,"","","","",null,null,null,null,"","","",""]
["",null,null,null,null,null,null,null,null,null,"","","","",null,null,null,null,"","","",""]
["",null,null,null,null,null,null,null,null,null,"","","","",null,null,null,null,"","","",""]
["",null,null,null,null,null,null,null,null,null,"","","","",null,null,null,null,"","","",""]
["",null,null,null,null,null,null,null,null,null,"","","","",null,null,null,null,"","","",""]
["",null,null,null,null,null,null,null,null,null,"","","","",null,null,null,null,"","","",""]
["",null,null,null,null,null,null,null,null,null,"","","","",null,null,null,null,"","","",""]
["",null,null,null,null,null,null,null,null,null,"","","","",null,null,null,null,"","","",""]
["",null,null,null,null,null,null,null,null,null,"","","","",null,null,null,null,"","","",""]
["",null,null,null,null,null,null,null,null,null,"","","","",null,null,null,null,"","","",""]
["",null,null,null,null,null,null,null,null,null,"","","","",null,null,null,null,"","","",""]
["",null,null,null,null,null,null,null,null,null,"","","","",null,null,null,null,"","","",""]
["",null,null,null,null,null,null,null,null,null,"","","","",null,null,null,null,"","","",""]
["",null,null,null,null,null,null,null,null,null,"","","","",null,null,null,null,"","","",""]
["",null,null,null,null,null,null,null,null,null,"","","","",null,null,null,null,"","","",""]
["",null,null,null,null,null,null,null,null,null,"","","","",null,null,null,null,"","","",""]
["",null,null,null,null,null,null,null,null,null,"","","","",null,null,null,null,"","","",""]
["",null,null,null,null,null,null,null,null,null,"","","","",null,null,null,null,"","","",""]
["",null,null,null,null,null,null,null,null,null,"","","","",null,null,null,null,"","","",""]
["",null,null,null,null,null,null,null,null,null,"","","","",null,null,null,null,"","","",""]
["",null,null,null,null,null,null,null,null,null,"","","","",null,null,null,null,"","","",""]
["",null,null,null,null,null,null,null,null,null,null,null,{"$f":"IF(H122<>\"\",H122-G122,\"\")","v":""},{"$f":"IF(J122<>\"\",J122-I122,\"\")","v":""},null,null,null,null,"","","",""]
["",null,null,null,null,null,null,null,null,null,null,null,"","",null,null,null,null,"","","",""]
["",null,null,null,null,null,null,null,null,null,null,null,"","",null,null,null,null,"","","",""]
["",null,null,null,null,null,null,null,null,null,null,null,"","",null,null,null,null,"","","",""]
["",null,null,null,null,null,null,null,null,null,null,null,"","",null,null,null,null,"","","",""]
["",null,null,null,null,null,null,null,null,null,null,null,"","",null,null,null,null,"","","",""]
["",null,null,null,null,null,null,null,null,null,null,null,"","",null,null,null,null,"","","",""]
["",null,null,null,null,null,null,null,null,null,null,null,"","",null,null,null,null,"","","",""]
["",null,null,null,null,null,null,null,null,null,null,null,"","",null,null,null,null,"","","",""]
["",null,null,null,null,null,null,null,null,null,null,null,"","",null,null,null,null,"","","",""]
["",null,null,null,null,null,null,null,null,null,null,null,"","",null,null,null,null,{"$f":"IF(R132<>\"\",SUMIF($A133:$A147,$R132,K133:K147),\"\")","v":""},{"$f":"IF(S132<>\"\",SUMIF($A133:$A147,$R132,L133:L147),\"\")","v":""},{"$f":"IF(T132<>\"\",SUMIF($A133:$A147,$R132,M133:M147),\"\")","v":""},{"$f":"IF(U132<>\"\",SUMIF($A133:$A147,$R132,N133:N147),\"\")","v":""}]
[{"$f":"IF(B133<>\"\",_xlfn.ISOWEEKNUM(B133),\"\")","v":""},null,null,null,null,null,null,null,null,null,null,null,{"$f":"IF(H133<>\"\",H133-G133,\"\")","v":""},{"$f":"IF(J133<>\"\",J133-I133,\"\")","v":""},null,null,null,null,"","","",""]
["",null,null,null,null,null,null,null,null,null,null,null,"","",null,null,null,null,"","","",""]
["",null,null,null,null,null,null,null,null,null,null,null,"","",null,null,null,null,"","","",""]
["",null,null,null,null,null,null,null,null,null,null,null,"","",null,null,null,null,"","","",""]
["",null,null,null,null,null,null,null,null,null,null,null,"","",null,null,null,null,"","","",""]
["",null,null,null,null,null,null,null,null,null,null,null,"","",null,null,null,null,"","","",""]
["",null,null,null,null,null,null,null,null,null,null,null,"","",null,null,null,null,"","","",""]
["",null,null,null,null,null,null,null,null,null,null,null,"","",null,null,null,null,"","","",""]
["",null,null,null,null,null,null,null,null,null,null,null,"","",null,null,null,null,"","","",""]
["",null,null,null,null,null,null,null,null,null,null,null,"","",null,null,null,null,"","","",""]
["",null,null,null,null,null,null,null,null,null,null,null,"","",null,null,null,null,"","","",""]
["",null,null,null,null,null,null,null,null,null,null,null,"","",null,null,null,null,"","","",""]
["",null,null,null,null,null,null,null,null,null,null,null,"","",null,null,null,null,"","","",""]
["",null,null,null,null,null,null,null,null,null,null,null,"","",null,null,null,null,"","","",""]
["",null,null,null,null,null,null,null,null,null,null,null,"","",null,null,null,null,"","","",""]
["",null,null,null,null,null,null,null,null,null,null,null,"","",null,null,null,null,"","","",""]
["",null,null,null,null,null,null,null,null,null,null,null,"","",null,null,null,null,"","","",""]
["",null,null,null,null,null,null,null,null,null,null,null,"","",null,null,null,null,"","","",""]
["",null,null,null,null,null,null,null,null,null,null,null,"","",null,null,null,null,"","","",""]
["",null,null,null,null,null,null,null,null,null,null,null,"","",null,null,null,null,"","","",""]
["",null,null,null,null,null,null,null,null,null,null,null,"","",null,null,null,null,"","","",""]
["",null,null,null,null,null,null,null,null,null,null,null,"","",null,null,null,null,"","","",""]
["",null,null,null,null,null,null,null,null,null,null,null,"","",null,null,null,null,"","","",""]
["",null,null,null,null,null,null,null,null,null,null,null,"","",null,null,null,null,"","","",""]
["",null,null,null,null,null,null,null,null,null,null,null,"","",null,null,null,null,"","","",""]
["",null,null,null,null,null,null,null,null,null,null,null,"","",null,null,null,null,"","","",""]
["",null,null,null,null,null,null,null,null,null,null,null,"","",null,null,null,null,"","","",""]
["",null,null,null,null,null,null,null,null,null,null,null,"","",null,null,null,null,"","","",""]
["",null,null,null,null,null,null,null,null,null,null,null,"","",null,null,null,null,"","","",""]
["",null,null,null,null,null,null,null,null,null,null,null,"","",null,null,null,null,"","","",""]
["",null,null,null,null,null,null,null,null,null,null,null,"","",null,null,null,null,"","","",""]
["",null,null,null,null,null,null,null,null,null,null,null,"","",null,null,null,null,"","","",""]
["",null,null,null,null,null,null,null,null,null,null,null,"","",null,null,null,null,"","","",""]
["",null,null,null,null,null,null,null,null,null,null,null,"","",null,null,null,null,"","","",""]
["",null,null,null,null,null,null,null,null,null,null,null,"","",null,null,null,null,"","","",""]
["",null,null,null,null,null,null,null,null,null,null,null,"","",null,null,null,null,"","","",""]
["",null,null,null,null,null,null,null,null,null,null,null,"","",null,null,null,null,"","","",""]
["",null,null,null,null,null,null,null,null,null,null,null,"","",null,null,null,null,"","","",""]
["",null,null,null,null,null,null,null,null,null,null,null,"","",null,null,null,null,"","","",""]
["",null,null,null,null,null,null,null,null,null,null,null,"","",null,null,null,null,"","","",""]
["",null,null,null,null,null,null,null,null,null,null,null,"","",null,null,null,null,"","","",""]
["",null,null,null,null,null,null,null,null,null,null,null,"","",null,null,null,null,"","","",""]
["",null,null,null,null,null,null,null,null,null,null,null,"","",null,null,null,null,"","","",""]
["",null,null,null,null,null,null,null,null,null,null,null,"","",null,null,null,null,"","","",""]
["",null,null,null,null,null,null,null,null,null,null,null,"","",null,null,null,null,"","","",""]
["",null,null,null,null,null,null,null,null,null,null,null,"","",null,null,null,null,"","","",""]
["",null,null,null,null,null,null,null,null,null,null,null,"","",null,null,null,null,"","","",""]
["",null,null,null,null,null,null,null,null,null,null,null,"","",null,null,null,null,"","","",""]
["",null,null,null,null,null,null,null,null,null,null,null,"","",null,null,null,null,"","","",""]
["",null,null,null,null,null,null,null,null,null,null,null,"","",null,null,null,null,"","","",""]
["",null,null,null,null,null,null,null,null,null,null,null,"","",null,null,null,null,"","","",""]
["",null,null,null,null,null,null,null,null,null,null,null,"","",null,null,null,null,"","","",""]
["",null,null,null,null,null,null,null,null,null,null,null,"","",null,null,null,null,"","","",""]
["",null,null,null,null,null,null,null,null,null,null,null,"","",null,null,null,null,"","","",""]
["",null,null,null,null,null,null,null,null,null,null,null,"","",null,null,null,null,"","","",""]
["",null,null,null,null,null,null,null,null,null,null,null,"","",null,null,null,null,"","","",""]
["",null,null,null,null,null,null,null,null,null,null,null,"","",null,null,null,null,"","","",""]
["",null,null,null,null,null,null,null,null,null,null,null,"","",null,null,null,null,"","","",""]
["",null,null,null,null,null,null,null,null,null,null,null,"","",null,null,null,null,"","","",""]
["",null,null,null,null,null,null,null,null,null,null,null,"","",null,null,null,null,"","","",""]
["",null,null,null,null,null,null,null,null,null,null,null,"","",null,null,null,null,"","","",""]
["",null,null,null,null,null,null,null,null,null,null,null,"","",null,null,null,null,"","","",""]
["",null,null,null,null,null,null,null,null,null,null,null,"","",null,null,null,null,"","","",""]
["",null,null,null,null,null,null,null,null,null,null,null,"","",null,null,null,null,{"$f":"IF(R196<>\"\",SUMIF($A197:$A211,$R196,K197:K211),\"\")","v":""},{"$f":"IF(S196<>\"\",SUMIF($A197:$A211,$R196,L197:L211),\"\")","v":""},{"$f":"IF(T196<>\"\",SUMIF($A197:$A211,$R196,M197:M211),\"\")","v":""},{"$f":"IF(U196<>\"\",SUMIF($A197:$A211,$R196,N197:N211),\"\")","v":""}]
[{"$f":"IF(B197<>\"\",_xlfn.ISOWEEKNUM(B197),\"\")","v":""},null,null,null,null,null,null,null,null,null,null,null,{"$f":"IF(H197<>\"\",H197-G197,\"\")","v":""},{"$f":"IF(J197<>\"\",J197-I197,\"\")","v":""},null,null,null,null,"","","",""]
["",null,null,null,null,null,null,null,null,null,null,null,"","",null,null,null,null,"","","",""]
["",null,null,null,null,null,null,null,null,null,null,null,"","",null,null,null,null,"","","",""]
["",null,null,null,null,null,null,null,null,null,null,null,"","",null,null,null,null,"","","",""]
["",null,null,null,null,null,null,null,null,null,null,null,"","",null,null,null,null,"","","",""]
["",null,null,null,null,null,null,null,null,null,null,null,"","",null,null,null,null,"","","",""]
["",null,null,null,null,null,null,null,null,null,null,null,"","",null,null,null,null,"","","",""]
["",null,null,null,null,null,null,null,null,null,null,null,"","",null,null,null,null,"","","",""]
["",null,null,null,null,null,null,null,null,null,null,null,"","",null,null,null,null,"","","",""]
["",null,null,null,null,null,null,null,null,null,null,null,"","",null,null,null,null,"","","",""]
["",null,null,null,null,null,null,null,null,null,null,null,"","",null,null,null,null,"","","",""]
["",null,null,null,null,null,null,null,null,null,null,null,"","",null,null,null,null,"","","",""]
["",null,null,null,null,null,null,null,null,null,null,null,"","",null,null,null,null,"","","",""]
["",null,null,null,null,null,null,null,null,null,null,null,"","",null,null,null,null,"","","",""]
["",null,null,null,null,null,null,null,null,null,null,null,"","",null,null,null,null,"","","",""]
["",null,null,null,null,null,null,null,null,null,null,null,"","",null,null,null,null,"","","",""]
["",null,null,null,null,null,null,null,null,null,null,null,"","",null,null,null,null,"","","",""]
["",null,null,null,null,null,null,null,null,null,null,null,"","",null,null,null,null,"","","",""]
["",null,null,null,null,null,null,null,null,null,null,null,"","",null,null,null,null,"","","",""]
["",null,null,null,null,null,null,null,null,null,null,null,"","",null,null,null,null,"","","",""]
["",null,null,null,null,null,null,null,null,null,null,null,"","",null,null,null,null,"","","",""]
["",null,null,null,null,null,null,null,null,null,null,null,"","",null,null,null,null,"","","",""]
["",null,null,null,null,null,null,null,null,null,null,null,"","",null,null,null,null,"","","",""]
["",null,null,null,null,null,null,null,null,null,null,null,"","",null,null,null,null,"","","",""]
["",null,null,null,null,null,null,null,null,null,null,null,"","",null,null,null,null,"","","",""]
["",null,null,null,null,null,null,null,null,null,null,null,"","",null,null,null,null,"","","",""]
["",null,null,null,null,null,null,null,null,null,null,null,"","",null,null,null,null,"","","",""]
["",null,null,null,null,null,null,null,null,null,null,null,"","",null,null,null,null,"","","",""]
["",null,null,null,null,null,null,null,null,null,null,null,"","",null,null,null,null,"","","",""]
["",null,null,null,null,null,null,null,null,null,null,null,"","",null,null,null,null,"","","",""]
["",null,null,null,null,null,null,null,null,null,null,null,"","",null,null,null,null,"","","",""]
["",null,null,null,null,null,null,null,null,null,null,null,"","",null,null,null,null,"","","",""]
["",null,null,null,null,null,null,null,null,null,null,null,"","",null,null,null,null,"","","",""]
["",null,null,null,null,null,null,null,null,null,null,null,"","",null,null,null,null,"","","",""]
["",null,null,null,null,null,null,null,null,null,null,null,"","",null,null,null,null,"","","",""]
["",null,null,null,null,null,null,null,null,null,null,null,"","",null,null,null,null,"","","",""]
["",null,null,null,null,null,null,null,null,null,null,null,"","",null,null,null,null,"","","",""]
["",null,null,null,null,null,null,null,null,null,null,null,"","",null,null,null,null,"","","",""]
["",null,null,null,null,null,null,null,null,null,null,null,"","",null,null,null,null,"","","",""]
["",null,null,null,null,null,null,null,null,null,null,null,"","",null,null,null,null,"","","",""]
["",null,null,null,null,null,null,null,null,null,null,null,"","",null,null,null,null,"","","",""]
["",null,null,null,null,null,null,null,null,null,null,null,"","",null,null,null,null,"","","",""]
["",null,null,null,null,null,null,null,null,null,null,null,"","",null,null,null,null,"","","",""]
["",null,null,null,null,null,null,null,null,null,null,null,"","",null,null,null,null,"","","",""]
["",null,null,null,null,null,null,null,null,null,null,null,"","",null,null,null,null,"","","",""]
["",null,null,null,null,null,null,null,null,null,null,null,"","",null,null,null,null,"","","",""]
["",null,null,null,null,null,null,null,null,null,null,null,"","",null,null,null,null,"","","",""]
["",null,null,null,null,null,null,null,null,null,null,null,"","",null,null,null,null,"","","",""]
["",null,null,null,null,null,null,null,null,null,null,null,"","",null,null,null,null,"","","",""]
["",null,null,null,null,null,null,null,null,null,null,null,"","",null,null,null,null,"","","",""]
["",null,null,null,null,null,null,null,null,null,null,null,"","",null,null,null,null,"","","",""]
["",null,null,null,null,null,null,null,null,null,null,null,"","",null,null,null,null,"","","",""]
["",null,null,null,null,null,null,null,null,null,null,null,"","",null,null,null,null,"","","",""]
["",null,null,null,null,null,null,null,null,null,null,null,"","",null,null,null,null,"","","",""]
["",null,null,null,null,null,null,null,null,null,null,null,"","",null,null,null,null,"","","",""]
["",null,null,null,null,null,null,null,null,null,null,null,"",""]
["",null,null,null,null,null,null,null,null,null,null,null,"",""]
["",null,null,null,null,null,null,null,null,null,null,null,"",""]
["",null,null,null,null,null,null,null,null,null,null,null,"",""]
["",null,null,null,null,null,null,null,null,null,null,null,"",""]
["",null,null,null,null,null,null,null,null,null,null,null,"",""]
["",null,null,null,null,null,null,null,null,null,null,null,"",""]
["",null,null,null,null,null,null,null,null,null,null,null,"",""]
["",null,null,null,null,null,null,null,null,null,null,null,"",""]
[{"$f":"IF(B261<>\"\",_xlfn.ISOWEEKNUM(B261),\"\")","v":""},null,null,null,null,null,null,null,null,null,null,null,{"$f":"IF(H261<>\"\",H261-G261,\"\")","v":""},{"$f":"IF(J261<>\"\",J261-I261,\"\")","v":""}]
["",null,null,null,null,null,null,null,null,null,null,null,"",""]
["",null,null,null,null,null,null,null,null,null,null,null,"",""]
["",null,null,null,null,null,null,null,null,null,null,null,"",""]
["",null,null,null,null,null,null,null,null,null,null,null,"",""]
["",null,null,null,null,null,null,null,null,null,null,null,"",""]
["",null,null,null,null,null,null,null,null,null,null,null,"",""]
["",null,null,null,null,null,null,null,null,null,null,null,"",""]
["",null,null,null,null,null,null,null,null,null,null,null,"",""]
["",null,null,null,null,null,null,null,null,null,null,null,"",""]
["",null,null,null,null,null,null,null,null,null,null,null,"",""]
["",null,null,null,null,null,null,null,null,null,null,null,"",""]
["",null,null,null,null,null,null,null,null,null,null,null,"",""]
["",null,null,null,null,null,null,null,null,null,null,null,"",""]
["",null,null,null,null,null,null,null,null,null,null,null,"",""]
["",null,null,null,null,null,null,null,null,null,null,null,"",""]
["",null,null,null,null,null,null,null,null,null,null,null,"",""]
["",null,null,null,null,null,null,null,null,null,null,null,"",""]
["",null,null,null,null,null,null,null,null,null,null,null,"",""]
["",null,null,null,null,null,null,null,null,null,null,null,"",""]
["",null,null,null,null,null,null,null,null,null,null,null,"",""]
["",null,null,null,null,null,null,null,null,null,null,null,"",""]
["",null,null,null,null,null,null,null,null,null,null,null,"",""]
["",null,null,null,null,null,null,null,null,null,null,null,"",""]
["",null,null,null,null,null,null,null,null,null,null,null,"",""]
["",null,null,null,null,null,null,null,null,null,null,null,"",""]
["",null,null,null,null,null,null,null,null,null,null,null,"",""]
["",null,null,null,null,null,null,null,null,null,null,null,"",""]
["",null,null,null,null,null,null,null,null,null,null,null,"",""]
["",null,null,null,null,null,null,null,null,null,null,null,"",""]
["",null,null,null,null,null,null,null,null,null,null,null,"",""]
["",null,null,null,null,null,null,null,null,null,null,null,"",""]
["",null,null,null,null,null,null,null,null,null,null,null,"",""]
["",null,null,null,null,null,null,null,null,null,null,null,"",""]
["",null,null,null,null,null,null,null,null,null,null,null,"",""]
["",null,null,null,null,null,null,null,null,null,null,null,"",""]
["",null,null,null,null,null,null,null,null,null,null,null,"",""]
["",null,null,null,null,null,null,null,null,null,null,null,"",""]
["",null,null,null,null,null,null,null,null,null,null,null,"",""]
["",null,null,null,null,null,null,null,null,null,null,null,"",""]
["",null,null,null,null,null,null,null,null,null,null,null,"",""]
["",null,null,null,null,null,null,null,null,null,null,null,"",""]
["",null,null,null,null,null,null,null,null,null,null,null,"",""]
["",null,null,null,null,null,null,null,null,null,null,null,"",""]
["",null,null,null,null,null,null,null,null,null,null,null,"",""]
["",null,null,null,null,null,null,null,null,null,null,null,"",""]
["",null,null,null,null,null,null,null,null,null,null,null,"",""]
["",null,null,null,null,null,null,null,null,null,null,null,"",""]
["",null,null,null,null,null,null,null,null,null,null,null,"",""]
["",null,null,null,null,null,null,null,null,null,null,null,"",""]
["",null,null,null,null,null,null,null,null,null,null,null,"",""]
["",null,null,null,null,null,null,null,null,null,null,null,"",""]
["",null,null,null,null,null,null,null,null,null,null,null,"",""]
["",null,null,null,null,null,null,null,null,null,null,null,"",""]
["",null,null,null,null,null,null,null,null,null,null,null,"",""]
["",null,null,null,null,null,null,null,null,null,null,null,"",""]
["",null,null,null,null,null,null,null,null,null,null,null,"",""]
["",null,null,null,null,null,null,null,null,null,null,null,"",""]
["",null,null,null,null,null,null,null,null,null,null,null,"",""]
["",null,null,null,null,null,null,null,null,null,null,null,"",""]
["",null,null,null,null,null,null,null,null,null,null,null,"",""]
["",null,null,null,null,null,null,null,null,null,null,null,"",""]
["",null,null,null,null,null,null,null,null,null,null,null,"",""]
["",null,null,null,null,null,null,null,null,null,null,null,"",""]
[{"$f":"IF(B325<>\"\",_xlfn.ISOWEEKNUM(B325),\"\")","v":""},null,null,null,null,null,null,null,null,null,null,null,{"$f":"IF(H325<>\"\",H325-G325,\"\")","v":""},{"$f":"IF(J325<>\"\",J325-I325,\"\")","v":""}]
["",null,null,null,null,null,null,null,null,null,null,null,"",""]
["",null,null,null,null,null,null,null,null,null,null,null,"",""]
["",null,null,null,null,null,null,null,null,null,null,null,"",""]
["",null,null,null,null,null,null,null,null,null,null,null,"",""]
["",null,null,null,null,null,null,null,null,null,null,null,"",""]
["",null,null,null,null,null,null,null,null,null,null,null,"",""]
["",null,null,null,null,null,null,null,null,null,null,null,"",""]
["",null,null,null,null,null,null,null,null,null,null,null,"",""]
["",null,null,null,null,null,null,null,null,null,null,null,"",""]
["",null,null,null,null,null,null,null,null,null,null,null,"",""]
["",null,null,null,null,null,null,null,null,null,null,null,"",""]
["",null,null,null,null,null,null,null,null,null,null,null,"",""]
["",null,null,null,null,null,null,null,null,null,null,null,"",""]
["",null,null,null,null,null,null,null,null,null,null,null,"",""]
["",null,null,null,null,null,null,null,null,null,null,null,"",""]
["",null,null,null,null,null,null,null,null,null,null,null,"",""]
["",null,null,null,null,null,null,null,null,null,null,null,"",""]
["",null,null,null,null,null,null,null,null,null,null,null,"",""]
["",null,null,null,null,null,null,null,null,null,null,null,"",""]
["",null,null,null,null,null,null,null,null,null,null,null,"",""]
["",null,null,null,null,null,null,null,null,null,null,null,"",""]
["",null,null,null,null,null,null,null,null,null,null,null,"",""]
["",null,null,null,null,null,null,null,null,null,null,null,"",""]
["",null,null,null,null,null,null,null,null,null,null,null,"",""]
["",null,null,null,null,null,null,null,null,null,null,null,"",""]
["",null,null,null,null,null,null,null,null,null,null,null,"",""]
["",null,null,null,null,null,null,null,null,null,null,null,"",""]
["",null,null,null,null,null,null,null,null,null,null,null,"",""]
["",null,null,null,null,null,null,null,null,null,null,null,"",""]
["",null,null,null,null,null,null,null,null,null,null,null,"",""]
["",null,null,null,null,null,null,null,null,null,null,null,"",""]
["",null,null,null,null,null,null,null,null,null,null,null,"",""]
["",null,null,null,null,null,null,null,null,null,null,null,"",""]
["",null,null,null,null,null,null,null,null,null,null,null,"",""]
["",null,null,null,null,null,null,null,null,null,null,null,"",""]
["",null,null,null,null,null,null,null,null,null,null,null,"",""]
["",null,null,null,null,null,null,null,null,null,null,null,"",""]
["",null,null,null,null,null,null,null,null,null,null,null,"",""]
["",null,null,null,null,null,null,null,null,null,null,null,"",""]
["",null,null,null,null,null,null,null,null,null,null,null,"",""]
["",null,null,null,null,null,null,null,null,null,null,null,"",""]
["",null,null,null,null,null,null,null,null,null,null,null,"",""]
["",null,null,null,null,null,null,null,null,null,null,null,"",""]
["",null,null,null,null,null,null,null,null,null,null,null,"",""]
["",null,null,null,null,null,null,null,null,null,null,null,"",""]
["",null,null,null,null,null,null,null,null,null,null,null,"",""]
["",null,null,null,null,null,null,null,null,null,null,null,"",""]
["",null,null,null,null,null,null,null,null,null,null,null,"",""]
["",null,null,null,null,null,null,null,null,null,null,null,"",""]
["",null,null,null,null,null,null,null,null,null,null,null,"",""]
["",null,null,null,null,null,null,null,null,null,null,null,"",""]
["",null,null,null,null,null,null,null,null,null,null,null,"",""]
["",null,null,null,null,null,null,null,null,null,null,null,"",""]
["",null,null,null,null,null,null,null,null,null,null,null,"",""]
["",null,null,null,null,null,null,null,null,null,null,null,"",""]
["",null,null,null,null,null,null,null,null,null,null,null,"",""]
["",null,null,null,null,null,null,null,null,null,null,null,"",""]
["",null,null,null,null,null,null,null,null,null,null,null,"",""]
["",null,null,null,null,null,null,null,null,null,null,null,"",""]
["",null,null,null,null,null,null,null,null,null,null,null,"",""]
["",null,null,null,null,null,null,null,null,null,null,null,"",""]
["",null,null,null,null,null,null,null,null,null,null,null,"",""]
["",null,null,null,null,null,null,null,null,null,null,null,"",""]
[{"$f":"IF(B389<>\"\",_xlfn.ISOWEEKNUM(B389),\"\")","v":""},null,null,null,null,null,null,null,null,null,null,null,{"$f":"IF(H389<>\"\",H389-G389,\"\")","v":""},{"$f":"IF(J389<>\"\",J389-I389,\"\")","v":""}]
["",null,null,null,null,null,null,null,null,null,null,null,"",""]
[null,null,null,null,null,null,null,null,null,null,null,null,"",""]
[null,null,null,null,null,null,null,null,null,null,null,null,"",""]
[null,null,null,null,null,null,null,null,null,null,null,null,"",""]
[null,null,null,null,null,null,null,null,null,null,null,null,"",""]
[null,null,null,null,null,null,null,null,null,null,null,null,"",""]
[null,null,null,null,null,null,null,null,null,null,null,null,"",""]
[null,null,null,null,null,null,null,null,null,null,null,null,"",""]
[null,null,null,null,null,null,null,null,null,null,null,null,"",""]
[null,null,null,null,null,null,null,null,null,null,null,null,"",""]
[null,null,null,null,null,null,null,null,null,null,null,null,"",""]

{"sheet":"Dag-taken week (49)","index":4,"n_rows":110,"n_cols":18,"rows_kept":110,"cut":false,"hidden":true,"merged":[[30,1,30,6],[30,12,30,17],[0,12,0,17],[4,1,4,6],[4,12,4,17],[17,1,17,6],[17,12,17,17],[43,1,43,6],[43,12,43,17],[56,1,56,6],[56,12,56,17],[69,1,69,6],[69,12,69,17],[82,1,82,6],[82,12,82,17],[95,8,96,8],[95,9,96,10],[97,8,98,8],[97,9,98,10],[106,8,108,8],[106,9,108,10],[109,1,112,17],[99,8,100,8],[99,9,100,10],[102,8,103,8],[102,9,103,10],[104,8,105,8],[104,9,105,10]]}
[null,"Dag-taken week 49",null,null,null,null,null,null,null,null,null,null,{"$f":"B1","v":"Dag-taken week 49"}]
[null,"tanken",null,"aan/afkoppelen",null,"Totaal",{"$f":"Q2","v":"Tijden"},null,null,null,null,null,"wachten instructie",null,"wachten koppelchauffeur",null,"Tijden"]
[]
[]
[null,"maandag 02-12-2019",null,null,null,null,null,null,null,null,null,null,{"$f":"B5","v":"maandag 02-12-2019"}]
[null,"Begintijd","Eindtijd","Begintijd","Eindtijd","tanken","aan/afkoppelen",null,"Totaal uren",{"$f":"J7+J8","v":0},null,null,"Begintijd","Eindtijd","Begintijd","Eindtijd","wachten instructie","wachten koppelchauffeur"]
[{"$f":"IF(B7,\"1\",0)","v":0},null,null,null,null,{"$f":"C7-B7","v":0},{"$f":"E7-D7","v":0},null,"tanken",{"$f":"SUM(F7:F12)","v":0},null,{"$f":"IF(M7,\"1\",0)","v":0},null,null,null,null,{"$f":"N7-M7","v":0},{"$f":"P7-O7","v":0}]
[0,null,null,null,null,{"$f":"C8-B8","v":0},0,null,"aan-afkoppelen",{"$f":"SUM(G7:G12)","v":0},null,0,null,null,null,null,{"$f":"N8-M8","v":0},{"$f":"P8-O8","v":0}]
[0,null,null,null,null,0,0,null,null,null,null,0,null,null,null,null,0,0]
[0,null,null,null,null,0,0,null,"Totaal uren",{"$f":"J11+J12","v":0},null,0,null,null,null,null,0,0]
[0,null,null,null,null,0,0,null,"wachten instructie",{"$f":"SUM(Q7:Q16)","v":0},null,0,null,null,null,null,0,0]
[0,null,null,null,null,0,0,null," wachten koppelchauffeur",{"$f":"SUM(R7:R16)","v":0},null,0,null,null,null,null,0,0]
[0,null,null,null,null,0,0,null,null,null,null,0,null,null,null,null,0,0]
[0,null,null,null,null,0,0,null,null,null,null,0,null,null,null,null,0,0]
[0,null,null,null,null,0,0,null,null,null,null,0,null,null,null,null,0,0]
[0,null,null,null,null,0,0,null,null,null,null,0,null,null,null,null,0,0]
[]
[null,"dinsdag 03-12-2019",null,null,null,null,null,null,null,null,null,null,{"$f":"B18","v":"dinsdag 03-12-2019"}]
[null,"Begintijd","Eindtijd","Begintijd","Eindtijd","tanken","aan/afkoppelen",null,"Totaal uren",{"$f":"J20+J21","v":9.8611111097852699E-3},null,null,"Begintijd","Eindtijd","Begintijd","Eindtijd","wachten instructie","wachten koppelchauffeur"]
[{"$f":"IF(B20,\"1\",0)","v":0},null,null,"2015-12-02T10:52:00","2015-12-02T11:06:12",{"$f":"C20-B20","v":0},{"$f":"E20-D20","v":9.8611111097852699E-3},null,"tanken",{"$f":"SUM(F20:F29)","v":0},null,{"$f":"IF(M20,\"1\",0)","v":0},null,null,null,null,{"$f":"N20-M20","v":0},{"$f":"R7","v":0}]
[{"$f":"IF(B21,\"1\",0)","v":0},null,null,null,null,0,0,null,"aan-afkoppelen",{"$f":"SUM(G20:G29)","v":9.8611111097852699E-3},null,0,null,null,null,null,{"$f":"N21-M21","v":0},0]
[0,null,null,null,null,0,0,null,null,null,null,0,null,null,null,null,0,0]
[0,null,null,null,null,0,0,null,"Totaal uren",{"$f":"J24+J25","v":0},null,0,null,null,null,null,0,0]
[0,null,null,null,null,0,0,null,"wachten instructie",{"$f":"SUM(Q20:Q29)","v":0},null,0,null,null,null,null,0,0]
[0,null,null,null,null,0,0,null,"wachten koppelchauffeur",{"$f":"SUM(R20:R29)","v":0},null,0,null,null,null,null,0,0]
[0,null,null,null,null,0,0,null,null,null,null,0,null,null,null,null,0,0]
[0,null,null,null,null,0,0,null,null,null,null,0,null,null,null,null,0,0]
[0,null,null,null,null,0,0,null,null,null,null,0,null,null,null,null,0,0]
[0,null,null,null,null,0,0,null,null,null,null,0,null,null,null,null,{"$f":"Q16","v":0},{"$f":"R16","v":0}]
[]
[null,"woensdag 04-12-2019",null,null,null,null,null,null,null,null,null,null,{"$f":"B31","v":"woensdag 04-12-2019"}]
[null,"Begintijd","Eindtijd","Begintijd","Eindtijd","tanken","aan/afkoppelen",null,"Totaal uren",{"$f":"J33+J34","v":1.4791666668315884E-2},null,null,"Begintijd","Eindtijd","Begintijd","Eindtijd","wachten instructie","wachten koppelchauffeur"]
[{"$f":"IF(B33,\"1\",0)","v":"1"},"2015-12-03T17:17:20","2015-12-03T17:32:40","2015-12-03T17:51:10","2015-12-03T17:57:08",{"$f":"C33-B33","v":1.0648148148902692E-2},{"$f":"E33-D33","v":4.1435185194131918E-3},null,"tanken",{"$f":"SUM(F33:F38)","v":1.0648148148902692E-2},null,1,null,null,null,null,0,0]
[0,null,null,null,null,0,0,null,"aan-afkoppelen",{"$f":"SUM(G33:G38)","v":4.1435185194131918E-3},null,{"$f":"IF(M34,\"1\",0)","v":0},null,null,null,null,0,0]
[0,null,null,null,null,0,0,null,null,null,null,0,null,null,null,null,0,0]
[0,null,null,null,null,0,0,null,"Totaal uren",{"$f":"J37+J38","v":0},null,0,null,null,null,null,0,0]
[0,null,null,null,null,0,0,null,"wachten instructie",{"$f":"SUM(Q33:Q42)","v":0},null,0,null,null,null,null,0,0]
[0,null,null,null,null,0,0,null,"wachten koppelchauffeur",{"$f":"SUM(R33:R42)","v":0},null,0,null,null,null,null,0,0]
[0,null,null,null,null,0,0,null,null,null,null,0,null,null,null,null,0,0]
[0,null,null,null,null,0,0,null,null,null,null,0,null,null,null,null,0,0]
[0,null,null,null,null,0,0,null,null,null,null,0,null,null,null,null,0,0]
[0,null,null,null,null,0,0,null,null,null,null,0,null,null,null,null,0,0]
[]
[null,"donderdag 05-12-2019",null,null,null,null,null,null,null,null,null,null,{"$f":"B44","v":"donderdag 05-12-2019"}]
[null,"Begintijd","Eindtijd","Begintijd","Eindtijd","tanken","aan/afkoppelen",null,"Totaal uren",{"$f":"J46+J47","v":2.7511574066011235E-2},null,null,"Begintijd","Eindtijd","Begintijd","Eindtijd","wachten instructie","wachten koppelchauffeur"]
[{"$f":"IF(B46,\"1\",0)","v":"1"},"2015-12-04T06:00:25","2015-12-04T06:12:11","2015-12-04T05:43:02","2015-12-04T05:49:21",{"$f":"C46-B46","v":8.1712962928577326E-3},{"$f":"E46-D46","v":4.386574073578231E-3},null,"tanken",{"$f":"SUM(F46:F55)","v":8.1712962928577326E-3},null,0,"2015-12-04T12:00:18","2015-12-04T13:54:59",null,null,{"$f":"N46-M46","v":7.9641203708888497E-2},{"$f":"P46-O46","v":0}]
[0,null,null,"2015-12-04T11:38:30","2015-12-04T11:49:11",{"$f":"C47-B47","v":0},7.4189814768033102E-3,null,"aan-afkoppelen",{"$f":"SUM(G46:G55)","v":1.9340277773153502E-2},null,{"$f":"IF(M46,\"1\",0)","v":"1"},null,null,null,null,0,{"$f":"P47-O47","v":0}]
[0,null,null,"2015-12-04T11:49:14","2015-12-04T12:00:05",0,7.5347222227719612E-3,null,null,null,null,{"$f":"IF(M47,\"1\",0)","v":0},null,null,null,null,0,0]
[0,null,null,null,null,0,0,null,"Totaal uren",{"$f":"J50+J51","v":7.9641203708888497E-2},null,{"$f":"IF(M49,\"1\",0)","v":0},null,null,null,null,0,0]
[0,null,null,null,null,0,0,null,"wachten instructie",{"$f":"SUM(Q46:Q55)","v":7.9641203708888497E-2},null,0,null,null,null,null,0,0]
[0,null,null,null,null,0,0,null,"wachten koppelchauffeur",{"$f":"SUM(R46:R55)","v":0},null,0,null,null,null,null,0,0]
[0,null,null,null,null,0,0,null,null,null,null,0,null,null,null,null,0,0]
[0,null,null,null,null,0,0,null,null,null,null,0,null,null,null,null,0,0]
[0,null,null,null,null,0,0,null,null,null,null,0,null,null,null,null,0,0]
[0,null,null,null,null,0,0,null,null,null,null,0,null,null,null,null,0,0]
[]
[null,"vrijdag 06-12-2019",null,null,null,null,null,null,null,null,null,null,{"$f":"B57","v":"vrijdag 06-12-2019"}]
[null,"Begintijd","Eindtijd","Begintijd","Eindtijd","tanken","aan/afkoppelen",null,"Totaal uren",{"$f":"J59+J60","v":1.3599537036498077E-2},null,null,"Begintijd","Eindtijd","Begintijd","Eindtijd","wachten instructie","wachten koppelchauffeur"]
[{"$f":"IF(B59,\"1\",0)","v":"1"},"2015-12-05T15:33:09","2015-12-05T15:52:44",null,null,{"$f":"C59-B59","v":1.3599537036498077E-2},{"$f":"E59-D59","v":0},null,"tanken",{"$f":"SUM(F59:F64)","v":1.3599537036498077E-2},null,{"$f":"IF(M59,\"1\",0)","v":0},null,null,null,null,{"$f":"N59-M59","v":0},{"$f":"P59-O59","v":0}]
[{"$f":"IF(B60,\"1\",0)","v":0},null,null,null,null,{"$f":"C60-B60","v":0},0,null,"aan-afkoppelen",{"$f":"SUM(G59:G64)","v":0},null,{"$f":"IF(M60,\"1\",0)","v":0},null,null,null,null,0,{"$f":"P60-O60","v":0}]
[0,null,null,null,null,0,0,null,null,null,null,0,null,null,null,null,0,0]
[0,null,null,null,null,0,0,null,"Totaal uren",{"$f":"J63+J64","v":0},null,0,null,null,null,null,0,0]
[0,null,null,null,null,0,0,null,"wachten instructie",{"$f":"SUM(Q59:Q68)","v":0},null,0,null,null,null,null,0,0]
[0,null,null,null,null,0,0,null,"wachten koppelchauffeur",{"$f":"SUM(R59:R68)","v":0},null,0,null,null,null,null,0,0]
[0,null,null,null,null,0,0,null,null,null,null,0,null,null,null,null,0,0]
[0,null,null,null,null,0,0,null,null,null,null,0,null,null,null,null,0,0]
[0,null,null,null,null,0,0,null,null,null,null,0,null,null,null,null,0,0]
[0,null,null,null,null,0,0,null,null,null,null,0,null,null,null,null,0,0]
[]
[null,"zaterdag 07-12-2019",null,null,null,null,null,null,null,null,null,null,{"$f":"B70","v":"zaterdag 07-12-2019"}]
[null,"Begintijd","Eindtijd","Begintijd","Eindtijd","tanken","aan/afkoppelen",null,"Totaal uren",{"$f":"J72+J73","v":0},null,null,"Begintijd","Eindtijd","Begintijd","Eindtijd","wachten instructie","wachten koppelchauffeur"]
[{"$f":"IF(B72,\"1\",0)","v":0},null,null,null,null,{"$f":"C72-B72","v":0},{"$f":"E72-D72","v":0},null,"tanken",{"$f":"SUM(F72:F81)","v":0},null,{"$f":"IF(M72,\"1\",0)","v":0},null,null,null,null,{"$f":"N72-M72","v":0},{"$f":"P72-O72","v":0}]
[{"$f":"IF(B73,\"1\",0)","v":0},null,null,null,null,{"$f":"C73-B73","v":0},{"$f":"E73-D73","v":0},null,"aan-afkoppelen",{"$f":"SUM(G72:G81)","v":0},null,{"$f":"IF(M73,\"1\",0)","v":0},null,null,null,null,{"$f":"N73-M73","v":0},{"$f":"P73-O73","v":0}]
[0,null,null,null,null,0,0,null,null,null,null,0,null,null,null,null,0,0]
[0,null,null,null,null,0,0,null,"Totaal uren",{"$f":"J76+J77","v":0},null,0,null,null,null,null,0,0]
[0,null,null,null,null,0,0,null,"wachten instructie",{"$f":"SUM(Q72:Q81)","v":0},null,0,null,null,null,null,0,0]
[0,null,null,null,null,0,0,null," wachten koppelchauffeur",{"$f":"SUM(R72:R81)","v":0},null,0,null,null,null,null,0,0]
[0,null,null,null,null,0,0,null,null,null,null,0,null,null,null,null,0,0]
[0,null,null,null,null,0,0,null,null,null,null,0,null,null,null,null,0,0]
[0,null,null,null,null,0,0,null,null,null,null,0,null,null,null,null,0,0]
[0,null,null,null,null,0,0,null,null,null,null,0,null,null,null,null,0,0]
[]
[null,"zondag 08-12-2019",null,null,null,null,null,null,null,null,null,null,{"$f":"B83","v":"zondag 08-12-2019"}]
[null,"Begintijd","Eindtijd","Begintijd","Eindtijd","tanken","aan/afkoppelen",null,"Totaal uren",{"$f":"J85+J86","v":0},null,null,"Begintijd","Eindtijd","Begintijd","Eindtijd","wachten instructie","wachten koppelchauffeur"]
[{"$f":"IF(B85,\"1\",0)","v":0},null,null,null,null,{"$f":"C85-B85","v":0},{"$f":"E85-D85","v":0},null,"tanken",{"$f":"SUM(F85:F90)","v":0},null,{"$f":"IF(M85,\"1\",0)","v":0},null,null,null,null,{"$f":"N85-M85","v":0},{"$f":"P85-O85","v":0}]
[0,null,null,null,null,{"$f":"C86-B86","v":0},{"$f":"E86-D86","v":0},null,"aan-afkoppelen",{"$f":"SUM(G85:G90)","v":0},null,{"$f":"IF(M86,\"1\",0)","v":0},null,null,null,null,0,0]
[0,null,null,null,null,0,0,null,null,null,null,0,null,null,null,null,0,0]
[0,null,null,null,null,0,0,null,"Totaal uren",{"$f":"J89+J90","v":0},null,0,null,null,null,null,0,0]
[0,null,null,null,null,0,0,null,"wachten instructie",{"$f":"SUM(Q85:Q94)","v":0},null,0,null,null,null,null,0,0]
[0,null,null,null,null,0,0,null,"wachten koppelchauffeur",{"$f":"SUM(R85:R94)","v":0},null,0,null,null,null,null,0,0]
[0,null,null,null,null,0,0,null,null,null,null,0,null,null,null,null,0,0]
[0,null,null,null,null,0,0,null,null,null,null,0,null,null,null,null,0,0]
[0,null,null,null,null,0,0,null,null,null,null,0,null,null,null,null,0,0]
[0,null,null,null,null,0,0,null,null,null,null,0,null,null,null,null,0,0]
[]
[null,null,null,null,null,null,null,null,"tanken",{"$f":"J85+J72+J59+J46+J33+J20+J7","v":3.2418981478258502E-2}]
[]
[null,null,null,null,null,null,null,null,"aan-afkoppelen",{"$f":"J86+J73+J60+J47+J34+J21+J8","v":3.3344907402351964E-2}]
[]
[null,null,null,null,null,null,null,null,"Totaal uren",{"$f":"J98+J96","v":6.5763888880610466E-2}]
[]
[]
[null,null,null,null,null,null,null,null,"wachten instructie",{"$f":"J89+J76+J63+J50+J37+J24+J11","v":7.9641203708888497E-2}]
[]
[null,null,null,null,null,null,null,null,"wachten koppelchauffeur",{"$f":"J90+J77+J64+J51+J38+J25+J12","v":0}]
[]
[null,null,null,null,null,null,null,null,"Totaal uren",{"$f":"J105+J103","v":7.9641203708888497E-2}]
[]
[]
[null,"Einde dag-taken week 49"]

{"sheet":"LadenLossen (49)","index":5,"n_rows":26,"n_cols":17,"rows_kept":26,"cut":false,"hidden":true,"merged":[[4,5,5,7],[4,1,5,4],[0,1,0,7],[6,19,6,20],[7,17,7,18],[7,19,7,20],[0,13,0,15],[3,13,3,15],[6,17,6,18]]}
["02:00:00","Laden/lossen (beschikbaarheidstijd (behalve bij Rood ))",null,null,null,null,null,null,null,"Week 48",null,null,null,"   = zelf laden/lossen"]
[]
[]
[null,null,null,null,null,null,null,null,null,"Totaal",null,null,null,"Wachturen laden/lossen"]
[null," Laden",null,null,null,"Lossen",null,null,null,"Laden","Lossen","Totaal uren",null,"Laden",null,"Lossen","Totaal uren"]
["Nr.",null,null,null,null,null,null,null,null,{"$f":"SUM(J8:J49)","v":0.29465277777975035},{"$f":"SUM(K8:K49)","v":0.26096064815161901},{"$f":"J6+K6","v":0.55561342593136942},null,{"$f":"SUM(N8:N49)","v":5.4386574078913938E-2},null,{"$f":"SUM(P8:P49)","v":0.17497685185420175},{"$f":"N6+P6","v":0.22936342593311571}]
[0,"begin",null,"eind",null,"begin",null,"eind"]
[1,"2015-11-30T09:20:44",null,"2015-11-30T09:24:46",null,null,null,null,null,{"$f":"IF(D8<>\"\",IF(D8-B8>TIME(2,0,0),TIME(2,0,0),D8-B8),\"\")","v":2.8009259258396924E-3},{"$f":"IF(H8<>\"\",IF(H8-F8>TIME(2,0,0),TIME(2,0,0),H8-F8),\"\")","v":""},{"$f":"IF(H8<>\"\",H8-F8,\"\")","v":""},null,{"$f":"IF(D8-B8>TIME(2,0,0),D8-B8-TIME(2,0,0),\"\")","v":""},null,{"$f":"IF((H8-F8)>TIME(2,0,0),H8-F8-TIME(2,0,0),\"\")","v":""}]
[2,null,null,null,null,"2015-12-01T07:23:46",null,"2015-12-01T12:29:27",null,"",{"$f":"IF(H9<>\"\",IF(H9-F9>TIME(2,0,0),TIME(2,0,0),H9-F9),\"\")","v":8.3333333333333329E-2},null,null,{"$f":"IF(D9-B9>TIME(2,0,0),D9-B9-TIME(2,0,0),\"\")","v":""},null,0.12894675926024018]
[3,null,null,null,null,"2015-12-01T12:33:48",null,"2015-12-01T13:18:18",null,"",3.0902777776645962E-2,null,null,{"$f":"IF(D10-B10>TIME(2,0,0),D10-B10-TIME(2,0,0),\"\")","v":""},null,""]
[4,null,null,null,null,"2015-12-01T14:00:12",null,"2015-12-01T14:22:38",null,"",1.5578703707433306E-2,null,null,{"$f":"IF(D11-B11>TIME(2,0,0),D11-B11-TIME(2,0,0),\"\")","v":""},null,""]
[5,null,null,null,null,"2015-12-01T15:06:14",null,"2015-12-01T15:41:52",null,"",2.47453703705105E-2,null,null,"",null,""]
[6,null,null,null,null,"2015-12-02T07:42:23",null,"2015-12-02T10:48:40",null,"",8.3333333333333329E-2,null,null,"",null,4.6030092593961555E-2]
[7,"2015-12-02T13:11:40",null,"2015-12-02T13:57:00",null,null,null,null,null,3.1481481484661344E-2,"",null,null,"",null,""]
[8,"2015-12-02T15:14:12",null,"2015-12-02T16:04:13",null,null,null,null,null,3.4733796295768116E-2,"",null,null,"",null,""]
[9,"2015-12-03T06:56:41",null,"2015-12-03T08:29:21",null,null,null,null,null,6.4351851855462883E-2,"",null,null,"",null,""]
[10,null,null,null,null,"2015-12-03T17:34:48",null,"2015-12-03T17:48:42",null,"",9.6527777786832303E-3,null,null,"",null,""]
[11,"2015-12-05T07:27:07",null,"2015-12-05T10:45:26",null,null,null,null,null,8.3333333333333329E-2,"",null,null,5.4386574078913938E-2,null,""]
[12,"2015-12-05T10:45:37",null,"2015-12-05T12:37:52",null,null,null,null,null,7.7951388884685002E-2,"",null,null,"",null,""]
[13,null,null,null,null,"2015-12-05T15:54:47",null,"2015-12-05T16:14:06",null,"",1.3414351851679385E-2,null,null,""]
[null,null,null,null,null,null,null,null,null,"","",null,null,"",null,{"$f":"IF((H21-F21)>TIME(2,0,0),H21-F21-TIME(2,0,0),\"\")","v":""}]
[null,null,null,null,null,null,null,null,null,"","",null,null,"",null,{"$f":"IF((H22-F22)>TIME(2,0,0),H22-F22-TIME(2,0,0),\"\")","v":""}]
[null,null,null,null,null,null,null,null,null,"","",null,null,"",null,{"$f":"IF((H23-F23)>TIME(2,0,0),H23-F23-TIME(2,0,0),\"\")","v":""}]
[null,null,null,null,null,null,null,null,null,"","",null,null,"",null,{"$f":"IF((H24-F24)>TIME(2,0,0),H24-F24-TIME(2,0,0),\"\")","v":""}]
[null,null,null,null,null,null,null,null,null,{"$f":"IF(D25<>\"\",IF(D25-B25>TIME(2,0,0),TIME(2,0,0),D25-B25),\"\")","v":""},"",null,null,"",null,{"$f":"IF((H25-F25)>TIME(2,0,0),H25-F25-TIME(2,0,0),\"\")","v":""}]
[null,null,null,null,null,null,null,null,null,{"$f":"IF(D26<>\"\",IF(D26-B26>TIME(2,0,0),TIME(2,0,0),D26-B26),\"\")","v":""}]

{"sheet":"LadenLossen (48)","index":6,"n_rows":27,"n_cols":17,"rows_kept":27,"cut":false,"hidden":true,"merged":[[7,17,7,18],[7,19,7,20],[6,19,6,20],[0,1,0,7],[0,13,0,15],[3,13,3,15],[4,1,5,4],[4,5,5,7],[6,17,6,18]]}
["02:00:00","Laden/lossen (beschikbaarheidstijd (behalve bij Rood ))",null,null,null,null,null,null,null,"Week 48",null,null,null,"   = zelf laden/lossen"]
[]
[]
[null,null,null,null,null,null,null,null,null,"Totaal",null,null,null,"Wachturen laden/lossen"]
[null," Laden",null,null,null,"Lossen",null,null,null,"Laden","Lossen","Totaal uren",null,"Laden",null,"Lossen","Totaal uren"]
["Nr.",null,null,null,null,null,null,null,null,{"$f":"SUM(J8:J51)","v":0.29797453704425908},{"$f":"SUM(K8:K51)","v":0.38292824074354331},{"$f":"J6+K6","v":0.68090277778780239},null,{"$f":"SUM(N8:N51)","v":3.7465277777907133E-2},null,{"$f":"SUM(P8:P51)","v":4.3611111107262943E-2},{"$f":"N6+P6","v":8.1076388885170075E-2}]
[0,"begin",null,"eind",null,"begin",null,"eind"]
[1,"2015-11-24T02:31:27",null,"2015-11-24T02:37:55",null,null,null,null,null,{"$f":"IF(D8<>\"\",IF(D8-B8>TIME(2,0,0),TIME(2,0,0),D8-B8),\"\")","v":4.4907407427672297E-3},{"$f":"IF(H8<>\"\",H8-F8,\"\")","v":""},{"$f":"IF(H8<>\"\",H8-F8,\"\")","v":""},null,{"$f":"IF(D8-B8>TIME(2,0,0),D8-B8-TIME(2,0,0),\"\")","v":""},null,{"$f":"IF((H8-F8)>TIME(2,0,0),H8-F8-TIME(2,0,0),\"\")","v":""}]
[2,null,null,null,null,"2015-11-24T09:04:34",null,"2015-11-24T09:54:23",null,{"$f":"IF(D9<>\"\",IF(D9-B9>TIME(2,0,0),TIME(2,0,0),D9-B9),\"\")","v":""},{"$f":"IF(H9<>\"\",H9-F9,\"\")","v":3.4594907410792075E-2},null,null,{"$f":"IF(D9-B9>TIME(2,0,0),D9-B9-TIME(2,0,0),\"\")","v":""},null,{"$f":"IF((H9-F9)>TIME(2,0,0),H9-F9-TIME(2,0,0),\"\")","v":""}]
[3,null,null,null,null,"2015-11-24T12:12:23",null,"2015-11-24T13:32:53",null,"",{"$f":"IF(H10<>\"\",H10-F10,\"\")","v":5.5902777778101154E-2},null,null,{"$f":"IF(D10-B10>TIME(2,0,0),D10-B10-TIME(2,0,0),\"\")","v":""},null,{"$f":"IF((H10-F10)>TIME(2,0,0),H10-F10-TIME(2,0,0),\"\")","v":""}]
[4,null,null,null,null,"2015-11-25T07:08:18",null,"2015-11-25T07:58:41",null,"",{"$f":"IF(H11<>\"\",H11-F11,\"\")","v":3.4988425926712807E-2}]
[5,"2015-11-25T12:01:46",null,"2015-11-25T12:52:33",null,null,null,null,null,3.5266203703940846E-2,{"$f":"IF(H12<>\"\",IF(H12-F12>TIME(2,0,0),TIME(2,0,0),H12-F12),\"\")","v":""}]
[6,"2015-11-25T15:10:21",null,"2015-11-25T15:40:14",null,null,null,null,null,2.0752314812853001E-2,"",null,null,{"$f":"IF(D13-B13>TIME(2,0,0),D13-B13-TIME(2,0,0),\"\")","v":""},null,{"$f":"IF((H13-F13)>TIME(2,0,0),H13-F13-TIME(2,0,0),\"\")","v":""}]
[7,"2015-11-26T06:27:42",null,"2015-11-26T07:55:28",null,null,null,null,null,6.0949074075324461E-2,"",null,null,{"$f":"IF(D14-B14>TIME(2,0,0),D14-B14-TIME(2,0,0),\"\")","v":""},null,{"$f":"IF((H14-F14)>TIME(2,0,0),H14-F14-TIME(2,0,0),\"\")","v":""}]
[8,null,null,null,null,"2015-11-26T15:34:40",null,"2015-11-26T17:25:06",null,"",7.6689814814017154E-2,null,null,"",null,""]
[9,"2015-11-26T18:05:42",null,"2015-11-26T18:36:02",null,null,null,null,null,2.1064814813144039E-2,"",null,null,"",null,""]
[10,"2015-11-27T06:20:26",null,"2015-11-27T06:32:17",null,null,null,null,null,8.2291666694800369E-3,"",null,null,"",null,""]
[11,null,null,null,null,"2015-11-27T07:46:36",null,"2015-11-27T10:49:24",null,"",{"$f":"IF(H18<>\"\",IF(H18-F18>TIME(2,0,0),TIME(2,0,0),H18-F18),\"\")","v":8.3333333333333329E-2},null,null,"",null,4.3611111107262943E-2]
[12,null,null,null,null,"2015-11-27T11:04:03",null,"2015-11-27T12:07:39",null,"",4.4166666666569654E-2,null,null,"",null,""]
[13,"2015-11-27T15:35:11",null,"2015-11-27T15:42:25",null,null,null,null,null,5.02314815093996E-3,"",null,null,"",null,""]
[14,"2015-11-27T15:35:11",null,"2015-11-27T15:42:25",null,null,null,null,null,5.02314815093996E-3,{"$f":"IF(H21<>\"\",IF(H21-F21>TIME(2,0,0),TIME(2,0,0),H21-F21),\"\")","v":""},null,null,{"$f":"IF(D21-B21>TIME(2,0,0),D21-B21-TIME(2,0,0),\"\")","v":""},null,{"$f":"IF((H21-F21)>TIME(2,0,0),H21-F21-TIME(2,0,0),\"\")","v":""}]
[15,"2015-11-28T06:35:51",null,"2015-11-28T07:26:51",null,null,null,null,null,3.5416666665696539E-2]
[16,"2015-11-28T07:58:51",null,"2015-11-28T10:52:48",null,null,null,null,null,8.3333333333333329E-2,{"$f":"IF(H23<>\"\",IF(H23-F23>TIME(2,0,0),TIME(2,0,0),H23-F23),\"\")","v":""},null,null,3.7465277777907133E-2,null,""]
[17,null,null,null,null,"2015-11-28T15:39:56",null,"2015-11-28T16:56:37",null,"",{"$f":"IF(H24<>\"\",IF(H24-F24>TIME(2,0,0),TIME(2,0,0),H24-F24),\"\")","v":5.3252314814017154E-2},null,null,"",null,""]
[18,null,null,null,null,"2015-11-28T17:08:40",null,"2015-11-28T17:34:31",null,"",null,null,null,"",null,""]
[19,"2015-11-28T18:27:07",null,"2015-11-28T18:53:39",null,null,null,null,null,1.8425925925839692E-2,null,null,null,"",null,""]
[null,null,null,null,null,null,null,null,null,null,null,null,null,"",null,""]

{"sheet":"Dag-taken week (48)","index":7,"n_rows":110,"n_cols":18,"rows_kept":110,"cut":false,"hidden":true,"merged":[[106,8,108,8],[106,9,108,10],[109,1,112,17],[99,8,100,8],[99,9,100,10],[102,8,103,8],[102,9,103,10],[104,8,105,8],[104,9,105,10],[82,1,82,6],[82,12,82,17],[95,8,96,8],[95,9,96,10],[97,8,98,8],[97,9,98,10],[43,1,43,6],[43,12,43,17],[56,1,56,6],[56,12,56,17],[69,1,69,6],[69,12,69,17],[30,1,30,6],[30,12,30,17],[0,12,0,17],[4,1,4,6],[4,12,4,17],[17,1,17,6],[17,12,17,17]]}
[null,"Dag-taken week 48",null,null,null,null,null,null,null,null,null,null,{"$f":"B1","v":"Dag-taken week 48"}]
[null,"tanken",null,"aan/afkoppelen",null,"Totaal",{"$f":"Q2","v":"Tijden"},null,null,null,null,null,"wachten instructie",null,"wachten koppelchauffeur",null,"Tijden"]
[]
[]
[null,"maandag 25-11-2019",null,null,null,null,null,null,null,null,null,null,{"$f":"B5","v":"maandag 25-11-2019"}]
[null,"Begintijd","Eindtijd","Begintijd","Eindtijd","tanken","aan/afkoppelen",null,"Totaal uren",{"$f":"J7+J8","v":2.9398148151813075E-2},null,null,"Begintijd","Eindtijd","Begintijd","Eindtijd","wachten instructie","wachten koppelchauffeur"]
[{"$f":"IF(B7,\"1\",0)","v":"1"},"2015-11-24T01:45:24","2015-11-24T02:04:58","2015-11-24T02:15:14","2015-11-24T02:31:00",{"$f":"C7-B7","v":1.3587962966994382E-2},{"$f":"E7-D7","v":1.0949074072414078E-2},null,"tanken",{"$f":"SUM(F7:F12)","v":1.8449074079398997E-2},null,{"$f":"IF(M7,\"1\",0)","v":0},null,null,null,null,{"$f":"N7-M7","v":0},{"$f":"P7-O7","v":0}]
["1","2015-11-24T02:47:46","2015-11-24T02:54:46",null,null,{"$f":"C8-B8","v":4.8611111124046147E-3},0,null,"aan-afkoppelen",{"$f":"SUM(G7:G12)","v":1.0949074072414078E-2},null,0,null,null,null,null,{"$f":"N8-M8","v":0},{"$f":"P8-O8","v":0}]
[0,null,null,null,null,0,0,null,null,null,null,0,null,null,null,null,0,0]
[0,null,null,null,null,0,0,null,"Totaal uren",{"$f":"J11+J12","v":0},null,0,null,null,null,null,0,0]
[0,null,null,null,null,0,0,null,"wachten instructie",{"$f":"SUM(Q7:Q16)","v":0},null,0,null,null,null,null,0,0]
[0,null,null,null,null,0,0,null," wachten koppelchauffeur",{"$f":"SUM(R7:R16)","v":0},null,0,null,null,null,null,0,0]
[0,null,null,null,null,0,0,null,null,null,null,0,null,null,null,null,0,0]
[0,null,null,null,null,0,0,null,null,null,null,0,null,null,null,null,0,0]
[0,null,null,null,null,0,0,null,null,null,null,0,null,null,null,null,0,0]
[0,null,null,null,null,0,0,null,null,null,null,0,null,null,null,null,0,0]
[]
[null,"dinsdag 26-11-2019",null,null,null,null,null,null,null,null,null,null,{"$f":"B18","v":"dinsdag 26-11-2019"}]
[null,"Begintijd","Eindtijd","Begintijd","Eindtijd","tanken","aan/afkoppelen",null,"Totaal uren",{"$f":"J20+J21","v":0},null,null,"Begintijd","Eindtijd","Begintijd","Eindtijd","wachten instructie","wachten koppelchauffeur"]
[{"$f":"IF(B20,\"1\",0)","v":0},null,null,null,null,{"$f":"C20-B20","v":0},{"$f":"E20-D20","v":0},null,"tanken",{"$f":"SUM(F20:F29)","v":0},null,{"$f":"IF(M20,\"1\",0)","v":"1"},"2015-11-25T07:59:15","2015-11-25T08:35:03",null,null,{"$f":"N20-M20","v":2.4861111116479151E-2},{"$f":"R7","v":0}]
[{"$f":"IF(B21,\"1\",0)","v":0},null,null,null,null,0,0,null,"aan-afkoppelen",{"$f":"SUM(G20:G29)","v":0},null,0,null,null,null,null,{"$f":"N21-M21","v":0},0]
[0,null,null,null,null,0,0,null,null,null,null,0,null,null,null,null,0,0]
[0,null,null,null,null,0,0,null,"Totaal uren",{"$f":"J24+J25","v":2.4861111116479151E-2},null,0,null,null,null,null,0,0]
[0,null,null,null,null,0,0,null,"wachten instructie",{"$f":"SUM(Q20:Q29)","v":2.4861111116479151E-2},null,0,null,null,null,null,0,0]
[0,null,null,null,null,0,0,null,"wachten koppelchauffeur",{"$f":"SUM(R20:R29)","v":0},null,0,null,null,null,null,0,0]
[0,null,null,null,null,0,0,null,null,null,null,0,null,null,null,null,0,0]
[0,null,null,null,null,0,0,null,null,null,null,0,null,null,null,null,0,0]
[0,null,null,null,null,0,0,null,null,null,null,0,null,null,null,null,0,0]
[0,null,null,null,null,0,0,null,null,null,null,0,null,null,null,null,{"$f":"Q16","v":0},{"$f":"R16","v":0}]
[]
[null,"woensdag 27-11-2019",null,null,null,null,null,null,null,null,null,null,{"$f":"B31","v":"woensdag 27-11-2019"}]
[null,"Begintijd","Eindtijd","Begintijd","Eindtijd","tanken","aan/afkoppelen",null,"Totaal uren",{"$f":"J33+J34","v":1.17361111115315E-2},null,null,"Begintijd","Eindtijd","Begintijd","Eindtijd","wachten instructie","wachten koppelchauffeur"]
[{"$f":"IF(B33,\"1\",0)","v":0},null,null,"2015-11-26T17:46:50","2015-11-26T17:51:47",{"$f":"C33-B33","v":0},{"$f":"E33-D33","v":3.4374999959254637E-3},null,"tanken",{"$f":"SUM(F33:F38)","v":0},null,1,null,null,null,null,0,0]
[0,null,null,"2015-11-26T19:59:42","2015-11-26T20:11:39",0,8.298611115606036E-3,null,"aan-afkoppelen",{"$f":"SUM(G33:G38)","v":1.17361111115315E-2},null,{"$f":"IF(M34,\"1\",0)","v":0},null,null,null,null,0,0]
[0,null,null,null,null,0,0,null,null,null,null,0,null,null,null,null,0,0]
[0,null,null,null,null,0,0,null,"Totaal uren",{"$f":"J37+J38","v":0},null,0,null,null,null,null,0,0]
[0,null,null,null,null,0,0,null,"wachten instructie",{"$f":"SUM(Q33:Q42)","v":0},null,0,null,null,null,null,0,0]
[0,null,null,null,null,0,0,null,"wachten koppelchauffeur",{"$f":"SUM(R33:R42)","v":0},null,0,null,null,null,null,0,0]
[0,null,null,null,null,0,0,null,null,null,null,0,null,null,null,null,0,0]
[0,null,null,null,null,0,0,null,null,null,null,0,null,null,null,null,0,0]
[0,null,null,null,null,0,0,null,null,null,null,0,null,null,null,null,0,0]
[0,null,null,null,null,0,0,null,null,null,null,0,null,null,null,null,0,0]
[]
[null,"donderdag 28-11-2019",null,null,null,null,null,null,null,null,null,null,{"$f":"B44","v":"donderdag 28-11-2019"}]
[null,"Begintijd","Eindtijd","Begintijd","Eindtijd","tanken","aan/afkoppelen",null,"Totaal uren",{"$f":"J46+J47","v":6.7824074067175388E-3},null,null,"Begintijd","Eindtijd","Begintijd","Eindtijd","wachten instructie","wachten koppelchauffeur"]
[{"$f":"IF(B46,\"1\",0)","v":"1"},"2015-11-27T05:45:30","2015-11-27T05:55:16",null,null,{"$f":"C46-B46","v":6.7824074067175388E-3},{"$f":"E46-D46","v":0},null,"tanken",{"$f":"SUM(F46:F55)","v":6.7824074067175388E-3},null,0,null,null,null,null,{"$f":"N46-M46","v":0},{"$f":"P46-O46","v":0}]
[0,null,null,null,null,{"$f":"C47-B47","v":0},0,null,"aan-afkoppelen",{"$f":"SUM(G46:G55)","v":0},null,{"$f":"IF(M46,\"1\",0)","v":0},null,null,null,null,0,{"$f":"P47-O47","v":0}]
[0,null,null,null,null,0,0,null,null,null,null,{"$f":"IF(M47,\"1\",0)","v":0},null,null,null,null,0,0]
[0,null,null,null,null,0,0,null,"Totaal uren",{"$f":"J50+J51","v":0},null,{"$f":"IF(M49,\"1\",0)","v":0},null,null,null,null,0,0]
[0,null,null,null,null,0,0,null,"wachten instructie",{"$f":"SUM(Q46:Q55)","v":0},null,0,null,null,null,null,0,0]
[0,null,null,null,null,0,0,null,"wachten koppelchauffeur",{"$f":"SUM(R46:R55)","v":0},null,0,null,null,null,null,0,0]
[0,null,null,null,null,0,0,null,null,null,null,0,null,null,null,null,0,0]
[0,null,null,null,null,0,0,null,null,null,null,0,null,null,null,null,0,0]
[0,null,null,null,null,0,0,null,null,null,null,0,null,null,null,null,0,0]
[0,null,null,null,null,0,0,null,null,null,null,0,null,null,null,null,0,0]
[]
[null,"vrijdag 29-11-2019",null,null,null,null,null,null,null,null,null,null,{"$f":"B57","v":"vrijdag 29-11-2019"}]
[null,"Begintijd","Eindtijd","Begintijd","Eindtijd","tanken","aan/afkoppelen",null,"Totaal uren",{"$f":"J59+J60","v":1.7997685179580003E-2},null,null,"Begintijd","Eindtijd","Begintijd","Eindtijd","wachten instructie","wachten koppelchauffeur"]
[{"$f":"IF(B59,\"1\",0)","v":0},null,null,"2015-11-28T18:03:20","2015-11-28T18:13:36",{"$f":"C59-B59","v":0},{"$f":"E59-D59","v":7.1296296300715767E-3},null,"tanken",{"$f":"SUM(F59:F64)","v":0},null,{"$f":"IF(M59,\"1\",0)","v":0},null,null,null,null,{"$f":"N59-M59","v":0},{"$f":"P59-O59","v":0}]
[{"$f":"IF(B60,\"1\",0)","v":0},null,null,"2015-11-28T20:40:07","2015-11-28T20:55:46",{"$f":"C60-B60","v":0},1.0868055549508426E-2,null,"aan-afkoppelen",{"$f":"SUM(G59:G64)","v":1.7997685179580003E-2},null,{"$f":"IF(M60,\"1\",0)","v":0},null,null,null,null,0,{"$f":"P60-O60","v":0}]
[0,null,null,null,null,0,0,null,null,null,null,0,null,null,null,null,0,0]
[0,null,null,null,null,0,0,null,"Totaal uren",{"$f":"J63+J64","v":0},null,0,null,null,null,null,0,0]
[0,null,null,null,null,0,0,null,"wachten instructie",{"$f":"SUM(Q59:Q68)","v":0},null,0,null,null,null,null,0,0]
[0,null,null,null,null,0,0,null,"wachten koppelchauffeur",{"$f":"SUM(R59:R68)","v":0},null,0,null,null,null,null,0,0]
[0,null,null,null,null,0,0,null,null,null,null,0,null,null,null,null,0,0]
[0,null,null,null,null,0,0,null,null,null,null,0,null,null,null,null,0,0]
[0,null,null,null,null,0,0,null,null,null,null,0,null,null,null,null,0,0]
[0,null,null,null,null,0,0,null,null,null,null,0,null,null,null,null,0,0]
[]
[null,"zaterdag 30-11-2019",null,null,null,null,null,null,null,null,null,null,{"$f":"B70","v":"zaterdag 30-11-2019"}]
[null,"Begintijd","Eindtijd","Begintijd","Eindtijd","tanken","aan/afkoppelen",null,"Totaal uren",{"$f":"J72+J73","v":0},null,null,"Begintijd","Eindtijd","Begintijd","Eindtijd","wachten instructie","wachten koppelchauffeur"]
[{"$f":"IF(B72,\"1\",0)","v":0},null,null,null,null,{"$f":"C72-B72","v":0},{"$f":"E72-D72","v":0},null,"tanken",{"$f":"SUM(F72:F81)","v":0},null,{"$f":"IF(M72,\"1\",0)","v":0},null,null,null,null,{"$f":"N72-M72","v":0},{"$f":"P72-O72","v":0}]
[{"$f":"IF(B73,\"1\",0)","v":0},null,null,null,null,{"$f":"C73-B73","v":0},{"$f":"E73-D73","v":0},null,"aan-afkoppelen",{"$f":"SUM(G72:G81)","v":0},null,{"$f":"IF(M73,\"1\",0)","v":0},null,null,null,null,{"$f":"N73-M73","v":0},{"$f":"P73-O73","v":0}]
[0,null,null,null,null,0,0,null,null,null,null,0,null,null,null,null,0,0]
[0,null,null,null,null,0,0,null,"Totaal uren",{"$f":"J76+J77","v":0},null,0,null,null,null,null,0,0]
[0,null,null,null,null,0,0,null,"wachten instructie",{"$f":"SUM(Q72:Q81)","v":0},null,0,null,null,null,null,0,0]
[0,null,null,null,null,0,0,null," wachten koppelchauffeur",{"$f":"SUM(R72:R81)","v":0},null,0,null,null,null,null,0,0]
[0,null,null,null,null,0,0,null,null,null,null,0,null,null,null,null,0,0]
[0,null,null,null,null,0,0,null,null,null,null,0,null,null,null,null,0,0]
[0,null,null,null,null,0,0,null,null,null,null,0,null,null,null,null,0,0]
[0,null,null,null,null,0,0,null,null,null,null,0,null,null,null,null,0,0]
[]
[null,"zondag 01-12-2019",null,null,null,null,null,null,null,null,null,null,{"$f":"B83","v":"zondag 01-12-2019"}]
[null,"Begintijd","Eindtijd","Begintijd","Eindtijd","tanken","aan/afkoppelen",null,"Totaal uren",{"$f":"J85+J86","v":1.0439814810524695E-2},null,null,"Begintijd","Eindtijd","Begintijd","Eindtijd","wachten instructie","wachten koppelchauffeur"]
[{"$f":"IF(B85,\"1\",0)","v":"1"},"2015-11-30T09:32:17","2015-11-30T09:47:19",null,null,{"$f":"C85-B85","v":1.0439814810524695E-2},{"$f":"E85-D85","v":0},null,"tanken",{"$f":"SUM(F85:F90)","v":1.0439814810524695E-2},null,{"$f":"IF(M85,\"1\",0)","v":0},null,null,null,null,{"$f":"N85-M85","v":0},{"$f":"P85-O85","v":0}]
[0,null,null,null,null,{"$f":"C86-B86","v":0},{"$f":"E86-D86","v":0},null,"aan-afkoppelen",{"$f":"SUM(G85:G90)","v":0},null,{"$f":"IF(M86,\"1\",0)","v":0},null,null,null,null,0,0]
[0,null,null,null,null,0,0,null,null,null,null,0,null,null,null,null,0,0]
[0,null,null,null,null,0,0,null,"Totaal uren",{"$f":"J89+J90","v":0},null,0,null,null,null,null,0,0]
[0,null,null,null,null,0,0,null,"wachten instructie",{"$f":"SUM(Q85:Q94)","v":0},null,0,null,null,null,null,0,0]
[0,null,null,null,null,0,0,null,"wachten koppelchauffeur",{"$f":"SUM(R85:R94)","v":0},null,0,null,null,null,null,0,0]
[0,null,null,null,null,0,0,null,null,null,null,0,null,null,null,null,0,0]
[0,null,null,null,null,0,0,null,null,null,null,0,null,null,null,null,0,0]
[0,null,null,null,null,0,0,null,null,null,null,0,null,null,null,null,0,0]
[0,null,null,null,null,0,0,null,null,null,null,0,null,null,null,null,0,0]
[]
[null,null,null,null,null,null,null,null,"tanken",{"$f":"J85+J72+J59+J46+J33+J20+J7","v":3.5671296296641231E-2}]
[]
[null,null,null,null,null,null,null,null,"aan-afkoppelen",{"$f":"J86+J73+J60+J47+J34+J21+J8","v":4.0682870363525581E-2}]
[]
[null,null,null,null,null,null,null,null,"Totaal uren",{"$f":"J98+J96","v":7.6354166660166811E-2}]
[]
[]
[null,null,null,null,null,null,null,null,"wachten instructie",{"$f":"J89+J76+J63+J50+J37+J24+J11","v":2.4861111116479151E-2}]
[]
[null,null,null,null,null,null,null,null,"wachten koppelchauffeur",{"$f":"J90+J77+J64+J51+J38+J25+J12","v":0}]
[]
[null,null,null,null,null,null,null,null,"Totaal uren",{"$f":"J105+J103","v":2.4861111116479151E-2}]
[]
[]
[null,"Einde dag-taken week 48"]

{"sheet":"Blad1","index":8,"n_rows":0,"n_cols":0,"rows_kept":0,"cut":false,"hidden":true,"merged":[]}

{"sheet":"LadenLossen (41)","index":9,"n_rows":38,"n_cols":17,"rows_kept":38,"cut":false,"hidden":true,"merged":[[17,17,17,18],[17,19,17,20],[18,17,18,18],[18,19,18,20],[11,11,11,12],[11,17,11,18],[11,19,11,20],[16,17,16,18],[16,19,16,20],[6,19,6,20],[7,11,7,12],[7,17,7,18],[7,19,7,20],[8,11,8,12],[8,17,8,18],[8,19,8,20],[6,17,6,18],[0,1,0,7],[0,13,0,15],[3,13,3,15],[4,1,5,4],[4,5,5,7]]}
["02:00:00","Laden/lossen (beschikbaarheidstijd (behalve bij Rood ))",null,null,null,null,null,null,null,"Week 41",null,null,null,"   = zelf laden/lossen"]
[]
[]
[null,null,null,null,null,null,null,null,null,"Totaal",null,null,null,"Wachturen laden/lossen"]
[null," Laden",null,null,null,"Lossen",null,null,null,"Laden","Lossen","Totaal uren",null,"Laden",null,"Lossen","Totaal uren"]
["Nr.",null,null,null,null,null,null,null,null,{"$f":"SUM(J8:J38)","v":0.15195601851640578},{"$f":"SUM(K8:K38)","v":0.23723379628791008},{"$f":"J6+K6","v":0.38918981480431586},null,{"$f":"SUM(N8:N16)","v":9.0787037038050286E-2},null,{"$f":"SUM(P8:P16)","v":0},{"$f":"N6+P6","v":9.0787037038050286E-2}]
[0,"begin",null,"eind",null,"begin",null,"eind"]
[1,"2015-10-06T09:22:55",null,"2015-10-06T09:24:41",null,null,null,null,null,{"$f":"IF(D8<>\"\",IF(D8-B8>TIME(2,0,0),TIME(2,0,0),D8-B8),\"\")","v":1.2268518476048484E-3},{"$f":"IF(H8<>\"\",IF((H8-F8)>TIME(2,0,0),TIME(2,0,0),H8-F8),\"\")","v":""},null,null,{"$f":"IF(D8-B8>TIME(2,0,0),D8-B8-TIME(2,0,0),\"\")","v":""},null,{"$f":"IF((H8-F8)>TIME(2,0,0),H8-F8-TIME(2,0,0),\"\")","v":""}]
[2,null,null,null,null,"2015-10-06T09:26:45",null,"2015-10-06T10:11:50",null,{"$f":"IF(D9<>\"\",IF(D9-B9>TIME(2,0,0),TIME(2,0,0),D9-B9),\"\")","v":""},3.1307870369346347E-2,null,null,{"$f":"IF(D9-B9>TIME(2,0,0),D9-B9-TIME(2,0,0),\"\")","v":""},null,{"$f":"IF((H9-F9)>TIME(2,0,0),H9-F9-TIME(2,0,0),\"\")","v":""}]
[3,null,null,null,null,"2015-10-06T10:15:30",null,"2015-10-06T12:05:42",null,{"$f":"IF(D10<>\"\",IF(D10-B10>TIME(2,0,0),TIME(2,0,0),D10-B10),\"\")","v":""},7.6527777775481809E-2]
[4,null,null,null,null,"2015-10-06T15:17:25",null,"2015-10-06T16:33:40",null,{"$f":"IF(D11<>\"\",IF(D11-B11>TIME(2,0,0),TIME(2,0,0),D11-B11),\"\")","v":""},5.2951388890505768E-2,null,null,{"$f":"IF(D11-B11>TIME(2,0,0),D11-B11-TIME(2,0,0),\"\")","v":""},null,{"$f":"IF((H11-F11)>TIME(2,0,0),H11-F11-TIME(2,0,0),\"\")","v":""}]
[5,"2015-10-07T07:49:50",null,"2015-10-07T12:00:34",null,null,null,null,null,{"$f":"IF(D12<>\"\",IF(D12-B12>TIME(2,0,0),TIME(2,0,0),D12-B12),\"\")","v":8.3333333333333329E-2},"",null,null,{"$f":"IF(D12-B12>TIME(2,0,0),D12-B12-TIME(2,0,0),\"\")","v":9.0787037038050286E-2},null,{"$f":"IF((H12-F12)>TIME(2,0,0),H12-F12-TIME(2,0,0),\"\")","v":""}]
[6,null,null,null,null,"2015-10-09T08:09:21",null,"2015-10-09T09:45:39",null,null,6.6874999996798579E-2]
[7,"2015-10-09T09:45:48",null,"2015-10-09T10:18:29",null,null,null,null,null,{"$f":"IF(D14<>\"\",IF(D14-B14>TIME(2,0,0),TIME(2,0,0),D14-B14),\"\")","v":2.269675926072523E-2},""]
[8,"2015-10-09T10:45:01",null,"2015-10-09T11:10:17",null,null,null,null,null,{"$f":"IF(D15<>\"\",IF(D15-B15>TIME(2,0,0),TIME(2,0,0),D15-B15),\"\")","v":1.7546296294312924E-2},""]
[9,"2015-10-09T13:27:42",null,"2015-10-09T14:06:48",null,null,null,null,null,{"$f":"IF(D16<>\"\",IF(D16-B16>TIME(2,0,0),TIME(2,0,0),D16-B16),\"\")","v":2.715277778042946E-2},""]
[10,null,null,null,null,"2015-10-09T16:34:03",null,42286.699884259258,null,{"$f":"IF(D17<>\"\",D17-B17,\"\")","v":""},{"$f":"IF(H17<>\"\",H17-F17,\"\")","v":9.5717592557775788E-3}]
[null,null,null,null,null,null,null,null,null,{"$f":"IF(D18<>\"\",D18-B18,\"\")","v":""},{"$f":"IF(H18<>\"\",H18-F18,\"\")","v":""}]
[null,null,null,null,null,null,null,null,null,{"$f":"IF(D19<>\"\",D19-B19,\"\")","v":""},{"$f":"IF(H19<>\"\",H19-F19,\"\")","v":""},{"$f":"IF(H19<>\"\",H19-F19,\"\")","v":""}]
[null,null,null,null,null,null,null,null,null,"",""]
[null,null,null,null,null,null,null,null,null,"",""]
[null,null,null,null,null,null,null,null,null,null,""]
[null,null,null,null,null,null,null,null,null,"",""]
[null,null,null,null,null,null,null,null,null,"",""]
[null,null,null,null,null,null,null,null,null,"",""]
[null,null,null,null,null,null,null,null,null,"",""]
[null,null,null,null,null,null,null,null,null,"",""]
[null,null,null,null,null,null,null,null,null,"",""]
[null,null,null,null,null,null,null,null,null,"",""]
[null,null,null,null,null,null,null,null,null,null,""]
[null,null,null,null,null,null,null,null,null,"",""]
[null,null,null,null,null,null,null,null,null,"",""]
[null,null,null,null,null,null,null,null,null,"",""]
[null,null,null,null,null,null,null,null,null,"",""]
[null,null,null,null,null,null,null,null,null,"",""]
[null,null,null,null,null,null,null,null,null,"",""]
[null,null,null,null,null,null,null,null,null,"",""]
[null,null,null,null,null,null,null,null,null,"",""]

{"sheet":"Dag-taken week (41)","index":10,"n_rows":110,"n_cols":18,"rows_kept":110,"cut":false,"hidden":true,"merged":[[106,8,108,8],[106,9,108,10],[109,1,112,17],[99,8,100,8],[99,9,100,10],[102,8,103,8],[102,9,103,10],[104,8,105,8],[104,9,105,10],[82,1,82,6],[82,12,82,17],[95,8,96,8],[95,9,96,10],[97,8,98,8],[97,9,98,10],[43,1,43,6],[43,12,43,17],[56,1,56,6],[56,12,56,17],[69,1,69,6],[69,12,69,17],[30,1,30,6],[30,12,30,17],[0,12,0,17],[4,1,4,6],[4,12,4,17],[17,1,17,6],[17,12,17,17]]}
[null,"Dag-taken week 41",null,null,null,null,null,null,null,null,null,null,{"$f":"B1","v":"Dag-taken week 41"}]
[null,"tanken",null,"aan/afkoppelen",null,"Totaal",{"$f":"Q2","v":"Tijden"},null,null,null,null,null,"wachten instructie",null,"wachten koppelchauffeur",null,"Tijden"]
[]
[]
[null,"maandag 07-10-2019",null,null,null,null,null,null,null,null,null,null,{"$f":"B5","v":"maandag 07-10-2019"}]
[null,"Begintijd","Eindtijd","Begintijd","Eindtijd","tanken","aan/afkoppelen",null,"Totaal uren",{"$f":"J7+J8","v":2.3437500007275958E-2},null,null,"Begintijd","Eindtijd","Begintijd","Eindtijd","wachten instructie","wachten koppelchauffeur"]
[{"$f":"IF(B7,\"1\",0)","v":"1"},"2015-10-06T03:10:38","2015-10-06T03:23:30","2015-10-06T03:26:58","2015-10-06T03:41:35",{"$f":"C7-B7","v":8.9351851856918074E-3},{"$f":"E7-D7","v":1.0150462963792961E-2},null,"tanken",{"$f":"SUM(F7:F12)","v":1.3287037043482997E-2},null,{"$f":"IF(M7,\"1\",0)","v":0},null,null,null,null,{"$f":"N7-M7","v":0},{"$f":"P7-O7","v":0}]
["1","2015-10-06T03:45:39","2015-10-06T03:51:55",null,null,{"$f":"C8-B8","v":4.3518518577911891E-3},0,null,"aan-afkoppelen",{"$f":"SUM(G7:G12)","v":1.0150462963792961E-2},null,0,null,null,null,null,{"$f":"N8-M8","v":0},{"$f":"P8-O8","v":0}]
[0,null,null,null,null,0,0,null,null,null,null,0,null,null,null,null,0,0]
[0,null,null,null,null,0,0,null,"Totaal uren",{"$f":"J11+J12","v":0},null,0,null,null,null,null,0,0]
[0,null,null,null,null,0,0,null,"wachten instructie",{"$f":"SUM(Q7:Q16)","v":0},null,0,null,null,null,null,0,0]
[0,null,null,null,null,0,0,null," wachten koppelchauffeur",{"$f":"SUM(R7:R16)","v":0},null,0,null,null,null,null,0,0]
[0,null,null,null,null,0,0,null,null,null,null,0,null,null,null,null,0,0]
[0,null,null,null,null,0,0,null,null,null,null,0,null,null,null,null,0,0]
[0,null,null,null,null,0,0,null,null,null,null,0,null,null,null,null,0,0]
[0,null,null,null,null,0,0,null,null,null,null,0,null,null,null,null,0,0]
[]
[null,"dinsdag 08-10-2019",null,null,null,null,null,null,null,null,null,null,{"$f":"B18","v":"dinsdag 08-10-2019"}]
[null,"Begintijd","Eindtijd","Begintijd","Eindtijd","tanken","aan/afkoppelen",null,"Totaal uren",{"$f":"J20+J21","v":0},null,null,"Begintijd","Eindtijd","Begintijd","Eindtijd","wachten instructie","wachten koppelchauffeur"]
[{"$f":"IF(B20,\"1\",0)","v":0},null,null,null,null,{"$f":"C20-B20","v":0},{"$f":"E20-D20","v":0},null,"tanken",{"$f":"SUM(F20:F29)","v":0},null,{"$f":"IF(M20,\"1\",0)","v":0},null,null,null,null,{"$f":"N20-M20","v":0},{"$f":"R7","v":0}]
[{"$f":"IF(B21,\"1\",0)","v":0},null,null,null,null,0,0,null,"aan-afkoppelen",{"$f":"SUM(G20:G29)","v":0},null,0,null,null,null,null,{"$f":"N21-M21","v":0},0]
[0,null,null,null,null,0,0,null,null,null,null,0,null,null,null,null,0,0]
[0,null,null,null,null,0,0,null,"Totaal uren",{"$f":"J24+J25","v":0},null,0,null,null,null,null,0,0]
[0,null,null,null,null,0,0,null,"wachten instructie",{"$f":"SUM(Q20:Q29)","v":0},null,0,null,null,null,null,0,0]
[0,null,null,null,null,0,0,null,"wachten koppelchauffeur",{"$f":"SUM(R20:R29)","v":0},null,0,null,null,null,null,0,0]
[0,null,null,null,null,0,0,null,null,null,null,0,null,null,null,null,0,0]
[0,null,null,null,null,0,0,null,null,null,null,0,null,null,null,null,0,0]
[0,null,null,null,null,0,0,null,null,null,null,0,null,null,null,null,0,0]
[0,null,null,null,null,0,0,null,null,null,null,0,null,null,null,null,{"$f":"Q16","v":0},{"$f":"R16","v":0}]
[]
[null,"woensdag 09-10-2019",null,null,null,null,null,null,null,null,null,null,{"$f":"B31","v":"woensdag 09-10-2019"}]
[null,"Begintijd","Eindtijd","Begintijd","Eindtijd","tanken","aan/afkoppelen",null,"Totaal uren",{"$f":"J33+J34","v":0},null,null,"Begintijd","Eindtijd","Begintijd","Eindtijd","wachten instructie","wachten koppelchauffeur"]
[{"$f":"IF(B33,\"1\",0)","v":0},null,null,null,null,{"$f":"C33-B33","v":0},{"$f":"E33-D33","v":0},null,"tanken",{"$f":"SUM(F33:F38)","v":0},null,1,null,null,null,null,0,0]
[0,null,null,null,null,0,0,null,"aan-afkoppelen",{"$f":"SUM(G33:G38)","v":0},null,{"$f":"IF(M34,\"1\",0)","v":0},null,null,null,null,0,0]
[0,null,null,null,null,0,0,null,null,null,null,0,null,null,null,null,0,0]
[0,null,null,null,null,0,0,null,"Totaal uren",{"$f":"J37+J38","v":0},null,0,null,null,null,null,0,0]
[0,null,null,null,null,0,0,null,"wachten instructie",{"$f":"SUM(Q33:Q42)","v":0},null,0,null,null,null,null,0,0]
[0,null,null,null,null,0,0,null,"wachten koppelchauffeur",{"$f":"SUM(R33:R42)","v":0},null,0,null,null,null,null,0,0]
[0,null,null,null,null,0,0,null,null,null,null,0,null,null,null,null,0,0]
[0,null,null,null,null,0,0,null,null,null,null,0,null,null,null,null,0,0]
[0,null,null,null,null,0,0,null,null,null,null,0,null,null,null,null,0,0]
[0,null,null,null,null,0,0,null,null,null,null,0,null,null,null,null,0,0]
[]
[null,"donderdag 10-10-2019",null,null,null,null,null,null,null,null,null,null,{"$f":"B44","v":"donderdag 10-10-2019"}]
[null,"Begintijd","Eindtijd","Begintijd","Eindtijd","tanken","aan/afkoppelen",null,"Totaal uren",{"$f":"J46+J47","v":1.0162037040572613E-2},null,null,"Begintijd","Eindtijd","Begintijd","Eindtijd","wachten instructie","wachten koppelchauffeur"]
[{"$f":"IF(B46,\"1\",0)","v":"1"},"2015-10-09T16:16:11","2015-10-09T16:30:49",null,null,{"$f":"C46-B46","v":1.0162037040572613E-2},{"$f":"E46-D46","v":0},null,"tanken",{"$f":"SUM(F46:F55)","v":1.0162037040572613E-2},null,0,"2015-10-09T11:12:10","2015-10-09T11:31:00",null,null,{"$f":"N46-M46","v":1.3078703705104999E-2},{"$f":"P46-O46","v":0}]
[{"$f":"IF(B47,\"1\",0)","v":0},null,null,null,null,{"$f":"C47-B47","v":0},0,null,"aan-afkoppelen",{"$f":"SUM(G46:G55)","v":0},null,{"$f":"IF(M46,\"1\",0)","v":"1"},null,null,null,null,0,{"$f":"P47-O47","v":0}]
[0,null,null,null,null,0,0,null,null,null,null,{"$f":"IF(M47,\"1\",0)","v":0},null,null,null,null,0,0]
[0,null,null,null,null,0,0,null,"Totaal uren",{"$f":"J50+J51","v":1.3078703705104999E-2},null,{"$f":"IF(M49,\"1\",0)","v":0},null,null,null,null,0,0]
[0,null,null,null,null,0,0,null,"wachten instructie",{"$f":"SUM(Q46:Q55)","v":1.3078703705104999E-2},null,0,null,null,null,null,0,0]
[0,null,null,null,null,0,0,null,"wachten koppelchauffeur",{"$f":"SUM(R46:R55)","v":0},null,0,null,null,null,null,0,0]
[0,null,null,null,null,0,0,null,null,null,null,0,null,null,null,null,0,0]
[0,null,null,null,null,0,0,null,null,null,null,0,null,null,null,null,0,0]
[0,null,null,null,null,0,0,null,null,null,null,0,null,null,null,null,0,0]
[0,null,null,null,null,0,0,null,null,null,null,0,null,null,null,null,0,0]
[]
[null,"vrijdag 11-10-2019",null,null,null,null,null,null,null,null,null,null,{"$f":"B57","v":"vrijdag 11-10-2019"}]
[null,"Begintijd","Eindtijd","Begintijd","Eindtijd","tanken","aan/afkoppelen",null,"Totaal uren",{"$f":"J59+J60","v":0},null,null,"Begintijd","Eindtijd","Begintijd","Eindtijd","wachten instructie","wachten koppelchauffeur"]
[{"$f":"IF(B59,\"1\",0)","v":0},null,null,null,null,{"$f":"C59-B59","v":0},{"$f":"E59-D59","v":0},null,"tanken",{"$f":"SUM(F59:F64)","v":0},null,{"$f":"IF(M59,\"1\",0)","v":0},null,null,null,null,{"$f":"N59-M59","v":0},{"$f":"P59-O59","v":0}]
[{"$f":"IF(B60,\"1\",0)","v":0},null,null,null,null,{"$f":"C60-B60","v":0},0,null,"aan-afkoppelen",{"$f":"SUM(G59:G64)","v":0},null,{"$f":"IF(M60,\"1\",0)","v":0},null,null,null,null,0,{"$f":"P60-O60","v":0}]
[0,null,null,null,null,0,0,null,null,null,null,0,null,null,null,null,0,0]
[0,null,null,null,null,0,0,null,"Totaal uren",{"$f":"J63+J64","v":0},null,0,null,null,null,null,0,0]
[0,null,null,null,null,0,0,null,"wachten instructie",{"$f":"SUM(Q59:Q68)","v":0},null,0,null,null,null,null,0,0]
[0,null,null,null,null,0,0,null,"wachten koppelchauffeur",{"$f":"SUM(R59:R68)","v":0},null,0,null,null,null,null,0,0]
[0,null,null,null,null,0,0,null,null,null,null,0,null,null,null,null,0,0]
[0,null,null,null,null,0,0,null,null,null,null,0,null,null,null,null,0,0]
[0,null,null,null,null,0,0,null,null,null,null,0,null,null,null,null,0,0]
[0,null,null,null,null,0,0,null,null,null,null,0,null,null,null,null,0,0]
[]
[null,"zaterdag 12-10-2019",null,null,null,null,null,null,null,null,null,null,{"$f":"B70","v":"zaterdag 12-10-2019"}]
[null,"Begintijd","Eindtijd","Begintijd","Eindtijd","tanken","aan/afkoppelen",null,"Totaal uren",{"$f":"J72+J73","v":0},null,null,"Begintijd","Eindtijd","Begintijd","Eindtijd","wachten instructie","wachten koppelchauffeur"]
[{"$f":"IF(B72,\"1\",0)","v":0},null,null,null,null,{"$f":"C72-B72","v":0},{"$f":"E72-D72","v":0},null,"tanken",{"$f":"SUM(F72:F81)","v":0},null,{"$f":"IF(M72,\"1\",0)","v":0},null,null,null,null,{"$f":"N72-M72","v":0},{"$f":"P72-O72","v":0}]
[{"$f":"IF(B73,\"1\",0)","v":0},null,null,null,null,{"$f":"C73-B73","v":0},{"$f":"E73-D73","v":0},null,"aan-afkoppelen",{"$f":"SUM(G72:G81)","v":0},null,{"$f":"IF(M73,\"1\",0)","v":0},null,null,null,null,{"$f":"N73-M73","v":0},{"$f":"P73-O73","v":0}]
[0,null,null,null,null,0,0,null,null,null,null,0,null,null,null,null,0,0]
[0,null,null,null,null,0,0,null,"Totaal uren",{"$f":"J76+J77","v":0},null,0,null,null,null,null,0,0]
[0,null,null,null,null,0,0,null,"wachten instructie",{"$f":"SUM(Q72:Q81)","v":0},null,0,null,null,null,null,0,0]
[0,null,null,null,null,0,0,null," wachten koppelchauffeur",{"$f":"SUM(R72:R81)","v":0},null,0,null,null,null,null,0,0]
[0,null,null,null,null,0,0,null,null,null,null,0,null,null,null,null,0,0]
[0,null,null,null,null,0,0,null,null,null,null,0,null,null,null,null,0,0]
[0,null,null,null,null,0,0,null,null,null,null,0,null,null,null,null,0,0]
[0,null,null,null,null,0,0,null,null,null,null,0,null,null,null,null,0,0]
[]
[null,"zondag 13-10-2019",null,null,null,null,null,null,null,null,null,null,{"$f":"B83","v":"zondag 13-10-2019"}]
[null,"Begintijd","Eindtijd","Begintijd","Eindtijd","tanken","aan/afkoppelen",null,"Totaal uren",{"$f":"J85+J86","v":0},null,null,"Begintijd","Eindtijd","Begintijd","Eindtijd","wachten instructie","wachten koppelchauffeur"]
[{"$f":"IF(B85,\"1\",0)","v":0},null,null,null,null,{"$f":"C85-B85","v":0},{"$f":"E85-D85","v":0},null,"tanken",{"$f":"SUM(F85:F90)","v":0},null,{"$f":"IF(M85,\"1\",0)","v":0},null,null,null,null,{"$f":"N85-M85","v":0},{"$f":"P85-O85","v":0}]
[0,null,null,null,null,{"$f":"C86-B86","v":0},{"$f":"E86-D86","v":0},null,"aan-afkoppelen",{"$f":"SUM(G85:G90)","v":0},null,{"$f":"IF(M86,\"1\",0)","v":0},null,null,null,null,0,0]
[0,null,null,null,null,0,0,null,null,null,null,0,null,null,null,null,0,0]
[0,null,null,null,null,0,0,null,"Totaal uren",{"$f":"J89+J90","v":0},null,0,null,null,null,null,0,0]
[0,null,null,null,null,0,0,null,"wachten instructie",{"$f":"SUM(Q85:Q94)","v":0},null,0,null,null,null,null,0,0]
[0,null,null,null,null,0,0,null,"wachten koppelchauffeur",{"$f":"SUM(R85:R94)","v":0},null,0,null,null,null,null,0,0]
[0,null,null,null,null,0,0,null,null,null,null,0,null,null,null,null,0,0]
[0,null,null,null,null,0,0,null,null,null,null,0,null,null,null,null,0,0]
[0,null,null,null,null,0,0,null,null,null,null,0,null,null,null,null,0,0]
[0,null,null,null,null,0,0,null,null,null,null,0,null,null,null,null,0,0]
[]
[null,null,null,null,null,null,null,null,"tanken",{"$f":"J85+J72+J59+J46+J33+J20+J7","v":2.344907408405561E-2}]
[]
[null,null,null,null,null,null,null,null,"aan-afkoppelen",{"$f":"J86+J73+J60+J47+J34+J21+J8","v":1.0150462963792961E-2}]
[]
[null,null,null,null,null,null,null,null,"Totaal uren",{"$f":"J98+J96","v":3.3599537047848571E-2}]
[]
[]
[null,null,null,null,null,null,null,null,"wachten instructie",{"$f":"J89+J76+J63+J50+J37+J24+J11","v":1.3078703705104999E-2}]
[]
[null,null,null,null,null,null,null,null,"wachten koppelchauffeur",{"$f":"J90+J77+J64+J51+J38+J25+J12","v":0}]
[]
[null,null,null,null,null,null,null,null,"Totaal uren",{"$f":"J105+J103","v":1.3078703705104999E-2}]
[]
[]
[null,"Einde dag-taken week 41"]

{"sheet":"LadenLossen (40)","index":11,"n_rows":38,"n_cols":17,"rows_kept":38,"cut":false,"hidden":true,"merged":[[0,1,0,7],[0,13,0,15],[3,13,3,15],[4,1,5,4],[4,5,5,7],[6,19,6,20],[7,11,7,12],[7,17,7,18],[7,19,7,20],[8,11,8,12],[8,17,8,18],[8,19,8,20],[6,17,6,18],[11,11,11,12],[11,17,11,18],[11,19,11,20],[18,11,18,12],[18,17,18,18],[18,19,18,20],[16,11,16,12],[16,17,16,18],[16,19,16,20],[17,11,17,12],[17,17,17,18],[17,19,17,20]]}
["02:00:00","Laden/lossen (beschikbaarheidstijd (behalve bij Rood ))",null,null,null,null,null,null,null,"Week 40",null,null,null,"   = zelf laden/lossen"]
[]
[]
[null,null,null,null,null,null,null,null,null,"Totaal",null,null,null,"Wachturen laden/lossen"]
[null," Laden",null,null,null,"Lossen",null,null,null,"Laden","Lossen","Totaal uren",null,"Laden",null,"Lossen","Totaal uren"]
["Nr.",null,null,null,null,null,null,null,null,{"$f":"SUM(J8:J38)","v":0.24421296296107659},{"$f":"SUM(K8:K38)","v":0.21196759260055842},{"$f":"J6+K6","v":0.456180555561635},null,{"$f":"SUM(N8:N16)","v":2.8541666668994978E-2},null,{"$f":"SUM(P8:P16)","v":0},{"$f":"N6+P6","v":2.8541666668994978E-2}]
[0,"begin",null,"eind",null,"begin",null,"eind"]
[1,"2015-09-29T02:40:24",null,"2015-09-29T02:45:12",null,null,null,null,null,{"$f":"IF(D8<>\"\",IF(D8-B8>TIME(2,0,0),TIME(2,0,0),D8-B8),\"\")","v":3.3333333340124227E-3},{"$f":"IF(H8<>\"\",IF((H8-F8)>TIME(2,0,0),TIME(2,0,0),H8-F8),\"\")","v":""},null,null,{"$f":"IF(D8-B8>TIME(2,0,0),D8-B8-TIME(2,0,0),\"\")","v":""},null,{"$f":"IF((H8-F8)>TIME(2,0,0),H8-F8-TIME(2,0,0),\"\")","v":""}]
[2,null,null,null,null,"2015-09-29T08:50:42",null,"2015-09-29T10:15:50",null,{"$f":"IF(D9<>\"\",IF(D9-B9>TIME(2,0,0),TIME(2,0,0),D9-B9),\"\")","v":""},5.9120370373420883E-2,null,null,{"$f":"IF(D9-B9>TIME(2,0,0),D9-B9-TIME(2,0,0),\"\")","v":""},null,{"$f":"IF((H9-F9)>TIME(2,0,0),H9-F9-TIME(2,0,0),\"\")","v":""}]
[3,null,null,null,null,"2015-09-29T10:16:29",null,"2015-09-29T10:33:35",null,{"$f":"IF(D10<>\"\",IF(D10-B10>TIME(2,0,0),TIME(2,0,0),D10-B10),\"\")","v":""},1.187499999650754E-2]
[4,"2015-09-30T07:11:00",null,"2015-09-30T09:52:06",null,null,null,null,null,{"$f":"IF(D11<>\"\",IF(D11-B11>TIME(2,0,0),TIME(2,0,0),D11-B11),\"\")","v":8.3333333333333329E-2},"",null,null,{"$f":"IF(D11-B11>TIME(2,0,0),D11-B11-TIME(2,0,0),\"\")","v":2.8541666668994978E-2},null,{"$f":"IF((H11-F11)>TIME(2,0,0),H11-F11-TIME(2,0,0),\"\")","v":""}]
[5,"2015-09-30T11:05:56",null,"2015-09-30T11:45:03",null,null,null,null,null,{"$f":"IF(D12<>\"\",IF(D12-B12>TIME(2,0,0),TIME(2,0,0),D12-B12),\"\")","v":2.7164351857209112E-2},"",null,null,{"$f":"IF(D12-B12>TIME(2,0,0),D12-B12-TIME(2,0,0),\"\")","v":""},null,{"$f":"IF((H12-F12)>TIME(2,0,0),H12-F12-TIME(2,0,0),\"\")","v":""}]
[6,null,null,null,null,"2015-09-30T12:51:19",null,42277.594409722224,null,null,5.8773148150066845E-2]
[7,null,null,null,null,"2015-09-30T15:00:30",null,42277.660902777781,null,{"$f":"IF(D14<>\"\",IF(D14-B14>TIME(2,0,0),TIME(2,0,0),D14-B14),\"\")","v":""},3.5555555557948537E-2]
[8,"2015-10-01T07:33:41",null,42278.371018518519,null,null,null,null,null,{"$f":"IF(D15<>\"\",IF(D15-B15>TIME(2,0,0),TIME(2,0,0),D15-B15),\"\")","v":5.59606481474475E-2},""]
[9,"2015-10-01T10:50:06",null,42278.494942129626,null,null,null,null,null,{"$f":"IF(D16<>\"\",IF(D16-B16>TIME(2,0,0),TIME(2,0,0),D16-B16),\"\")","v":4.3483796289365273E-2},""]
[10,"2015-10-01T13:46:18",null,"2015-10-01T14:30:51",null,null,null,null,null,{"$f":"IF(D17<>\"\",D17-B17,\"\")","v":3.0937499999708962E-2},{"$f":"IF(H17<>\"\",H17-F17,\"\")","v":""},{"$f":"IF(H17<>\"\",H17-F17,\"\")","v":""}]
[11,null,null,null,null,"2015-10-02T14:28:02",null,"2015-10-02T15:35:12",null,"",4.6643518522614613E-2]
[null,null,null,null,null,null,null,null,null,"","",{"$f":"IF(H19<>\"\",H19-F19,\"\")","v":""}]
[null,null,null,null,null,null,null,null,null,"",""]
[null,null,null,null,null,null,null,null,null,"",""]
[null,null,null,null,null,null,null,null,null,"",""]
[null,null,null,null,null,null,null,null,null,"",""]
[null,null,null,null,null,null,null,null,null,"",""]
[null,null,null,null,null,null,null,null,null,"",""]
[null,null,null,null,null,null,null,null,null,"",""]
[null,null,null,null,null,null,null,null,null,"",""]
[null,null,null,null,null,null,null,null,null,"",""]
[null,null,null,null,null,null,null,null,null,"",""]
[null,null,null,null,null,null,null,null,null,"",""]
[null,null,null,null,null,null,null,null,null,"",""]
[null,null,null,null,null,null,null,null,null,"",""]
[null,null,null,null,null,null,null,null,null,"",""]
[null,null,null,null,null,null,null,null,null,"",""]
[null,null,null,null,null,null,null,null,null,"",""]
[null,null,null,null,null,null,null,null,null,"",""]
[null,null,null,null,null,null,null,null,null,"",""]
[null,null,null,null,null,null,null,null,null,"",""]

{"sheet":"Dag-taken week (40)","index":12,"n_rows":110,"n_cols":18,"rows_kept":110,"cut":false,"hidden":true,"merged":[[30,1,30,6],[30,12,30,17],[0,12,0,17],[4,1,4,6],[4,12,4,17],[17,1,17,6],[17,12,17,17],[43,1,43,6],[43,12,43,17],[56,1,56,6],[56,12,56,17],[69,1,69,6],[69,12,69,17],[82,1,82,6],[82,12,82,17],[95,8,96,8],[95,9,96,10],[97,8,98,8],[97,9,98,10],[106,8,108,8],[106,9,108,10],[109,1,112,17],[99,8,100,8],[99,9,100,10],[102,8,103,8],[102,9,103,10],[104,8,105,8],[104,9,105,10]]}
[null,"Dag-taken week 40",null,null,null,null,null,null,null,null,null,null,{"$f":"B1","v":"Dag-taken week 40"}]
[null,"tanken",null,"aan/afkoppelen",null,"Totaal",{"$f":"Q2","v":"Tijden"},null,null,null,null,null,"wachten instructie",null,"wachten koppelchauffeur",null,"Tijden"]
[]
[]
[null,"maandag 30-9-2019",null,null,null,null,null,null,null,null,null,null,{"$f":"B5","v":"maandag 30-9-2019"}]
[null,"Begintijd","Eindtijd","Begintijd","Eindtijd","tanken","aan/afkoppelen",null,"Totaal uren",{"$f":"J7+J8","v":1.8148148148611654E-2},null,null,"Begintijd","Eindtijd","Begintijd","Eindtijd","wachten instructie","wachten koppelchauffeur"]
[{"$f":"IF(B7,\"1\",0)","v":"1"},"2015-09-29T02:21:06","2015-09-29T02:39:53","2015-09-29T02:11:27","2015-09-29T02:18:48",{"$f":"C7-B7","v":1.3043981482042E-2},{"$f":"E7-D7","v":5.1041666665696539E-3},null,"tanken",{"$f":"SUM(F7:F12)","v":1.3043981482042E-2},null,{"$f":"IF(M7,\"1\",0)","v":"1"},"2015-09-29T10:34:59","2015-09-29T10:52:06",null,null,{"$f":"N7-M7","v":1.1886574073287193E-2},{"$f":"P7-O7","v":0}]
[0,null,null,null,null,{"$f":"C8-B8","v":0},0,null,"aan-afkoppelen",{"$f":"SUM(G7:G12)","v":5.1041666665696539E-3},null,0,null,null,null,null,{"$f":"N8-M8","v":0},{"$f":"P8-O8","v":0}]
[0,null,null,null,null,0,0,null,null,null,null,0,null,null,null,null,0,0]
[0,null,null,null,null,0,0,null,"Totaal uren",{"$f":"J11+J12","v":1.1886574073287193E-2},null,0,null,null,null,null,0,0]
[0,null,null,null,null,0,0,null,"wachten instructie",{"$f":"SUM(Q7:Q16)","v":1.1886574073287193E-2},null,0,null,null,null,null,0,0]
[0,null,null,null,null,0,0,null," wachten koppelchauffeur",{"$f":"SUM(R7:R16)","v":0},null,0,null,null,null,null,0,0]
[0,null,null,null,null,0,0,null,null,null,null,0,null,null,null,null,0,0]
[0,null,null,null,null,0,0,null,null,null,null,0,null,null,null,null,0,0]
[0,null,null,null,null,0,0,null,null,null,null,0,null,null,null,null,0,0]
[0,null,null,null,null,0,0,null,null,null,null,0,null,null,null,null,0,0]
[]
[null,"dinsdag 01-10-2019",null,null,null,null,null,null,null,null,null,null,{"$f":"B18","v":"dinsdag 01-10-2019"}]
[null,"Begintijd","Eindtijd","Begintijd","Eindtijd","tanken","aan/afkoppelen",null,"Totaal uren",{"$f":"J20+J21","v":0},null,null,"Begintijd","Eindtijd","Begintijd","Eindtijd","wachten instructie","wachten koppelchauffeur"]
[{"$f":"IF(B20,\"1\",0)","v":0},null,null,null,null,{"$f":"C20-B20","v":0},{"$f":"E20-D20","v":0},null,"tanken",{"$f":"SUM(F20:F29)","v":0},null,{"$f":"IF(M20,\"1\",0)","v":"1"},"2015-09-30T15:51:57","2015-09-30T16:14:47",null,null,{"$f":"N20-M20","v":1.5856481484661344E-2},{"$f":"R7","v":0}]
[{"$f":"IF(B21,\"1\",0)","v":0},null,null,null,null,0,0,null,"aan-afkoppelen",{"$f":"SUM(G20:G29)","v":0},null,0,null,null,null,null,{"$f":"N21-M21","v":0},0]
[0,null,null,null,null,0,0,null,null,null,null,0,null,null,null,null,0,0]
[0,null,null,null,null,0,0,null,"Totaal uren",{"$f":"J24+J25","v":1.5856481484661344E-2},null,0,null,null,null,null,0,0]
[0,null,null,null,null,0,0,null,"wachten instructie",{"$f":"SUM(Q20:Q29)","v":1.5856481484661344E-2},null,0,null,null,null,null,0,0]
[0,null,null,null,null,0,0,null,"wachten koppelchauffeur",{"$f":"SUM(R20:R29)","v":0},null,0,null,null,null,null,0,0]
[0,null,null,null,null,0,0,null,null,null,null,0,null,null,null,null,0,0]
[0,null,null,null,null,0,0,null,null,null,null,0,null,null,null,null,0,0]
[0,null,null,null,null,0,0,null,null,null,null,0,null,null,null,null,0,0]
[0,null,null,null,null,0,0,null,null,null,null,0,null,null,null,null,{"$f":"Q16","v":0},{"$f":"R16","v":0}]
[]
[null,"woensdag 02-10-2019",null,null,null,null,null,null,null,null,null,null,{"$f":"B31","v":"woensdag 02-10-2019"}]
[null,"Begintijd","Eindtijd","Begintijd","Eindtijd","tanken","aan/afkoppelen",null,"Totaal uren",{"$f":"J33+J34","v":0},null,null,"Begintijd","Eindtijd","Begintijd","Eindtijd","wachten instructie","wachten koppelchauffeur"]
[{"$f":"IF(B33,\"1\",0)","v":0},null,null,null,null,{"$f":"C33-B33","v":0},{"$f":"E33-D33","v":0},null,"tanken",{"$f":"SUM(F33:F38)","v":0},null,1,null,null,null,null,0,0]
[0,null,null,null,null,0,0,null,"aan-afkoppelen",{"$f":"SUM(G33:G38)","v":0},null,{"$f":"IF(M34,\"1\",0)","v":0},null,null,null,null,0,0]
[0,null,null,null,null,0,0,null,null,null,null,0,null,null,null,null,0,0]
[0,null,null,null,null,0,0,null,"Totaal uren",{"$f":"J37+J38","v":0},null,0,null,null,null,null,0,0]
[0,null,null,null,null,0,0,null,"wachten instructie",{"$f":"SUM(Q33:Q42)","v":0},null,0,null,null,null,null,0,0]
[0,null,null,null,null,0,0,null,"wachten koppelchauffeur",{"$f":"SUM(R33:R42)","v":0},null,0,null,null,null,null,0,0]
[0,null,null,null,null,0,0,null,null,null,null,0,null,null,null,null,0,0]
[0,null,null,null,null,0,0,null,null,null,null,0,null,null,null,null,0,0]
[0,null,null,null,null,0,0,null,null,null,null,0,null,null,null,null,0,0]
[0,null,null,null,null,0,0,null,null,null,null,0,null,null,null,null,0,0]
[]
[null,"donderdag 03-10-2019",null,null,null,null,null,null,null,null,null,null,{"$f":"B44","v":"donderdag 03-10-2019"}]
[null,"Begintijd","Eindtijd","Begintijd","Eindtijd","tanken","aan/afkoppelen",null,"Totaal uren",{"$f":"J46+J47","v":1.0416666671517305E-2},null,null,"Begintijd","Eindtijd","Begintijd","Eindtijd","wachten instructie","wachten koppelchauffeur"]
[{"$f":"IF(B46,\"1\",0)","v":0},null,null,"2015-10-02T10:23:05","2015-10-02T10:38:05",{"$f":"C46-B46","v":0},{"$f":"E46-D46","v":1.0416666671517305E-2},null,"tanken",{"$f":"SUM(F46:F55)","v":0},null,0,"2015-10-02T15:35:12","2015-10-02T16:40:01",null,null,{"$f":"N46-M46","v":4.5011574075033423E-2},{"$f":"P46-O46","v":0}]
[{"$f":"IF(B47,\"1\",0)","v":0},null,null,null,null,{"$f":"C47-B47","v":0},0,null,"aan-afkoppelen",{"$f":"SUM(G46:G55)","v":1.0416666671517305E-2},null,{"$f":"IF(M46,\"1\",0)","v":"1"},"2015-10-02T16:58:23","2015-10-02T17:27:17",null,null,2.0069444442924578E-2,{"$f":"P47-O47","v":0}]
[0,null,null,null,null,0,0,null,null,null,null,{"$f":"IF(M47,\"1\",0)","v":"1"},null,null,null,null,0,0]
[0,null,null,null,null,0,0,null,"Totaal uren",{"$f":"J50+J51","v":6.5081018517958E-2},null,{"$f":"IF(M49,\"1\",0)","v":0},null,null,null,null,0,0]
[0,null,null,null,null,0,0,null,"wachten instructie",{"$f":"SUM(Q46:Q55)","v":6.5081018517958E-2},null,0,null,null,null,null,0,0]
[0,null,null,null,null,0,0,null,"wachten koppelchauffeur",{"$f":"SUM(R46:R55)","v":0},null,0,null,null,null,null,0,0]
[0,null,null,null,null,0,0,null,null,null,null,0,null,null,null,null,0,0]
[0,null,null,null,null,0,0,null,null,null,null,0,null,null,null,null,0,0]
[0,null,null,null,null,0,0,null,null,null,null,0,null,null,null,null,0,0]
[0,null,null,null,null,0,0,null,null,null,null,0,null,null,null,null,0,0]
[]
[null,"vrijdag 04-10-2019",null,null,null,null,null,null,null,null,null,null,{"$f":"B57","v":"vrijdag 04-10-2019"}]
[null,"Begintijd","Eindtijd","Begintijd","Eindtijd","tanken","aan/afkoppelen",null,"Totaal uren",{"$f":"J59+J60","v":1.0925925926130731E-2},null,null,"Begintijd","Eindtijd","Begintijd","Eindtijd","wachten instructie","wachten koppelchauffeur"]
[{"$f":"IF(B59,\"1\",0)","v":0},null,null,"2015-10-03T10:35:04","2015-10-03T10:50:48",{"$f":"C59-B59","v":0},{"$f":"E59-D59","v":1.0925925926130731E-2},null,"tanken",{"$f":"SUM(F59:F64)","v":0},null,{"$f":"IF(M59,\"1\",0)","v":0},null,null,null,null,{"$f":"N59-M59","v":0},{"$f":"P59-O59","v":0}]
[{"$f":"IF(B60,\"1\",0)","v":0},null,null,null,null,{"$f":"C60-B60","v":0},0,null,"aan-afkoppelen",{"$f":"SUM(G59:G64)","v":1.0925925926130731E-2},null,{"$f":"IF(M60,\"1\",0)","v":0},null,null,null,null,0,{"$f":"P60-O60","v":0}]
[0,null,null,null,null,0,0,null,null,null,null,0,null,null,null,null,0,0]
[0,null,null,null,null,0,0,null,"Totaal uren",{"$f":"J63+J64","v":0},null,0,null,null,null,null,0,0]
[0,null,null,null,null,0,0,null,"wachten instructie",{"$f":"SUM(Q59:Q68)","v":0},null,0,null,null,null,null,0,0]
[0,null,null,null,null,0,0,null,"wachten koppelchauffeur",{"$f":"SUM(R59:R68)","v":0},null,0,null,null,null,null,0,0]
[0,null,null,null,null,0,0,null,null,null,null,0,null,null,null,null,0,0]
[0,null,null,null,null,0,0,null,null,null,null,0,null,null,null,null,0,0]
[0,null,null,null,null,0,0,null,null,null,null,0,null,null,null,null,0,0]
[0,null,null,null,null,0,0,null,null,null,null,0,null,null,null,null,0,0]
[]
[null,"zaterdag 05-10-2019",null,null,null,null,null,null,null,null,null,null,{"$f":"B70","v":"zaterdag 05-10-2019"}]
[null,"Begintijd","Eindtijd","Begintijd","Eindtijd","tanken","aan/afkoppelen",null,"Totaal uren",{"$f":"J72+J73","v":0},null,null,"Begintijd","Eindtijd","Begintijd","Eindtijd","wachten instructie","wachten koppelchauffeur"]
[{"$f":"IF(B72,\"1\",0)","v":0},null,null,null,null,{"$f":"C72-B72","v":0},{"$f":"E72-D72","v":0},null,"tanken",{"$f":"SUM(F72:F81)","v":0},null,{"$f":"IF(M72,\"1\",0)","v":0},null,null,null,null,{"$f":"N72-M72","v":0},{"$f":"P72-O72","v":0}]
[{"$f":"IF(B73,\"1\",0)","v":0},null,null,null,null,{"$f":"C73-B73","v":0},{"$f":"E73-D73","v":0},null,"aan-afkoppelen",{"$f":"SUM(G72:G81)","v":0},null,{"$f":"IF(M73,\"1\",0)","v":0},null,null,null,null,{"$f":"N73-M73","v":0},{"$f":"P73-O73","v":0}]
[0,null,null,null,null,0,0,null,null,null,null,0,null,null,null,null,0,0]
[0,null,null,null,null,0,0,null,"Totaal uren",{"$f":"J76+J77","v":0},null,0,null,null,null,null,0,0]
[0,null,null,null,null,0,0,null,"wachten instructie",{"$f":"SUM(Q72:Q81)","v":0},null,0,null,null,null,null,0,0]
[0,null,null,null,null,0,0,null," wachten koppelchauffeur",{"$f":"SUM(R72:R81)","v":0},null,0,null,null,null,null,0,0]
[0,null,null,null,null,0,0,null,null,null,null,0,null,null,null,null,0,0]
[0,null,null,null,null,0,0,null,null,null,null,0,null,null,null,null,0,0]
[0,null,null,null,null,0,0,null,null,null,null,0,null,null,null,null,0,0]
[0,null,null,null,null,0,0,null,null,null,null,0,null,null,null,null,0,0]
[]
[null,"zondag 06-10-2019",null,null,null,null,null,null,null,null,null,null,{"$f":"B83","v":"zondag 06-10-2019"}]
[null,"Begintijd","Eindtijd","Begintijd","Eindtijd","tanken","aan/afkoppelen",null,"Totaal uren",{"$f":"J85+J86","v":0},null,null,"Begintijd","Eindtijd","Begintijd","Eindtijd","wachten instructie","wachten koppelchauffeur"]
[{"$f":"IF(B85,\"1\",0)","v":0},null,null,null,null,{"$f":"C85-B85","v":0},{"$f":"E85-D85","v":0},null,"tanken",{"$f":"SUM(F85:F90)","v":0},null,{"$f":"IF(M85,\"1\",0)","v":0},null,null,null,null,{"$f":"N85-M85","v":0},{"$f":"P85-O85","v":0}]
[0,null,null,null,null,{"$f":"C86-B86","v":0},{"$f":"E86-D86","v":0},null,"aan-afkoppelen",{"$f":"SUM(G85:G90)","v":0},null,{"$f":"IF(M86,\"1\",0)","v":0},null,null,null,null,0,0]
[0,null,null,null,null,0,0,null,null,null,null,0,null,null,null,null,0,0]
[0,null,null,null,null,0,0,null,"Totaal uren",{"$f":"J89+J90","v":0},null,0,null,null,null,null,0,0]
[0,null,null,null,null,0,0,null,"wachten instructie",{"$f":"SUM(Q85:Q94)","v":0},null,0,null,null,null,null,0,0]
[0,null,null,null,null,0,0,null,"wachten koppelchauffeur",{"$f":"SUM(R85:R94)","v":0},null,0,null,null,null,null,0,0]
[0,null,null,null,null,0,0,null,null,null,null,0,null,null,null,null,0,0]
[0,null,null,null,null,0,0,null,null,null,null,0,null,null,null,null,0,0]
[0,null,null,null,null,0,0,null,null,null,null,0,null,null,null,null,0,0]
[0,null,null,null,null,0,0,null,null,null,null,0,null,null,null,null,0,0]
[]
[null,null,null,null,null,null,null,null,"tanken",{"$f":"J85+J72+J59+J46+J33+J20+J7","v":1.3043981482042E-2}]
[]
[null,null,null,null,null,null,null,null,"aan-afkoppelen",{"$f":"J86+J73+J60+J47+J34+J21+J8","v":2.644675926421769E-2}]
[]
[null,null,null,null,null,null,null,null,"Totaal uren",{"$f":"J98+J96","v":3.9490740746259689E-2}]
[]
[]
[null,null,null,null,null,null,null,null,"wachten instructie",{"$f":"J89+J76+J63+J50+J37+J24+J11","v":9.2824074075906537E-2}]
[]
[null,null,null,null,null,null,null,null,"wachten koppelchauffeur",{"$f":"J90+J77+J64+J51+J38+J25+J12","v":0}]
[]
[null,null,null,null,null,null,null,null,"Totaal uren",{"$f":"J105+J103","v":9.2824074075906537E-2}]
[]
[]
[null,"Einde dag-taken week 40"]

{"sheet":"LadenLossen (39)","index":13,"n_rows":51,"n_cols":17,"rows_kept":51,"cut":false,"hidden":true,"merged":[[0,1,0,7],[0,13,0,15],[3,13,3,15],[4,1,5,4],[4,5,5,7],[6,19,6,20],[7,11,7,12],[7,17,7,18],[7,19,7,20],[8,11,8,12],[8,17,8,18],[8,19,8,20],[6,17,6,18],[11,11,11,12],[11,17,11,18],[11,19,11,20],[17,11,17,12],[17,17,17,18],[17,19,17,20],[20,11,20,12],[20,17,20,18],[20,19,20,20],[16,11,16,12],[16,17,16,18],[16,19,16,20],[18,11,18,12],[18,17,18,18],[18,19,18,20],[19,11,19,12],[19,17,19,18],[19,19,19,20],[21,11,21,12],[21,17,21,18],[21,19,21,20],[22,11,22,12],[22,17,22,18],[22,19,22,20],[23,11,23,12],[23,17,23,18],[23,19,23,20],[24,11,24,12],[24,17,24,18],[24,19,24,20],[25,11,25,12],[25,17,25,18],[25,19,25,20],[26,11,26,12],[26,17,26,18],[26,19,26,20],[27,11,27,12],[27,17,27,18],[27,19,27,20],[28,11,28,12],[28,17,28,18],[28,19,28,20],[31,11,31,12],[31,17,31,18],[31,19,31,20],[29,11,29,12],[29,17,29,18],[29,19,29,20],[30,11,30,12],[30,17,30,18],[30,19,30,20]]}
["02:00:00","Laden/lossen (beschikbaarheidstijd (behalve bij Rood ))",null,null,null,null,null,null,null,"Week 39",null,null,null,"   = zelf laden/lossen"]
[]
[]
[null,null,null,null,null,null,null,null,null,"Totaal",null,null,null,"Wachturen laden/lossen"]
[null," Laden",null,null,null,"Lossen",null,null,null,"Laden","Lossen","Totaal uren",null,"Laden",null,"Lossen","Totaal uren"]
["Nr.",null,null,null,null,null,null,null,null,{"$f":"SUM(J8:J51)","v":0.30065972221685416},{"$f":"SUM(K8:K51)","v":9.1620370367309079E-2},{"$f":"J6+K6","v":0.39228009258416324},null,{"$f":"SUM(N8:N27)","v":3.9918981480392787E-2},null,{"$f":"SUM(P8:P27)","v":0},{"$f":"N6+P6","v":3.9918981480392787E-2}]
[0,"begin",null,"eind",null,"begin",null,"eind"]
[1,"2015-09-22T06:53:54",null,"2015-09-22T07:42:09",null,null,null,null,null,{"$f":"IF(D8<>\"\",IF(D8-B8>TIME(2,0,0),TIME(2,0,0),D8-B8),\"\")","v":3.3506944448163267E-2},{"$f":"IF(H8<>\"\",IF((H8-F8)>TIME(2,0,0),TIME(2,0,0),H8-F8),\"\")","v":""},null,null,{"$f":"IF(D8-B8>TIME(2,0,0),D8-B8-TIME(2,0,0),\"\")","v":""},null,{"$f":"IF((H8-F8)>TIME(2,0,0),H8-F8-TIME(2,0,0),\"\")","v":""}]
[2,"2015-09-22T08:41:44",null,"2015-09-22T11:39:13",null,null,null,null,null,8.3333333333333329E-2,"",null,null,3.9918981480392787E-2,null,""]
[3,"2015-09-22T12:02:13",null,"2015-09-22T13:39:13",null,null,null,null,null,6.7361111105128657E-2]
[4,null,null,null,null,"2015-09-24T08:31:57",null,"2015-09-24T09:26:34",null,"",3.792824073752854E-2,null,null,"",null,""]
[5,"2015-09-24T09:27:56",null,"2015-09-24T10:31:09",null,null,null,null,null,4.390046295884531E-2,"",null,null,"",null,""]
[]
[]
[]
[5]
[6,null,null,null,null,"2015-09-26T09:29:27",null,"2015-09-26T10:46:46",null,"",5.3692129629780538E-2,null,null,"",null,""]
[7,"2015-09-26T11:51:36",null,"2015-09-26T13:36:05",null,null,null,null,null,{"$f":"IF(D18<>\"\",IF(D18-B18>TIME(2,0,0),TIME(2,0,0),D18-B18),\"\")","v":7.2557870371383615E-2},{"$f":"IF(H18<>\"\",IF((H18-F18)>TIME(2,0,0),TIME(2,0,0),H18-F18),\"\")","v":""},null,null,{"$f":"IF(D18-B18>TIME(2,0,0),D18-B18-TIME(2,0,0),\"\")","v":""},null,{"$f":"IF((H18-F18)>TIME(2,0,0),H18-F18-TIME(2,0,0),\"\")","v":""}]
[null,null,null,null,null,null,null,null,null,{"$f":"IF(D19<>\"\",IF(D19-B19>TIME(2,0,0),TIME(2,0,0),D19-B19),\"\")","v":""},{"$f":"IF(H19<>\"\",IF((H19-F19)>TIME(2,0,0),TIME(2,0,0),H19-F19),\"\")","v":""},null,null,{"$f":"IF(D19-H11>TIME(2,0,0),D19-H11-TIME(2,0,0),\"\")","v":""},null,{"$f":"IF((H19-F19)>TIME(2,0,0),H19-F19-TIME(2,0,0),\"\")","v":""}]
[null,null,null,null,null,null,null,null,null,{"$f":"IF(D20<>\"\",IF(D20-B20>TIME(2,0,0),TIME(2,0,0),D20-B20),\"\")","v":""},{"$f":"IF(H20<>\"\",IF((H20-F20)>TIME(2,0,0),TIME(2,0,0),H20-F20),\"\")","v":""},null,null,{"$f":"IF(D20-D12>TIME(2,0,0),D20-D12-TIME(2,0,0),\"\")","v":""},null,{"$f":"IF((H20-F20)>TIME(2,0,0),H20-F20-TIME(2,0,0),\"\")","v":""}]
[null,null,null,null,null,null,null,null,null,{"$f":"IF(D21<>\"\",IF(D21-B21>TIME(2,0,0),TIME(2,0,0),D21-B21),\"\")","v":""},{"$f":"IF(H21<>\"\",IF((H21-F21)>TIME(2,0,0),TIME(2,0,0),H21-F21),\"\")","v":""},null,null,{"$f":"IF(D21-B21>TIME(2,0,0),D21-B21-TIME(2,0,0),\"\")","v":""},null,{"$f":"IF((H21-F21)>TIME(2,0,0),H21-F21-TIME(2,0,0),\"\")","v":""}]
[null,null,null,null,null,null,null,null,null,"","",null,null,"",null,""]
[null,null,null,null,null,null,null,null,null,"","",null,null,"",null,""]
[null,null,null,null,null,null,null,null,null,"","",null,null,"",null,""]
[null,null,null,null,null,null,null,null,null,"","",null,null,"",null,""]
[null,null,null,null,null,null,null,null,null,"","",null,null,"",null,""]
[null,null,null,null,null,null,null,null,null,"","",{"$f":"IF(H27<>\"\",H27-F27,\"\")","v":""},null,"",null,""]
[null,null,null,null,null,null,null,null,null,{"$f":"IF(D28<>\"\",D28-B28,\"\")","v":""},{"$f":"IF(H28<>\"\",H28-F28,\"\")","v":""},""]
[null,null,null,null,null,null,null,null,null,"","",""]
[null,null,null,null,null,null,null,null,null,"","",""]
[null,null,null,null,null,null,null,null,null,"","",""]
[null,null,null,null,null,null,null,null,null,"","",""]
[null,null,null,null,null,null,null,null,null,"",""]
[null,null,null,null,null,null,null,null,null,"",""]
[null,null,null,null,null,null,null,null,null,"",""]
[null,null,null,null,null,null,null,null,null,"",""]
[null,null,null,null,null,null,null,null,null,"",""]
[null,null,null,null,null,null,null,null,null,"",""]
[null,null,null,null,null,null,null,null,null,"",""]
[null,null,null,null,null,null,null,null,null,"",""]
[null,null,null,null,null,null,null,null,null,"",""]
[null,null,null,null,null,null,null,null,null,"",""]
[null,null,null,null,null,null,null,null,null,"",""]
[null,null,null,null,null,null,null,null,null,"",""]
[null,null,null,null,null,null,null,null,null,"",""]
[null,null,null,null,null,null,null,null,null,"",""]
[null,null,null,null,null,null,null,null,null,"",""]
[null,null,null,null,null,null,null,null,null,"",""]
[null,null,null,null,null,null,null,null,null,"",""]
[null,null,null,null,null,null,null,null,null,"",""]
[null,null,null,null,null,null,null,null,null,"",""]

{"sheet":"Dag-taken week (39)","index":14,"n_rows":110,"n_cols":18,"rows_kept":110,"cut":false,"hidden":true,"merged":[[106,8,108,8],[106,9,108,10],[109,1,112,17],[99,8,100,8],[99,9,100,10],[102,8,103,8],[102,9,103,10],[104,8,105,8],[104,9,105,10],[82,1,82,6],[82,12,82,17],[95,8,96,8],[95,9,96,10],[97,8,98,8],[97,9,98,10],[43,1,43,6],[43,12,43,17],[56,1,56,6],[56,12,56,17],[69,1,69,6],[69,12,69,17],[30,1,30,6],[30,12,30,17],[0,12,0,17],[4,1,4,6],[4,12,4,17],[17,1,17,6],[17,12,17,17]]}
[null,"Dag-taken week 39",null,null,null,null,null,null,null,null,null,null,{"$f":"B1","v":"Dag-taken week 39"}]
[null,"tanken",null,"aan/afkoppelen",null,"Totaal",{"$f":"Q2","v":"Tijden"},null,null,null,null,null,"wachten instructie",null,"wachten koppelchauffeur",null,"Tijden"]
[]
[]
[null,"maandag 23-9-2019",null,null,null,null,null,null,null,null,null,null,{"$f":"B5","v":"maandag 23-9-2019"}]
[null,"Begintijd","Eindtijd","Begintijd","Eindtijd","tanken","aan/afkoppelen",null,"Totaal uren",{"$f":"J7+J8","v":1.9884259258105885E-2},null,null,"Begintijd","Eindtijd","Begintijd","Eindtijd","wachten instructie","wachten koppelchauffeur"]
[{"$f":"IF(B7,\"1\",0)","v":"1"},"2015-09-22T05:18:08","2015-09-22T05:33:09","2015-09-22T04:33:04","2015-09-22T04:46:41",{"$f":"C7-B7","v":1.0428240741021E-2},{"$f":"E7-D7","v":9.4560185170848854E-3},null,"tanken",{"$f":"SUM(F7:F12)","v":1.0428240741021E-2},null,null,null,null,null,null,{"$f":"N7-M7","v":0},{"$f":"P7-O7","v":0}]
[0,null,null,null,null,{"$f":"C8-B8","v":0},0,null,"aan-afkoppelen",{"$f":"SUM(G7:G12)","v":9.4560185170848854E-3},null,{"$f":"IF(M8,\"1\",0)","v":0},null,null,null,null,0,{"$f":"P8-O8","v":0}]
[0,null,null,null,null,0,0,null,null,null,null,0,null,null,null,null,0,0]
[0,null,null,null,null,0,0,null,"Totaal uren",{"$f":"J11+J12","v":0},null,0,null,null,null,null,0,0]
[0,null,null,null,null,0,0,null,"wachten instructie",{"$f":"SUM(Q7:Q16)","v":0},null,0,null,null,null,null,0,0]
[0,null,null,null,null,0,0,null," wachten koppelchauffeur",{"$f":"SUM(R7:R16)","v":0},null,0,null,null,null,null,0,0]
[0,null,null,null,null,0,0,null,null,null,null,0,null,null,null,null,0,0]
[0,null,null,null,null,0,0,null,null,null,null,0,null,null,null,null,0,0]
[0,null,null,null,null,0,0,null,null,null,null,0,null,null,null,null,0,0]
[0,null,null,null,null,0,0,null,null,null,null,0,null,null,null,null,0,0]
[]
[null,"dinsdag 24-9-2019",null,null,null,null,null,null,null,null,null,null,{"$f":"B18","v":"dinsdag 24-9-2019"}]
[null,"Begintijd","Eindtijd","Begintijd","Eindtijd","tanken","aan/afkoppelen",null,"Totaal uren",{"$f":"J20+J21","v":0},null,null,"Begintijd","Eindtijd","Begintijd","Eindtijd","wachten instructie","wachten koppelchauffeur"]
[{"$f":"IF(B20,\"1\",0)","v":0},null,null,null,null,{"$f":"C20-B20","v":0},{"$f":"E20-D20","v":0},null,"tanken",{"$f":"SUM(F20:F29)","v":0},null,0,null,null,null,null,{"$f":"N20-M20","v":0},{"$f":"R7","v":0}]
[{"$f":"IF(B21,\"1\",0)","v":0},null,null,null,null,{"$f":"C21-B21","v":0},0,null,"aan-afkoppelen",{"$f":"SUM(G20:G29)","v":0},null,{"$f":"IF(M21,\"1\",0)","v":0},null,null,null,null,0,0]
[0,null,null,null,null,0,0,null,null,null,null,0,null,null,null,null,0,0]
[0,null,null,null,null,0,0,null,"Totaal uren",{"$f":"J24+J25","v":0},null,0,null,null,null,null,0,0]
[0,null,null,null,null,0,0,null,"wachten instructie",{"$f":"SUM(Q20:Q29)","v":0},null,0,null,null,null,null,0,0]
[0,null,null,null,null,0,0,null,"wachten koppelchauffeur",{"$f":"SUM(R20:R29)","v":0},null,0,null,null,null,null,0,0]
[0,null,null,null,null,0,0,null,null,null,null,0,null,null,null,null,0,0]
[0,null,null,null,null,0,0,null,null,null,null,0,null,null,null,null,0,0]
[0,null,null,null,null,0,0,null,null,null,null,0,null,null,null,null,0,0]
[0,null,null,null,null,0,0,null,null,null,null,0,null,null,null,null,{"$f":"Q16","v":0},{"$f":"R16","v":0}]
[]
[null,"woensdag 25-9-2019",null,null,null,null,null,null,null,null,null,null,{"$f":"B31","v":"woensdag 25-9-2019"}]
[null,"Begintijd","Eindtijd","Begintijd","Eindtijd","tanken","aan/afkoppelen",null,"Totaal uren",{"$f":"J33+J34","v":0},null,null,"Begintijd","Eindtijd","Begintijd","Eindtijd","wachten instructie","wachten koppelchauffeur"]
[{"$f":"IF(B33,\"1\",0)","v":0},null,null,null,null,{"$f":"C33-B33","v":0},{"$f":"E33-D33","v":0},null,"tanken",{"$f":"SUM(F33:F38)","v":0},null,1,null,null,null,null,0,0]
[0,null,null,null,null,0,0,null,"aan-afkoppelen",{"$f":"SUM(G33:G38)","v":0},null,{"$f":"IF(M34,\"1\",0)","v":0},null,null,null,null,0,0]
[0,null,null,null,null,0,0,null,null,null,null,0,null,null,null,null,0,0]
[0,null,null,null,null,0,0,null,"Totaal uren",{"$f":"J37+J38","v":0},null,0,null,null,null,null,0,0]
[0,null,null,null,null,0,0,null,"wachten instructie",{"$f":"SUM(Q33:Q42)","v":0},null,0,null,null,null,null,0,0]
[0,null,null,null,null,0,0,null,"wachten koppelchauffeur",{"$f":"SUM(R33:R42)","v":0},null,0,null,null,null,null,0,0]
[0,null,null,null,null,0,0,null,null,null,null,0,null,null,null,null,0,0]
[0,null,null,null,null,0,0,null,null,null,null,0,null,null,null,null,0,0]
[0,null,null,null,null,0,0,null,null,null,null,0,null,null,null,null,0,0]
[0,null,null,null,null,0,0,null,null,null,null,0,null,null,null,null,0,0]
[]
[null,"donderdag 26-9-2019",null,null,null,null,null,null,null,null,null,null,{"$f":"B44","v":"donderdag 26-9-2019"}]
[null,"Begintijd","Eindtijd","Begintijd","Eindtijd","tanken","aan/afkoppelen",null,"Totaal uren",{"$f":"J46+J47","v":1.0428240741021E-2},null,null,"Begintijd","Eindtijd","Begintijd","Eindtijd","wachten instructie","wachten koppelchauffeur"]
[{"$f":"IF(B46,\"1\",0)","v":"1"},"2015-09-25T09:36:31","2015-09-25T09:51:32",null,null,{"$f":"C46-B46","v":1.0428240741021E-2},{"$f":"E46-D46","v":0},null,"tanken",{"$f":"SUM(F46:F55)","v":1.0428240741021E-2},null,0,null,null,null,null,{"$f":"N46-M46","v":0},{"$f":"P46-O46","v":0}]
[{"$f":"IF(B47,\"1\",0)","v":0},null,null,null,null,{"$f":"C47-B47","v":0},0,null,"aan-afkoppelen",{"$f":"SUM(G46:G55)","v":0},null,{"$f":"IF(M47,\"1\",0)","v":0},null,null,null,null,0,{"$f":"P47-O47","v":0}]
[0,null,null,null,null,0,0,null,null,null,null,0,null,null,null,null,0,0]
[0,null,null,null,null,0,0,null,"Totaal uren",{"$f":"J50+J51","v":0},null,0,null,null,null,null,0,0]
[0,null,null,null,null,0,0,null,"wachten instructie",{"$f":"SUM(Q46:Q55)","v":0},null,0,null,null,null,null,0,0]
[0,null,null,null,null,0,0,null,"wachten koppelchauffeur",{"$f":"SUM(R46:R55)","v":0},null,0,null,null,null,null,0,0]
[0,null,null,null,null,0,0,null,null,null,null,0,null,null,null,null,0,0]
[0,null,null,null,null,0,0,null,null,null,null,0,null,null,null,null,0,0]
[0,null,null,null,null,0,0,null,null,null,null,0,null,null,null,null,0,0]
[0,null,null,null,null,0,0,null,null,null,null,0,null,null,null,null,0,0]
[]
[null,"vrijdag 27-9-2019",null,null,null,null,null,null,null,null,null,null,{"$f":"B57","v":"vrijdag 27-9-2019"}]
[null,"Begintijd","Eindtijd","Begintijd","Eindtijd","tanken","aan/afkoppelen",null,"Totaal uren",{"$f":"J59+J60","v":1.5891203700448386E-2},null,null,"Begintijd","Eindtijd","Begintijd","Eindtijd","wachten instructie","wachten koppelchauffeur"]
[{"$f":"IF(B59,\"1\",0)","v":0},null,null,"2015-09-26T14:56:36","2015-09-26T15:19:29",{"$f":"C59-B59","v":0},{"$f":"E59-D59","v":1.5891203700448386E-2},null,"tanken",{"$f":"SUM(F59:F64)","v":0},null,{"$f":"IF(M59,\"1\",0)","v":"1"},"2015-09-26T10:49:33","2015-09-26T11:00:50",null,null,{"$f":"N59-M59","v":7.8356481462833472E-3},{"$f":"P59-O59","v":0}]
[{"$f":"IF(B60,\"1\",0)","v":0},null,null,null,null,{"$f":"C60-B60","v":0},0,null,"aan-afkoppelen",{"$f":"SUM(G59:G64)","v":1.5891203700448386E-2},null,{"$f":"IF(M60,\"1\",0)","v":0},null,null,null,null,0,{"$f":"P60-O60","v":0}]
[0,null,null,null,null,0,0,null,null,null,null,0,null,null,null,null,0,0]
[0,null,null,null,null,0,0,null,"Totaal uren",{"$f":"J63+J64","v":7.8356481462833472E-3},null,0,null,null,null,null,0,0]
[0,null,null,null,null,0,0,null,"wachten instructie",{"$f":"SUM(Q59:Q68)","v":7.8356481462833472E-3},null,0,null,null,null,null,0,0]
[0,null,null,null,null,0,0,null,"wachten koppelchauffeur",{"$f":"SUM(R59:R68)","v":0},null,0,null,null,null,null,0,0]
[0,null,null,null,null,0,0,null,null,null,null,0,null,null,null,null,0,0]
[0,null,null,null,null,0,0,null,null,null,null,0,null,null,null,null,0,0]
[0,null,null,null,null,0,0,null,null,null,null,0,null,null,null,null,0,0]
[0,null,null,null,null,0,0,null,null,null,null,0,null,null,null,null,0,0]
[]
[null,"zaterdag 28-9-2019",null,null,null,null,null,null,null,null,null,null,{"$f":"B70","v":"zaterdag 28-9-2019"}]
[null,"Begintijd","Eindtijd","Begintijd","Eindtijd","tanken","aan/afkoppelen",null,"Totaal uren",{"$f":"J72+J73","v":0},null,null,"Begintijd","Eindtijd","Begintijd","Eindtijd","wachten instructie","wachten koppelchauffeur"]
[{"$f":"IF(B72,\"1\",0)","v":0},null,null,null,null,{"$f":"C72-B72","v":0},{"$f":"E72-D72","v":0},null,"tanken",{"$f":"SUM(F72:F81)","v":0},null,{"$f":"IF(M72,\"1\",0)","v":0},null,null,null,null,{"$f":"N72-M72","v":0},{"$f":"P72-O72","v":0}]
[{"$f":"IF(B73,\"1\",0)","v":0},null,null,null,null,{"$f":"C73-B73","v":0},{"$f":"E73-D73","v":0},null,"aan-afkoppelen",{"$f":"SUM(G72:G81)","v":0},null,{"$f":"IF(M73,\"1\",0)","v":0},null,null,null,null,{"$f":"N73-M73","v":0},{"$f":"P73-O73","v":0}]
[0,null,null,null,null,0,0,null,null,null,null,0,null,null,null,null,0,0]
[0,null,null,null,null,0,0,null,"Totaal uren",{"$f":"J76+J77","v":0},null,0,null,null,null,null,0,0]
[0,null,null,null,null,0,0,null,"wachten instructie",{"$f":"SUM(Q72:Q81)","v":0},null,0,null,null,null,null,0,0]
[0,null,null,null,null,0,0,null," wachten koppelchauffeur",{"$f":"SUM(R72:R81)","v":0},null,0,null,null,null,null,0,0]
[0,null,null,null,null,0,0,null,null,null,null,0,null,null,null,null,0,0]
[0,null,null,null,null,0,0,null,null,null,null,0,null,null,null,null,0,0]
[0,null,null,null,null,0,0,null,null,null,null,0,null,null,null,null,0,0]
[0,null,null,null,null,0,0,null,null,null,null,0,null,null,null,null,0,0]
[]
[null,"zondag 29-9-2019",null,null,null,null,null,null,null,null,null,null,{"$f":"B83","v":"zondag 29-9-2019"}]
[null,"Begintijd","Eindtijd","Begintijd","Eindtijd","tanken","aan/afkoppelen",null,"Totaal uren",{"$f":"J85+J86","v":0},null,null,"Begintijd","Eindtijd","Begintijd","Eindtijd","wachten instructie","wachten koppelchauffeur"]
[{"$f":"IF(B85,\"1\",0)","v":0},null,null,null,null,{"$f":"C85-B85","v":0},{"$f":"E85-D85","v":0},null,"tanken",{"$f":"SUM(F85:F90)","v":0},null,{"$f":"IF(M85,\"1\",0)","v":0},null,null,null,null,{"$f":"N85-M85","v":0},{"$f":"P85-O85","v":0}]
[0,null,null,null,null,{"$f":"C86-B86","v":0},{"$f":"E86-D86","v":0},null,"aan-afkoppelen",{"$f":"SUM(G85:G90)","v":0},null,{"$f":"IF(M86,\"1\",0)","v":0},null,null,null,null,0,0]
[0,null,null,null,null,0,0,null,null,null,null,0,null,null,null,null,0,0]
[0,null,null,null,null,0,0,null,"Totaal uren",{"$f":"J89+J90","v":0},null,0,null,null,null,null,0,0]
[0,null,null,null,null,0,0,null,"wachten instructie",{"$f":"SUM(Q85:Q94)","v":0},null,0,null,null,null,null,0,0]
[0,null,null,null,null,0,0,null,"wachten koppelchauffeur",{"$f":"SUM(R85:R94)","v":0},null,0,null,null,null,null,0,0]
[0,null,null,null,null,0,0,null,null,null,null,0,null,null,null,null,0,0]
[0,null,null,null,null,0,0,null,null,null,null,0,null,null,null,null,0,0]
[0,null,null,null,null,0,0,null,null,null,null,0,null,null,null,null,0,0]
[0,null,null,null,null,0,0,null,null,null,null,0,null,null,null,null,0,0]
[]
[null,null,null,null,null,null,null,null,"tanken",{"$f":"J85+J72+J59+J46+J33+J20+J7","v":2.0856481482042E-2}]
[]
[null,null,null,null,null,null,null,null,"aan-afkoppelen",{"$f":"J86+J73+J60+J47+J34+J21+J8","v":2.5347222217533272E-2}]
[]
[null,null,null,null,null,null,null,null,"Totaal uren",{"$f":"J98+J96","v":4.6203703699575271E-2}]
[]
[]
[null,null,null,null,null,null,null,null,"wachten instructie",{"$f":"J89+J76+J63+J50+J37+J24+J11","v":7.8356481462833472E-3}]
[]
[null,null,null,null,null,null,null,null,"wachten koppelchauffeur",{"$f":"J90+J77+J64+J51+J38+J25+J12","v":0}]
[]
[null,null,null,null,null,null,null,null,"Totaal uren",{"$f":"J105+J103","v":7.8356481462833472E-3}]
[]
[]
[null,"Einde dag-taken week 39"]

{"sheet":"LadenLossen (38)","index":15,"n_rows":49,"n_cols":17,"rows_kept":49,"cut":false,"hidden":true,"merged":[[0,1,0,7],[0,13,0,15],[3,13,3,15],[4,1,5,4],[4,5,5,7],[6,19,6,20],[7,11,7,12],[7,17,7,18],[7,19,7,20],[8,11,8,12],[8,17,8,18],[8,19,8,20],[6,17,6,18],[9,11,9,12],[9,17,9,18],[9,19,9,20],[10,11,10,12],[10,17,10,18],[10,19,10,20],[11,11,11,12],[11,17,11,18],[11,19,11,20],[12,11,12,12],[12,17,12,18],[12,19,12,20],[13,11,13,12],[13,17,13,18],[13,19,13,20],[14,11,14,12],[14,17,14,18],[14,19,14,20],[15,11,15,12],[15,17,15,18],[15,19,15,20],[16,11,16,12],[16,17,16,18],[16,19,16,20],[17,11,17,12],[17,17,17,18],[17,19,17,20],[18,11,18,12],[18,17,18,18],[18,19,18,20],[19,11,19,12],[19,17,19,18],[19,19,19,20],[20,11,20,12],[20,17,20,18],[20,19,20,20],[21,11,21,12],[21,17,21,18],[21,19,21,20],[22,11,22,12],[22,17,22,18],[22,19,22,20],[23,11,23,12],[23,17,23,18],[23,19,23,20],[24,11,24,12],[24,17,24,18],[24,19,24,20],[25,11,25,12],[25,17,25,18],[25,19,25,20],[26,11,26,12],[26,17,26,18],[26,19,26,20],[29,11,29,12],[29,17,29,18],[29,19,29,20],[27,11,27,12],[27,17,27,18],[27,19,27,20],[28,11,28,12],[28,17,28,18],[28,19,28,20]]}
["02:00:00","Laden/lossen (beschikbaarheidstijd (behalve bij Rood ))",null,null,null,null,null,null,null,"Week 38",null,null,null,"   = zelf laden/lossen"]
[]
[]
[null,null,null,null,null,null,null,null,null,"Totaal",null,null,null,"Wachturen laden/lossen"]
[null," Laden",null,null,null,"Lossen",null,null,null,"Laden","Lossen","Totaal uren",null,"Laden",null,"Lossen","Totaal uren"]
["Nr.",null,null,null,null,null,null,null,null,{"$f":"SUM(J8:J49)","v":0.16818287036585389},{"$f":"SUM(K8:K49)","v":0.29796296296020347},{"$f":"J6+K6","v":0.46614583332605736},null,{"$f":"SUM(N8:N25)","v":0},null,{"$f":"SUM(P8:P25)","v":0.18662037037089857},{"$f":"N6+P6","v":0.18662037037089857}]
[0,"begin",null,"eind",null,"begin",null,"eind"]
[1,null,null,null,null,"2015-09-15T08:55:17",null,"2015-09-15T09:47:10",null,{"$f":"IF(D8<>\"\",IF(D8-B8>TIME(2,0,0),TIME(2,0,0),D8-B8),\"\")","v":""},{"$f":"IF(H8<>\"\",IF((H8-F8)>TIME(2,0,0),TIME(2,0,0),H8-F8),\"\")","v":3.6030092596774921E-2},null,null,{"$f":"IF(D8-B8>TIME(2,0,0),D8-B8-TIME(2,0,0),\"\")","v":""},null,{"$f":"IF((H8-F8)>TIME(2,0,0),H8-F8-TIME(2,0,0),\"\")","v":""}]
[2,null,null,null,null,"2015-09-15T10:21:52",null,"2015-09-15T11:11:47",null,"",3.4664351856918074E-2,null,null,"",null,""]
[3,null,null,null,null,"2015-09-15T13:58:45",null,"2015-09-15T15:10:28",null,"",4.9803240734036081E-2,null,null,"",null,""]
[4,null,null,null,null,"2015-09-15T16:12:05",null,"2015-09-15T16:36:43",null,"",1.710648147854954E-2,null,null,"",null,""]
[5,"2015-09-16T09:32:59",null,"2015-09-16T10:50:15",null,null,null,null,null,5.3657407406717539E-2,"",null,null,"",null,""]
[6,null,null,null,null,"2015-09-17T06:54:42",null,"2015-09-17T07:35:37",null,"",2.8414351851097308E-2,null,null,"",null,""]
[7,"2015-09-17T09:50:40",null,"2015-09-17T11:09:13",null,null,null,null,null,5.4548611107748002E-2,"",null,null,"",null,""]
[8,null,null,null,null,"2015-09-18T09:46:46",null,"2015-09-18T16:15:30",null,"",8.3333333333333329E-2,null,null,"",null,0.18662037037089857]
[9,null,null,null,null,"2015-09-19T08:34:57",null,"2015-09-19T09:30:53",null,"",3.8842592592118308E-2,null,null,"",null,""]
[10,"2015-09-19T15:30:42",null,"2015-09-19T16:57:04",null,null,null,null,null,5.9976851851388346E-2,"",null,null,"",null,""]
[11,null,null,null,null,"2015-09-19T18:41:51",null,"2015-09-19T18:55:55",null,"",9.7685185173759237E-3,null,null,"",null,""]
[12,null,null,null,null,null,null,null,null,"","",null,null,"",null,""]
[null,null,null,null,null,null,null,null,null,"","",null,null,"",null,""]
[null,null,null,null,null,null,null,null,null,"","",null,null,"",null,""]
[null,null,null,null,null,null,null,null,null,"","",null,null,"",null,""]
[null,null,null,null,null,null,null,null,null,"","",null,null,"",null,""]
[null,null,null,null,null,null,null,null,null,"","",null,null,"",null,""]
[null,null,null,null,null,null,null,null,null,"","",{"$f":"IF(H25<>\"\",H25-F25,\"\")","v":""},null,"",null,""]
[null,null,null,null,null,null,null,null,null,{"$f":"IF(D26<>\"\",D26-B26,\"\")","v":""},{"$f":"IF(H26<>\"\",H26-F26,\"\")","v":""},""]
[null,null,null,null,null,null,null,null,null,"","",""]
[null,null,null,null,null,null,null,null,null,"","",""]
[null,null,null,null,null,null,null,null,null,"","",""]
[null,null,null,null,null,null,null,null,null,"","",""]
[null,null,null,null,null,null,null,null,null,"",""]
[null,null,null,null,null,null,null,null,null,"",""]
[null,null,null,null,null,null,null,null,null,"",""]
[null,null,null,null,null,null,null,null,null,"",""]
[null,null,null,null,null,null,null,null,null,"",""]
[null,null,null,null,null,null,null,null,null,"",""]
[null,null,null,null,null,null,null,null,null,"",""]
[null,null,null,null,null,null,null,null,null,"",""]
[null,null,null,null,null,null,null,null,null,"",""]
[null,null,null,null,null,null,null,null,null,"",""]
[null,null,null,null,null,null,null,null,null,"",""]
[null,null,null,null,null,null,null,null,null,"",""]
[null,null,null,null,null,null,null,null,null,"",""]
[null,null,null,null,null,null,null,null,null,"",""]
[null,null,null,null,null,null,null,null,null,"",""]
[null,null,null,null,null,null,null,null,null,"",""]
[null,null,null,null,null,null,null,null,null,"",""]
[null,null,null,null,null,null,null,null,null,"",""]
[null,null,null,null,null,null,null,null,null,"",""]

{"sheet":"Dag-taken week (38)","index":16,"n_rows":110,"n_cols":18,"rows_kept":110,"cut":false,"hidden":true,"merged":[[30,1,30,6],[30,12,30,17],[0,12,0,17],[4,1,4,6],[4,12,4,17],[17,1,17,6],[17,12,17,17],[43,1,43,6],[43,12,43,17],[56,1,56,6],[56,12,56,17],[69,1,69,6],[69,12,69,17],[82,1,82,6],[82,12,82,17],[95,8,96,8],[95,9,96,10],[97,8,98,8],[97,9,98,10],[106,8,108,8],[106,9,108,10],[109,1,112,17],[99,8,100,8],[99,9,100,10],[102,8,103,8],[102,9,103,10],[104,8,105,8],[104,9,105,10]]}
[null,"Dag-taken week 38",null,null,null,null,null,null,null,null,null,null,{"$f":"B1","v":"Dag-taken week 38"}]
[null,"tanken",null,"aan/afkoppelen",null,"Totaal",{"$f":"Q2","v":"Tijden"},null,null,null,null,null,"wachten instructie",null,"wachten koppelchauffeur",null,"Tijden"]
[]
[]
[null,"maandag 16-9-2019",null,null,null,null,null,null,null,null,null,null,{"$f":"B5","v":"maandag 16-9-2019"}]
[null,"Begintijd","Eindtijd","Begintijd","Eindtijd","tanken","aan/afkoppelen",null,"Totaal uren",{"$f":"J7+J8","v":1.5486111107748002E-2},null,null,"Begintijd","Eindtijd","Begintijd","Eindtijd","wachten instructie","wachten koppelchauffeur"]
[1,"2015-09-15T03:32:21","2015-09-15T03:49:32","2015-09-15T03:23:06","2015-09-15T03:28:13",{"$f":"C7-B7","v":1.1932870373129845E-2},{"$f":"E7-D7","v":3.5532407346181571E-3},null,"tanken",{"$f":"SUM(F7:F12)","v":1.1932870373129845E-2},null,null,null,null,null,null,{"$f":"N7-M7","v":0},{"$f":"P7-O7","v":0}]
[{"$f":"IF(B8,\"1\",0)","v":0},null,null,null,null,{"$f":"C8-B8","v":0},0,null,"aan-afkoppelen",{"$f":"SUM(G7:G12)","v":3.5532407346181571E-3},null,{"$f":"IF(M8,\"1\",0)","v":0},null,null,null,null,0,{"$f":"P8-O8","v":0}]
[0,null,null,null,null,0,0,null,null,null,null,0,null,null,null,null,0,0]
[0,null,null,null,null,0,0,null,"Totaal uren",{"$f":"J11+J12","v":0},null,0,null,null,null,null,0,0]
[0,null,null,null,null,0,0,null,"wachten instructie",{"$f":"SUM(Q7:Q16)","v":0},null,0,null,null,null,null,0,0]
[0,null,null,null,null,0,0,null," wachten koppelchauffeur",{"$f":"SUM(R7:R16)","v":0},null,0,null,null,null,null,0,0]
[0,null,null,null,null,0,0,null,null,null,null,0,null,null,null,null,0,0]
[0,null,null,null,null,0,0,null,null,null,null,0,null,null,null,null,0,0]
[0,null,null,null,null,0,0,null,null,null,null,0,null,null,null,null,0,0]
[0,null,null,null,null,0,0,null,null,null,null,0,null,null,null,null,0,0]
[]
[null,"dinsdag 17-9-2019",null,null,null,null,null,null,null,null,null,null,{"$f":"B18","v":"dinsdag 17-9-2019"}]
[null,"Begintijd","Eindtijd","Begintijd","Eindtijd","tanken","aan/afkoppelen",null,"Totaal uren",{"$f":"J20+J21","v":0},null,null,"Begintijd","Eindtijd","Begintijd","Eindtijd","wachten instructie","wachten koppelchauffeur"]
[{"$f":"IF(B20,\"1\",0)","v":0},null,null,null,null,{"$f":"C20-B20","v":0},{"$f":"E20-D20","v":0},null,"tanken",{"$f":"SUM(F20:F29)","v":0},null,0,null,null,null,null,{"$f":"N20-M20","v":0},{"$f":"R7","v":0}]
[{"$f":"IF(B21,\"1\",0)","v":0},null,null,null,null,{"$f":"C21-B21","v":0},0,null,"aan-afkoppelen",{"$f":"SUM(G20:G29)","v":0},null,{"$f":"IF(M21,\"1\",0)","v":0},null,null,null,null,0,0]
[0,null,null,null,null,0,0,null,null,null,null,0,null,null,null,null,0,0]
[0,null,null,null,null,0,0,null,"Totaal uren",{"$f":"J24+J25","v":0},null,0,null,null,null,null,0,0]
[0,null,null,null,null,0,0,null,"wachten instructie",{"$f":"SUM(Q20:Q29)","v":0},null,0,null,null,null,null,0,0]
[0,null,null,null,null,0,0,null,"wachten koppelchauffeur",{"$f":"SUM(R20:R29)","v":0},null,0,null,null,null,null,0,0]
[0,null,null,null,null,0,0,null,null,null,null,0,null,null,null,null,0,0]
[0,null,null,null,null,0,0,null,null,null,null,0,null,null,null,null,0,0]
[0,null,null,null,null,0,0,null,null,null,null,0,null,null,null,null,0,0]
[0,null,null,null,null,0,0,null,null,null,null,0,null,null,null,null,{"$f":"Q16","v":0},{"$f":"R16","v":0}]
[]
[null,"woensdag 18-9-2019",null,null,null,null,null,null,null,null,null,null,{"$f":"B31","v":"woensdag 18-9-2019"}]
[null,"Begintijd","Eindtijd","Begintijd","Eindtijd","tanken","aan/afkoppelen",null,"Totaal uren",{"$f":"J33+J34","v":0},null,null,"Begintijd","Eindtijd","Begintijd","Eindtijd","wachten instructie","wachten koppelchauffeur"]
[{"$f":"IF(B33,\"1\",0)","v":0},null,null,null,null,{"$f":"C33-B33","v":0},{"$f":"E33-D33","v":0},null,"tanken",{"$f":"SUM(F33:F38)","v":0},null,1,null,null,null,null,0,0]
[0,null,null,null,null,0,0,null,"aan-afkoppelen",{"$f":"SUM(G33:G38)","v":0},null,{"$f":"IF(M34,\"1\",0)","v":0},null,null,null,null,0,0]
[0,null,null,null,null,0,0,null,null,null,null,0,null,null,null,null,0,0]
[0,null,null,null,null,0,0,null,"Totaal uren",{"$f":"J37+J38","v":0},null,0,null,null,null,null,0,0]
[0,null,null,null,null,0,0,null,"wachten instructie",{"$f":"SUM(Q33:Q42)","v":0},null,0,null,null,null,null,0,0]
[0,null,null,null,null,0,0,null,"wachten koppelchauffeur",{"$f":"SUM(R33:R42)","v":0},null,0,null,null,null,null,0,0]
[0,null,null,null,null,0,0,null,null,null,null,0,null,null,null,null,0,0]
[0,null,null,null,null,0,0,null,null,null,null,0,null,null,null,null,0,0]
[0,null,null,null,null,0,0,null,null,null,null,0,null,null,null,null,0,0]
[0,null,null,null,null,0,0,null,null,null,null,0,null,null,null,null,0,0]
[]
[null,"donderdag 19-9-2019",null,null,null,null,null,null,null,null,null,null,{"$f":"B44","v":"donderdag 19-9-2019"}]
[null,"Begintijd","Eindtijd","Begintijd","Eindtijd","tanken","aan/afkoppelen",null,"Totaal uren",{"$f":"J46+J47","v":1.0439814817800652E-2},null,null,"Begintijd","Eindtijd","Begintijd","Eindtijd","wachten instructie","wachten koppelchauffeur"]
[{"$f":"IF(B46,\"1\",0)","v":"1"},"2015-09-18T04:11:58","2015-09-18T04:27:00",null,null,{"$f":"C46-B46","v":1.0439814817800652E-2},{"$f":"E46-D46","v":0},null,"tanken",{"$f":"SUM(F46:F55)","v":1.0439814817800652E-2},null,0,null,null,null,null,{"$f":"N46-M46","v":0},{"$f":"P46-O46","v":0}]
[{"$f":"IF(B47,\"1\",0)","v":0},null,null,null,null,{"$f":"C47-B47","v":0},0,null,"aan-afkoppelen",{"$f":"SUM(G46:G55)","v":0},null,{"$f":"IF(M47,\"1\",0)","v":0},null,null,null,null,0,{"$f":"P47-O47","v":0}]
[0,null,null,null,null,0,0,null,null,null,null,0,null,null,null,null,0,0]
[0,null,null,null,null,0,0,null,"Totaal uren",{"$f":"J50+J51","v":0},null,0,null,null,null,null,0,0]
[0,null,null,null,null,0,0,null,"wachten instructie",{"$f":"SUM(Q46:Q55)","v":0},null,0,null,null,null,null,0,0]
[0,null,null,null,null,0,0,null,"wachten koppelchauffeur",{"$f":"SUM(R46:R55)","v":0},null,0,null,null,null,null,0,0]
[0,null,null,null,null,0,0,null,null,null,null,0,null,null,null,null,0,0]
[0,null,null,null,null,0,0,null,null,null,null,0,null,null,null,null,0,0]
[0,null,null,null,null,0,0,null,null,null,null,0,null,null,null,null,0,0]
[0,null,null,null,null,0,0,null,null,null,null,0,null,null,null,null,0,0]
[]
[null,"vrijdag 20-9-2019",null,null,null,null,null,null,null,null,null,null,{"$f":"B57","v":"vrijdag 20-9-2019"}]
[null,"Begintijd","Eindtijd","Begintijd","Eindtijd","tanken","aan/afkoppelen",null,"Totaal uren",{"$f":"J59+J60","v":2.4097222216369119E-2},null,null,"Begintijd","Eindtijd","Begintijd","Eindtijd","wachten instructie","wachten koppelchauffeur"]
[{"$f":"IF(B59,\"1\",0)","v":"1"},"2015-09-19T19:10:45","2015-09-19T19:25:03","2015-09-19T18:56:24","2015-09-19T19:10:40",{"$f":"C59-B59","v":9.930555555911269E-3},{"$f":"E59-D59","v":9.9074074023519643E-3},null,"tanken",{"$f":"SUM(F59:F64)","v":1.4189814814017154E-2},null,1,"2015-09-19T09:36:17","2015-09-19T10:03:38",null,null,{"$f":"N59-M59","v":1.8993055557075422E-2},{"$f":"P59-O59","v":0}]
[{"$f":"IF(B60,\"1\",0)","v":"1"},"2015-09-19T19:38:32","2015-09-19T19:44:40",null,null,{"$f":"C60-B60","v":4.2592592581058852E-3},0,null,"aan-afkoppelen",{"$f":"SUM(G59:G64)","v":9.9074074023519643E-3},null,{"$f":"IF(M60,\"1\",0)","v":0},null,null,null,null,0,{"$f":"P60-O60","v":0}]
[0,null,null,null,null,0,0,null,null,null,null,0,null,null,null,null,0,0]
[0,null,null,null,null,0,0,null,"Totaal uren",{"$f":"J63+J64","v":1.8993055557075422E-2},null,0,null,null,null,null,0,0]
[0,null,null,null,null,0,0,null,"wachten instructie",{"$f":"SUM(Q59:Q68)","v":1.8993055557075422E-2},null,0,null,null,null,null,0,0]
[0,null,null,null,null,0,0,null,"wachten koppelchauffeur",{"$f":"SUM(R59:R68)","v":0},null,0,null,null,null,null,0,0]
[0,null,null,null,null,0,0,null,null,null,null,0,null,null,null,null,0,0]
[0,null,null,null,null,0,0,null,null,null,null,0,null,null,null,null,0,0]
[0,null,null,null,null,0,0,null,null,null,null,0,null,null,null,null,0,0]
[0,null,null,null,null,0,0,null,null,null,null,0,null,null,null,null,0,0]
[]
[null,"zaterdag 21-9-2019",null,null,null,null,null,null,null,null,null,null,{"$f":"B70","v":"zaterdag 21-9-2019"}]
[null,"Begintijd","Eindtijd","Begintijd","Eindtijd","tanken","aan/afkoppelen",null,"Totaal uren",{"$f":"J72+J73","v":0},null,null,"Begintijd","Eindtijd","Begintijd","Eindtijd","wachten instructie","wachten koppelchauffeur"]
[{"$f":"IF(B72,\"1\",0)","v":0},null,null,null,null,{"$f":"C72-B72","v":0},{"$f":"E72-D72","v":0},null,"tanken",{"$f":"SUM(F72:F81)","v":0},null,{"$f":"IF(M72,\"1\",0)","v":0},null,null,null,null,{"$f":"N72-M72","v":0},{"$f":"P72-O72","v":0}]
[{"$f":"IF(B73,\"1\",0)","v":0},null,null,null,null,{"$f":"C73-B73","v":0},{"$f":"E73-D73","v":0},null,"aan-afkoppelen",{"$f":"SUM(G72:G81)","v":0},null,{"$f":"IF(M73,\"1\",0)","v":0},null,null,null,null,{"$f":"N73-M73","v":0},{"$f":"P73-O73","v":0}]
[0,null,null,null,null,0,0,null,null,null,null,0,null,null,null,null,0,0]
[0,null,null,null,null,0,0,null,"Totaal uren",{"$f":"J76+J77","v":0},null,0,null,null,null,null,0,0]
[0,null,null,null,null,0,0,null,"wachten instructie",{"$f":"SUM(Q72:Q81)","v":0},null,0,null,null,null,null,0,0]
[0,null,null,null,null,0,0,null," wachten koppelchauffeur",{"$f":"SUM(R72:R81)","v":0},null,0,null,null,null,null,0,0]
[0,null,null,null,null,0,0,null,null,null,null,0,null,null,null,null,0,0]
[0,null,null,null,null,0,0,null,null,null,null,0,null,null,null,null,0,0]
[0,null,null,null,null,0,0,null,null,null,null,0,null,null,null,null,0,0]
[0,null,null,null,null,0,0,null,null,null,null,0,null,null,null,null,0,0]
[]
[null,"zondag 22-9-2019",null,null,null,null,null,null,null,null,null,null,{"$f":"B83","v":"zondag 22-9-2019"}]
[null,"Begintijd","Eindtijd","Begintijd","Eindtijd","tanken","aan/afkoppelen",null,"Totaal uren",{"$f":"J85+J86","v":0},null,null,"Begintijd","Eindtijd","Begintijd","Eindtijd","wachten instructie","wachten koppelchauffeur"]
[{"$f":"IF(B85,\"1\",0)","v":0},null,null,null,null,{"$f":"C85-B85","v":0},{"$f":"E85-D85","v":0},null,"tanken",{"$f":"SUM(F85:F90)","v":0},null,{"$f":"IF(M85,\"1\",0)","v":0},null,null,null,null,{"$f":"N85-M85","v":0},{"$f":"P85-O85","v":0}]
[0,null,null,null,null,{"$f":"C86-B86","v":0},{"$f":"E86-D86","v":0},null,"aan-afkoppelen",{"$f":"SUM(G85:G90)","v":0},null,{"$f":"IF(M86,\"1\",0)","v":0},null,null,null,null,0,0]
[0,null,null,null,null,0,0,null,null,null,null,0,null,null,null,null,0,0]
[0,null,null,null,null,0,0,null,"Totaal uren",{"$f":"J89+J90","v":0},null,0,null,null,null,null,0,0]
[0,null,null,null,null,0,0,null,"wachten instructie",{"$f":"SUM(Q85:Q94)","v":0},null,0,null,null,null,null,0,0]
[0,null,null,null,null,0,0,null,"wachten koppelchauffeur",{"$f":"SUM(R85:R94)","v":0},null,0,null,null,null,null,0,0]
[0,null,null,null,null,0,0,null,null,null,null,0,null,null,null,null,0,0]
[0,null,null,null,null,0,0,null,null,null,null,0,null,null,null,null,0,0]
[0,null,null,null,null,0,0,null,null,null,null,0,null,null,null,null,0,0]
[0,null,null,null,null,0,0,null,null,null,null,0,null,null,null,null,0,0]
[]
[null,null,null,null,null,null,null,null,"tanken",{"$f":"J85+J72+J59+J46+J33+J20+J7","v":3.6562500004947651E-2}]
[]
[null,null,null,null,null,null,null,null,"aan-afkoppelen",{"$f":"J86+J73+J60+J47+J34+J21+J8","v":1.3460648136970121E-2}]
[]
[null,null,null,null,null,null,null,null,"Totaal uren",{"$f":"J98+J96","v":5.0023148141917773E-2}]
[]
[]
[null,null,null,null,null,null,null,null,"wachten instructie",{"$f":"J89+J76+J63+J50+J37+J24+J11","v":1.8993055557075422E-2}]
[]
[null,null,null,null,null,null,null,null,"wachten koppelchauffeur",{"$f":"J90+J77+J64+J51+J38+J25+J12","v":0}]
[]
[null,null,null,null,null,null,null,null,"Totaal uren",{"$f":"J105+J103","v":1.8993055557075422E-2}]
[]
[]
[null,"Einde dag-taken week 38"]

{"sheet":"LadenLossen (37)","index":17,"n_rows":49,"n_cols":17,"rows_kept":49,"cut":false,"hidden":true,"merged":[[0,1,0,7],[0,13,0,15],[3,13,3,15],[4,1,5,4],[4,5,5,7],[6,19,6,20],[7,11,7,12],[7,17,7,18],[7,19,7,20],[8,11,8,12],[8,17,8,18],[8,19,8,20],[6,17,6,18],[9,11,9,12],[9,17,9,18],[9,19,9,20],[10,11,10,12],[10,17,10,18],[10,19,10,20],[11,11,11,12],[11,17,11,18],[11,19,11,20],[12,11,12,12],[12,17,12,18],[12,19,12,20],[13,11,13,12],[13,17,13,18],[13,19,13,20],[14,11,14,12],[14,17,14,18],[14,19,14,20],[15,11,15,12],[15,17,15,18],[15,19,15,20],[16,11,16,12],[16,17,16,18],[16,19,16,20],[17,11,17,12],[17,17,17,18],[17,19,17,20],[18,11,18,12],[18,17,18,18],[18,19,18,20],[19,11,19,12],[19,17,19,18],[19,19,19,20],[20,11,20,12],[20,17,20,18],[20,19,20,20],[21,11,21,12],[21,17,21,18],[21,19,21,20],[22,11,22,12],[22,17,22,18],[22,19,22,20],[23,11,23,12],[23,17,23,18],[23,19,23,20],[24,11,24,12],[24,17,24,18],[24,19,24,20],[25,11,25,12],[25,17,25,18],[25,19,25,20],[26,11,26,12],[26,17,26,18],[26,19,26,20],[29,11,29,12],[29,17,29,18],[29,19,29,20],[27,11,27,12],[27,17,27,18],[27,19,27,20],[28,11,28,12],[28,17,28,18],[28,19,28,20]]}
["02:00:00","Laden/lossen (beschikbaarheidstijd (behalve bij Rood ))",null,null,null,null,null,null,null,"Week 37",null,null,null,"   = zelf laden/lossen"]
[]
[]
[null,null,null,null,null,null,null,null,null,"Totaal",null,null,null,"Wachturen laden/lossen"]
[null," Laden",null,null,null,"Lossen",null,null,null,"Laden","Lossen","Totaal uren",null,"Laden",null,"Lossen","Totaal uren"]
["Nr.",null,null,null,null,null,null,null,null,{"$f":"SUM(J8:J49)","v":0.14412037037012243},{"$f":"SUM(K8:K49)","v":0.32974537037565216},{"$f":"J6+K6","v":0.47386574074577459},null,{"$f":"SUM(N8:N25)","v":7.6840277778198171E-2},null,{"$f":"SUM(P8:P25)","v":3.5752314814696248E-2},{"$f":"N6+P6","v":0.11259259259289442}]
[0,"begin",null,"eind",null,"begin",null,"eind"]
[1,null,null,null,null,"2015-09-09T12:21:19",null,"2015-09-09T13:34:16",null,{"$f":"IF(D8<>\"\",IF(D8-B8>TIME(2,0,0),TIME(2,0,0),D8-B8),\"\")","v":""},{"$f":"IF(H8<>\"\",IF((H8-F8)>TIME(2,0,0),TIME(2,0,0),H8-F8),\"\")","v":5.0659722226555459E-2},null,null,{"$f":"IF(D8-B8>TIME(2,0,0),D8-B8-TIME(2,0,0),\"\")","v":""},null,{"$f":"IF((H8-F8)>TIME(2,0,0),H8-F8-TIME(2,0,0),\"\")","v":""}]
[2,null,null,null,null,"2015-09-09T14:46:20",null,"2015-09-09T15:36:11",null,"",3.4618055557075422E-2,null,null,"",null,""]
[3,null,null,null,null,"2015-09-09T15:41:33",null,"2015-09-09T16:09:38",null,"",1.9502314811688848E-2,null,null,"",null,""]
[4,"2015-09-10T07:09:36",null,"2015-09-10T11:00:15",null,null,null,null,null,8.3333333333333329E-2,"",null,null,7.6840277778198171E-2,null,""]
[5,null,null,null,null,"2015-09-11T10:50:36",null,"2015-09-11T12:23:23",null,"",6.4432870371092577E-2,null,null,"",null,""]
[6,null,null,null,null,"2015-09-11T18:55:39",null,"2015-09-11T19:05:37",null,"",6.921296298969537E-3,null,null,"",null,""]
[7,null,null,null,null,"2015-09-12T07:29:07",null,"2015-09-12T08:52:58",null,"",5.8229166665114462E-2,null,null,"",null,""]
[8,null,null,null,null,"2015-09-12T09:12:10",null,"2015-09-12T12:03:39",null,"",8.3333333333333329E-2,null,null,"",null,3.5752314814696248E-2]
[9,"2015-09-12T13:23:23",null,"2015-09-12T14:50:55",null,null,null,null,null,6.0787037036789116E-2,"",null,null,"",null,""]
[10,null,null,null,null,"2015-09-12T17:02:13",null,42259.721921296295,null,"",1.2048611111822538E-2,null,null,"",null,""]
[null,null,null,null,null,null,null,null,null,"","",null,null,"",null,""]
[null,null,null,null,null,null,null,null,null,"","",null,null,"",null,""]
[null,null,null,null,null,null,null,null,null,"","",null,null,"",null,""]
[null,null,null,null,null,null,null,null,null,"",null,null,null,""]
[null,null,null,null,null,null,null,null,null,"","",null,null,"",null,""]
[null,null,null,null,null,null,null,null,null,"","",null,null,"",null,""]
[null,null,null,null,null,null,null,null,null,"","",null,null,"",null,""]
[null,null,null,null,null,null,null,null,null,"","",{"$f":"IF(H25<>\"\",H25-F25,\"\")","v":""},null,"",null,""]
[null,null,null,null,null,null,null,null,null,{"$f":"IF(D26<>\"\",D26-B26,\"\")","v":""},{"$f":"IF(H26<>\"\",H26-F26,\"\")","v":""},""]
[null,null,null,null,null,null,null,null,null,"","",""]
[null,null,null,null,null,null,null,null,null,"","",""]
[null,null,null,null,null,null,null,null,null,"","",""]
[null,null,null,null,null,null,null,null,null,"","",""]
[null,null,null,null,null,null,null,null,null,"",""]
[null,null,null,null,null,null,null,null,null,"",""]
[null,null,null,null,null,null,null,null,null,"",""]
[null,null,null,null,null,null,null,null,null,"",""]
[null,null,null,null,null,null,null,null,null,"",""]
[null,null,null,null,null,null,null,null,null,"",""]
[null,null,null,null,null,null,null,null,null,"",""]
[null,null,null,null,null,null,null,null,null,"",""]
[null,null,null,null,null,null,null,null,null,"",""]
[null,null,null,null,null,null,null,null,null,"",""]
[null,null,null,null,null,null,null,null,null,"",""]
[null,null,null,null,null,null,null,null,null,"",""]
[null,null,null,null,null,null,null,null,null,"",""]
[null,null,null,null,null,null,null,null,null,"",""]
[null,null,null,null,null,null,null,null,null,"",""]
[null,null,null,null,null,null,null,null,null,"",""]
[null,null,null,null,null,null,null,null,null,"",""]
[null,null,null,null,null,null,null,null,null,"",""]
[null,null,null,null,null,null,null,null,null,"",""]

{"sheet":"Dag-taken week (37)","index":18,"n_rows":110,"n_cols":18,"rows_kept":110,"cut":false,"hidden":true,"merged":[[30,1,30,6],[30,12,30,17],[0,12,0,17],[4,1,4,6],[4,12,4,17],[17,1,17,6],[17,12,17,17],[43,1,43,6],[43,12,43,17],[56,1,56,6],[56,12,56,17],[69,1,69,6],[69,12,69,17],[82,1,82,6],[82,12,82,17],[95,8,96,8],[95,9,96,10],[97,8,98,8],[97,9,98,10],[106,8,108,8],[106,9,108,10],[109,1,112,17],[99,8,100,8],[99,9,100,10],[102,8,103,8],[102,9,103,10],[104,8,105,8],[104,9,105,10]]}
[null,"Dag-taken week 37",null,null,null,null,null,null,null,null,null,null,{"$f":"B1","v":"Dag-taken week 37"}]
[null,"tanken",null,"aan/afkoppelen",null,"Totaal",{"$f":"Q2","v":"Tijden"},null,null,null,null,null,"wachten instructie",null,"wachten koppelchauffeur",null,"Tijden"]
[]
[]
[null,"maandag 09-9-2019",null,null,null,null,null,null,null,null,null,null,{"$f":"B5","v":"maandag 09-9-2019"}]
[null,"Begintijd","Eindtijd","Begintijd","Eindtijd","tanken","aan/afkoppelen",null,"Totaal uren",{"$f":"J7+J8","v":0},null,null,"Begintijd","Eindtijd","Begintijd","Eindtijd","wachten instructie","wachten koppelchauffeur"]
[1,null,null,null,null,{"$f":"C7-B7","v":0},{"$f":"E7-D7","v":0},null,"tanken",{"$f":"SUM(F7:F12)","v":0},null,null,null,null,null,null,{"$f":"N7-M7","v":0},{"$f":"P7-O7","v":0}]
[{"$f":"IF(B8,\"1\",0)","v":0},null,null,null,null,{"$f":"C8-B8","v":0},0,null,"aan-afkoppelen",{"$f":"SUM(G7:G12)","v":0},null,{"$f":"IF(M8,\"1\",0)","v":0},null,null,null,null,0,{"$f":"P8-O8","v":0}]
[0,null,null,null,null,0,0,null,null,null,null,0,null,null,null,null,0,0]
[0,null,null,null,null,0,0,null,"Totaal uren",{"$f":"J11+J12","v":0},null,0,null,null,null,null,0,0]
[0,null,null,null,null,0,0,null,"wachten instructie",{"$f":"SUM(Q7:Q16)","v":0},null,0,null,null,null,null,0,0]
[0,null,null,null,null,0,0,null," wachten koppelchauffeur",{"$f":"SUM(R7:R16)","v":0},null,0,null,null,null,null,0,0]
[0,null,null,null,null,0,0,null,null,null,null,0,null,null,null,null,0,0]
[0,null,null,null,null,0,0,null,null,null,null,0,null,null,null,null,0,0]
[0,null,null,null,null,0,0,null,null,null,null,0,null,null,null,null,0,0]
[0,null,null,null,null,0,0,null,null,null,null,0,null,null,null,null,0,0]
[]
[null,"dinsdag 10-9-2019",null,null,null,null,null,null,null,null,null,null,{"$f":"B18","v":"dinsdag 10-9-2019"}]
[null,"Begintijd","Eindtijd","Begintijd","Eindtijd","tanken","aan/afkoppelen",null,"Totaal uren",{"$f":"J20+J21","v":2.0023148143081926E-2},null,null,"Begintijd","Eindtijd","Begintijd","Eindtijd","wachten instructie","wachten koppelchauffeur"]
[{"$f":"IF(B20,\"1\",0)","v":"1"},"2015-09-09T03:33:34","2015-09-09T03:53:01","2015-09-09T03:19:25","2015-09-09T03:28:48",{"$f":"C20-B20","v":1.3506944444088731E-2},{"$f":"E20-D20","v":6.5162036989931948E-3},null,"tanken",{"$f":"SUM(F20:F29)","v":1.3506944444088731E-2},null,0,null,null,null,null,{"$f":"N20-M20","v":0},{"$f":"R7","v":0}]
[{"$f":"IF(B21,\"1\",0)","v":0},null,null,null,null,{"$f":"C21-B21","v":0},0,null,"aan-afkoppelen",{"$f":"SUM(G20:G29)","v":6.5162036989931948E-3},null,{"$f":"IF(M21,\"1\",0)","v":0},null,null,null,null,0,0]
[0,null,null,null,null,0,0,null,null,null,null,0,null,null,null,null,0,0]
[0,null,null,null,null,0,0,null,"Totaal uren",{"$f":"J24+J25","v":0},null,0,null,null,null,null,0,0]
[0,null,null,null,null,0,0,null,"wachten instructie",{"$f":"SUM(Q20:Q29)","v":0},null,0,null,null,null,null,0,0]
[0,null,null,null,null,0,0,null,"wachten koppelchauffeur",{"$f":"SUM(R20:R29)","v":0},null,0,null,null,null,null,0,0]
[0,null,null,null,null,0,0,null,null,null,null,0,null,null,null,null,0,0]
[0,null,null,null,null,0,0,null,null,null,null,0,null,null,null,null,0,0]
[0,null,null,null,null,0,0,null,null,null,null,0,null,null,null,null,0,0]
[0,null,null,null,null,0,0,null,null,null,null,0,null,null,null,null,{"$f":"Q16","v":0},{"$f":"R16","v":0}]
[]
[null,"woensdag 11-9-2019",null,null,null,null,null,null,null,null,null,null,{"$f":"B31","v":"woensdag 11-9-2019"}]
[null,"Begintijd","Eindtijd","Begintijd","Eindtijd","tanken","aan/afkoppelen",null,"Totaal uren",{"$f":"J33+J34","v":0},null,null,"Begintijd","Eindtijd","Begintijd","Eindtijd","wachten instructie","wachten koppelchauffeur"]
[{"$f":"IF(B33,\"1\",0)","v":0},null,null,null,null,{"$f":"C33-B33","v":0},{"$f":"E33-D33","v":0},null,"tanken",{"$f":"SUM(F33:F38)","v":0},null,1,null,null,null,null,{"$f":"N33-M33","v":0},0]
[0,null,null,null,null,0,0,null,"aan-afkoppelen",{"$f":"SUM(G33:G38)","v":0},null,{"$f":"IF(M34,\"1\",0)","v":0},null,null,null,null,0,0]
[0,null,null,null,null,0,0,null,null,null,null,0,null,null,null,null,0,0]
[0,null,null,null,null,0,0,null,"Totaal uren",{"$f":"J37+J38","v":0},null,0,null,null,null,null,0,0]
[0,null,null,null,null,0,0,null,"wachten instructie",{"$f":"SUM(Q33:Q42)","v":0},null,0,null,null,null,null,0,0]
[0,null,null,null,null,0,0,null,"wachten koppelchauffeur",{"$f":"SUM(R33:R42)","v":0},null,0,null,null,null,null,0,0]
[0,null,null,null,null,0,0,null,null,null,null,0,null,null,null,null,0,0]
[0,null,null,null,null,0,0,null,null,null,null,0,null,null,null,null,0,0]
[0,null,null,null,null,0,0,null,null,null,null,0,null,null,null,null,0,0]
[0,null,null,null,null,0,0,null,null,null,null,0,null,null,null,null,0,0]
[]
[null,"donderdag 12-9-2019",null,null,null,null,null,null,null,null,null,null,{"$f":"B44","v":"donderdag 12-9-2019"}]
[null,"Begintijd","Eindtijd","Begintijd","Eindtijd","tanken","aan/afkoppelen",null,"Totaal uren",{"$f":"J46+J47","v":1.1307870372547768E-2},null,null,"Begintijd","Eindtijd","Begintijd","Eindtijd","wachten instructie","wachten koppelchauffeur"]
[{"$f":"IF(B46,\"1\",0)","v":0},null,null,"2015-09-11T19:07:43","2015-09-11T19:24:00",{"$f":"C46-B46","v":0},{"$f":"E46-D46","v":1.1307870372547768E-2},null,"tanken",{"$f":"SUM(F46:F55)","v":0},null,0,"2015-09-11T12:28:31","2015-09-11T13:07:30",null,null,{"$f":"#REF!-#REF!","v":{"$error":"#REF!"}},{"$f":"P46-O46","v":0}]
[{"$f":"IF(B47,\"1\",0)","v":0},null,null,null,null,{"$f":"C47-B47","v":0},0,null,"aan-afkoppelen",{"$f":"SUM(G46:G55)","v":1.1307870372547768E-2},null,{"$f":"IF(M47,\"1\",0)","v":0},null,null,null,null,{"$f":"N47-M47","v":0},{"$f":"P47-O47","v":0}]
[0,null,null,null,null,0,0,null,null,null,null,0,null,null,null,null,0,0]
[0,null,null,null,null,0,0,null,"Totaal uren",{"$f":"J50+J51","v":2.7071759257523809E-2},null,0,null,null,null,null,0,0]
[0,null,null,null,null,0,0,null,"wachten instructie",{"$f":"SUM(N46-M46)","v":2.7071759257523809E-2},null,0,null,null,null,null,0,0]
[0,null,null,null,null,0,0,null,"wachten koppelchauffeur",{"$f":"SUM(R46:R55)","v":0},null,0,null,null,null,null,0,0]
[0,null,null,null,null,0,0,null,null,null,null,0,null,null,null,null,0,0]
[0,null,null,null,null,0,0,null,null,null,null,0,null,null,null,null,0,0]
[0,null,null,null,null,0,0,null,null,{"$f":"J45+J49","v":3.8379629630071577E-2},null,0,null,null,null,null,0,0]
[0,null,null,null,null,0,0,null,null,null,null,0,null,null,null,null,0,0]
[]
[null,"vrijdag 13-9-2019",null,null,null,null,null,null,null,null,null,null,{"$f":"B57","v":"vrijdag 13-9-2019"}]
[null,"Begintijd","Eindtijd","Begintijd","Eindtijd","tanken","aan/afkoppelen",null,"Totaal uren",{"$f":"J59+J60","v":1.5555555561149959E-2},null,null,"Begintijd","Eindtijd","Begintijd","Eindtijd","wachten instructie","wachten koppelchauffeur"]
[{"$f":"IF(B59,\"1\",0)","v":0},null,null,"2015-09-12T05:48:52","2015-09-12T06:09:38",{"$f":"C59-B59","v":0},{"$f":"E59-D59","v":1.4421296298678499E-2},null,"tanken",{"$f":"SUM(F59:F64)","v":0},null,1,null,null,null,null,{"$f":"N59-M59","v":0},{"$f":"P59-O59","v":0}]
[{"$f":"IF(B60,\"1\",0)","v":0},null,null,"2015-09-12T17:21:45","2015-09-12T17:23:23",{"$f":"C60-B60","v":0},1.1342592624714598E-3,null,"aan-afkoppelen",{"$f":"SUM(G59:G64)","v":1.5555555561149959E-2},null,{"$f":"IF(M60,\"1\",0)","v":0},null,null,null,null,0,{"$f":"P60-O60","v":0}]
[0,null,null,null,null,0,0,null,null,null,null,0,null,null,null,null,0,0]
[0,null,null,null,null,0,0,null,"Totaal uren",{"$f":"J63+J64","v":0},null,0,null,null,null,null,0,0]
[0,null,null,null,null,0,0,null,"wachten instructie",{"$f":"SUM(Q59:Q68)","v":0},null,0,null,null,null,null,0,0]
[0,null,null,null,null,0,0,null,"wachten koppelchauffeur",{"$f":"SUM(R59:R68)","v":0},null,0,null,null,null,null,0,0]
[0,null,null,null,null,0,0,null,null,null,null,0,null,null,null,null,0,0]
[0,null,null,null,null,0,0,null,null,null,null,0,null,null,null,null,0,0]
[0,null,null,null,null,0,0,null,null,null,null,0,null,null,null,null,0,0]
[0,null,null,null,null,0,0,null,null,null,null,0,null,null,null,null,0,0]
[]
[null,"zaterdag 14-9-2019",null,null,null,null,null,null,null,null,null,null,{"$f":"B70","v":"zaterdag 14-9-2019"}]
[null,"Begintijd","Eindtijd","Begintijd","Eindtijd","tanken","aan/afkoppelen",null,"Totaal uren",{"$f":"J72+J73","v":0},null,null,"Begintijd","Eindtijd","Begintijd","Eindtijd","wachten instructie","wachten koppelchauffeur"]
[{"$f":"IF(B72,\"1\",0)","v":0},null,null,null,null,{"$f":"C72-B72","v":0},{"$f":"E72-D72","v":0},null,"tanken",{"$f":"SUM(F72:F81)","v":0},null,{"$f":"IF(M72,\"1\",0)","v":0},null,null,null,null,{"$f":"N72-M72","v":0},{"$f":"P72-O72","v":0}]
[{"$f":"IF(B73,\"1\",0)","v":0},null,null,null,null,{"$f":"C73-B73","v":0},{"$f":"E73-D73","v":0},null,"aan-afkoppelen",{"$f":"SUM(G72:G81)","v":0},null,{"$f":"IF(M73,\"1\",0)","v":0},null,null,null,null,{"$f":"N73-M73","v":0},{"$f":"P73-O73","v":0}]
[0,null,null,null,null,0,0,null,null,null,null,0,null,null,null,null,0,0]
[0,null,null,null,null,0,0,null,"Totaal uren",{"$f":"J76+J77","v":0},null,0,null,null,null,null,0,0]
[0,null,null,null,null,0,0,null,"wachten instructie",{"$f":"SUM(Q72:Q81)","v":0},null,0,null,null,null,null,0,0]
[0,null,null,null,null,0,0,null," wachten koppelchauffeur",{"$f":"SUM(R72:R81)","v":0},null,0,null,null,null,null,0,0]
[0,null,null,null,null,0,0,null,null,null,null,0,null,null,null,null,0,0]
[0,null,null,null,null,0,0,null,null,null,null,0,null,null,null,null,0,0]
[0,null,null,null,null,0,0,null,null,null,null,0,null,null,null,null,0,0]
[0,null,null,null,null,0,0,null,null,null,null,0,null,null,null,null,0,0]
[]
[null,"zondag 15-9-2019",null,null,null,null,null,null,null,null,null,null,{"$f":"B83","v":"zondag 15-9-2019"}]
[null,"Begintijd","Eindtijd","Begintijd","Eindtijd","tanken","aan/afkoppelen",null,"Totaal uren",{"$f":"J85+J86","v":0},null,null,"Begintijd","Eindtijd","Begintijd","Eindtijd","wachten instructie","wachten koppelchauffeur"]
[{"$f":"IF(B85,\"1\",0)","v":0},null,null,null,null,{"$f":"C85-B85","v":0},{"$f":"E85-D85","v":0},null,"tanken",{"$f":"SUM(F85:F90)","v":0},null,{"$f":"IF(M85,\"1\",0)","v":0},null,null,null,null,{"$f":"N85-M85","v":0},{"$f":"P85-O85","v":0}]
[0,null,null,null,null,{"$f":"C86-B86","v":0},{"$f":"E86-D86","v":0},null,"aan-afkoppelen",{"$f":"SUM(G85:G90)","v":0},null,{"$f":"IF(M86,\"1\",0)","v":0},null,null,null,null,0,0]
[0,null,null,null,null,0,0,null,null,null,null,0,null,null,null,null,0,0]
[0,null,null,null,null,0,0,null,"Totaal uren",{"$f":"J89+J90","v":0},null,0,null,null,null,null,0,0]
[0,null,null,null,null,0,0,null,"wachten instructie",{"$f":"SUM(Q85:Q94)","v":0},null,0,null,null,null,null,0,0]
[0,null,null,null,null,0,0,null,"wachten koppelchauffeur",{"$f":"SUM(R85:R94)","v":0},null,0,null,null,null,null,0,0]
[0,null,null,null,null,0,0,null,null,null,null,0,null,null,null,null,0,0]
[0,null,null,null,null,0,0,null,null,null,null,0,null,null,null,null,0,0]
[0,null,null,null,null,0,0,null,null,null,null,0,null,null,null,null,0,0]
[0,null,null,null,null,0,0,null,null,null,null,0,null,null,null,null,0,0]
[]
[null,null,null,null,null,null,null,null,"tanken",{"$f":"J85+J72+J59+J46+J33+J20+J7","v":1.3506944444088731E-2}]
[]
[null,null,null,null,null,null,null,null,"aan-afkoppelen",{"$f":"J86+J73+J60+J47+J34+J21+J8","v":3.3379629632690921E-2}]
[]
[null,null,null,null,null,null,null,null,"Totaal uren",{"$f":"J98+J96","v":4.6886574076779652E-2}]
[]
[]
[null,null,null,null,null,null,null,null,"wachten instructie",{"$f":"J89+J76+J63+J50+J37+J24+J11","v":2.7071759257523809E-2}]
[]
[null,null,null,null,null,null,null,null,"wachten koppelchauffeur",{"$f":"J90+J77+J64+J51+J38+J25+J12","v":0}]
[]
[null,null,null,null,null,null,null,null,"Totaal uren",{"$f":"J105+J103","v":2.7071759257523809E-2}]
[]
[]
[null,"Einde dag-taken week 37"]

{"sheet":"LadenLossen (36)","index":19,"n_rows":49,"n_cols":17,"rows_kept":49,"cut":false,"hidden":true,"merged":[[0,1,0,7],[0,13,0,15],[3,13,3,15],[4,1,5,4],[4,5,5,7],[6,19,6,20],[7,11,7,12],[7,17,7,18],[7,19,7,20],[8,11,8,12],[8,17,8,18],[8,19,8,20],[6,17,6,18],[9,11,9,12],[9,17,9,18],[9,19,9,20],[10,11,10,12],[10,17,10,18],[10,19,10,20],[11,11,11,12],[11,17,11,18],[11,19,11,20],[12,11,12,12],[12,17,12,18],[12,19,12,20],[13,11,13,12],[13,17,13,18],[13,19,13,20],[14,11,14,12],[14,17,14,18],[14,19,14,20],[15,11,15,12],[15,17,15,18],[15,19,15,20],[16,11,16,12],[16,17,16,18],[16,19,16,20],[17,11,17,12],[17,17,17,18],[17,19,17,20],[18,11,18,12],[18,17,18,18],[18,19,18,20],[19,11,19,12],[19,17,19,18],[19,19,19,20],[20,11,20,12],[20,17,20,18],[20,19,20,20],[21,11,21,12],[21,17,21,18],[21,19,21,20],[22,11,22,12],[22,17,22,18],[22,19,22,20],[23,11,23,12],[23,17,23,18],[23,19,23,20],[24,11,24,12],[24,17,24,18],[24,19,24,20],[25,11,25,12],[25,17,25,18],[25,19,25,20],[26,11,26,12],[26,17,26,18],[26,19,26,20],[29,11,29,12],[29,17,29,18],[29,19,29,20],[27,11,27,12],[27,17,27,18],[27,19,27,20],[28,11,28,12],[28,17,28,18],[28,19,28,20]]}
["02:00:00","Laden/lossen (beschikbaarheidstijd (behalve bij Rood ))",null,null,null,null,null,null,null,"Week 36",null,null,null,"   = zelf laden/lossen"]
[]
[]
[null,null,null,null,null,null,null,null,null,"Totaal",null,null,null,"Wachturen laden/lossen"]
[null," Laden",null,null,null,"Lossen",null,null,null,"Laden","Lossen","Totaal uren",null,"Laden",null,"Lossen","Totaal uren"]
["Nr.",null,null,null,null,null,null,null,null,{"$f":"SUM(J8:J49)","v":0.30386574073539424},{"$f":"SUM(K8:K49)","v":0.19931712962473586},{"$f":"J6+K6","v":0.5031828703601301},null,{"$f":"SUM(N8:N25)","v":1.0312499997477673E-2},null,{"$f":"SUM(P8:P25)","v":4.0752314819352861E-2},{"$f":"N6+P6","v":5.1064814816830534E-2}]
[0,"begin",null,"eind",null,"begin",null,"eind"]
[1,"2015-09-01T08:27:49",null,"2015-09-01T10:19:16",null,null,null,null,null,{"$f":"IF(D8<>\"\",IF(D8-B8>TIME(2,0,0),TIME(2,0,0),D8-B8),\"\")","v":7.7395833330228925E-2},{"$f":"IF(H8<>\"\",IF((H8-F8)>TIME(2,0,0),TIME(2,0,0),H8-F8),\"\")","v":""},null,null,{"$f":"IF(D8-B8>TIME(2,0,0),D8-B8-TIME(2,0,0),\"\")","v":""},null,{"$f":"IF((H8-F8)>TIME(2,0,0),H8-F8-TIME(2,0,0),\"\")","v":""}]
[2,null,null,null,null,"2015-09-02T08:18:00",null,"2015-09-02T09:11:58",null,"",3.7476851852261461E-2,null,null,"",null,""]
[3,"2015-09-02T09:12:06",null,"2015-09-02T11:09:18",null,null,null,null,null,8.1388888887886424E-2,"",null,null,"",null,""]
[4,null,null,null,null,"2015-09-03T10:53:14",null,"2015-09-03T12:46:17",null,"",7.850694443914108E-2,null,null,"",null,""]
[5,"2015-09-03T13:28:02",null,"2015-09-03T15:42:53",null,null,null,null,null,8.3333333333333329E-2,"",null,null,1.0312499997477673E-2,null,""]
[6,"2015-09-03T17:10:48",null,"2015-09-03T18:39:43",null,null,null,null,null,6.1747685183945578E-2,"",null,null,"",null,""]
[7,null,null,null,null,"2015-09-05T09:58:39",null,"2015-09-05T12:57:20",null,"",8.3333333333333329E-2,null,null,"",null,4.0752314819352861E-2]
[null,null,null,null,null,null,null,null,null,"","",null,null,"",null,""]
[null,null,null,null,null,null,null,null,null,"","",null,null,"",null,""]
[null,null,null,null,null,null,null,null,null,"","",null,null,"",null,""]
[null,null,null,null,null,null,null,null,null,"","",null,null,"",null,""]
[null,null,null,null,null,null,null,null,null,"","",null,null,"",null,""]
[null,null,null,null,null,null,null,null,null,"","",null,null,"",null,""]
[null,null,null,null,null,null,null,null,null,"","",null,null,"",null,""]
[null,null,null,null,null,null,"c ",null,null,"","",null,null,"",null,""]
[null,null,null,null,null,null,null,null,null,"","",null,null,"",null,""]
[null,null,null,null,null,null,null,null,null,"","",null,null,"",null,""]
[null,null,null,null,null,null,null,null,null,"","",{"$f":"IF(H25<>\"\",H25-F25,\"\")","v":""},null,"",null,""]
[null,null,null,null,null,null,null,null,null,{"$f":"IF(D26<>\"\",D26-B26,\"\")","v":""},{"$f":"IF(H26<>\"\",H26-F26,\"\")","v":""},""]
[null,null,null,null,null,null,null,null,null,"","",""]
[null,null,null,null,null,null,null,null,null,"","",""]
[null,null,null,null,null,null,null,null,null,"","",""]
[null,null,null,null,null,null,null,null,null,"","",""]
[null,null,null,null,null,null,null,null,null,"",""]
[null,null,null,null,null,null,null,null,null,"",""]
[null,null,null,null,null,null,null,null,null,"",""]
[null,null,null,null,null,null,null,null,null,"",""]
[null,null,null,null,null,null,null,null,null,"",""]
[null,null,null,null,null,null,null,null,null,"",""]
[null,null,null,null,null,null,null,null,null,"",""]
[null,null,null,null,null,null,null,null,null,"",""]
[null,null,null,null,null,null,null,null,null,"",""]
[null,null,null,null,null,null,null,null,null,"",""]
[null,null,null,null,null,null,null,null,null,"",""]
[null,null,null,null,null,null,null,null,null,"",""]
[null,null,null,null,null,null,null,null,null,"",""]
[null,null,null,null,null,null,null,null,null,"",""]
[null,null,null,null,null,null,null,null,null,"",""]
[null,null,null,null,null,null,null,null,null,"",""]
[null,null,null,null,null,null,null,null,null,"",""]
[null,null,null,null,null,null,null,null,null,"",""]
[null,null,null,null,null,null,null,null,null,"",""]

{"sheet":"Dag-taken week (36)","index":20,"n_rows":110,"n_cols":18,"rows_kept":110,"cut":false,"hidden":true,"merged":[[30,1,30,6],[30,12,30,17],[0,12,0,17],[4,1,4,6],[4,12,4,17],[17,1,17,6],[17,12,17,17],[43,1,43,6],[43,12,43,17],[56,1,56,6],[56,12,56,17],[69,1,69,6],[69,12,69,17],[82,1,82,6],[82,12,82,17],[95,8,96,8],[95,9,96,10],[97,8,98,8],[97,9,98,10],[106,8,108,8],[106,9,108,10],[109,1,112,17],[99,8,100,8],[99,9,100,10],[102,8,103,8],[102,9,103,10],[104,8,105,8],[104,9,105,10]]}
[null,"Dag-taken week 36",null,null,null,null,null,null,null,null,null,null,{"$f":"B1","v":"Dag-taken week 36"}]
[null,"tanken",null,"aan/afkoppelen",null,"Totaal",{"$f":"Q2","v":"Tijden"},null,null,null,null,null,"wachten instructie",null,"wachten koppelchauffeur",null,"Tijden"]
[]
[]
[null,"maandag 02-9-2019",null,null,null,null,null,null,null,null,null,null,{"$f":"B5","v":"maandag 02-9-2019"}]
[null,"Begintijd","Eindtijd","Begintijd","Eindtijd","tanken","aan/afkoppelen",null,"Totaal uren",{"$f":"J7+J8","v":1.1030092595319729E-2},null,null,"Begintijd","Eindtijd","Begintijd","Eindtijd","wachten instructie","wachten koppelchauffeur"]
[1,null,null,"2015-09-01T06:29:21","2015-09-01T06:45:14",{"$f":"C7-B7","v":0},{"$f":"E7-D7","v":1.1030092595319729E-2},null,"tanken",{"$f":"SUM(F7:F12)","v":0},null,null,null,null,null,null,{"$f":"N7-M7","v":0},{"$f":"P7-O7","v":0}]
[{"$f":"IF(B8,\"1\",0)","v":0},null,null,null,null,{"$f":"C8-B8","v":0},0,null,"aan-afkoppelen",{"$f":"SUM(G7:G12)","v":1.1030092595319729E-2},null,{"$f":"IF(M8,\"1\",0)","v":0},null,null,null,null,0,{"$f":"P8-O8","v":0}]
[0,null,null,null,null,0,0,null,null,null,null,0,null,null,null,null,0,0]
[0,null,null,null,null,0,0,null,"Totaal uren",{"$f":"J11+J12","v":0},null,0,null,null,null,null,0,0]
[0,null,null,null,null,0,0,null,"wachten instructie",{"$f":"SUM(Q7:Q16)","v":0},null,0,null,null,null,null,0,0]
[0,null,null,null,null,0,0,null," wachten koppelchauffeur",{"$f":"SUM(R7:R16)","v":0},null,0,null,null,null,null,0,0]
[0,null,null,null,null,0,0,null,null,null,null,0,null,null,null,null,0,0]
[0,null,null,null,null,0,0,null,null,null,null,0,null,null,null,null,0,0]
[0,null,null,null,null,0,0,null,null,null,null,0,null,null,null,null,0,0]
[0,null,null,null,null,0,0,null,null,null,null,0,null,null,null,null,0,0]
[]
[null,"dinsdag 03-9-2019",null,null,null,null,null,null,null,null,null,null,{"$f":"B18","v":"dinsdag 03-9-2019"}]
[null,"Begintijd","Eindtijd","Begintijd","Eindtijd","tanken","aan/afkoppelen",null,"Totaal uren",{"$f":"J20+J21","v":0},null,null,"Begintijd","Eindtijd","Begintijd","Eindtijd","wachten instructie","wachten koppelchauffeur"]
[{"$f":"IF(B20,\"1\",0)","v":0},null,null,null,null,{"$f":"C20-B20","v":0},{"$f":"E20-D20","v":0},null,"tanken",{"$f":"SUM(F20:F29)","v":0},null,0,null,null,null,null,{"$f":"N20-M20","v":0},{"$f":"R7","v":0}]
[{"$f":"IF(B21,\"1\",0)","v":0},null,null,null,null,{"$f":"C21-B21","v":0},0,null,"aan-afkoppelen",{"$f":"SUM(G20:G29)","v":0},null,{"$f":"IF(M21,\"1\",0)","v":0},null,null,null,null,0,0]
[0,null,null,null,null,0,0,null,null,null,null,0,null,null,null,null,0,0]
[0,null,null,null,null,0,0,null,"Totaal uren",{"$f":"J24+J25","v":0},null,0,null,null,null,null,0,0]
[0,null,null,null,null,0,0,null,"wachten instructie",{"$f":"SUM(Q20:Q29)","v":0},null,0,null,null,null,null,0,0]
[0,null,null,null,null,0,0,null,"wachten koppelchauffeur",{"$f":"SUM(R20:R29)","v":0},null,0,null,null,null,null,0,0]
[0,null,null,null,null,0,0,null,null,null,null,0,null,null,null,null,0,0]
[0,null,null,null,null,0,0,null,null,null,null,0,null,null,null,null,0,0]
[0,null,null,null,null,0,0,null,null,null,null,0,null,null,null,null,0,0]
[0,null,null,null,null,0,0,null,null,null,null,0,null,null,null,null,{"$f":"Q16","v":0},{"$f":"R16","v":0}]
[]
[null,"woensdag 04-9-2019",null,null,null,null,null,null,null,null,null,null,{"$f":"B31","v":"woensdag 04-9-2019"}]
[null,"Begintijd","Eindtijd","Begintijd","Eindtijd","tanken","aan/afkoppelen",null,"Totaal uren",{"$f":"J33+J34","v":0},null,null,"Begintijd","Eindtijd","Begintijd","Eindtijd","wachten instructie","wachten koppelchauffeur"]
[{"$f":"IF(B33,\"1\",0)","v":0},null,null,null,null,{"$f":"C33-B33","v":0},{"$f":"E33-D33","v":0},null,"tanken",{"$f":"SUM(F33:F38)","v":0},null,1,null,null,null,null,{"$f":"N33-M33","v":0},0]
[0,null,null,null,null,0,0,null,"aan-afkoppelen",{"$f":"SUM(G33:G38)","v":0},null,{"$f":"IF(M34,\"1\",0)","v":0},null,null,null,null,0,0]
[0,null,null,null,null,0,0,null,null,null,null,0,null,null,null,null,0,0]
[0,null,null,null,null,0,0,null,"Totaal uren",{"$f":"J37+J38","v":0},null,0,null,null,null,null,0,0]
[0,null,null,null,null,0,0,null,"wachten instructie",{"$f":"SUM(Q33:Q42)","v":0},null,0,null,null,null,null,0,0]
[0,null,null,null,null,0,0,null,"wachten koppelchauffeur",{"$f":"SUM(R33:R42)","v":0},null,0,null,null,null,null,0,0]
[0,null,null,null,null,0,0,null,null,null,null,0,null,null,null,null,0,0]
[0,null,null,null,null,0,0,null,null,null,null,0,null,null,null,null,0,0]
[0,null,null,null,null,0,0,null,null,null,null,0,null,null,null,null,0,0]
[0,null,null,null,null,0,0,null,null,null,null,0,null,null,null,null,0,0]
[]
[null,"donderdag 05-9-2019",null,null,null,null,null,null,null,null,null,null,{"$f":"B44","v":"donderdag 05-9-2019"}]
[null,"Begintijd","Eindtijd","Begintijd","Eindtijd","tanken","aan/afkoppelen",null,"Totaal uren",{"$f":"J46+J47","v":4.1261574064265005E-2},null,null,"Begintijd","Eindtijd","Begintijd","Eindtijd","wachten instructie","wachten koppelchauffeur"]
[{"$f":"IF(B46,\"1\",0)","v":"1"},"2015-09-04T05:52:37","2015-09-04T06:07:39","2015-09-04T07:48:56","2015-09-04T08:02:02",{"$f":"C46-B46","v":1.0439814810524695E-2},{"$f":"E46-D46","v":9.0972222169511952E-3},null,"tanken",{"$f":"SUM(F46:F55)","v":1.0439814810524695E-2},null,0,null,null,"2015-09-04T08:02:02","2015-09-04T08:50:09",{"$f":"N46-M46","v":0},{"$f":"P46-O46","v":3.3414351855753921E-2}]
[{"$f":"IF(B47,\"1\",0)","v":0},null,null,"2015-09-04T08:50:09","2015-09-04T08:57:16",{"$f":"C47-B47","v":0},4.9421296280343086E-3,null,"aan-afkoppelen",{"$f":"SUM(G46:G55)","v":3.0821759253740311E-2},null,{"$f":"IF(M47,\"1\",0)","v":0},null,null,null,null,0,{"$f":"P47-O47","v":0}]
[0,null,null,"2015-09-04T13:01:44","2015-09-04T13:11:06",0,6.5046296294895001E-3,null,null,null,null,0,null,null,null,null,0,0]
[0,null,null,"2015-09-04T13:12:40","2015-09-04T13:27:28",0,1.0277777779265307E-2,null,"Totaal uren",{"$f":"J50+J51","v":3.3414351855753921E-2},null,0,null,null,null,null,0,0]
[0,null,null,null,null,0,0,null,"wachten instructie",{"$f":"SUM(Q46:Q55)","v":0},null,0,null,null,null,null,0,0]
[0,null,null,null,null,0,0,null,"wachten koppelchauffeur",{"$f":"SUM(R46:R55)","v":3.3414351855753921E-2},null,0,null,null,null,null,0,0]
[0,null,null,null,null,0,0,null,null,null,null,0,null,null,null,null,0,0]
[0,null,null,null,null,0,0,null,null,null,null,0,null,null,null,null,0,0]
[0,null,null,null,null,0,0,null,null,null,null,0,null,null,null,null,0,0]
[0,null,null,null,null,0,0,null,null,null,null,0,null,null,null,null,0,0]
[]
[null,"vrijdag 06-9-2019",null,null,null,null,null,null,null,null,null,null,{"$f":"B57","v":"vrijdag 06-9-2019"}]
[null,"Begintijd","Eindtijd","Begintijd","Eindtijd","tanken","aan/afkoppelen",null,"Totaal uren",{"$f":"J59+J60","v":3.0729166661330964E-2},null,null,"Begintijd","Eindtijd","Begintijd","Eindtijd","wachten instructie","wachten koppelchauffeur"]
[{"$f":"IF(B59,\"1\",0)","v":"1"},"2015-09-05T19:02:30","2015-09-05T19:17:44","2015-09-05T14:57:49","2015-09-05T15:01:51",{"$f":"C59-B59","v":1.0578703702776693E-2},{"$f":"E59-D59","v":2.8009259258396924E-3},null,"tanken",{"$f":"SUM(F59:F64)","v":1.0578703702776693E-2},null,1,"2015-09-05T12:59:15","2015-09-05T13:22:01",null,null,{"$f":"N59-M59","v":1.5810185184818693E-2},{"$f":"P59-O59","v":0}]
[{"$f":"IF(B60,\"1\",0)","v":0},null,null,"2015-09-05T15:04:38","2015-09-05T15:24:05",{"$f":"C60-B60","v":0},1.3506944444088731E-2,null,"aan-afkoppelen",{"$f":"SUM(G59:G64)","v":2.0150462958554272E-2},null,{"$f":"IF(M60,\"1\",0)","v":0},null,null,null,null,0,{"$f":"P60-O60","v":0}]
[0,null,null,"2015-09-05T15:26:33","2015-09-05T15:32:05",0,3.8425925886258483E-3,null,null,null,null,0,null,null,null,null,0,0]
[0,null,null,null,null,0,0,null,"Totaal uren",{"$f":"J63+J64","v":1.5810185184818693E-2},null,0,null,null,null,null,0,0]
[0,null,null,null,null,0,0,null,"wachten instructie",{"$f":"SUM(Q59:Q68)","v":1.5810185184818693E-2},null,0,null,null,null,null,0,0]
[0,null,null,null,null,0,0,null,"wachten koppelchauffeur",{"$f":"SUM(R59:R68)","v":0},null,0,null,null,null,null,0,0]
[0,null,null,null,null,0,0,null,null,null,null,0,null,null,null,null,0,0]
[0,null,null,null,null,0,0,null,null,null,null,0,null,null,null,null,0,0]
[0,null,null,null,null,0,0,null,null,null,null,0,null,null,null,null,0,0]
[0,null,null,null,null,0,0,null,null,null,null,0,null,null,null,null,0,0]
[]
[null,"zaterdag 07-9-2019",null,null,null,null,null,null,null,null,null,null,{"$f":"B70","v":"zaterdag 07-9-2019"}]
[null,"Begintijd","Eindtijd","Begintijd","Eindtijd","tanken","aan/afkoppelen",null,"Totaal uren",{"$f":"J72+J73","v":0},null,null,"Begintijd","Eindtijd","Begintijd","Eindtijd","wachten instructie","wachten koppelchauffeur"]
[{"$f":"IF(B72,\"1\",0)","v":0},null,null,null,null,{"$f":"C72-B72","v":0},{"$f":"E72-D72","v":0},null,"tanken",{"$f":"SUM(F72:F81)","v":0},null,{"$f":"IF(M72,\"1\",0)","v":0},null,null,null,null,{"$f":"N72-M72","v":0},{"$f":"P72-O72","v":0}]
[{"$f":"IF(B73,\"1\",0)","v":0},null,null,null,null,{"$f":"C73-B73","v":0},{"$f":"E73-D73","v":0},null,"aan-afkoppelen",{"$f":"SUM(G72:G81)","v":0},null,{"$f":"IF(M73,\"1\",0)","v":0},null,null,null,null,{"$f":"N73-M73","v":0},{"$f":"P73-O73","v":0}]
[0,null,null,null,null,0,0,null,null,null,null,0,null,null,null,null,0,0]
[0,null,null,null,null,0,0,null,"Totaal uren",{"$f":"J76+J77","v":0},null,0,null,null,null,null,0,0]
[0,null,null,null,null,0,0,null,"wachten instructie",{"$f":"SUM(Q72:Q81)","v":0},null,0,null,null,null,null,0,0]
[0,null,null,null,null,0,0,null," wachten koppelchauffeur",{"$f":"SUM(R72:R81)","v":0},null,0,null,null,null,null,0,0]
[0,null,null,null,null,0,0,null,null,null,null,0,null,null,null,null,0,0]
[0,null,null,null,null,0,0,null,null,null,null,0,null,null,null,null,0,0]
[0,null,null,null,null,0,0,null,null,null,null,0,null,null,null,null,0,0]
[0,null,null,null,null,0,0,null,null,null,null,0,null,null,null,null,0,0]
[]
[null,"zondag 08-9-2019",null,null,null,null,null,null,null,null,null,null,{"$f":"B83","v":"zondag 08-9-2019"}]
[null,"Begintijd","Eindtijd","Begintijd","Eindtijd","tanken","aan/afkoppelen",null,"Totaal uren",{"$f":"J85+J86","v":0},null,null,"Begintijd","Eindtijd","Begintijd","Eindtijd","wachten instructie","wachten koppelchauffeur"]
[{"$f":"IF(B85,\"1\",0)","v":0},null,null,null,null,{"$f":"C85-B85","v":0},{"$f":"E85-D85","v":0},null,"tanken",{"$f":"SUM(F85:F90)","v":0},null,{"$f":"IF(M85,\"1\",0)","v":0},null,null,null,null,{"$f":"N85-M85","v":0},{"$f":"P85-O85","v":0}]
[0,null,null,null,null,{"$f":"C86-B86","v":0},{"$f":"E86-D86","v":0},null,"aan-afkoppelen",{"$f":"SUM(G85:G90)","v":0},null,{"$f":"IF(M86,\"1\",0)","v":0},null,null,null,null,0,0]
[0,null,null,null,null,0,0,null,null,null,null,0,null,null,null,null,0,0]
[0,null,null,null,null,0,0,null,"Totaal uren",{"$f":"J89+J90","v":0},null,0,null,null,null,null,0,0]
[0,null,null,null,null,0,0,null,"wachten instructie",{"$f":"SUM(Q85:Q94)","v":0},null,0,null,null,null,null,0,0]
[0,null,null,null,null,0,0,null,"wachten koppelchauffeur",{"$f":"SUM(R85:R94)","v":0},null,0,null,null,null,null,0,0]
[0,null,null,null,null,0,0,null,null,null,null,0,null,null,null,null,0,0]
[0,null,null,null,null,0,0,null,null,null,null,0,null,null,null,null,0,0]
[0,null,null,null,null,0,0,null,null,null,null,0,null,null,null,null,0,0]
[0,null,null,null,null,0,0,null,null,null,null,0,null,null,null,null,0,0]
[]
[null,null,null,null,null,null,null,null,"tanken",{"$f":"J85+J72+J59+J46+J33+J20+J7","v":2.1018518513301387E-2}]
[]
[null,null,null,null,null,null,null,null,"aan-afkoppelen",{"$f":"J86+J73+J60+J47+J34+J21+J8","v":6.2002314807614312E-2}]
[]
[null,null,null,null,null,null,null,null,"Totaal uren",{"$f":"J98+J96","v":8.3020833320915699E-2}]
[]
[]
[null,null,null,null,null,null,null,null,"wachten instructie",{"$f":"J89+J76+J63+J50+J37+J24+J11","v":1.5810185184818693E-2}]
[]
[null,null,null,null,null,null,null,null,"wachten koppelchauffeur",{"$f":"J90+J77+J64+J51+J38+J25+J12","v":3.3414351855753921E-2}]
[]
[null,null,null,null,null,null,null,null,"Totaal uren",{"$f":"J105+J103","v":4.9224537040572613E-2}]
[]
[]
[null,"Einde dag-taken week 36"]

{"sheet":"LadenLossen (35)","index":21,"n_rows":49,"n_cols":17,"rows_kept":49,"cut":false,"hidden":true,"merged":[[0,1,0,7],[0,13,0,15],[3,13,3,15],[4,1,5,4],[4,5,5,7],[6,19,6,20],[7,11,7,12],[7,17,7,18],[7,19,7,20],[8,11,8,12],[8,17,8,18],[8,19,8,20],[6,17,6,18],[9,11,9,12],[9,17,9,18],[9,19,9,20],[10,11,10,12],[10,17,10,18],[10,19,10,20],[11,11,11,12],[11,17,11,18],[11,19,11,20],[12,11,12,12],[12,17,12,18],[12,19,12,20],[13,11,13,12],[13,17,13,18],[13,19,13,20],[14,11,14,12],[14,17,14,18],[14,19,14,20],[15,11,15,12],[15,17,15,18],[15,19,15,20],[16,11,16,12],[16,17,16,18],[16,19,16,20],[17,11,17,12],[17,17,17,18],[17,19,17,20],[18,11,18,12],[18,17,18,18],[18,19,18,20],[19,11,19,12],[19,17,19,18],[19,19,19,20],[20,11,20,12],[20,17,20,18],[20,19,20,20],[21,11,21,12],[21,17,21,18],[21,19,21,20],[22,11,22,12],[22,17,22,18],[22,19,22,20],[23,11,23,12],[23,17,23,18],[23,19,23,20],[24,11,24,12],[24,17,24,18],[24,19,24,20],[25,11,25,12],[25,17,25,18],[25,19,25,20],[26,11,26,12],[26,17,26,18],[26,19,26,20],[29,11,29,12],[29,17,29,18],[29,19,29,20],[27,11,27,12],[27,17,27,18],[27,19,27,20],[28,11,28,12],[28,17,28,18],[28,19,28,20]]}
["02:00:00","Laden/lossen (beschikbaarheidstijd (behalve bij Rood ))",null,null,null,null,null,null,null,"Week 35",null,null,null,"   = zelf laden/lossen"]
[]
[]
[null,null,null,null,null,null,null,null,null,"Totaal",null,null,null,"Wachturen laden/lossen"]
[null," Laden",null,null,null,"Lossen",null,null,null,"Laden","Lossen","Totaal uren",null,"Laden",null,"Lossen","Totaal uren"]
["Nr.",null,null,null,null,null,null,null,null,{"$f":"SUM(J8:J49)","v":0.31716435185323155},{"$f":"SUM(K8:K49)","v":0.11719907406950369},{"$f":"J6+K6","v":0.43436342592273525},null,{"$f":"SUM(N8:N25)","v":0.20281249999728365},null,{"$f":"SUM(P8:P25)","v":0},{"$f":"N6+P6","v":0.20281249999728365}]
[0,"begin",null,"eind",null,"begin",null,"eind"]
[1,null,null,null,null,"2015-08-25T12:26:17",null,"2015-08-25T13:17:45",null,{"$f":"IF(D8<>\"\",IF(D8-B8>TIME(2,0,0),TIME(2,0,0),D8-B8),\"\")","v":""},{"$f":"IF(H8<>\"\",IF((H8-F8)>TIME(2,0,0),TIME(2,0,0),H8-F8),\"\")","v":3.5740740735491272E-2},null,null,{"$f":"IF(D8-B8>TIME(2,0,0),D8-B8-TIME(2,0,0),\"\")","v":""},null,{"$f":"IF((H8-F8)>TIME(2,0,0),H8-F8-TIME(2,0,0),\"\")","v":""}]
[2,"2015-08-26T06:31:15",null,"2015-08-26T11:20:19",null,null,null,null,null,8.3333333333333329E-2,"",null,null,0.11740740740303106,null,""]
[3,null,null,null,null,"2015-08-26T11:34:18",null,"2015-08-26T12:14:14",null,"",2.7731481481168885E-2,null,null,"",null,""]
[4,"2015-08-26T12:31:25",null,"2015-08-26T12:40:39",null,null,null,null,null,6.4120370370801538E-3,"",null,null,"",null,""]
[5,null,null,null,null,"2015-08-27T06:56:45",null,"2015-08-27T08:14:07",null,"",5.3726851852843538E-2,null,null,"",null,""]
[6,"2015-08-27T13:26:14",null,"2015-08-27T14:32:19",null,null,null,null,null,4.5891203706560191E-2,"",null,null,"",null,""]
[7,"2015-08-28T07:00:58",null,"2015-08-28T07:44:26",null,null,null,null,null,3.0185185183654539E-2,"",null,null,"",null,""]
[8,"2015-08-28T08:06:07",null,"2015-08-28T12:09:06",null,null,null,null,null,8.3333333333333329E-2,"",null,null,8.5405092594252593E-2,null,""]
[9,"2015-08-29T07:27:54",null,"2015-08-29T09:05:50",null,null,null,null,null,6.8009259259270038E-2,"",null,null,"",null,""]
[null,null,null,null,null,null,null,null,null,"","",null,null,"",null,""]
[null,null,null,null,null,null,null,null,null,"","",null,null,"",null,""]
[null,null,null,null,null,null,null,null,null,"","",null,null,"",null,""]
[null,null,null,null,null,null,null,null,null,"","",null,null,"",null,""]
[null,null,null,null,null,null,null,null,null,"","",null,null,"",null,""]
[null,null,null,null,null,null,null,null,null,"","",null,null,"",null,""]
[null,null,null,null,null,null,null,null,null,"","",null,null,"",null,""]
[null,null,null,null,null,null,null,null,null,"","",null,null,"",null,""]
[null,null,null,null,null,null,null,null,null,"","",{"$f":"IF(H25<>\"\",H25-F25,\"\")","v":""},null,"",null,""]
[null,null,null,null,null,null,null,null,null,{"$f":"IF(D26<>\"\",D26-B26,\"\")","v":""},{"$f":"IF(H26<>\"\",H26-F26,\"\")","v":""},""]
[null,null,null,null,null,null,null,null,null,"","",""]
[null,null,null,null,null,null,null,null,null,"","",""]
[null,null,null,null,null,null,null,null,null,"","",""]
[null,null,null,null,null,null,null,null,null,"","",""]
[null,null,null,null,null,null,null,null,null,"",""]
[null,null,null,null,null,null,null,null,null,"",""]
[null,null,null,null,null,null,null,null,null,"",""]
[null,null,null,null,null,null,null,null,null,"",""]
[null,null,null,null,null,null,null,null,null,"",""]
[null,null,null,null,null,null,null,null,null,"",""]
[null,null,null,null,null,null,null,null,null,"",""]
[null,null,null,null,null,null,null,null,null,"",""]
[null,null,null,null,null,null,null,null,null,"",""]
[null,null,null,null,null,null,null,null,null,"",""]
[null,null,null,null,null,null,null,null,null,"",""]
[null,null,null,null,null,null,null,null,null,"",""]
[null,null,null,null,null,null,null,null,null,"",""]
[null,null,null,null,null,null,null,null,null,"",""]
[null,null,null,null,null,null,null,null,null,"",""]
[null,null,null,null,null,null,null,null,null,"",""]
[null,null,null,null,null,null,null,null,null,"",""]
[null,null,null,null,null,null,null,null,null,"",""]
[null,null,null,null,null,null,null,null,null,"",""]

{"sheet":"Dag-taken week (35)","index":22,"n_rows":110,"n_cols":18,"rows_kept":110,"cut":false,"hidden":true,"merged":[[106,8,108,8],[106,9,108,10],[109,1,112,17],[99,8,100,8],[99,9,100,10],[102,8,103,8],[102,9,103,10],[104,8,105,8],[104,9,105,10],[82,1,82,6],[82,12,82,17],[95,8,96,8],[95,9,96,10],[97,8,98,8],[97,9,98,10],[43,1,43,6],[43,12,43,17],[56,1,56,6],[56,12,56,17],[69,1,69,6],[69,12,69,17],[30,1,30,6],[30,12,30,17],[0,12,0,17],[4,1,4,6],[4,12,4,17],[17,1,17,6],[17,12,17,17]]}
[null,"Dag-taken week 35",null,null,null,null,null,null,null,null,null,null,{"$f":"B1","v":"Dag-taken week 35"}]
[null,"tanken",null,"aan/afkoppelen",null,"Totaal",{"$f":"Q2","v":"Tijden"},null,null,null,null,null,"wachten instructie",null,"wachten koppelchauffeur",null,"Tijden"]
[]
[]
[null,"maandag 26-8-2019",null,null,null,null,null,null,null,null,null,null,{"$f":"B5","v":"maandag 26-8-2019"}]
[null,"Begintijd","Eindtijd","Begintijd","Eindtijd","tanken","aan/afkoppelen",null,"Totaal uren",{"$f":"J7+J8","v":1.6168981484952383E-2},null,null,"Begintijd","Eindtijd","Begintijd","Eindtijd","wachten instructie","wachten koppelchauffeur"]
[1,"2015-08-25T06:36:59","2015-08-25T06:47:40","2015-08-25T06:19:54","2015-08-25T06:32:30",{"$f":"C7-B7","v":7.4189814840792678E-3},{"$f":"E7-D7","v":8.7500000008731149E-3},null,"tanken",{"$f":"SUM(F7:F12)","v":7.4189814840792678E-3},null,null,null,null,null,null,{"$f":"N7-M7","v":0},{"$f":"P7-O7","v":0}]
[{"$f":"IF(B8,\"1\",0)","v":0},null,null,null,null,{"$f":"C8-B8","v":0},{"$f":"E8-D8","v":0},null,"aan-afkoppelen",{"$f":"SUM(G7:G12)","v":8.7500000008731149E-3},null,{"$f":"IF(M8,\"1\",0)","v":0},null,null,null,null,0,{"$f":"P8-O8","v":0}]
[0,null,null,null,null,0,0,null,null,null,null,0,null,null,null,null,0,0]
[0,null,null,null,null,0,0,null,"Totaal uren",{"$f":"J11+J12","v":0},null,0,null,null,null,null,0,0]
[0,null,null,null,null,0,0,null,"wachten instructie",{"$f":"SUM(Q7:Q16)","v":0},null,0,null,null,null,null,0,0]
[0,null,null,null,null,0,0,null," wachten koppelchauffeur",{"$f":"SUM(R7:R16)","v":0},null,0,null,null,null,null,0,0]
[0,null,null,null,null,0,0,null,null,null,null,0,null,null,null,null,0,0]
[0,null,null,null,null,0,0,null,null,null,null,0,null,null,null,null,0,0]
[0,null,null,null,null,0,0,null,null,null,null,0,null,null,null,null,0,0]
[0,null,null,null,null,0,0,null,null,null,null,0,null,null,null,null,0,0]
[]
[null,"dinsdag 27-8-2019",null,null,null,null,null,null,null,null,null,null,{"$f":"B18","v":"dinsdag 27-8-2019"}]
[null,"Begintijd","Eindtijd","Begintijd","Eindtijd","tanken","aan/afkoppelen",null,"Totaal uren",{"$f":"J20+J21","v":0},null,null,"Begintijd","Eindtijd","Begintijd","Eindtijd","wachten instructie","wachten koppelchauffeur"]
[{"$f":"IF(B20,\"1\",0)","v":0},null,null,null,null,{"$f":"C20-B20","v":0},{"$f":"E20-D20","v":0},null,"tanken",{"$f":"SUM(F20:F29)","v":0},null,0,null,null,null,null,{"$f":"N20-M20","v":0},{"$f":"R7","v":0}]
[{"$f":"IF(B21,\"1\",0)","v":0},null,null,null,null,{"$f":"C21-B21","v":0},0,null,"aan-afkoppelen",{"$f":"SUM(G20:G29)","v":0},null,{"$f":"IF(M21,\"1\",0)","v":0},null,null,null,null,0,0]
[0,null,null,null,null,0,0,null,null,null,null,0,null,null,null,null,0,0]
[0,null,null,null,null,0,0,null,"Totaal uren",{"$f":"J24+J25","v":0},null,0,null,null,null,null,0,0]
[0,null,null,null,null,0,0,null,"wachten instructie",{"$f":"SUM(Q20:Q29)","v":0},null,0,null,null,null,null,0,0]
[0,null,null,null,null,0,0,null,"wachten koppelchauffeur",{"$f":"SUM(R20:R29)","v":0},null,0,null,null,null,null,0,0]
[0,null,null,null,null,0,0,null,null,null,null,0,null,null,null,null,0,0]
[0,null,null,null,null,0,0,null,null,null,null,0,null,null,null,null,0,0]
[0,null,null,null,null,0,0,null,null,null,null,0,null,null,null,null,0,0]
[0,null,null,null,null,0,0,null,null,null,null,0,null,null,null,null,{"$f":"Q16","v":0},{"$f":"R16","v":0}]
[]
[null,"woensdag 28-8-2019",null,null,null,null,null,null,null,null,null,null,{"$f":"B31","v":"woensdag 28-8-2019"}]
[null,"Begintijd","Eindtijd","Begintijd","Eindtijd","tanken","aan/afkoppelen",null,"Totaal uren",{"$f":"J33+J34","v":0},null,null,"Begintijd","Eindtijd","Begintijd","Eindtijd","wachten instructie","wachten koppelchauffeur"]
[{"$f":"IF(B33,\"1\",0)","v":0},null,null,null,null,{"$f":"C33-B33","v":0},{"$f":"E33-D33","v":0},null,"tanken",{"$f":"SUM(F33:F38)","v":0},null,1,"2015-08-27T08:21:20","2015-08-27T08:59:54",null,null,{"$f":"N33-M33","v":2.6782407403516117E-2},0]
[0,null,null,null,null,0,0,null,"aan-afkoppelen",{"$f":"SUM(G33:G38)","v":0},null,{"$f":"IF(M34,\"1\",0)","v":0},null,null,null,null,0,0]
[0,null,null,null,null,0,0,null,null,null,null,0,null,null,null,null,0,0]
[0,null,null,null,null,0,0,null,"Totaal uren",{"$f":"J37+J38","v":2.6782407403516117E-2},null,0,null,null,null,null,0,0]
[0,null,null,null,null,0,0,null,"wachten instructie",{"$f":"SUM(Q33:Q42)","v":2.6782407403516117E-2},null,0,null,null,null,null,0,0]
[0,null,null,null,null,0,0,null,"wachten koppelchauffeur",{"$f":"SUM(R33:R42)","v":0},null,0,null,null,null,null,0,0]
[0,null,null,null,null,0,0,null,null,null,null,0,null,null,null,null,0,0]
[0,null,null,null,null,0,0,null,null,null,null,0,null,null,null,null,0,0]
[0,null,null,null,null,0,0,null,null,null,null,0,null,null,null,null,0,0]
[0,null,null,null,null,0,0,null,null,null,null,0,null,null,null,null,0,0]
[]
[null,"donderdag 29-8-2019",null,null,null,null,null,null,null,null,null,null,{"$f":"B44","v":"donderdag 29-8-2019"}]
[null,"Begintijd","Eindtijd","Begintijd","Eindtijd","tanken","aan/afkoppelen",null,"Totaal uren",{"$f":"J46+J47","v":0},null,null,"Begintijd","Eindtijd","Begintijd","Eindtijd","wachten instructie","wachten koppelchauffeur"]
[{"$f":"IF(B46,\"1\",0)","v":0},null,null,null,null,{"$f":"C46-B46","v":0},{"$f":"E46-D46","v":0},null,"tanken",{"$f":"SUM(F46:F55)","v":0},null,0,null,null,null,null,{"$f":"N46-#REF!","v":{"$error":"#REF!"}},{"$f":"P46-O46","v":0}]
[{"$f":"IF(B47,\"1\",0)","v":0},null,null,null,null,{"$f":"C47-B47","v":0},0,null,"aan-afkoppelen",{"$f":"SUM(G46:G55)","v":0},null,{"$f":"IF(M47,\"1\",0)","v":0},null,null,null,null,{"$f":"N47-M47","v":0},{"$f":"P47-O47","v":0}]
[0,null,null,null,null,0,0,null,null,null,null,0,null,null,null,null,0,0]
[0,null,null,null,null,0,0,null,"Totaal uren",{"$f":"J50+J51","v":{"$error":"#REF!"}},null,0,null,null,null,null,0,0]
[0,null,null,null,null,0,0,null,"wachten instructie",{"$f":"SUM(Q46:Q55)","v":{"$error":"#REF!"}},null,0,null,null,null,null,0,0]
[0,null,null,null,null,0,0,null,"wachten koppelchauffeur",{"$f":"SUM(R46:R55)","v":0},null,0,null,null,null,null,0,0]
[0,null,null,null,null,0,0,null,null,null,null,0,null,null,null,null,0,0]
[0,null,null,null,null,0,0,null,null,null,null,0,null,null,null,null,0,0]
[0,null,null,null,null,0,0,null,null,null,null,0,null,null,null,null,0,0]
[0,null,null,null,null,0,0,null,null,null,null,0,null,null,null,null,0,0]
[]
[null,"vrijdag 30-8-2019",null,null,null,null,null,null,null,null,null,null,{"$f":"B57","v":"vrijdag 30-8-2019"}]
[null,"Begintijd","Eindtijd","Begintijd","Eindtijd","tanken","aan/afkoppelen",null,"Totaal uren",{"$f":"J59+J60","v":0},null,null,"Begintijd","Eindtijd","Begintijd","Eindtijd","wachten instructie","wachten koppelchauffeur"]
[{"$f":"IF(B59,\"1\",0)","v":0},null,null,null,null,{"$f":"C59-B59","v":0},{"$f":"E59-D59","v":0},null,"tanken",{"$f":"SUM(F59:F64)","v":0},null,{"$f":"IF(M59,\"1\",0)","v":0},null,null,null,null,{"$f":"N59-M59","v":0},{"$f":"P59-O59","v":0}]
[{"$f":"IF(B60,\"1\",0)","v":0},null,null,null,null,{"$f":"C60-B60","v":0},{"$f":"E60-D60","v":0},null,"aan-afkoppelen",{"$f":"SUM(G59:G64)","v":0},null,{"$f":"IF(M60,\"1\",0)","v":0},null,null,null,null,{"$f":"N60-M60","v":0},{"$f":"P60-O60","v":0}]
[0,null,null,null,null,0,0,null,null,null,null,0,null,null,null,null,0,0]
[0,null,null,null,null,0,0,null,"Totaal uren",{"$f":"J63+J64","v":0},null,0,null,null,null,null,0,0]
[0,null,null,null,null,0,0,null,"wachten instructie",{"$f":"SUM(Q59:Q68)","v":0},null,0,null,null,null,null,0,0]
[0,null,null,null,null,0,0,null,"wachten koppelchauffeur",{"$f":"SUM(R59:R68)","v":0},null,0,null,null,null,null,0,0]
[0,null,null,null,null,0,0,null,null,null,null,0,null,null,null,null,0,0]
[0,null,null,null,null,0,0,null,null,null,null,0,null,null,null,null,0,0]
[0,null,null,null,null,0,0,null,null,null,null,0,null,null,null,null,0,0]
[0,null,null,null,null,0,0,null,null,null,null,0,null,null,null,null,0,0]
[]
[null,"zaterdag 31-8-2019",null,null,null,null,null,null,null,null,null,null,{"$f":"B70","v":"zaterdag 31-8-2019"}]
[null,"Begintijd","Eindtijd","Begintijd","Eindtijd","tanken","aan/afkoppelen",null,"Totaal uren",{"$f":"J72+J73","v":0},null,null,"Begintijd","Eindtijd","Begintijd","Eindtijd","wachten instructie","wachten koppelchauffeur"]
[{"$f":"IF(B72,\"1\",0)","v":0},null,null,null,null,{"$f":"C72-B72","v":0},{"$f":"E72-D72","v":0},null,"tanken",{"$f":"SUM(F72:F81)","v":0},null,{"$f":"IF(M72,\"1\",0)","v":0},null,null,null,null,{"$f":"N72-M72","v":0},{"$f":"P72-O72","v":0}]
[{"$f":"IF(B73,\"1\",0)","v":0},null,null,null,null,{"$f":"C73-B73","v":0},{"$f":"E73-D73","v":0},null,"aan-afkoppelen",{"$f":"SUM(G72:G81)","v":0},null,{"$f":"IF(M73,\"1\",0)","v":0},null,null,null,null,{"$f":"N73-M73","v":0},{"$f":"P73-O73","v":0}]
[0,null,null,null,null,0,0,null,null,null,null,0,null,null,null,null,0,0]
[0,null,null,null,null,0,0,null,"Totaal uren",{"$f":"J76+J77","v":0},null,0,null,null,null,null,0,0]
[0,null,null,null,null,0,0,null,"wachten instructie",{"$f":"SUM(Q72:Q81)","v":0},null,0,null,null,null,null,0,0]
[0,null,null,null,null,0,0,null," wachten koppelchauffeur",{"$f":"SUM(R72:R81)","v":0},null,0,null,null,null,null,0,0]
[0,null,null,null,null,0,0,null,null,null,null,0,null,null,null,null,0,0]
[0,null,null,null,null,0,0,null,null,null,null,0,null,null,null,null,0,0]
[0,null,null,null,null,0,0,null,null,null,null,0,null,null,null,null,0,0]
[0,null,null,null,null,0,0,null,null,null,null,0,null,null,null,null,0,0]
[]
[null,"zondag 01-9-2019",null,null,null,null,null,null,null,null,null,null,{"$f":"B83","v":"zondag 01-9-2019"}]
[null,"Begintijd","Eindtijd","Begintijd","Eindtijd","tanken","aan/afkoppelen",null,"Totaal uren",{"$f":"J85+J86","v":0},null,null,"Begintijd","Eindtijd","Begintijd","Eindtijd","wachten instructie","wachten koppelchauffeur"]
[{"$f":"IF(B85,\"1\",0)","v":0},null,null,null,null,{"$f":"C85-B85","v":0},{"$f":"E85-D85","v":0},null,"tanken",{"$f":"SUM(F85:F90)","v":0},null,{"$f":"IF(M85,\"1\",0)","v":0},null,null,null,null,{"$f":"N85-M85","v":0},{"$f":"P85-O85","v":0}]
[0,null,null,null,null,{"$f":"C86-B86","v":0},{"$f":"E86-D86","v":0},null,"aan-afkoppelen",{"$f":"SUM(G85:G90)","v":0},null,{"$f":"IF(M86,\"1\",0)","v":0},null,null,null,null,0,0]
[0,null,null,null,null,0,0,null,null,null,null,0,null,null,null,null,0,0]
[0,null,null,null,null,0,0,null,"Totaal uren",{"$f":"J89+J90","v":0},null,0,null,null,null,null,0,0]
[0,null,null,null,null,0,0,null,"wachten instructie",{"$f":"SUM(Q85:Q94)","v":0},null,0,null,null,null,null,0,0]
[0,null,null,null,null,0,0,null,"wachten koppelchauffeur",{"$f":"SUM(R85:R94)","v":0},null,0,null,null,null,null,0,0]
[0,null,null,null,null,0,0,null,null,null,null,0,null,null,null,null,0,0]
[0,null,null,null,null,0,0,null,null,null,null,0,null,null,null,null,0,0]
[0,null,null,null,null,0,0,null,null,null,null,0,null,null,null,null,0,0]
[0,null,null,null,null,0,0,null,null,null,null,0,null,null,null,null,0,0]
[]
[null,null,null,null,null,null,null,null,"tanken",{"$f":"J85+J72+J59+J46+J33+J20+J7","v":7.4189814840792678E-3}]
[]
[null,null,null,null,null,null,null,null,"aan-afkoppelen",{"$f":"J86+J73+J60+J47+J34+J21+J8","v":8.7500000008731149E-3}]
[]
[null,null,null,null,null,null,null,null,"Totaal uren",{"$f":"J98+J96","v":1.6168981484952383E-2}]
[]
[]
[null,null,null,null,null,null,null,null,"wachten instructie",{"$f":"J89+J76+J63+J50+J37+J24+J11","v":{"$error":"#REF!"}}]
[]
[null,null,null,null,null,null,null,null,"wachten koppelchauffeur",{"$f":"J90+J77+J64+J51+J38+J25+J12","v":0}]
[]
[null,null,null,null,null,null,null,null,"Totaal uren",{"$f":"J105+J103","v":{"$error":"#REF!"}}]
[]
[]
[null,"Einde dag-taken week 35"]

{"sheet":"Dag-taken week (23)","index":23,"n_rows":114,"n_cols":18,"rows_kept":114,"cut":false,"hidden":true,"merged":[[69,1,69,6],[82,1,82,6],[4,1,4,6],[17,1,17,6],[30,1,30,6],[43,1,43,6],[56,1,56,6],[95,9,96,10],[97,8,98,8],[97,9,98,10],[103,8,104,8],[103,9,104,10],[0,12,0,17],[113,1,116,17],[110,8,112,8],[110,9,112,10],[99,8,100,8],[99,9,100,10],[101,8,102,8],[101,9,102,10],[82,12,82,17],[69,12,69,17],[4,12,4,17],[17,12,17,17],[30,12,30,17],[43,12,43,17],[56,12,56,17],[95,8,96,8]]}
[null,"Dag-taken week 23",null,null,null,null,null,null,null,null,null,null,"Dag-taken week 23"]
[null,"tanken",null,"aan/afkoppelen",null,"Tijden",null,null,null,null,null,null,"wachten instructie",null,"wachten koppelchauffeur",null,"Tijden"]
[]
[]
[null,"maandag 03-6-2019",null,null,null,null,null,null,null,null,null,null,"maandag 03-6-2019"]
[null,"Begintijd","Eindtijd","Begintijd","Eindtijd","tanken","aan/afkoppelen",null,"Totaal uren",{"$f":"J7+J8+J9+J10","v":1.3425925921183079E-2},null,null,"Begintijd","Eindtijd","Begintijd","Eindtijd","wachten instructie","wachten koppelchauffeur"]
[{"$f":"IF(B7,\"1\",0)","v":"1"},"2015-06-02T16:27:52","2015-06-02T16:44:30","2015-06-02T17:07:53","2015-06-02T17:10:35",{"$f":"C7-B7","v":1.155092591943685E-2},{"$f":"E7-D7","v":1.8750000017462298E-3},null,"tanken",{"$f":"SUM(F7:F12)","v":1.155092591943685E-2},null,{"$f":"IF(M7,\"1\",0)","v":0},null,null,null,null,{"$f":"N7-M7","v":0},{"$f":"P7-O7","v":0}]
[{"$f":"IF(B8,\"1\",0)","v":0},null,null,null,null,{"$f":"C8-B8","v":0},{"$f":"E8-D8","v":0},null,"aan-afkoppelen",{"$f":"SUM(G7:G12)","v":1.8750000017462298E-3},null,{"$f":"IF(M8,\"1\",0)","v":0},null,null,null,null,{"$f":"N8-M8","v":0},{"$f":"P8-O8","v":0}]
[0,null,null,null,null,0,0,null,"wachten instructie",{"$f":"SUM(Q7:Q16)","v":0},null,0,null,null,null,null,0,0]
[0,null,null,null,null,0,0,null,"wachten koppelchauffeur",{"$f":"SUM(R7:R16)","v":0},null,0,null,null,null,null,0,0]
[0,null,null,null,null,0,0,null,null,null,null,0,null,null,null,null,0,0]
[0,null,null,null,null,0,0,null,null,null,null,0,null,null,null,null,0,0]
[0,null,null,null,null,0,0,null,null,null,null,0,null,null,null,null,0,0]
[0,null,null,null,null,0,0,null,null,null,null,0,null,null,null,null,0,0]
[0,null,null,null,null,0,0,null,null,null,null,0,null,null,null,null,0,0]
[0,null,null,null,null,0,0,null,null,null,null,0,null,null,null,null,0,0]
[]
[null,"dinsdag 04-6-2019",null,null,null,null,null,null,null,null,null,null,"dinsdag 04-6-2019"]
[null,"Begintijd","Eindtijd","Begintijd","Eindtijd","tanken","aan/afkoppelen",null,"Totaal uren",{"$f":"J20+J21+J22+J23","v":2.6631944441760425E-2},null,null,"Begintijd","Eindtijd","Begintijd","Eindtijd","wachten instructie","wachten koppelchauffeur"]
[{"$f":"IF(B20,\"1\",0)","v":"1"},"2015-06-03T03:20:16","2015-06-03T03:47:42","2015-06-03T03:00:57","2015-06-03T03:11:52",{"$f":"C20-B20","v":1.9050925926421769E-2},{"$f":"E20-D20","v":7.5810185153386556E-3},null,"tanken",{"$f":"SUM(F20:F29)","v":1.9050925926421769E-2},null,{"$f":"IF(M20,\"1\",0)","v":0},null,null,null,null,{"$f":"N20-M20","v":0},{"$f":"R7","v":0}]
[{"$f":"IF(B21,\"1\",0)","v":0},null,null,null,null,{"$f":"C21-B21","v":0},{"$f":"E21-D21","v":0},null,"aan-afkoppelen",{"$f":"SUM(G20:G29)","v":7.5810185153386556E-3},null,{"$f":"IF(M21,\"1\",0)","v":0},null,null,null,null,0,0]
[0,null,null,null,null,0,0,null,"wachten instructie",{"$f":"SUM(Q20:Q29)","v":0},null,0,null,null,null,null,0,0]
[0,null,null,null,null,0,0,null,"wachten koppelchauffeur",{"$f":"SUM(R20:R29)","v":0},null,0,null,null,null,null,0,0]
[0,null,null,null,null,0,0,null,null,null,null,0,null,null,null,null,0,0]
[0,null,null,null,null,0,0,null,null,null,null,0,null,null,null,null,0,0]
[0,null,null,null,null,0,0,null,null,null,null,0,null,null,null,null,0,0]
[0,null,null,null,null,0,0,null,null,null,null,0,null,null,null,null,0,0]
[0,null,null,null,null,0,0,null,null,null,null,0,null,null,null,null,0,0]
[0,null,null,null,null,0,0,null,null,null,null,0,null,null,null,null,{"$f":"Q16","v":0},0]
[]
[null,"woensdag 05-6-2019",null,null,null,null,null,null,null,null,null,null,"woensdag 05-6-2019"]
[null,"Begintijd","Eindtijd","Begintijd","Eindtijd","tanken","aan/afkoppelen",null,"Totaal uren",{"$f":"J33+J34+J35+J36","v":0},null,null,"Begintijd","Eindtijd","Begintijd","Eindtijd","wachten instructie","wachten koppelchauffeur"]
[{"$f":"IF(B33,\"1\",0)","v":0},null,null,null,null,{"$f":"C33-B33","v":0},{"$f":"E33-D33","v":0},null,"tanken",{"$f":"SUM(F33:F38)","v":0},null,1,"2015-06-04T13:03:42","2015-06-04T13:13:28",null,null,0,0]
[0,null,null,null,null,0,{"$f":"E34-D34","v":0},null,"aan-afkoppelen",{"$f":"SUM(G33:G38)","v":0},null,{"$f":"IF(M34,\"1\",0)","v":0},null,null,null,null,0,0]
[0,null,null,null,null,0,0,null,"wachten instructie",0,null,0,null,null,null,null,0,0]
[0,null,null,null,null,0,0,null,"wachten koppelchauffeur",{"$f":"SUM(R33:R42)","v":0},null,0,null,null,null,null,0,0]
[0,null,null,null,null,0,0,null,null,null,null,0,null,null,null,null,0,0]
[0,null,null,null,null,0,0,null,null,null,null,0,null,null,null,null,0,0]
[0,null,null,null,null,0,0,null,null,null,null,0,null,null,null,null,0,0]
[0,null,null,null,null,0,0,null,null,null,null,0,null,null,null,null,0,0]
[0,null,null,null,null,0,0,null,null,null,null,0,null,null,null,null,0,0]
[0,null,null,null,null,0,0,null,null,null,null,0,null,null,null,null,0,0]
[]
[null,"donderdag 06-6-2019",null,null,null,null,null,null,null,null,null,null,"donderdag 06-6-2019"]
[null,"Begintijd","Eindtijd","Begintijd","Eindtijd","tanken","aan/afkoppelen",null,"Totaal uren",{"$f":"J46+J47+J48+J49","v":0},null,null,"Begintijd","Eindtijd","Begintijd","Eindtijd","wachten instructie","wachten koppelchauffeur"]
[{"$f":"IF(B46,\"1\",0)","v":0},null,null,null,null,{"$f":"C46-B46","v":0},{"$f":"E46-D46","v":0},null,"tanken",{"$f":"SUM(F46:F51)","v":0},null,{"$f":"IF(M46,\"1\",0)","v":0},null,null,null,null,{"$f":"N46-M46","v":0},{"$f":"P46-O46","v":0}]
[{"$f":"IF(B47,\"1\",0)","v":0},null,null,null,null,{"$f":"C47-B47","v":0},{"$f":"E47-D47","v":0},null,"aan-afkoppelen",{"$f":"SUM(G46:G51)","v":0},null,{"$f":"IF(M47,\"1\",0)","v":0},null,null,null,null,{"$f":"N47-M47","v":0},{"$f":"P47-O47","v":0}]
[0,null,null,null,null,0,0,null,"wachten instructie",{"$f":"N46-M46","v":0},null,0,null,null,null,null,0,0]
[0,null,null,null,null,0,0,null,"wachten koppelchauffeur",{"$f":"SUM(R46:R55)","v":0},null,0,null,null,null,null,0,0]
[0,null,null,null,null,0,0,null,null,null,null,0,null,null,null,null,0,0]
[0,null,null,null,null,0,0,null,null,null,null,0,null,null,null,null,0,0]
[0,null,null,null,null,0,0,null,null,null,null,0,null,null,null,null,0,0]
[0,null,null,null,null,0,0,null,null,null,null,0,null,null,null,null,0,0]
[0,null,null,null,null,0,0,null,null,null,null,0,null,null,null,null,0,0]
[0,null,null,null,null,0,0,null,null,null,null,0,null,null,null,null,0,0]
[]
[null,"vrijdag 07-6-2019",null,null,null,null,null,null,null,null,null,null,"vrijdag 07-6-2019"]
[null,"Begintijd","Eindtijd","Begintijd","Eindtijd","tanken","aan/afkoppelen",null,"Totaal uren",{"$f":"J59+J60+J61+J62","v":1.8263888894580305E-2},null,null,"Begintijd","Eindtijd","Begintijd","Eindtijd","wachten instructie","wachten koppelchauffeur"]
[{"$f":"IF(B59,\"1\",0)","v":"1"},"2015-06-06T17:24:36","2015-06-06T17:35:03","2015-06-06T18:01:33","2015-06-06T18:17:24",{"$f":"C59-B59","v":7.2569444455439225E-3},{"$f":"E59-D59","v":1.1006944449036382E-2},null,"tanken",{"$f":"SUM(F59:F64)","v":7.2569444455439225E-3},null,{"$f":"IF(M59,\"1\",0)","v":0},null,null,null,null,{"$f":"N59-M59","v":0},{"$f":"P59-O59","v":0}]
[{"$f":"IF(B60,\"1\",0)","v":0},null,null,null,null,{"$f":"C60-B60","v":0},{"$f":"E60-D60","v":0},null,"aan-afkoppelen",{"$f":"SUM(G59:G64)","v":1.1006944449036382E-2},null,{"$f":"IF(M60,\"1\",0)","v":0},null,null,null,null,{"$f":"N60-M60","v":0},{"$f":"P60-O60","v":0}]
[0,null,null,null,null,0,0,null,"wachten instructie",{"$f":"N59-M59","v":0},null,0,null,null,null,null,0,0]
[0,null,null,null,null,0,0,null,"wachten koppelchauffeur",{"$f":"SUM(R59:R68)","v":0},null,0,null,null,null,null,0,0]
[0,null,null,null,null,0,0,null,null,null,null,0,null,null,null,null,0,0]
[0,null,null,null,null,0,0,null,null,null,null,0,null,null,null,null,0,0]
[0,null,null,null,null,0,0,null,null,null,null,0,null,null,null,null,0,0]
[0,null,null,null,null,0,0,null,null,null,null,0,null,null,null,null,0,0]
[0,null,null,null,null,0,0,null,null,null,null,0,null,null,null,null,0,0]
[0,null,null,null,null,0,0,null,null,null,null,0,null,null,null,null,0,0]
[]
[null,"zaterdag 08-6-2019",null,null,null,null,null,null,null,null,null,null,"zaterdag 08-6-2019"]
[null,"Begintijd","Eindtijd","Begintijd","Eindtijd","tanken","aan/afkoppelen",null,"Totaal uren",{"$f":"J72+J73+J74+J75","v":0},null,null,"Begintijd","Eindtijd","Begintijd","Eindtijd","wachten instructie","wachten koppelchauffeur"]
[{"$f":"IF(B72,\"1\",0)","v":0},null,null,null,null,{"$f":"C72-B72","v":0},{"$f":"E72-D72","v":0},null,"tanken",{"$f":"SUM(F72:F77)","v":0},null,{"$f":"IF(M72,\"1\",0)","v":0},null,null,null,null,{"$f":"N72-M72","v":0},{"$f":"P72-O72","v":0}]
[{"$f":"IF(B73,\"1\",0)","v":0},null,null,null,null,{"$f":"C73-B73","v":0},{"$f":"E73-D73","v":0},null,"aan-afkoppelen",{"$f":"SUM(G72:G77)","v":0},null,{"$f":"IF(M73,\"1\",0)","v":0},null,null,null,null,{"$f":"N73-M73","v":0},{"$f":"P73-O73","v":0}]
[0,null,null,null,null,0,0,null,"wachten instructie",{"$f":"N72-M72","v":0},null,0,null,null,null,null,0,0]
[0,null,null,null,null,0,0,null,"wachten koppelchauffeur",{"$f":"SUM(R72:R81)","v":0},null,0,null,null,null,null,0,0]
[0,null,null,null,null,0,0,null,null,null,null,0,null,null,null,null,0,0]
[0,null,null,null,null,0,0,null,null,null,null,0,null,null,null,null,0,0]
[0,null,null,null,null,0,0,null,null,null,null,0,null,null,null,null,0,0]
[0,null,null,null,null,0,0,null,null,null,null,0,null,null,null,null,0,0]
[0,null,null,null,null,0,0,null,null,null,null,0,null,null,null,null,0,0]
[0,null,null,null,null,0,0,null,null,null,null,0,null,null,null,null,0,0]
[]
[null,"zondag 09-6-2019",null,null,null,null,null,null,null,null,null,null,"zondag 09-6-2019"]
[null,"Begintijd","Eindtijd","Begintijd","Eindtijd","tanken","aan/afkoppelen",null,"Totaal uren",{"$f":"J85+J86+J87+J88","v":0},null,null,"Begintijd","Eindtijd","Begintijd","Eindtijd","wachten instructie","wachten koppelchauffeur"]
[{"$f":"IF(B85,\"1\",0)","v":0},null,null,null,null,{"$f":"C85-B85","v":0},{"$f":"E85-D85","v":0},null,"tanken",{"$f":"SUM(F85:F90)","v":0},null,{"$f":"IF(M85,\"1\",0)","v":0},null,null,null,null,{"$f":"N85-M85","v":0},{"$f":"P85-O85","v":0}]
[{"$f":"IF(B86,\"1\",0)","v":0},null,null,null,null,{"$f":"C86-B86","v":0},{"$f":"E86-D86","v":0},null,"aan-afkoppelen",{"$f":"SUM(G85:G90)","v":0},null,{"$f":"IF(M86,\"1\",0)","v":0},null,null,null,null,0,0]
[0,null,null,null,null,0,0,null,"wachten instructie",{"$f":"N85-M85","v":0},null,0,null,null,null,null,0,0]
[0,null,null,null,null,0,0,null," wachten koppelchauffeur",{"$f":"SUM(R85:R94)","v":0},null,0,null,null,null,null,0,0]
[0,null,null,null,null,0,0,null,null,null,null,0,null,null,null,null,0,0]
[0,null,null,null,null,0,0,null,null,null,null,0,null,null,null,null,0,0]
[0,null,null,null,null,0,0,null,null,null,null,0,null,null,null,null,0,0]
[0,null,null,null,null,0,0,null,null,null,null,0,null,null,null,null,0,0]
[0,null,null,null,null,0,0,null,null,null,null,0,null,null,null,null,0,0]
[0,null,null,null,null,0,0,null,null,null,null,0,null,null,null,null,0,0]
[]
[null,null,null,null,null,null,null,null,"tanken",{"$f":"J85+J72+J59+J46+J33+J20+J7","v":3.7858796291402541E-2}]
[]
[null,null,null,null,null,null,null,null,"aan-afkoppelen",{"$f":"J86+J73+J60+J47+J34+J21+J8","v":2.0462962966121268E-2}]
[]
[null,null,null,null,null,null,null,null,"wachten instructie",{"$f":"J87+J74+J61+J48+J35+J22+J9","v":0}]
[]
[null,null,null,null,null,null,null,null,"wachten koppelchauffeur",{"$f":"J90+J77+J64+J51+J36+J23+J10","v":0}]
[]
[null,null,null,null,null,null,null,null,"Totaal uren",{"$f":"J98+J96+J100+J102","v":5.8321759257523809E-2}]
[]
[]
[]
[]
[]
[]
[null,null,null,null,null,null,null,null,"Totaal uren",{"$f":"J102+J100","v":0}]
[]
[]
[null,"Einde dag-taken week 23"]

{"sheet":"Dag-taken week (24)","index":24,"n_rows":110,"n_cols":18,"rows_kept":110,"cut":false,"hidden":true,"merged":[[30,1,30,6],[30,12,30,17],[0,12,0,17],[4,1,4,6],[4,12,4,17],[17,1,17,6],[17,12,17,17],[43,1,43,6],[43,12,43,17],[56,1,56,6],[56,12,56,17],[69,1,69,6],[69,12,69,17],[82,1,82,6],[82,12,82,17],[95,8,96,8],[95,9,96,10],[97,8,98,8],[97,9,98,10],[106,8,108,8],[106,9,108,10],[109,1,112,17],[99,8,100,8],[99,9,100,10],[102,8,103,8],[102,9,103,10],[104,8,105,8],[104,9,105,10]]}
[null,"Dag-taken week 24",null,null,null,null,null,null,null,null,null,null,{"$f":"B1","v":"Dag-taken week 24"}]
[null,"tanken",null,"aan/afkoppelen",null,"Tijden",null,null,null,null,null,null,"wachten instructie",null,"wachten koppelchauffeur",null,"Tijden"]
[]
[]
[null,"maandag 10-6-2019",null,null,null,null,null,null,null,null,null,null,{"$f":"B5","v":"maandag 10-6-2019"}]
[0,"Begintijd","Eindtijd","Begintijd","Eindtijd","tanken","aan/afkoppelen",null,"Totaal uren",{"$f":"J7+J8","v":2.7824074073578231E-2},null,0,"Begintijd","Eindtijd","Begintijd","Eindtijd","wachten instructie","wachten koppelchauffeur"]
[{"$f":"IF(B7,\"1\",0)","v":"1"},"2015-06-09T05:34:47","2015-06-09T06:07:05","2015-06-09T05:22:08","2015-06-09T05:29:54",{"$f":"C7-B7","v":2.2430555553000886E-2},{"$f":"E7-D7","v":5.393518520577345E-3},null,"tanken",{"$f":"SUM(F7:F12)","v":2.2430555553000886E-2},null,{"$f":"IF(M7,\"1\",0)","v":0},null,null,null,null,{"$f":"N7-M7","v":0},{"$f":"P7-O7","v":0}]
[0,null,null,null,null,{"$f":"C8-B8","v":0},{"$f":"E8-D8","v":0},null,"aan-afkoppelen",{"$f":"SUM(G7:G12)","v":5.393518520577345E-3},null,{"$f":"IF(M8,\"1\",0)","v":0},null,null,null,null,{"$f":"N8-M8","v":0},{"$f":"P8-O8","v":0}]
[0,null,null,null,null,0,0,null,null,null,null,0,null,null,null,null,0,0]
[0,null,null,null,null,0,0,null,"Totaal uren",{"$f":"J11+J12","v":0},null,0,null,null,null,null,0,0]
[0,null,null,null,null,0,0,null,"wachten instructie",{"$f":"SUM(Q7:Q16)","v":0},null,0,null,null,null,null,0,0]
[0,null,null,null,null,0,0,null,"wachten koppelchauffeur",{"$f":"SUM(R7:R16)","v":0},null,0,null,null,null,null,0,0]
[0,null,null,null,null,0,0,null,null,null,null,0,null,null,null,null,0,0]
[0,null,null,null,null,0,0,null,null,null,null,0,null,null,null,null,0,0]
[0,null,null,null,null,0,0,null,null,null,null,0,null,null,null,null,0,0]
[0,null,null,null,null,0,0,null,null,null,null,0,null,null,null,null,0,0]
[]
[null,"dinsdag 11-6-2019",null,null,null,null,null,null,null,null,null,null,{"$f":"B18","v":"dinsdag 11-6-2019"}]
[null,"Begintijd","Eindtijd","Begintijd","Eindtijd","tanken","aan/afkoppelen",null,"Totaal uren",{"$f":"J20+J21","v":2.0717592597065959E-2},null,null,"Begintijd","Eindtijd","Begintijd","Eindtijd","wachten instructie","wachten koppelchauffeur"]
[{"$f":"IF(B20,\"1\",0)","v":0},null,null,"2015-06-10T10:37:55","2015-06-10T11:07:45",{"$f":"C20-B20","v":0},{"$f":"E20-D20","v":2.0717592597065959E-2},null,"tanken",{"$f":"SUM(F20:F29)","v":0},null,{"$f":"IF(M20,\"1\",0)","v":0},null,null,null,null,{"$f":"N20-M20","v":0},{"$f":"R7","v":0}]
[{"$f":"IF(B21,\"1\",0)","v":0},null,null,null,null,{"$f":"C21-B21","v":0},{"$f":"E21-D21","v":0},null,"aan-afkoppelen",{"$f":"SUM(G20:G29)","v":2.0717592597065959E-2},null,{"$f":"IF(M21,\"1\",0)","v":0},null,null,null,null,0,0]
[0,null,null,null,null,0,0,null,null,null,null,0,null,null,null,null,0,0]
[0,null,null,null,null,0,0,null,"Totaal uren",{"$f":"J24+J25","v":0},null,0,null,null,null,null,0,0]
[0,null,null,null,null,0,0,null,"wachten instructie",{"$f":"SUM(Q20:Q29)","v":0},null,0,null,null,null,null,0,0]
[0,null,null,null,null,0,0,null,"wachten koppelchauffeur",{"$f":"SUM(R20:R29)","v":0},null,0,null,null,null,null,0,0]
[0,null,null,null,null,0,0,null,null,null,null,0,null,null,null,null,0,0]
[0,null,null,null,null,0,0,null,null,null,null,0,null,null,null,null,0,0]
[0,null,null,null,null,0,0,null,null,null,null,0,null,null,null,null,0,0]
[0,null,null,null,null,0,0,null,null,null,null,0,null,null,null,null,{"$f":"Q16","v":0},{"$f":"R16","v":0}]
[]
[null,"woensdag 12-6-2019",null,null,null,null,null,null,null,null,null,null,{"$f":"B31","v":"woensdag 12-6-2019"}]
[null,"Begintijd","Eindtijd","Begintijd","Eindtijd","tanken","aan/afkoppelen",null,"Totaal uren",{"$f":"J33+J34","v":0},null,null,"Begintijd","Eindtijd","Begintijd","Eindtijd","wachten instructie","wachten koppelchauffeur"]
[{"$f":"IF(B33,\"1\",0)","v":0},null,null,null,null,{"$f":"C33-B33","v":0},{"$f":"E33-D33","v":0},null,"tanken",{"$f":"SUM(F33:F38)","v":0},null,{"$f":"IF(M33,\"1\",0)","v":0},null,null,null,null,0,0]
[{"$f":"IF(B34,\"1\",0)","v":0},null,null,null,null,{"$f":"C34-B34","v":0},{"$f":"E34-D34","v":0},null,"aan-afkoppelen",{"$f":"SUM(G33:G38)","v":0},null,{"$f":"IF(M34,\"1\",0)","v":0},null,null,null,null,0,0]
[0,null,null,null,null,0,0,null,null,null,null,0,null,null,null,null,0,0]
[0,null,null,null,null,0,0,null,"Totaal uren",{"$f":"J37+J38","v":0},null,0,null,null,null,null,0,0]
[0,null,null,null,null,0,0,null,"wachten instructie",{"$f":"SUM(Q33:Q42)","v":0},null,0,null,null,null,null,0,0]
[0,null,null,null,null,0,0,null,"wachten koppelchauffeur",{"$f":"SUM(R33:R42)","v":0},null,0,null,null,null,null,0,0]
[0,null,null,null,null,0,0,null,null,null,null,0,null,null,null,null,0,0]
[0,null,null,null,null,0,0,null,null,null,null,0,null,null,null,null,0,0]
[0,null,null,null,null,0,0,null,null,null,null,0,null,null,null,null,0,0]
[0,null,null,null,null,0,0,null,null,null,null,0,null,null,null,null,0,0]
[]
[null,"donderdag 13-6-2019",null,null,null,null,null,null,null,null,null,null,{"$f":"B44","v":"donderdag 13-6-2019"}]
[null,"Begintijd","Eindtijd","Begintijd","Eindtijd","tanken","aan/afkoppelen",null,"Totaal uren",{"$f":"J46+J47","v":2.3865740731707774E-2},null,null,"Begintijd","Eindtijd","Begintijd","Eindtijd","wachten instructie","wachten koppelchauffeur"]
[{"$f":"IF(B46,\"1\",0)","v":"1"},"2015-06-12T14:48:57","2015-06-12T15:06:10","2015-06-12T15:28:25","2015-06-12T15:45:34",{"$f":"C46-B46","v":1.1956018512137234E-2},{"$f":"E46-D46","v":1.190972221957054E-2},null,"tanken",{"$f":"SUM(F46:F55)","v":1.1956018512137234E-2},null,{"$f":"IF(M46,\"1\",0)","v":0},null,null,null,null,{"$f":"N46-M46","v":0},{"$f":"P46-O46","v":0}]
[{"$f":"IF(B47,\"1\",0)","v":0},null,null,null,null,{"$f":"C47-B47","v":0},{"$f":"E47-D47","v":0},null,"aan-afkoppelen",{"$f":"SUM(G46:G55)","v":1.190972221957054E-2},null,{"$f":"IF(M47,\"1\",0)","v":0},null,null,null,null,{"$f":"N47-M47","v":0},{"$f":"P47-O47","v":0}]
[0,null,null,null,null,0,0,null,null,null,null,0,null,null,null,null,0,0]
[0,null,null,null,null,0,0,null,"Totaal uren",{"$f":"J50+J51","v":0},null,0,null,null,null,null,0,0]
[0,null,null,null,null,0,0,null,"wachten instructie",{"$f":"SUM(Q46:Q55)","v":0},null,0,null,null,null,null,0,0]
[0,null,null,null,null,0,0,null,"wachten koppelchauffeur",{"$f":"SUM(R46:R55)","v":0},null,0,null,null,null,null,0,0]
[0,null,null,null,null,0,0,null,null,null,null,0,null,null,null,null,0,0]
[0,null,null,null,null,0,0,null,null,null,null,0,null,null,null,null,0,0]
[0,null,null,null,null,0,0,null,null,null,null,0,null,null,null,null,0,0]
[0,null,null,null,null,0,0,null,null,null,null,0,null,null,null,null,0,0]
[]
[null,"vrijdag 14-6-2019",null,null,null,null,null,null,null,null,null,null,{"$f":"B57","v":"vrijdag 14-6-2019"}]
[null,"Begintijd","Eindtijd","Begintijd","Eindtijd","tanken","aan/afkoppelen",null,"Totaal uren",{"$f":"J59+J60","v":4.0625000001455192E-2},null,null,"Begintijd","Eindtijd","Begintijd","Eindtijd","wachten instructie","wachten koppelchauffeur"]
[{"$f":"IF(B59,\"1\",0)","v":0},null,null,"2015-06-13T11:15:05","2015-06-13T12:06:12",{"$f":"C59-B59","v":0},{"$f":"E59-D59","v":3.549768518860219E-2},null,"tanken",{"$f":"SUM(F59:F64)","v":0},null,{"$f":"IF(M59,\"1\",0)","v":"1"},"2015-06-13T09:21:46","2015-06-13T09:40:50",null,null,{"$f":"N59-M59","v":1.3240740743640345E-2},{"$f":"P59-O59","v":0}]
[{"$f":"IF(B60,\"1\",0)","v":0},null,null,"2015-06-13T18:41:38","2015-06-13T18:49:01",{"$f":"C60-B60","v":0},{"$f":"E60-D60","v":5.1273148128530011E-3},null,"aan-afkoppelen",{"$f":"SUM(G59:G64)","v":4.0625000001455192E-2},null,0,null,null,null,null,{"$f":"N60-M60","v":0},{"$f":"P60-O60","v":0}]
[0,null,null,null,null,0,0,null,null,null,null,0,null,null,null,null,0,0]
[0,null,null,null,null,0,0,null,"Totaal uren",{"$f":"J63+J64","v":1.3240740743640345E-2},null,0,null,null,null,null,0,0]
[0,null,null,null,null,0,0,null,"wachten instructie",{"$f":"SUM(Q59:Q68)","v":1.3240740743640345E-2},null,0,null,null,null,null,0,0]
[0,null,null,null,null,0,0,null,"wachten koppelchauffeur",{"$f":"SUM(R59:R68)","v":0},null,0,null,null,null,null,0,0]
[0,null,null,null,null,0,0,null,null,null,null,0,null,null,null,null,0,0]
[0,null,null,null,null,0,0,null,null,null,null,0,null,null,null,null,0,0]
[0,null,null,null,null,0,0,null,null,null,null,0,null,null,null,null,0,0]
[0,null,null,null,null,0,0,null,null,null,null,0,null,null,null,null,0,0]
[]
[null,"zaterdag 15-6-2019",null,null,null,null,null,null,null,null,null,null,{"$f":"B70","v":"zaterdag 15-6-2019"}]
[null,"Begintijd","Eindtijd","Begintijd","Eindtijd","tanken","aan/afkoppelen",null,"Totaal uren",{"$f":"J72+J73","v":0},null,null,"Begintijd","Eindtijd","Begintijd","Eindtijd","wachten instructie","wachten koppelchauffeur"]
[{"$f":"IF(B72,\"1\",0)","v":0},null,null,null,null,{"$f":"C72-B72","v":0},{"$f":"E72-D72","v":0},null,"tanken",{"$f":"SUM(F72:F81)","v":0},null,{"$f":"IF(M72,\"1\",0)","v":0},null,null,null,null,{"$f":"N72-M72","v":0},{"$f":"P72-O72","v":0}]
[{"$f":"IF(B73,\"1\",0)","v":0},null,null,null,null,{"$f":"C73-B73","v":0},{"$f":"E73-D73","v":0},null,"aan-afkoppelen",{"$f":"SUM(G72:G81)","v":0},null,{"$f":"IF(M73,\"1\",0)","v":0},null,null,null,null,{"$f":"N73-M73","v":0},{"$f":"P73-O73","v":0}]
[0,null,null,null,null,0,0,null,null,null,null,0,null,null,null,null,0,0]
[0,null,null,null,null,0,0,null,"Totaal uren",{"$f":"J76+J77","v":0},null,0,null,null,null,null,0,0]
[0,null,null,null,null,0,0,null,"wachten instructie",{"$f":"SUM(Q72:Q81)","v":0},null,0,null,null,null,null,0,0]
[0,null,null,null,null,0,0,null," wachten koppelchauffeur",{"$f":"SUM(R72:R81)","v":0},null,0,null,null,null,null,0,0]
[0,null,null,null,null,0,0,null,null,null,null,0,null,null,null,null,0,0]
[0,null,null,null,null,0,0,null,null,null,null,0,null,null,null,null,0,0]
[0,null,null,null,null,0,0,null,null,null,null,0,null,null,null,null,0,0]
[0,null,null,null,null,0,0,null,null,null,null,0,null,null,null,null,0,0]
[]
[null,"zondag 16-6-2019",null,null,null,null,null,null,null,null,null,null,{"$f":"B83","v":"zondag 16-6-2019"}]
[null,"Begintijd","Eindtijd","Begintijd","Eindtijd","tanken","aan/afkoppelen",null,"Totaal uren",{"$f":"J85+J86","v":0},null,null,"Begintijd","Eindtijd","Begintijd","Eindtijd","wachten instructie","wachten koppelchauffeur"]
[{"$f":"IF(B85,\"1\",0)","v":0},null,null,null,null,{"$f":"C85-B85","v":0},{"$f":"E85-D85","v":0},null,"tanken",{"$f":"SUM(F85:F90)","v":0},null,{"$f":"IF(M85,\"1\",0)","v":0},null,null,null,null,{"$f":"N85-M85","v":0},{"$f":"P85-O85","v":0}]
[{"$f":"IF(B86,\"1\",0)","v":0},null,null,null,null,{"$f":"C86-B86","v":0},{"$f":"E86-D86","v":0},null,"aan-afkoppelen",{"$f":"SUM(G85:G90)","v":0},null,{"$f":"IF(M86,\"1\",0)","v":0},null,null,null,null,0,0]
[0,null,null,null,null,0,0,null,null,null,null,0,null,null,null,null,0,0]
[0,null,null,null,null,0,0,null,"Totaal uren",{"$f":"J89+J90","v":0},null,0,null,null,null,null,0,0]
[0,null,null,null,null,0,0,null,"wachten instructie",{"$f":"SUM(Q85:Q94)","v":0},null,0,null,null,null,null,0,0]
[0,null,null,null,null,0,0,null,"wachten koppelchauffeur",{"$f":"SUM(R85:R94)","v":0},null,0,null,null,null,null,0,0]
[0,null,null,null,null,0,0,null,null,null,null,0,null,null,null,null,0,0]
[0,null,null,null,null,0,0,null,null,null,null,0,null,null,null,null,0,0]
[0,null,null,null,null,0,0,null,null,null,null,0,null,null,null,null,0,0]
[0,null,null,null,null,0,0,null,null,null,null,0,null,null,null,null,0,0]
[]
[null,null,null,null,null,null,null,null,"tanken",{"$f":"J85+J72+J59+J46+J33+J20+J7","v":3.438657406513812E-2}]
[]
[null,null,null,null,null,null,null,null,"aan-afkoppelen",{"$f":"J86+J73+J60+J47+J34+J21+J8","v":7.8645833338669036E-2}]
[]
[null,null,null,null,null,null,null,null,"Totaal uren",{"$f":"J98+J96","v":0.11303240740380716}]
[]
[]
[null,null,null,null,null,null,null,null,"wachten instructie",{"$f":"J89+J76+J63+J50+J37+J24+J11","v":1.3240740743640345E-2}]
[]
[null,null,null,null,null,null,null,null,"wachten koppelchauffeur",{"$f":"J90+J77+J64+J51+J38+J25+J12","v":0}]
[]
[null,null,null,null,null,null,null,null,"Totaal uren",{"$f":"J105+J103","v":1.3240740743640345E-2}]
[]
[]
[null,"Einde dag-taken week 24"]

{"sheet":"Dag-taken week (25)","index":25,"n_rows":110,"n_cols":18,"rows_kept":110,"cut":false,"hidden":true,"merged":[[30,1,30,6],[30,12,30,17],[0,12,0,17],[4,1,4,6],[4,12,4,17],[17,1,17,6],[17,12,17,17],[43,1,43,6],[43,12,43,17],[56,1,56,6],[56,12,56,17],[69,1,69,6],[69,12,69,17],[82,1,82,6],[82,12,82,17],[95,8,96,8],[95,9,96,10],[97,8,98,8],[97,9,98,10],[106,8,108,8],[106,9,108,10],[109,1,112,17],[99,8,100,8],[99,9,100,10],[102,8,103,8],[102,9,103,10],[104,8,105,8],[104,9,105,10]]}
[null,"Dag-taken week 25",null,null,null,null,null,null,null,null,null,null,{"$f":"B1","v":"Dag-taken week 25"}]
[null,"tanken",null,"aan/afkoppelen",null,"Tijden",null,null,null,null,null,null,"wachten instructie",null,"wachten koppelchauffeur",null,"Tijden"]
[]
[]
[null,"maandag 17-6-2019",null,null,null,null,null,null,null,null,null,null,{"$f":"B5","v":"maandag 17-6-2019"}]
[null,"Begintijd","Eindtijd","Begintijd","Eindtijd","tanken","aan/afkoppelen",null,"Totaal uren",{"$f":"J7+J8","v":3.4525462957390118E-2},null,null,"Begintijd","Eindtijd","Begintijd","Eindtijd","wachten instructie","wachten koppelchauffeur"]
[{"$f":"IF(B7,\"1\",0)","v":"1"},"2015-06-16T13:48:06","2015-06-16T14:02:08","2015-06-16T02:31:36","2015-06-16T02:46:11",{"$f":"C7-B7","v":9.7453703710925765E-3},{"$f":"E7-D7","v":1.0127314810233656E-2},null,"tanken",{"$f":"SUM(F7:F12)","v":9.7453703710925765E-3},null,{"$f":"IF(M7,\"1\",0)","v":0},null,null,null,null,{"$f":"N7-M7","v":0},{"$f":"P7-O7","v":0}]
[{"$f":"IF(B8,\"1\",0)","v":0},null,null,"2015-06-16T12:00:17","2015-06-16T12:10:51",{"$f":"C8-B8","v":0},{"$f":"E8-D8","v":7.3379629611736163E-3},null,"aan-afkoppelen",{"$f":"SUM(G7:G12)","v":2.4780092586297542E-2},null,{"$f":"IF(M8,\"1\",0)","v":0},null,null,null,null,{"$f":"N8-M8","v":0},{"$f":"P8-O8","v":0}]
[0,null,null,"2015-06-16T12:30:54","2015-06-16T12:41:26",0,7.3148148148902692E-3,null,null,null,null,0,null,null,null,null,0,0]
[0,null,null,null,null,0,0,null,"Totaal uren",{"$f":"J11+J12","v":0},null,0,null,null,null,null,0,0]
[0,null,null,null,null,0,0,null,"wachten instructie",{"$f":"SUM(Q7:Q16)","v":0},null,0,null,null,null,null,0,0]
[0,null,null,null,null,0,0,null,"wachten koppelchauffeur",{"$f":"SUM(R7:R16)","v":0},null,0,null,null,null,null,0,0]
[0,null,null,null,null,0,0,null,null,null,null,0,null,null,null,null,0,0]
[0,null,null,null,null,0,0,null,null,null,null,0,null,null,null,null,0,0]
[0,null,null,null,null,0,0,null,null,null,null,0,null,null,null,null,0,0]
[0,null,null,null,null,0,0,null,null,null,null,0,null,null,null,null,0,0]
[]
[null,"dinsdag 18-6-2019",null,null,null,null,null,null,null,null,null,null,{"$f":"B18","v":"dinsdag 18-6-2019"}]
[null,"Begintijd","Eindtijd","Begintijd","Eindtijd","tanken","aan/afkoppelen",null,"Totaal uren",{"$f":"J20+J21","v":0},null,null,"Begintijd","Eindtijd","Begintijd","Eindtijd","wachten instructie","wachten koppelchauffeur"]
[{"$f":"IF(B20,\"1\",0)","v":0},null,null,null,null,{"$f":"C20-B20","v":0},{"$f":"E20-D20","v":0},null,"tanken",{"$f":"SUM(F20:F29)","v":0},null,{"$f":"IF(M20,\"1\",0)","v":0},null,null,null,null,{"$f":"N20-M20","v":0},{"$f":"R7","v":0}]
[{"$f":"IF(B21,\"1\",0)","v":0},null,null,null,null,{"$f":"C21-B21","v":0},{"$f":"E21-D21","v":0},null,"aan-afkoppelen",{"$f":"SUM(G20:G29)","v":0},null,{"$f":"IF(M21,\"1\",0)","v":0},null,null,null,null,0,0]
[0,null,null,null,null,0,0,null,null,null,null,0,null,null,null,null,0,0]
[0,null,null,null,null,0,0,null,"Totaal uren",{"$f":"J24+J25","v":0},null,0,null,null,null,null,0,0]
[0,null,null,null,null,0,0,null,"wachten instructie",{"$f":"SUM(Q20:Q29)","v":0},null,0,null,null,null,null,0,0]
[0,null,null,null,null,0,0,null,"wachten koppelchauffeur",{"$f":"SUM(R20:R29)","v":0},null,0,null,null,null,null,0,0]
[0,null,null,null,null,0,0,null,null,null,null,0,null,null,null,null,0,0]
[0,null,null,null,null,0,0,null,null,null,null,0,null,null,null,null,0,0]
[0,null,null,null,null,0,0,null,null,null,null,0,null,null,null,null,0,0]
[0,null,null,null,null,0,0,null,null,null,null,0,null,null,null,null,{"$f":"Q16","v":0},{"$f":"R16","v":0}]
[]
[null,"woensdag 19-6-2019",null,null,null,null,null,null,null,null,null,null,{"$f":"B31","v":"woensdag 19-6-2019"}]
[null,"Begintijd","Eindtijd","Begintijd","Eindtijd","tanken","aan/afkoppelen",null,"Totaal uren",{"$f":"J33+J34","v":0},null,null,"Begintijd","Eindtijd","Begintijd","Eindtijd","wachten instructie","wachten koppelchauffeur"]
[{"$f":"IF(B33,\"1\",0)","v":0},null,null,null,null,{"$f":"C33-B33","v":0},{"$f":"E33-D33","v":0},null,"tanken",{"$f":"SUM(F33:F38)","v":0},null,{"$f":"IF(M33,\"1\",0)","v":0},null,null,null,null,0,0]
[{"$f":"IF(B34,\"1\",0)","v":0},null,null,null,null,{"$f":"C34-B34","v":0},{"$f":"E34-D34","v":0},null,"aan-afkoppelen",{"$f":"SUM(G33:G38)","v":0},null,{"$f":"IF(M34,\"1\",0)","v":0},null,null,null,null,0,0]
[0,null,null,null,null,0,0,null,null,null,null,0,null,null,null,null,0,0]
[0,null,null,null,null,0,0,null,"Totaal uren",{"$f":"J37+J38","v":0},null,0,null,null,null,null,0,0]
[0,null,null,null,null,0,0,null,"wachten instructie",{"$f":"SUM(Q33:Q42)","v":0},null,0,null,null,null,null,0,0]
[0,null,null,null,null,0,0,null,"wachten koppelchauffeur",{"$f":"SUM(R33:R42)","v":0},null,0,null,null,null,null,0,0]
[0,null,null,null,null,0,0,null,null,null,null,0,null,null,null,null,0,0]
[0,null,null,null,null,0,0,null,null,null,null,0,null,null,null,null,0,0]
[0,null,null,null,null,0,0,null,null,null,null,0,null,null,null,null,0,0]
[0,null,null,null,null,0,0,null,null,null,null,0,null,null,null,null,0,0]
[]
[null,"donderdag 20-6-2019",null,null,null,null,null,null,null,null,null,null,{"$f":"B44","v":"donderdag 20-6-2019"}]
[null,"Begintijd","Eindtijd","Begintijd","Eindtijd","tanken","aan/afkoppelen",null,"Totaal uren",{"$f":"J46+J47","v":0},null,null,"Begintijd","Eindtijd","Begintijd","Eindtijd","wachten instructie","wachten koppelchauffeur"]
[{"$f":"IF(B46,\"1\",0)","v":0},null,null,null,null,{"$f":"C46-B46","v":0},{"$f":"E46-D46","v":0},null,"tanken",{"$f":"SUM(F46:F55)","v":0},null,{"$f":"IF(M46,\"1\",0)","v":0},null,null,null,null,{"$f":"N46-M46","v":0},{"$f":"P46-O46","v":0}]
[{"$f":"IF(B47,\"1\",0)","v":0},null,null,null,null,{"$f":"C47-B47","v":0},{"$f":"E47-D47","v":0},null,"aan-afkoppelen",{"$f":"SUM(G46:G55)","v":0},null,{"$f":"IF(M47,\"1\",0)","v":0},null,null,null,null,{"$f":"N47-M47","v":0},{"$f":"P47-O47","v":0}]
[0,null,null,null,null,0,0,null,null,null,null,0,null,null,null,null,0,0]
[0,null,null,null,null,0,0,null,"Totaal uren",{"$f":"J50+J51","v":0},null,0,null,null,null,null,0,0]
[0,null,null,null,null,0,0,null,"wachten instructie",{"$f":"SUM(Q46:Q55)","v":0},null,0,null,null,null,null,0,0]
[0,null,null,null,null,0,0,null,"wachten koppelchauffeur",{"$f":"SUM(R46:R55)","v":0},null,0,null,null,null,null,0,0]
[0,null,null,null,null,0,0,null,null,null,null,0,null,null,null,null,0,0]
[0,null,null,null,null,0,0,null,null,null,null,0,null,null,null,null,0,0]
[0,null,null,null,null,0,0,null,null,null,null,0,null,null,null,null,0,0]
[0,null,null,null,null,0,0,null,null,null,null,0,null,null,null,null,0,0]
[]
[null,"vrijdag 21-6-2019",null,null,null,null,null,null,null,null,null,null,{"$f":"B57","v":"vrijdag 21-6-2019"}]
[null,"Begintijd","Eindtijd","Begintijd","Eindtijd","tanken","aan/afkoppelen",null,"Totaal uren",{"$f":"J59+J60","v":1.0289351856044959E-2},null,null,"Begintijd","Eindtijd","Begintijd","Eindtijd","wachten instructie","wachten koppelchauffeur"]
[{"$f":"IF(B59,\"1\",0)","v":"1"},"2015-06-20T07:01:23","2015-06-20T07:16:12",null,null,{"$f":"C59-B59","v":1.0289351856044959E-2},{"$f":"E59-D59","v":0},null,"tanken",{"$f":"SUM(F59:F64)","v":1.0289351856044959E-2},null,{"$f":"IF(M59,\"1\",0)","v":0},null,null,null,null,{"$f":"N59-M59","v":0},{"$f":"P59-O59","v":0}]
[{"$f":"IF(B60,\"1\",0)","v":0},null,null,null,null,{"$f":"C60-B60","v":0},{"$f":"E60-D60","v":0},null,"aan-afkoppelen",{"$f":"SUM(G59:G64)","v":0},null,{"$f":"IF(M60,\"1\",0)","v":0},null,null,null,null,{"$f":"N60-M60","v":0},{"$f":"P60-O60","v":0}]
[0,null,null,null,null,0,0,null,null,null,null,0,null,null,null,null,0,0]
[0,null,null,null,null,0,0,null,"Totaal uren",{"$f":"J63+J64","v":0},null,0,null,null,null,null,0,0]
[0,null,null,null,null,0,0,null,"wachten instructie",{"$f":"SUM(Q59:Q68)","v":0},null,0,null,null,null,null,0,0]
[0,null,null,null,null,0,0,null,"wachten koppelchauffeur",{"$f":"SUM(R59:R68)","v":0},null,0,null,null,null,null,0,0]
[0,null,null,null,null,0,0,null,null,null,null,0,null,null,null,null,0,0]
[0,null,null,null,null,0,0,null,null,null,null,0,null,null,null,null,0,0]
[0,null,null,null,null,0,0,null,null,null,null,0,null,null,null,null,0,0]
[0,null,null,null,null,0,0,null,null,null,null,0,null,null,null,null,0,0]
[]
[null,"zaterdag 22-6-2019",null,null,null,null,null,null,null,null,null,null,{"$f":"B70","v":"zaterdag 22-6-2019"}]
[null,"Begintijd","Eindtijd","Begintijd","Eindtijd","tanken","aan/afkoppelen",null,"Totaal uren",{"$f":"J72+J73","v":2.0810185182199348E-2},null,null,"Begintijd","Eindtijd","Begintijd","Eindtijd","wachten instructie","wachten koppelchauffeur"]
[1,"2015-06-21T02:15:38","2015-06-21T02:30:38","2015-06-21T01:50:59","2015-06-21T02:05:57",{"$f":"C72-B72","v":1.0416666664241347E-2},{"$f":"E72-D72","v":1.0393518517958E-2},null,"tanken",{"$f":"SUM(F72:F81)","v":1.0416666664241347E-2},null,{"$f":"IF(M72,\"1\",0)","v":0},null,null,null,null,{"$f":"N72-M72","v":0},{"$f":"P72-O72","v":0}]
[{"$f":"IF(B73,\"1\",0)","v":0},null,null,null,null,{"$f":"C73-B73","v":0},{"$f":"E73-D73","v":0},null,"aan-afkoppelen",{"$f":"SUM(G72:G81)","v":1.0393518517958E-2},null,{"$f":"IF(M73,\"1\",0)","v":0},null,null,null,null,{"$f":"N73-M73","v":0},{"$f":"P73-O73","v":0}]
[0,null,null,null,null,0,0,null,null,null,null,0,null,null,null,null,0,0]
[0,null,null,null,null,{"$f":"C75-B75","v":0},{"$f":"E75-D75","v":0},null,"Totaal uren",{"$f":"J76+J77","v":0},null,0,null,null,null,null,0,0]
[0,null,null,null,null,0,0,null,"wachten instructie",{"$f":"SUM(Q72:Q81)","v":0},null,0,null,null,null,null,0,0]
[0,null,null,null,null,0,0,null," wachten koppelchauffeur",{"$f":"SUM(R72:R81)","v":0},null,0,null,null,null,null,0,0]
[0,null,null,null,null,0,0,null,null,null,null,0,null,null,null,null,0,0]
[0,null,null,null,null,0,0,null,null,null,null,0,null,null,null,null,0,0]
[0,null,null,null,null,0,0,null,null,null,null,0,null,null,null,null,0,0]
[0,null,null,null,null,0,0,null,null,null,null,0,null,null,null,null,0,0]
[]
[null,"zondag 23-6-2019",null,null,null,null,null,null,null,null,null,null,{"$f":"B83","v":"zondag 23-6-2019"}]
[null,"Begintijd","Eindtijd","Begintijd","Eindtijd","tanken","aan/afkoppelen",null,"Totaal uren",{"$f":"J85+J86","v":2.0810185182199348E-2},null,null,"Begintijd","Eindtijd","Begintijd","Eindtijd","wachten instructie","wachten koppelchauffeur"]
[{"$f":"IF(B72,\"1\",0)","v":"1"},null,null,null,null,null,null,null,"tanken",{"$f":"SUM(F72:F90)","v":1.0416666664241347E-2},null,{"$f":"IF(M85,\"1\",0)","v":0},null,null,null,null,{"$f":"N85-M85","v":0},{"$f":"P85-O85","v":0}]
[{"$f":"IF(B86,\"1\",0)","v":0},null,null,null,null,{"$f":"C86-B86","v":0},{"$f":"E86-D86","v":0},null,"aan-afkoppelen",{"$f":"SUM(G72:G90)","v":1.0393518517958E-2},null,{"$f":"IF(M86,\"1\",0)","v":0},null,null,null,null,0,0]
[0,null,null,null,null,0,0,null,null,null,null,0,null,null,null,null,0,0]
[0,null,null,null,null,0,0,null,"Totaal uren",{"$f":"J89+J90","v":0},null,0,null,null,null,null,0,0]
[0,null,null,null,null,0,0,null,"wachten instructie",{"$f":"SUM(Q85:Q94)","v":0},null,0,null,null,null,null,0,0]
[0,null,null,null,null,0,0,null,"wachten koppelchauffeur",{"$f":"SUM(R85:R94)","v":0},null,0,null,null,null,null,0,0]
[0,null,null,null,null,0,0,null,null,null,null,0,null,null,null,null,0,0]
[0,null,null,null,null,0,0,null,null,null,null,0,null,null,null,null,0,0]
[0,null,null,null,null,0,0,null,null,null,null,0,null,null,null,null,0,0]
[0,null,null,null,null,0,0,null,null,null,null,0,null,null,null,null,0,0]
[]
[null,null,null,null,null,null,null,null,"tanken",{"$f":"J85+J72+J59+J46+J33+J20+J7","v":4.0868055555620231E-2}]
[]
[null,null,null,null,null,null,null,null,"aan-afkoppelen",{"$f":"J86+J73+J60+J47+J34+J21+J8","v":4.5567129622213542E-2}]
[]
[null,null,null,null,null,null,null,null,"Totaal uren week 25",{"$f":"J98+J96","v":8.6435185177833773E-2}]
[]
[]
[null,null,null,null,null,null,null,null,"wachten instructie",{"$f":"J89+J76+J63+J50+J37+J24+J11","v":0}]
[]
[null,null,null,null,null,null,null,null,"wachten koppelchauffeur",{"$f":"J90+J77+J64+J51+J38+J25+J12","v":0}]
[]
[null,null,null,null,null,null,null,null,"Totaal uren",{"$f":"J105+J103","v":0}]
[]
[]
[null,"Einde dag-taken week 25"]

{"sheet":"LadenLossen (33)","index":26,"n_rows":49,"n_cols":17,"rows_kept":49,"cut":false,"hidden":true,"merged":[[4,5,5,7],[8,17,8,18],[0,1,0,7],[6,17,6,18],[0,13,0,15],[4,1,5,4],[6,19,6,20],[3,13,3,15],[7,11,7,12],[7,17,7,18],[7,19,7,20],[11,11,11,12],[11,17,11,18],[11,19,11,20],[14,11,14,12],[10,11,10,12],[12,17,12,18],[12,19,12,20],[12,11,12,12],[13,11,13,12],[13,17,13,18],[8,19,8,20],[9,11,9,12],[9,17,9,18],[9,19,9,20],[10,17,10,18],[10,19,10,20],[8,11,8,12],[16,11,16,12],[13,19,13,20],[14,17,14,18],[14,19,14,20],[15,11,15,12],[15,17,15,18],[15,19,15,20],[16,17,16,18],[16,19,16,20],[17,11,17,12],[17,17,17,18],[17,19,17,20],[20,11,20,12],[18,17,18,18],[18,19,18,20],[18,11,18,12],[22,17,22,18],[22,19,22,20],[19,11,19,12],[19,17,19,18],[19,19,19,20],[20,17,20,18],[20,19,20,20],[26,17,26,18],[26,19,26,20],[24,11,24,12],[21,11,21,12],[21,17,21,18],[21,19,21,20],[23,11,23,12],[23,17,23,18],[23,19,23,20],[22,11,22,12],[26,11,26,12],[24,17,24,18],[24,19,24,20],[25,11,25,12],[25,17,25,18],[25,19,25,20],[29,11,29,12],[29,17,29,18],[29,19,29,20],[28,11,28,12],[27,11,27,12],[27,17,27,18],[27,19,27,20],[28,17,28,18],[28,19,28,20]]}
["02:00:00","Laden/lossen (beschikbaarheidstijd (behalve bij Rood ))",null,null,null,null,null,null,null,"Week 33",null,null,null,"   = zelf laden/lossen"]
[]
[]
[null,null,null,null,null,null,null,null,null,"Totaal",null,null,null,"Wachturen laden/lossen"]
[null," Laden",null,null,null,"Lossen",null,null,null,"Laden","Lossen","Totaal uren",null,"Laden",null,"Lossen","Totaal uren"]
["Nr.",null,null,null,null,null,null,null,null,{"$f":"SUM(J8:J49)","v":5.2546296356013045E-3},{"$f":"SUM(K8:K49)","v":0.23611111110706889},{"$f":"J6+K6","v":0.2413657407426702},null,{"$f":"SUM(N8:N25)","v":0},null,{"$f":"SUM(P8:P25)","v":5.1365740737916596E-2},{"$f":"N6+P6","v":5.1365740737916596E-2}]
[0,"begin",null,"eind",null,"begin",null,"eind"]
[1,null,null,null,null,"2015-08-11T12:23:05",null,"2015-08-11T12:35:32",null,{"$f":"IF(D8<>\"\",IF(D8-B8>TIME(2,0,0),TIME(2,0,0),D8-B8),\"\")","v":""},{"$f":"IF(H8<>\"\",IF((H8-F8)>TIME(2,0,0),TIME(2,0,0),H8-F8),\"\")","v":8.6458333316841163E-3},null,null,{"$f":"IF(D8-B8>TIME(2,0,0),D8-B8-TIME(2,0,0),\"\")","v":""},null,{"$f":"IF((H8-F8)>TIME(2,0,0),H8-F8-TIME(2,0,0),\"\")","v":""}]
[2,"2015-08-12T08:05:02",null,"2015-08-12T08:12:36",null,null,null,null,null,5.2546296356013045E-3,"",null,null,"",null,""]
[3,null,null,null,null,"2015-08-13T06:17:55",null,"2015-08-13T06:41:32",null,"",1.640046296233777E-2,null,null,"",null,""]
[4,null,null,null,null,"2015-08-13T14:23:37",null,"2015-08-13T17:37:35",null,"",8.3333333333333329E-2,null,null,"",null,5.1365740737916596E-2]
[5,null,null,null,null,"2015-08-15T06:53:05",null,"2015-08-15T08:34:57",null,"",7.0740740738983732E-2,null,null,"",null,""]
[6,null,null,null,null,"2015-08-15T08:58:11",null,"2015-08-15T10:20:15",null,"",5.6990740740729962E-2,null,null,"",null,""]
[null,null,null,null,null,null,null,null,null,"","",null,null,"",null,""]
[null,null,null,null,null,null,null,null,null,"","",null,null,"",null,""]
[null,null,null,null,null,null,null,null,null,{"$f":"IF(D16<>\"\",IF(D16-B16>TIME(2,0,0),TIME(2,0,0),D16-B16),\"\")","v":""},"",null,null,"",null,""]
[null,null,null,null,null,null,null,null,null,"","",null,null,"",null,""]
[null,null,null,null,null,null,null,null,null,"","",null,null,"",null,""]
[null,null,null,null,null,null,null,null,null,"","",null,null,"",null,""]
[null,null,null,null,null,null,null,null,null,"","",null,null,"",null,""]
[null,null,null,null,null,null,null,null,null,"","",null,null,"",null,""]
[null,null,null,null,null,null,null,null,null,"","",null,null,"",null,""]
[null,null,null,null,null,null,null,null,null,"","",null,null,"",null,""]
[null,null,null,null,null,null,null,null,null,"","",null,null,"",null,""]
[null,null,null,null,null,null,null,null,null,"","",{"$f":"IF(H25<>\"\",H25-F25,\"\")","v":""},null,"",null,""]
[null,null,null,null,null,null,null,null,null,{"$f":"IF(D26<>\"\",D26-B26,\"\")","v":""},{"$f":"IF(H26<>\"\",H26-F26,\"\")","v":""},""]
[null,null,null,null,null,null,null,null,null,"","",""]
[null,null,null,null,null,null,null,null,null,"","",""]
[null,null,null,null,null,null,null,null,null,"","",""]
[null,null,null,null,null,null,null,null,null,"","",""]
[null,null,null,null,null,null,null,null,null,"",""]
[null,null,null,null,null,null,null,null,null,"",""]
[null,null,null,null,null,null,null,null,null,"",""]
[null,null,null,null,null,null,null,null,null,"",""]
[null,null,null,null,null,null,null,null,null,"",""]
[null,null,null,null,null,null,null,null,null,"",""]
[null,null,null,null,null,null,null,null,null,"",""]
[null,null,null,null,null,null,null,null,null,"",""]
[null,null,null,null,null,null,null,null,null,"",""]
[null,null,null,null,null,null,null,null,null,"",""]
[null,null,null,null,null,null,null,null,null,"",""]
[null,null,null,null,null,null,null,null,null,"",""]
[null,null,null,null,null,null,null,null,null,"",""]
[null,null,null,null,null,null,null,null,null,"",""]
[null,null,null,null,null,null,null,null,null,"",""]
[null,null,null,null,null,null,null,null,null,"",""]
[null,null,null,null,null,null,null,null,null,"",""]
[null,null,null,null,null,null,null,null,null,"",""]
[null,null,null,null,null,null,null,null,null,"",""]

{"sheet":"Dag-taken week (34)","index":27,"n_rows":110,"n_cols":18,"rows_kept":110,"cut":false,"hidden":true,"merged":[[30,1,30,6],[30,12,30,17],[0,12,0,17],[4,1,4,6],[4,12,4,17],[17,1,17,6],[17,12,17,17],[43,1,43,6],[43,12,43,17],[56,1,56,6],[56,12,56,17],[69,1,69,6],[69,12,69,17],[82,1,82,6],[82,12,82,17],[95,8,96,8],[95,9,96,10],[97,8,98,8],[97,9,98,10],[106,8,108,8],[106,9,108,10],[109,1,112,17],[99,8,100,8],[99,9,100,10],[102,8,103,8],[102,9,103,10],[104,8,105,8],[104,9,105,10]]}
[null,"Dag-taken week 34",null,null,null,null,null,null,null,null,null,null,{"$f":"B1","v":"Dag-taken week 34"}]
[null,"tanken",null,"aan/afkoppelen",null,"Totaal",{"$f":"Q2","v":"Tijden"},null,null,null,null,null,"wachten instructie",null,"wachten koppelchauffeur",null,"Tijden"]
[]
[]
[null,"maandag 19-8-2019",null,null,null,null,null,null,null,null,null,null,{"$f":"B5","v":"maandag 19-8-2019"}]
[null,"Begintijd","Eindtijd","Begintijd","Eindtijd","tanken","aan/afkoppelen",null,"Totaal uren",{"$f":"J7+J8","v":0},null,null,"Begintijd","Eindtijd","Begintijd","Eindtijd","wachten instructie","wachten koppelchauffeur"]
[1,null,null,null,null,{"$f":"C7-B7","v":0},{"$f":"E7-D7","v":0},null,"tanken",{"$f":"SUM(F7:F12)","v":0},null,{"$f":"IF(M7,\"1\",0)","v":0},null,null,null,null,{"$f":"N7-M7","v":0},{"$f":"P7-O7","v":0}]
[{"$f":"IF(B8,\"1\",0)","v":0},null,null,null,null,{"$f":"C8-B8","v":0},{"$f":"E8-D8","v":0},null,"aan-afkoppelen",{"$f":"SUM(G7:G12)","v":0},null,0,null,null,null,null,{"$f":"N8-M8","v":0},{"$f":"P8-O8","v":0}]
[0,null,null,null,null,0,0,null,null,null,null,0,null,null,null,null,0,0]
[0,null,null,null,null,0,0,null,"Totaal uren",{"$f":"J11+J12","v":0},null,0,null,null,null,null,0,0]
[0,null,null,null,null,0,0,null,"wachten instructie",{"$f":"SUM(Q7:Q16)","v":0},null,0,null,null,null,null,0,0]
[0,null,null,null,null,0,0,null," wachten koppelchauffeur",{"$f":"SUM(R7:R16)","v":0},null,0,null,null,null,null,0,0]
[0,null,null,null,null,0,0,null,null,null,null,0,null,null,null,null,0,0]
[0,null,null,null,null,0,0,null,null,null,null,0,null,null,null,null,0,0]
[0,null,null,null,null,0,0,null,null,null,null,0,null,null,null,null,0,0]
[0,null,null,null,null,0,0,null,null,null,null,0,null,null,null,null,0,0]
[]
[null,"dinsdag 20-8-2019",null,null,null,null,null,null,null,null,null,null,{"$f":"B18","v":"dinsdag 20-8-2019"}]
[null,"Begintijd","Eindtijd","Begintijd","Eindtijd","tanken","aan/afkoppelen",null,"Totaal uren",{"$f":"J20+J21","v":1.6678240739565808E-2},null,null,"Begintijd","Eindtijd","Begintijd","Eindtijd","wachten instructie","wachten koppelchauffeur"]
[{"$f":"IF(B20,\"1\",0)","v":"1"},"2015-08-19T13:11:57","2015-08-19T13:35:58",null,null,{"$f":"C20-B20","v":1.6678240739565808E-2},{"$f":"E20-D20","v":0},null,"tanken",{"$f":"SUM(F20:F29)","v":1.6678240739565808E-2},null,0,null,null,null,null,{"$f":"N20-M20","v":0},{"$f":"R7","v":0}]
[{"$f":"IF(B21,\"1\",0)","v":0},null,null,null,null,{"$f":"C21-B21","v":0},0,null,"aan-afkoppelen",{"$f":"SUM(G20:G29)","v":0},null,{"$f":"IF(M21,\"1\",0)","v":0},null,null,null,null,0,0]
[0,null,null,null,null,0,0,null,null,null,null,0,null,null,null,null,0,0]
[0,null,null,null,null,0,0,null,"Totaal uren",{"$f":"J24+J25","v":0},null,0,null,null,null,null,0,0]
[0,null,null,null,null,0,0,null,"wachten instructie",{"$f":"SUM(Q20:Q29)","v":0},null,0,null,null,null,null,0,0]
[0,null,null,null,null,0,0,null,"wachten koppelchauffeur",{"$f":"SUM(R20:R29)","v":0},null,0,null,null,null,null,0,0]
[0,null,null,null,null,0,0,null,null,null,null,0,null,null,null,null,0,0]
[0,null,null,null,null,0,0,null,null,null,null,0,null,null,null,null,0,0]
[0,null,null,null,null,0,0,null,null,null,null,0,null,null,null,null,0,0]
[0,null,null,null,null,0,0,null,null,null,null,0,null,null,null,null,{"$f":"Q16","v":0},{"$f":"R16","v":0}]
[]
[null,"woensdag 21-8-2019",null,null,null,null,null,null,null,null,null,null,{"$f":"B31","v":"woensdag 21-8-2019"}]
[null,"Begintijd","Eindtijd","Begintijd","Eindtijd","tanken","aan/afkoppelen",null,"Totaal uren",{"$f":"J33+J34","v":2.7789351850515231E-2},null,null,"Begintijd","Eindtijd","Begintijd","Eindtijd","wachten instructie","wachten koppelchauffeur"]
[{"$f":"IF(B33,\"1\",0)","v":0},null,null,null,null,{"$f":"C33-B33","v":0},{"$f":"N33-M33","v":2.7789351850515231E-2},null,"tanken",{"$f":"SUM(F33:F38)","v":0},null,0,"2015-08-20T08:00:39","2015-08-20T08:40:40",null,null,0,0]
[0,null,null,null,null,0,{"$f":"E34-D34","v":0},null,"aan-afkoppelen",{"$f":"SUM(G33:G38)","v":2.7789351850515231E-2},null,{"$f":"IF(M34,\"1\",0)","v":0},null,null,null,null,0,0]
[0,null,null,null,null,0,0,null,null,null,null,0,null,null,null,null,0,0]
[0,null,null,null,null,0,0,null,"Totaal uren",{"$f":"J37+J38","v":0},null,0,null,null,null,null,0,0]
[0,null,null,null,null,0,0,null,"wachten instructie",{"$f":"SUM(Q33:Q42)","v":0},null,0,null,null,null,null,0,0]
[0,null,null,null,null,0,0,null,"wachten koppelchauffeur",{"$f":"SUM(R33:R42)","v":0},null,0,null,null,null,null,0,0]
[0,null,null,null,null,0,0,null,null,null,null,0,null,null,null,null,0,0]
[0,null,null,null,null,0,0,null,null,null,null,0,null,null,null,null,0,0]
[0,null,null,null,null,0,0,null,null,null,null,0,null,null,null,null,0,0]
[0,null,null,null,null,0,0,null,null,null,null,0,null,null,null,null,0,0]
[]
[null,"donderdag 22-8-2019",null,null,null,null,null,null,null,null,null,null,{"$f":"B44","v":"donderdag 22-8-2019"}]
[null,"Begintijd","Eindtijd","Begintijd","Eindtijd","tanken","aan/afkoppelen",null,"Totaal uren",{"$f":"J46+J47","v":0},null,null,"Begintijd","Eindtijd","Begintijd","Eindtijd","wachten instructie","wachten koppelchauffeur"]
[{"$f":"IF(B46,\"1\",0)","v":0},null,null,null,null,{"$f":"C46-B46","v":0},{"$f":"N46-M46","v":0},null,"tanken",{"$f":"SUM(F46:F55)","v":0},null,0,null,null,null,null,{"$f":"N46-M46","v":0},{"$f":"P46-O46","v":0}]
[{"$f":"IF(B47,\"1\",0)","v":0},null,null,null,null,{"$f":"C47-B47","v":0},{"$f":"E47-D47","v":0},null,"aan-afkoppelen",{"$f":"SUM(G46:G55)","v":0},null,{"$f":"IF(M47,\"1\",0)","v":0},null,null,null,null,0,{"$f":"P47-O47","v":0}]
[0,null,null,null,null,0,0,null,null,null,null,0,null,null,null,null,0,0]
[0,null,null,null,null,0,0,null,"Totaal uren",{"$f":"J50+J51","v":0},null,0,null,null,null,null,0,0]
[0,null,null,null,null,0,0,null,"wachten instructie",{"$f":"SUM(Q46:Q55)","v":0},null,0,null,null,null,null,0,0]
[0,null,null,null,null,0,0,null,"wachten koppelchauffeur",{"$f":"SUM(R46:R55)","v":0},null,0,null,null,null,null,0,0]
[0,null,null,null,null,0,0,null,null,null,null,0,null,null,null,null,0,0]
[0,null,null,null,null,0,0,null,null,null,null,0,null,null,null,null,0,0]
[0,null,null,null,null,0,0,null,null,null,null,0,null,null,null,null,0,0]
[0,null,null,null,null,0,0,null,null,null,null,0,null,null,null,null,0,0]
[]
[null,"vrijdag 23-8-2019",null,null,null,null,null,null,null,null,null,null,{"$f":"B57","v":"vrijdag 23-8-2019"}]
[null,"Begintijd","Eindtijd","Begintijd","Eindtijd","tanken","aan/afkoppelen",null,"Totaal uren",{"$f":"J59+J60","v":0},null,null,"Begintijd","Eindtijd","Begintijd","Eindtijd","wachten instructie","wachten koppelchauffeur"]
[{"$f":"IF(B59,\"1\",0)","v":0},null,null,null,null,{"$f":"C59-B59","v":0},{"$f":"E59-D59","v":0},null,"tanken",{"$f":"SUM(F59:F64)","v":0},null,{"$f":"IF(M59,\"1\",0)","v":0},null,null,null,null,{"$f":"N59-M59","v":0},{"$f":"P59-O59","v":0}]
[{"$f":"IF(B60,\"1\",0)","v":0},null,null,null,null,{"$f":"C60-B60","v":0},{"$f":"E60-D60","v":0},null,"aan-afkoppelen",{"$f":"SUM(G59:G64)","v":0},null,{"$f":"IF(M60,\"1\",0)","v":0},null,null,null,null,{"$f":"N60-M60","v":0},{"$f":"P60-O60","v":0}]
[0,null,null,null,null,0,0,null,null,null,null,0,null,null,null,null,0,0]
[0,null,null,null,null,0,0,null,"Totaal uren",{"$f":"J63+J64","v":0},null,0,null,null,null,null,0,0]
[0,null,null,null,null,0,0,null,"wachten instructie",{"$f":"SUM(Q59:Q68)","v":0},null,0,null,null,null,null,0,0]
[0,null,null,null,null,0,0,null,"wachten koppelchauffeur",{"$f":"SUM(R59:R68)","v":0},null,0,null,null,null,null,0,0]
[0,null,null,null,null,0,0,null,null,null,null,0,null,null,null,null,0,0]
[0,null,null,null,null,0,0,null,null,null,null,0,null,null,null,null,0,0]
[0,null,null,null,null,0,0,null,null,null,null,0,null,null,null,null,0,0]
[0,null,null,null,null,0,0,null,null,null,null,0,null,null,null,null,0,0]
[]
[null,"zaterdag 24-8-2019",null,null,null,null,null,null,null,null,null,null,{"$f":"B70","v":"zaterdag 24-8-2019"}]
[null,"Begintijd","Eindtijd","Begintijd","Eindtijd","tanken","aan/afkoppelen",null,"Totaal uren",{"$f":"J72+J73","v":3.0601851860410534E-2},null,null,"Begintijd","Eindtijd","Begintijd","Eindtijd","wachten instructie","wachten koppelchauffeur"]
[{"$f":"IF(B72,\"1\",0)","v":"1"},"2015-08-23T05:36:38","2015-08-23T06:01:40","2015-08-23T06:04:50","2015-08-23T06:23:52",{"$f":"C72-B72","v":1.7384259263053536E-2},{"$f":"E72-D72","v":1.3217592597356997E-2},null,"tanken",{"$f":"SUM(F72:F81)","v":1.7384259263053536E-2},null,{"$f":"IF(M72,\"1\",0)","v":0},null,null,null,null,{"$f":"N72-M72","v":0},{"$f":"P72-O72","v":0}]
[{"$f":"IF(B73,\"1\",0)","v":0},null,null,null,null,{"$f":"C73-B73","v":0},{"$f":"E73-D73","v":0},null,"aan-afkoppelen",{"$f":"SUM(G72:G81)","v":1.3217592597356997E-2},null,{"$f":"IF(M73,\"1\",0)","v":0},null,null,null,null,{"$f":"N73-M73","v":0},{"$f":"P73-O73","v":0}]
[0,null,null,null,null,0,0,null,null,null,null,0,null,null,null,null,0,0]
[0,null,null,null,null,0,0,null,"Totaal uren",{"$f":"J76+J77","v":0},null,0,null,null,null,null,0,0]
[0,null,null,null,null,0,0,null,"wachten instructie",{"$f":"SUM(Q72:Q81)","v":0},null,0,null,null,null,null,0,0]
[0,null,null,null,null,0,0,null," wachten koppelchauffeur",{"$f":"SUM(R72:R81)","v":0},null,0,null,null,null,null,0,0]
[0,null,null,null,null,0,0,null,null,null,null,0,null,null,null,null,0,0]
[0,null,null,null,null,0,0,null,null,null,null,0,null,null,null,null,0,0]
[0,null,null,null,null,0,0,null,null,null,null,0,null,null,null,null,0,0]
[0,null,null,null,null,0,0,null,null,null,null,0,null,null,null,null,0,0]
[]
[null,"zondag 25-8-2019",null,null,null,null,null,null,null,null,null,null,{"$f":"B83","v":"zondag 25-8-2019"}]
[null,"Begintijd","Eindtijd","Begintijd","Eindtijd","tanken","aan/afkoppelen",null,"Totaal uren",{"$f":"J85+J86","v":0},null,null,"Begintijd","Eindtijd","Begintijd","Eindtijd","wachten instructie","wachten koppelchauffeur"]
[{"$f":"IF(B85,\"1\",0)","v":0},null,null,null,null,{"$f":"C85-B85","v":0},{"$f":"E85-D85","v":0},null,"tanken",{"$f":"SUM(F85:F90)","v":0},null,{"$f":"IF(M85,\"1\",0)","v":0},null,null,null,null,{"$f":"N85-M85","v":0},{"$f":"P85-O85","v":0}]
[0,null,null,null,null,{"$f":"C86-B86","v":0},{"$f":"E86-D86","v":0},null,"aan-afkoppelen",{"$f":"SUM(G85:G90)","v":0},null,{"$f":"IF(M86,\"1\",0)","v":0},null,null,null,null,0,0]
[0,null,null,null,null,0,0,null,null,null,null,0,null,null,null,null,0,0]
[0,null,null,null,null,0,0,null,"Totaal uren",{"$f":"J89+J90","v":0},null,0,null,null,null,null,0,0]
[0,null,null,null,null,0,0,null,"wachten instructie",{"$f":"SUM(Q85:Q94)","v":0},null,0,null,null,null,null,0,0]
[0,null,null,null,null,0,0,null,"wachten koppelchauffeur",{"$f":"SUM(R85:R94)","v":0},null,0,null,null,null,null,0,0]
[0,null,null,null,null,0,0,null,null,null,null,0,null,null,null,null,0,0]
[0,null,null,null,null,0,0,null,null,null,null,0,null,null,null,null,0,0]
[0,null,null,null,null,0,0,null,null,null,null,0,null,null,null,null,0,0]
[0,null,null,null,null,0,0,null,null,null,null,0,null,null,null,null,0,0]
[]
[null,null,null,null,null,null,null,null,"tanken",{"$f":"J85+J72+J59+J46+J33+J20+J7","v":3.4062500002619345E-2}]
[]
[null,null,null,null,null,null,null,null,"aan-afkoppelen",{"$f":"J86+J73+J60+J47+J34+J21+J8","v":4.1006944447872229E-2}]
[]
[null,null,null,null,null,null,null,null,"Totaal uren",{"$f":"J98+J96","v":7.5069444450491574E-2}]
[]
[]
[null,null,null,null,null,null,null,null,"wachten instructie",{"$f":"J89+J76+J63+J50+J37+J24+J11","v":0}]
[]
[null,null,null,null,null,null,null,null,"wachten koppelchauffeur",{"$f":"J90+J77+J64+J51+J38+J25+J12","v":0}]
[]
[null,null,null,null,null,null,null,null,"Totaal uren",{"$f":"J105+J103","v":0}]
[]
[]
[null,"Einde dag-taken week 34"]

{"sheet":"Dag-taken week (33)","index":28,"n_rows":110,"n_cols":18,"rows_kept":110,"cut":false,"hidden":true,"merged":[[30,1,30,6],[30,12,30,17],[0,12,0,17],[4,1,4,6],[4,12,4,17],[17,1,17,6],[17,12,17,17],[43,1,43,6],[43,12,43,17],[56,1,56,6],[56,12,56,17],[69,1,69,6],[69,12,69,17],[82,1,82,6],[82,12,82,17],[95,8,96,8],[95,9,96,10],[97,8,98,8],[97,9,98,10],[106,8,108,8],[106,9,108,10],[109,1,112,17],[99,8,100,8],[99,9,100,10],[102,8,103,8],[102,9,103,10],[104,8,105,8],[104,9,105,10]]}
[null,"Dag-taken week 33",null,null,null,null,null,null,null,null,null,null,{"$f":"B1","v":"Dag-taken week 33"}]
[null,"tanken",null,"aan/afkoppelen",null,"Totaal",{"$f":"Q2","v":"Tijden"},null,null,null,null,null,"wachten instructie",null,"wachten koppelchauffeur",null,"Tijden"]
[]
[]
[null,"maandag 12-8-2019",null,null,null,null,null,null,null,null,null,null,{"$f":"B5","v":"maandag 12-8-2019"}]
[null,"Begintijd","Eindtijd","Begintijd","Eindtijd","tanken","aan/afkoppelen",null,"Totaal uren",{"$f":"J7+J8","v":2.1643518521159422E-2},null,null,"Begintijd","Eindtijd","Begintijd","Eindtijd","wachten instructie","wachten koppelchauffeur"]
[1,"2015-08-11T11:56:10","2015-08-11T12:22:28","2015-08-11T12:35:48","2015-08-11T12:40:40",{"$f":"C7-B7","v":1.8263888887304347E-2},{"$f":"E7-D7","v":3.3796296338550746E-3},null,"tanken",{"$f":"SUM(F7:F12)","v":1.8263888887304347E-2},null,{"$f":"IF(M7,\"1\",0)","v":0},null,null,null,null,{"$f":"N7-M7","v":0},{"$f":"P7-O7","v":0}]
[{"$f":"IF(B8,\"1\",0)","v":0},null,null,null,null,{"$f":"C8-B8","v":0},{"$f":"E8-D8","v":0},null,"aan-afkoppelen",{"$f":"SUM(G7:G12)","v":3.3796296338550746E-3},null,0,null,null,null,null,{"$f":"N8-M8","v":0},{"$f":"P8-O8","v":0}]
[0,null,null,null,null,0,0,null,null,null,null,0,null,null,null,null,0,0]
[0,null,null,null,null,0,0,null,"Totaal uren",{"$f":"J11+J12","v":0},null,0,null,null,null,null,0,0]
[0,null,null,null,null,0,0,null,"wachten instructie",{"$f":"SUM(Q7:Q16)","v":0},null,0,null,null,null,null,0,0]
[0,null,null,null,null,0,0,null," wachten koppelchauffeur",{"$f":"SUM(R7:R16)","v":0},null,0,null,null,null,null,0,0]
[0,null,null,null,null,0,0,null,null,null,null,0,null,null,null,null,0,0]
[0,null,null,null,null,0,0,null,null,null,null,0,null,null,null,null,0,0]
[0,null,null,null,null,0,0,null,null,null,null,0,null,null,null,null,0,0]
[0,null,null,null,null,0,0,null,null,null,null,0,null,null,null,null,0,0]
[]
[null,"dinsdag 13-8-2019",null,null,null,null,null,null,null,null,null,null,{"$f":"B18","v":"dinsdag 13-8-2019"}]
[null,"Begintijd","Eindtijd","Begintijd","Eindtijd","tanken","aan/afkoppelen",null,"Totaal uren",{"$f":"J20+J21","v":2.4386574077652767E-2},null,null,"Begintijd","Eindtijd","Begintijd","Eindtijd","wachten instructie","wachten koppelchauffeur"]
[{"$f":"IF(B20,\"1\",0)","v":"1"},"2015-08-12T07:39:22","2015-08-12T07:53:08","2015-08-12T07:55:27","2015-08-12T08:03:48",{"$f":"C20-B20","v":9.560185186273884E-3},{"$f":"E20-D20","v":5.7986111132777296E-3},null,"tanken",{"$f":"SUM(F20:F29)","v":1.8587962964375038E-2},null,0,null,null,null,null,{"$f":"N20-M20","v":0},{"$f":"R7","v":0}]
[{"$f":"IF(B21,\"1\",0)","v":"1"},"2015-08-12T08:17:02","2015-08-12T08:30:02",null,null,{"$f":"C21-B21","v":9.0277777781011537E-3},0,null,"aan-afkoppelen",{"$f":"SUM(G20:G29)","v":5.7986111132777296E-3},null,{"$f":"IF(M21,\"1\",0)","v":0},null,null,null,null,0,0]
[0,null,null,null,null,0,0,null,null,null,null,0,null,null,null,null,0,0]
[0,null,null,null,null,0,0,null,"Totaal uren",{"$f":"J24+J25","v":0},null,0,null,null,null,null,0,0]
[0,null,null,null,null,0,0,null,"wachten instructie",{"$f":"SUM(Q20:Q29)","v":0},null,0,null,null,null,null,0,0]
[0,null,null,null,null,0,0,null,"wachten koppelchauffeur",{"$f":"SUM(R20:R29)","v":0},null,0,null,null,null,null,0,0]
[0,null,null,null,null,0,0,null,null,null,null,0,null,null,null,null,0,0]
[0,null,null,null,null,0,0,null,null,null,null,0,null,null,null,null,0,0]
[0,null,null,null,null,0,0,null,null,{"$f":"J19+J23","v":2.4386574077652767E-2},null,0,null,null,null,null,0,0]
[0,null,null,null,null,0,0,null,null,null,null,0,null,null,null,null,{"$f":"Q16","v":0},{"$f":"R16","v":0}]
[]
[null,"woensdag 14-8-2019",null,null,null,null,null,null,null,null,null,null,{"$f":"B31","v":"woensdag 14-8-2019"}]
[null,"Begintijd","Eindtijd","Begintijd","Eindtijd","tanken","aan/afkoppelen",null,"Totaal uren",{"$f":"J33+J34","v":0},null,null,"Begintijd","Eindtijd","Begintijd","Eindtijd","wachten instructie","wachten koppelchauffeur"]
[{"$f":"IF(B33,\"1\",0)","v":0},null,null,null,null,{"$f":"C33-B33","v":0},{"$f":"E33-D33","v":0},null,"tanken",{"$f":"SUM(F33:F38)","v":0},null,0,null,null,null,null,0,0]
[0,null,null,null,null,0,{"$f":"E34-D34","v":0},null,"aan-afkoppelen",{"$f":"SUM(G33:G38)","v":0},null,{"$f":"IF(M34,\"1\",0)","v":0},null,null,null,null,0,0]
[0,null,null,null,null,0,0,null,null,null,null,0,null,null,null,null,0,0]
[0,null,null,null,null,0,0,null,"Totaal uren",{"$f":"J37+J38","v":0},null,0,null,null,null,null,0,0]
[0,null,null,null,null,0,0,null,"wachten instructie",{"$f":"SUM(Q33:Q42)","v":0},null,0,null,null,null,null,0,0]
[0,null,null,null,null,0,0,null,"wachten koppelchauffeur",{"$f":"SUM(R33:R42)","v":0},null,0,null,null,null,null,0,0]
[0,null,null,null,null,0,0,null,null,null,null,0,null,null,null,null,0,0]
[0,null,null,null,null,0,0,null,null,null,null,0,null,null,null,null,0,0]
[0,null,null,null,null,0,0,null,null,null,null,0,null,null,null,null,0,0]
[0,null,null,null,null,0,0,null,null,null,null,0,null,null,null,null,0,0]
[]
[null,"donderdag 15-8-2019",null,null,null,null,null,null,null,null,null,null,{"$f":"B44","v":"donderdag 15-8-2019"}]
[null,"Begintijd","Eindtijd","Begintijd","Eindtijd","tanken","aan/afkoppelen",null,"Totaal uren",{"$f":"J46+J47","v":0},null,null,"Begintijd","Eindtijd","Begintijd","Eindtijd","wachten instructie","wachten koppelchauffeur"]
[{"$f":"IF(B46,\"1\",0)","v":0},null,null,null,null,{"$f":"C46-B46","v":0},{"$f":"N46-M46","v":0},null,"tanken",{"$f":"SUM(F46:F55)","v":0},null,0,null,null,null,null,{"$f":"N46-M46","v":0},{"$f":"P46-O46","v":0}]
[{"$f":"IF(B47,\"1\",0)","v":0},null,null,null,null,{"$f":"C47-B47","v":0},{"$f":"E47-D47","v":0},null,"aan-afkoppelen",{"$f":"SUM(G46:G55)","v":0},null,{"$f":"IF(M47,\"1\",0)","v":0},null,null,null,null,0,{"$f":"P47-O47","v":0}]
[0,null,null,null,null,0,0,null,null,null,null,0,null,null,null,null,0,0]
[0,null,null,null,null,0,0,null,"Totaal uren",{"$f":"J50+J51","v":0},null,0,null,null,null,null,0,0]
[0,null,null,null,null,0,0,null,"wachten instructie",{"$f":"SUM(Q46:Q55)","v":0},null,0,null,null,null,null,0,0]
[0,null,null,null,null,0,0,null,"wachten koppelchauffeur",{"$f":"SUM(R46:R55)","v":0},null,0,null,null,null,null,0,0]
[0,null,null,null,null,0,0,null,null,null,null,0,null,null,null,null,0,0]
[0,null,null,null,null,0,0,null,null,null,null,0,null,null,null,null,0,0]
[0,null,null,null,null,0,0,null,null,null,null,0,null,null,null,null,0,0]
[0,null,null,null,null,0,0,null,null,null,null,0,null,null,null,null,0,0]
[]
[null,"vrijdag 16-8-2019",null,null,null,null,null,null,null,null,null,null,{"$f":"B57","v":"vrijdag 16-8-2019"}]
[null,"Begintijd","Eindtijd","Begintijd","Eindtijd","tanken","aan/afkoppelen",null,"Totaal uren",{"$f":"J59+J60","v":6.284722221607808E-3},null,null,"Begintijd","Eindtijd","Begintijd","Eindtijd","wachten instructie","wachten koppelchauffeur"]
[{"$f":"IF(B59,\"1\",0)","v":"1"},"2015-08-15T10:26:35","2015-08-15T10:35:38",null,null,{"$f":"C59-B59","v":6.284722221607808E-3},{"$f":"E59-D59","v":0},null,"tanken",{"$f":"SUM(F59:F64)","v":6.284722221607808E-3},null,{"$f":"IF(M59,\"1\",0)","v":0},null,null,null,null,{"$f":"N59-M59","v":0},{"$f":"P59-O59","v":0}]
[{"$f":"IF(B60,\"1\",0)","v":0},null,null,null,null,{"$f":"C60-B60","v":0},{"$f":"E60-D60","v":0},null,"aan-afkoppelen",{"$f":"SUM(G59:G64)","v":0},null,{"$f":"IF(M60,\"1\",0)","v":0},null,null,null,null,{"$f":"N60-M60","v":0},{"$f":"P60-O60","v":0}]
[0,null,null,null,null,0,0,null,null,null,null,0,null,null,null,null,0,0]
[0,null,null,null,null,0,0,null,"Totaal uren",{"$f":"J63+J64","v":0},null,0,null,null,null,null,0,0]
[0,null,null,null,null,0,0,null,"wachten instructie",{"$f":"SUM(Q59:Q68)","v":0},null,0,null,null,null,null,0,0]
[0,null,null,null,null,0,0,null,"wachten koppelchauffeur",{"$f":"SUM(R59:R68)","v":0},null,0,null,null,null,null,0,0]
[0,null,null,null,null,0,0,null,null,null,null,0,null,null,null,null,0,0]
[0,null,null,null,null,0,0,null,null,null,null,0,null,null,null,null,0,0]
[0,null,null,null,null,0,0,null,null,null,null,0,null,null,null,null,0,0]
[0,null,null,null,null,0,0,null,null,null,null,0,null,null,null,null,0,0]
[]
[null,"zaterdag 17-8-2019",null,null,null,null,null,null,null,null,null,null,{"$f":"B70","v":"zaterdag 17-8-2019"}]
[null,"Begintijd","Eindtijd","Begintijd","Eindtijd","tanken","aan/afkoppelen",null,"Totaal uren",{"$f":"J72+J73","v":0},null,null,"Begintijd","Eindtijd","Begintijd","Eindtijd","wachten instructie","wachten koppelchauffeur"]
[{"$f":"IF(B72,\"1\",0)","v":0},null,null,null,null,{"$f":"C72-B72","v":0},{"$f":"E72-D72","v":0},null,"tanken",{"$f":"SUM(F72:F81)","v":0},null,{"$f":"IF(M72,\"1\",0)","v":0},null,null,null,null,{"$f":"N72-M72","v":0},{"$f":"P72-O72","v":0}]
[{"$f":"IF(B73,\"1\",0)","v":0},null,null,null,null,{"$f":"C73-B73","v":0},{"$f":"E73-D73","v":0},null,"aan-afkoppelen",{"$f":"SUM(G72:G81)","v":0},null,{"$f":"IF(M73,\"1\",0)","v":0},null,null,null,null,{"$f":"N73-M73","v":0},{"$f":"P73-O73","v":0}]
[0,null,null,null,null,0,0,null,null,null,null,0,null,null,null,null,0,0]
[0,null,null,null,null,0,0,null,"Totaal uren",{"$f":"J76+J77","v":0},null,0,null,null,null,null,0,0]
[0,null,null,null,null,0,0,null,"wachten instructie",{"$f":"SUM(Q72:Q81)","v":0},null,0,null,null,null,null,0,0]
[0,null,null,null,null,0,0,null," wachten koppelchauffeur",{"$f":"SUM(R72:R81)","v":0},null,0,null,null,null,null,0,0]
[0,null,null,null,null,0,0,null,null,null,null,0,null,null,null,null,0,0]
[0,null,null,null,null,0,0,null,null,null,null,0,null,null,null,null,0,0]
[0,null,null,null,null,0,0,null,null,null,null,0,null,null,null,null,0,0]
[0,null,null,null,null,0,0,null,null,null,null,0,null,null,null,null,0,0]
[]
[null,"zondag 18-8-2019",null,null,null,null,null,null,null,null,null,null,{"$f":"B83","v":"zondag 18-8-2019"}]
[null,"Begintijd","Eindtijd","Begintijd","Eindtijd","tanken","aan/afkoppelen",null,"Totaal uren",{"$f":"J85+J86","v":0},null,null,"Begintijd","Eindtijd","Begintijd","Eindtijd","wachten instructie","wachten koppelchauffeur"]
[{"$f":"IF(B85,\"1\",0)","v":0},null,null,null,null,{"$f":"C85-B85","v":0},{"$f":"E85-D85","v":0},null,"tanken",{"$f":"SUM(F85:F90)","v":0},null,{"$f":"IF(M85,\"1\",0)","v":0},null,null,null,null,{"$f":"N85-M85","v":0},{"$f":"P85-O85","v":0}]
[0,null,null,null,null,{"$f":"C86-B86","v":0},{"$f":"E86-D86","v":0},null,"aan-afkoppelen",{"$f":"SUM(G85:G90)","v":0},null,{"$f":"IF(M86,\"1\",0)","v":0},null,null,null,null,0,0]
[0,null,null,null,null,0,0,null,null,null,null,0,null,null,null,null,0,0]
[0,null,null,null,null,0,0,null,"Totaal uren",{"$f":"J89+J90","v":0},null,0,null,null,null,null,0,0]
[0,null,null,null,null,0,0,null,"wachten instructie",{"$f":"SUM(Q85:Q94)","v":0},null,0,null,null,null,null,0,0]
[0,null,null,null,null,0,0,null,"wachten koppelchauffeur",{"$f":"SUM(R85:R94)","v":0},null,0,null,null,null,null,0,0]
[0,null,null,null,null,0,0,null,null,null,null,0,null,null,null,null,0,0]
[0,null,null,null,null,0,0,null,null,null,null,0,null,null,null,null,0,0]
[0,null,null,null,null,0,0,null,null,null,null,0,null,null,null,null,0,0]
[0,null,null,null,null,0,0,null,null,null,null,0,null,null,null,null,0,0]
[]
[null,null,null,null,null,null,null,null,"tanken",{"$f":"J85+J72+J59+J46+J33+J20+J7","v":4.3136574073287193E-2}]
[]
[null,null,null,null,null,null,null,null,"aan-afkoppelen",{"$f":"J86+J73+J60+J47+J34+J21+J8","v":9.1782407471328042E-3}]
[]
[null,null,null,null,null,null,null,null,"Totaal uren",{"$f":"J98+J96","v":5.2314814820419997E-2}]
[]
[]
[null,null,null,null,null,null,null,null,"wachten instructie",{"$f":"J89+J76+J63+J50+J37+J24+J11","v":0}]
[]
[null,null,null,null,null,null,null,null,"wachten koppelchauffeur",{"$f":"J90+J77+J64+J51+J38+J25+J12","v":0}]
[]
[null,null,null,null,null,null,null,null,"Totaal uren",{"$f":"J105+J103","v":0}]
[]
[]
[null,"Einde dag-taken week 33"]

{"sheet":"Dag-taken week (32)","index":29,"n_rows":110,"n_cols":18,"rows_kept":110,"cut":false,"hidden":true,"merged":[[106,8,108,8],[106,9,108,10],[109,1,112,17],[99,8,100,8],[99,9,100,10],[102,8,103,8],[102,9,103,10],[104,8,105,8],[104,9,105,10],[82,1,82,6],[82,12,82,17],[95,8,96,8],[95,9,96,10],[97,8,98,8],[97,9,98,10],[43,1,43,6],[43,12,43,17],[56,1,56,6],[56,12,56,17],[69,1,69,6],[69,12,69,17],[30,1,30,6],[30,12,30,17],[0,12,0,17],[4,1,4,6],[4,12,4,17],[17,1,17,6],[17,12,17,17]]}
[null,"Dag-taken week 32",null,null,null,null,null,null,null,null,null,null,{"$f":"B1","v":"Dag-taken week 32"}]
[null,"tanken",null,"aan/afkoppelen",null,"Totaal",{"$f":"Q2","v":"Tijden"},null,null,null,null,null,"wachten instructie",null,"wachten koppelchauffeur",null,"Tijden"]
[]
[]
[null,"maandag 05-8-2019",null,null,null,null,null,null,null,null,null,null,{"$f":"B5","v":"maandag 05-8-2019"}]
[null,"Begintijd","Eindtijd","Begintijd","Eindtijd","tanken","aan/afkoppelen",null,"Totaal uren",{"$f":"J7+J8","v":1.8703703703067731E-2},null,null,"Begintijd","Eindtijd","Begintijd","Eindtijd","wachten instructie","wachten koppelchauffeur"]
[1,"2015-08-04T04:32:44","2015-08-04T04:52:06","2015-08-04T04:13:07","2015-08-04T04:20:41",{"$f":"C7-B7","v":1.3449074074742384E-2},{"$f":"E7-D7","v":5.2546296283253469E-3},null,"tanken",{"$f":"SUM(F7:F12)","v":1.3449074074742384E-2},null,{"$f":"IF(M7,\"1\",0)","v":0},null,null,null,null,{"$f":"N7-M7","v":0},{"$f":"P7-O7","v":0}]
[{"$f":"IF(B8,\"1\",0)","v":0},null,null,null,null,0,0,null,"aan-afkoppelen",{"$f":"SUM(G7:G12)","v":5.2546296283253469E-3},null,0,null,null,null,null,{"$f":"N8-M8","v":0},{"$f":"P8-O8","v":0}]
[0,null,null,null,null,0,0,null,null,null,null,0,null,null,null,null,0,0]
[0,null,null,null,null,0,0,null,"Totaal uren",{"$f":"J11+J12","v":0},null,0,null,null,null,null,0,0]
[0,null,null,null,null,0,0,null,"wachten instructie",{"$f":"SUM(Q7:Q16)","v":0},null,0,null,null,null,null,0,0]
[0,null,null,null,null,0,0,null," wachten koppelchauffeur",{"$f":"SUM(R7:R16)","v":0},null,0,null,null,null,null,0,0]
[0,null,null,null,null,0,0,null,null,null,null,0,null,null,null,null,0,0]
[0,null,null,null,null,0,0,null,null,null,null,0,null,null,null,null,0,0]
[0,null,null,null,null,0,0,null,null,null,null,0,null,null,null,null,0,0]
[0,null,null,null,null,0,0,null,null,null,null,0,null,null,null,null,0,0]
[]
[null,"dinsdag 06-8-2019",null,null,null,null,null,null,null,null,null,null,{"$f":"B18","v":"dinsdag 06-8-2019"}]
[null,"Begintijd","Eindtijd","Begintijd","Eindtijd","tanken","aan/afkoppelen",null,"Totaal uren",{"$f":"J20+J21","v":5.7407407439313829E-3},null,null,"Begintijd","Eindtijd","Begintijd","Eindtijd","wachten instructie","wachten koppelchauffeur"]
[{"$f":"IF(B20,\"1\",0)","v":0},null,null,"2015-08-05T15:13:37","2015-08-05T15:21:53",{"$f":"C20-B20","v":0},{"$f":"E20-D20","v":5.7407407439313829E-3},null,"tanken",{"$f":"SUM(F20:F29)","v":0},null,0,null,null,null,null,{"$f":"N20-M20","v":0},{"$f":"R7","v":0}]
[{"$f":"IF(B21,\"1\",0)","v":0},null,null,null,null,{"$f":"C21-B21","v":0},0,null,"aan-afkoppelen",{"$f":"SUM(G20:G29)","v":5.7407407439313829E-3},null,{"$f":"IF(M21,\"1\",0)","v":0},null,null,null,null,0,0]
[0,null,null,null,null,0,0,null,null,null,null,0,null,null,null,null,0,0]
[0,null,null,null,null,0,0,null,"Totaal uren",{"$f":"J24+J25","v":0},null,0,null,null,null,null,0,0]
[0,null,null,null,null,0,0,null,"wachten instructie",{"$f":"SUM(Q20:Q29)","v":0},null,0,null,null,null,null,0,0]
[0,null,null,null,null,0,0,null,"wachten koppelchauffeur",{"$f":"SUM(R20:R29)","v":0},null,0,null,null,null,null,0,0]
[0,null,null,null,null,0,0,null,null,null,null,0,null,null,null,null,0,0]
[0,null,null,null,null,0,0,null,null,null,null,0,null,null,null,null,0,0]
[0,null,null,null,null,0,0,null,null,{"$f":"J19+J23","v":5.7407407439313829E-3},null,0,null,null,null,null,0,0]
[0,null,null,null,null,0,0,null,null,null,null,0,null,null,null,null,{"$f":"Q16","v":0},{"$f":"R16","v":0}]
[]
[null,"woensdag 07-8-2019",null,null,null,null,null,null,null,null,null,null,{"$f":"B31","v":"woensdag 07-8-2019"}]
[null,"Begintijd","Eindtijd","Begintijd","Eindtijd","tanken","aan/afkoppelen",null,"Totaal uren",{"$f":"J33+J34","v":1.4722222222189885E-2},null,null,"Begintijd","Eindtijd","Begintijd","Eindtijd","wachten instructie","wachten koppelchauffeur"]
[{"$f":"IF(B33,\"1\",0)","v":"1"},"2015-08-06T04:03:04","2015-08-06T04:16:25","2015-08-06T04:20:48","2015-08-06T04:28:39",{"$f":"C33-B33","v":9.2708333322661929E-3},{"$f":"E33-D33","v":5.4513888899236917E-3},null,"tanken",{"$f":"SUM(F33:F38)","v":9.2708333322661929E-3},null,0,null,null,null,null,0,0]
[0,null,null,null,null,0,{"$f":"E34-D34","v":0},null,"aan-afkoppelen",{"$f":"SUM(G33:G38)","v":5.4513888899236917E-3},null,{"$f":"IF(M34,\"1\",0)","v":0},null,null,null,null,0,0]
[0,null,null,null,null,0,0,null,null,null,null,0,null,null,null,null,0,0]
[0,null,null,null,null,0,0,null,"Totaal uren",{"$f":"J37+J38","v":0},null,0,null,null,null,null,0,0]
[0,null,null,null,null,0,0,null,"wachten instructie",{"$f":"SUM(Q33:Q42)","v":0},null,0,null,null,null,null,0,0]
[0,null,null,null,null,0,0,null,"wachten koppelchauffeur",{"$f":"SUM(R33:R42)","v":0},null,0,null,null,null,null,0,0]
[0,null,null,null,null,0,0,null,null,null,null,0,null,null,null,null,0,0]
[0,null,null,null,null,0,0,null,null,null,null,0,null,null,null,null,0,0]
[0,null,null,null,null,0,0,null,null,null,null,0,null,null,null,null,0,0]
[0,null,null,null,null,0,0,null,null,null,null,0,null,null,null,null,0,0]
[]
[null,"donderdag 08-8-2019",null,null,null,null,null,null,null,null,null,null,{"$f":"B44","v":"donderdag 08-8-2019"}]
[null,"Begintijd","Eindtijd","Begintijd","Eindtijd","tanken","aan/afkoppelen",null,"Totaal uren",{"$f":"J46+J47","v":0},null,null,"Begintijd","Eindtijd","Begintijd","Eindtijd","wachten instructie","wachten koppelchauffeur"]
[{"$f":"IF(B46,\"1\",0)","v":0},null,null,null,null,{"$f":"C46-B46","v":0},{"$f":"N46-M46","v":0},null,"tanken",{"$f":"SUM(F46:F55)","v":0},null,0,null,null,null,null,{"$f":"N46-M46","v":0},{"$f":"P46-O46","v":0}]
[{"$f":"IF(B47,\"1\",0)","v":0},null,null,null,null,{"$f":"C47-B47","v":0},{"$f":"E47-D47","v":0},null,"aan-afkoppelen",{"$f":"SUM(G46:G55)","v":0},null,{"$f":"IF(M47,\"1\",0)","v":0},null,null,null,null,0,{"$f":"P47-O47","v":0}]
[0,null,null,null,null,0,0,null,null,null,null,0,null,null,null,null,0,0]
[0,null,null,null,null,0,0,null,"Totaal uren",{"$f":"J50+J51","v":0},null,0,null,null,null,null,0,0]
[0,null,null,null,null,0,0,null,"wachten instructie",{"$f":"SUM(Q46:Q55)","v":0},null,0,null,null,null,null,0,0]
[0,null,null,null,null,0,0,null,"wachten koppelchauffeur",{"$f":"SUM(R46:R55)","v":0},null,0,null,null,null,null,0,0]
[0,null,null,null,null,0,0,null,null,null,null,0,null,null,null,null,0,0]
[0,null,null,null,null,0,0,null,null,null,null,0,null,null,null,null,0,0]
[0,null,null,null,null,0,0,null,null,null,null,0,null,null,null,null,0,0]
[0,null,null,null,null,0,0,null,null,null,null,0,null,null,null,null,0,0]
[]
[null,"vrijdag 09-8-2019",null,null,null,null,null,null,null,null,null,null,{"$f":"B57","v":"vrijdag 09-8-2019"}]
[null,"Begintijd","Eindtijd","Begintijd","Eindtijd","tanken","aan/afkoppelen",null,"Totaal uren",{"$f":"J59+J60","v":0},null,null,"Begintijd","Eindtijd","Begintijd","Eindtijd","wachten instructie","wachten koppelchauffeur"]
[{"$f":"IF(B59,\"1\",0)","v":0},null,null,null,null,{"$f":"C59-B59","v":0},{"$f":"E59-D59","v":0},null,"tanken",{"$f":"SUM(F59:F64)","v":0},null,{"$f":"IF(M59,\"1\",0)","v":0},null,null,null,null,{"$f":"N59-M59","v":0},{"$f":"P59-O59","v":0}]
[{"$f":"IF(B60,\"1\",0)","v":0},null,null,null,null,{"$f":"C60-B60","v":0},{"$f":"E60-D60","v":0},null,"aan-afkoppelen",{"$f":"SUM(G59:G64)","v":0},null,{"$f":"IF(M60,\"1\",0)","v":0},null,null,null,null,{"$f":"N60-M60","v":0},{"$f":"P60-O60","v":0}]
[0,null,null,null,null,0,0,null,null,null,null,0,null,null,null,null,0,0]
[0,null,null,null,null,0,0,null,"Totaal uren",{"$f":"J63+J64","v":0},null,0,null,null,null,null,0,0]
[0,null,null,null,null,0,0,null,"wachten instructie",{"$f":"SUM(Q59:Q68)","v":0},null,0,null,null,null,null,0,0]
[0,null,null,null,null,0,0,null,"wachten koppelchauffeur",{"$f":"SUM(R59:R68)","v":0},null,0,null,null,null,null,0,0]
[0,null,null,null,null,0,0,null,null,null,null,0,null,null,null,null,0,0]
[0,null,null,null,null,0,0,null,null,null,null,0,null,null,null,null,0,0]
[0,null,null,null,null,0,0,null,null,null,null,0,null,null,null,null,0,0]
[0,null,null,null,null,0,0,null,null,null,null,0,null,null,null,null,0,0]
[]
[null,"zaterdag 10-8-2019",null,null,null,null,null,null,null,null,null,null,{"$f":"B70","v":"zaterdag 10-8-2019"}]
[null,"Begintijd","Eindtijd","Begintijd","Eindtijd","tanken","aan/afkoppelen",null,"Totaal uren",{"$f":"J72+J73","v":1.081018518016208E-2},null,null,"Begintijd","Eindtijd","Begintijd","Eindtijd","wachten instructie","wachten koppelchauffeur"]
[{"$f":"IF(B72,\"1\",0)","v":"1"},"2015-08-09T07:05:35","2015-08-09T07:21:09",null,null,{"$f":"C72-B72","v":1.081018518016208E-2},{"$f":"E72-D72","v":0},null,"tanken",{"$f":"SUM(F72:F81)","v":1.081018518016208E-2},null,{"$f":"IF(M72,\"1\",0)","v":0},null,null,null,null,{"$f":"N72-M72","v":0},{"$f":"P72-O72","v":0}]
[{"$f":"IF(B73,\"1\",0)","v":0},null,null,null,null,{"$f":"C73-B73","v":0},{"$f":"E73-D73","v":0},null,"aan-afkoppelen",{"$f":"SUM(G72:G81)","v":0},null,{"$f":"IF(M73,\"1\",0)","v":0},null,null,null,null,{"$f":"N73-M73","v":0},{"$f":"P73-O73","v":0}]
[0,null,null,null,null,0,0,null,null,null,null,0,null,null,null,null,0,0]
[0,null,null,null,null,0,0,null,"Totaal uren",{"$f":"J76+J77","v":0},null,0,null,null,null,null,0,0]
[0,null,null,null,null,0,0,null,"wachten instructie",{"$f":"SUM(Q72:Q81)","v":0},null,0,null,null,null,null,0,0]
[0,null,null,null,null,0,0,null," wachten koppelchauffeur",{"$f":"SUM(R72:R81)","v":0},null,0,null,null,null,null,0,0]
[0,null,null,null,null,0,0,null,null,null,null,0,null,null,null,null,0,0]
[0,null,null,null,null,0,0,null,null,null,null,0,null,null,null,null,0,0]
[0,null,null,null,null,0,0,null,null,null,null,0,null,null,null,null,0,0]
[0,null,null,null,null,0,0,null,null,null,null,0,null,null,null,null,0,0]
[]
[null,"zondag 11-8-2019",null,null,null,null,null,null,null,null,null,null,{"$f":"B83","v":"zondag 11-8-2019"}]
[null,"Begintijd","Eindtijd","Begintijd","Eindtijd","tanken","aan/afkoppelen",null,"Totaal uren",{"$f":"J85+J86","v":0},null,null,"Begintijd","Eindtijd","Begintijd","Eindtijd","wachten instructie","wachten koppelchauffeur"]
[{"$f":"IF(B85,\"1\",0)","v":0},null,null,null,null,{"$f":"C85-B85","v":0},{"$f":"E85-D85","v":0},null,"tanken",{"$f":"SUM(F85:F90)","v":0},null,{"$f":"IF(M85,\"1\",0)","v":0},null,null,null,null,{"$f":"N85-M85","v":0},{"$f":"P85-O85","v":0}]
[{"$f":"IF(B86,\"1\",0)","v":0},null,null,null,null,{"$f":"C86-B86","v":0},{"$f":"E86-D86","v":0},null,"aan-afkoppelen",{"$f":"SUM(G85:G90)","v":0},null,{"$f":"IF(M86,\"1\",0)","v":0},null,null,null,null,0,0]
[0,null,null,null,null,0,0,null,null,null,null,0,null,null,null,null,0,0]
[0,null,null,null,null,0,0,null,"Totaal uren",{"$f":"J89+J90","v":0},null,0,null,null,null,null,0,0]
[0,null,null,null,null,0,0,null,"wachten instructie",{"$f":"SUM(Q85:Q94)","v":0},null,0,null,null,null,null,0,0]
[0,null,null,null,null,0,0,null,"wachten koppelchauffeur",{"$f":"SUM(R85:R94)","v":0},null,0,null,null,null,null,0,0]
[0,null,null,null,null,0,0,null,null,null,null,0,null,null,null,null,0,0]
[0,null,null,null,null,0,0,null,null,null,null,0,null,null,null,null,0,0]
[0,null,null,null,null,0,0,null,null,null,null,0,null,null,null,null,0,0]
[0,null,null,null,null,0,0,null,null,null,null,0,null,null,null,null,0,0]
[]
[null,null,null,null,null,null,null,null,"tanken",{"$f":"J85+J72+J59+J46+J33+J20+J7","v":3.3530092587170657E-2}]
[]
[null,null,null,null,null,null,null,null,"aan-afkoppelen",{"$f":"J86+J73+J60+J47+J34+J21+J8","v":1.6446759262180422E-2}]
[]
[null,null,null,null,null,null,null,null,"Totaal uren",{"$f":"J98+J96","v":4.9976851849351078E-2}]
[]
[]
[null,null,null,null,null,null,null,null,"wachten instructie",{"$f":"J89+J76+J63+J50+J37+J24+J11","v":0}]
[]
[null,null,null,null,null,null,null,null,"wachten koppelchauffeur",{"$f":"J90+J77+J64+J51+J38+J25+J12","v":0}]
[]
[null,null,null,null,null,null,null,null,"Totaal uren",{"$f":"J105+J103","v":0}]
[]
[]
[null,"Einde dag-taken week 32"]

{"sheet":"Dag-taken week (31)","index":30,"n_rows":110,"n_cols":18,"rows_kept":110,"cut":false,"hidden":true,"merged":[[106,8,108,8],[106,9,108,10],[109,1,112,17],[99,8,100,8],[99,9,100,10],[102,8,103,8],[102,9,103,10],[104,8,105,8],[104,9,105,10],[82,1,82,6],[82,12,82,17],[95,8,96,8],[95,9,96,10],[97,8,98,8],[97,9,98,10],[43,1,43,6],[43,12,43,17],[56,1,56,6],[56,12,56,17],[69,1,69,6],[69,12,69,17],[30,1,30,6],[30,12,30,17],[0,12,0,17],[4,1,4,6],[4,12,4,17],[17,1,17,6],[17,12,17,17]]}
[null,"Dag-taken week 31",null,null,null,null,null,null,null,null,null,null,{"$f":"B1","v":"Dag-taken week 31"}]
[null,"tanken",null,"aan/afkoppelen",null,"Totaal",{"$f":"Q2","v":"Tijden"},null,null,null,null,null,"wachten instructie",null,"wachten koppelchauffeur",null,"Tijden"]
[]
[]
[null,"maandag 29-7-2019",null,null,null,null,null,null,null,null,null,null,{"$f":"B5","v":"maandag 29-7-2019"}]
[null,"Begintijd","Eindtijd","Begintijd","Eindtijd","tanken","aan/afkoppelen",null,"Totaal uren",{"$f":"J7+J8","v":2.0393518527271226E-2},null,null,"Begintijd","Eindtijd","Begintijd","Eindtijd","wachten instructie","wachten koppelchauffeur"]
[1,"2015-07-28T05:01:40","2015-07-28T05:12:28","2015-07-28T04:41:36","2015-07-28T05:00:10",{"$f":"C7-B7","v":7.5000000069849193E-3},{"$f":"E7-D7","v":1.2893518520286307E-2},null,"tanken",{"$f":"SUM(F7:F12)","v":7.5000000069849193E-3},null,{"$f":"IF(M7,\"1\",0)","v":0},null,null,null,null,{"$f":"N7-M7","v":0},{"$f":"P7-O7","v":0}]
[{"$f":"IF(B8,\"1\",0)","v":0},null,null,null,null,0,0,null,"aan-afkoppelen",{"$f":"SUM(G7:G12)","v":1.2893518520286307E-2},null,0,null,null,null,null,{"$f":"N8-M8","v":0},{"$f":"P8-O8","v":0}]
[0,null,null,null,null,0,0,null,null,null,null,0,null,null,null,null,0,0]
[0,null,null,null,null,0,0,null,"Totaal uren",{"$f":"J11+J12","v":0},null,0,null,null,null,null,0,0]
[0,null,null,null,null,0,0,null,"wachten instructie",{"$f":"SUM(Q7:Q16)","v":0},null,0,null,null,null,null,0,0]
[0,null,null,null,null,0,0,null," wachten koppelchauffeur",{"$f":"SUM(R7:R16)","v":0},null,0,null,null,null,null,0,0]
[0,null,null,null,null,0,0,null,null,null,null,0,null,null,null,null,0,0]
[0,null,null,null,null,0,0,null,null,null,null,0,null,null,null,null,0,0]
[0,null,null,null,null,0,0,null,null,null,null,0,null,null,null,null,0,0]
[0,null,null,null,null,0,0,null,null,null,null,0,null,null,null,null,0,0]
[]
[null,"dinsdag 30-7-2019",null,null,null,null,null,null,null,null,null,null,{"$f":"B18","v":"dinsdag 30-7-2019"}]
[null,"Begintijd","Eindtijd","Begintijd","Eindtijd","tanken","aan/afkoppelen",null,"Totaal uren",{"$f":"J20+J21","v":2.0219907404680271E-2},null,null,"Begintijd","Eindtijd","Begintijd","Eindtijd","wachten instructie","wachten koppelchauffeur"]
[{"$f":"IF(B20,\"1\",0)","v":0},null,null,"2015-07-29T16:35:12","2015-07-29T16:47:42",{"$f":"C20-B20","v":0},{"$f":"E20-D20","v":8.6805555547471158E-3},null,"tanken",{"$f":"SUM(F20:F29)","v":0},null,{"$f":"IF(M20,\"1\",0)","v":0},null,null,null,null,{"$f":"N20-M20","v":0},{"$f":"R7","v":0}]
[{"$f":"IF(B21,\"1\",0)","v":0},null,null,"2015-07-29T16:50:26","2015-07-29T17:07:03",{"$f":"C21-B21","v":0},{"$f":"E21-D21","v":1.1539351849933155E-2},null,"aan-afkoppelen",{"$f":"SUM(G20:G29)","v":2.0219907404680271E-2},null,{"$f":"IF(M21,\"1\",0)","v":0},null,null,null,null,0,0]
[0,null,null,null,null,0,0,null,null,null,null,0,null,null,null,null,0,0]
[0,null,null,null,null,0,0,null,"Totaal uren",{"$f":"J24+J25","v":0},null,0,null,null,null,null,0,0]
[0,null,null,null,null,0,0,null,"wachten instructie",{"$f":"SUM(Q20:Q29)","v":0},null,0,null,null,null,null,0,0]
[0,null,null,null,null,0,0,null,"wachten koppelchauffeur",{"$f":"SUM(R20:R29)","v":0},null,0,null,null,null,null,0,0]
[0,null,null,null,null,0,0,null,null,null,null,0,null,null,null,null,0,0]
[0,null,null,null,null,0,0,null,null,null,null,0,null,null,null,null,0,0]
[0,null,null,null,null,0,0,null,null,{"$f":"J19+J23","v":2.0219907404680271E-2},null,0,null,null,null,null,0,0]
[0,null,null,null,null,0,0,null,null,null,null,0,null,null,null,null,{"$f":"Q16","v":0},{"$f":"R16","v":0}]
[]
[null,"woensdag 31-7-2019",null,null,null,null,null,null,null,null,null,null,{"$f":"B31","v":"woensdag 31-7-2019"}]
[null,"Begintijd","Eindtijd","Begintijd","Eindtijd","tanken","aan/afkoppelen",null,"Totaal uren",{"$f":"J33+J34","v":4.2407407403516117E-2},null,null,"Begintijd","Eindtijd","Begintijd","Eindtijd","wachten instructie","wachten koppelchauffeur"]
[{"$f":"IF(#REF!,\"1\",0)","v":{"$error":"#REF!"}},null,null,"2015-07-30T08:03:35","2015-07-30T08:17:49",{"$f":"N33-M33","v":2.0486111112404615E-2},{"$f":"E33-D33","v":9.8842592560686171E-3},null,"tanken",{"$f":"SUM(F33:F38)","v":2.0486111112404615E-2},null,1,"2015-07-30T08:17:55","2015-07-30T08:47:25",null,null,0,{"$f":"#REF!-#REF!","v":{"$error":"#REF!"}}]
[{"$f":"IF(B34,\"1\",0)","v":0},null,null,"2015-07-30T08:47:36","2015-07-30T09:04:56",{"$f":"C34-B34","v":0},{"$f":"E34-D34","v":1.2037037035042886E-2},null,"aan-afkoppelen",{"$f":"SUM(G33:G38)","v":2.1921296291111503E-2},null,{"$f":"IF(M34,\"1\",0)","v":0},null,null,null,null,0,0]
[0,null,null,null,null,0,0,null,null,null,null,0,null,null,null,null,0,0]
[0,null,null,null,null,0,0,null,"Totaal uren",{"$f":"J37+J38","v":{"$error":"#REF!"}},null,0,null,null,null,null,0,0]
[0,null,null,null,null,0,0,null,"wachten instructie",{"$f":"SUM(Q33:Q42)","v":0},null,0,null,null,null,null,0,0]
[0,null,null,null,null,0,0,null,"wachten koppelchauffeur",{"$f":"SUM(R33:R42)","v":{"$error":"#REF!"}},null,0,null,null,null,null,0,0]
[0,null,null,null,null,0,0,null,null,null,null,0,null,null,null,null,0,0]
[0,null,null,null,null,0,0,null,null,null,null,0,null,null,null,null,0,0]
[0,null,null,null,null,0,0,null,null,null,null,0,null,null,null,null,0,0]
[0,null,null,null,null,0,0,null,null,null,null,0,null,null,null,null,0,0]
[]
[null,"donderdag 01-8-2019",null,null,null,null,null,null,null,null,null,null,{"$f":"B44","v":"donderdag 01-8-2019"}]
[null,"Begintijd","Eindtijd","Begintijd","Eindtijd","tanken","aan/afkoppelen",null,"Totaal uren",{"$f":"J46+J47","v":3.4027777728624642E-3},null,null,"Begintijd","Eindtijd","Begintijd","Eindtijd","wachten instructie","wachten koppelchauffeur"]
[{"$f":"IF(B46,\"1\",0)","v":0},null,null,"2015-07-31T16:15:46","2015-07-31T16:24:13",{"$f":"C46-B46","v":0},{"$f":"N46-M46","v":3.4027777728624642E-3},null,"tanken",{"$f":"SUM(F46:F55)","v":0},null,{"$f":"IF(#REF!,\"1\",0)","v":{"$error":"#REF!"}},"2015-07-31T09:29:36","2015-07-31T09:34:30",null,null,{"$f":"#REF!-#REF!","v":{"$error":"#REF!"}},{"$f":"P46-O46","v":0}]
[{"$f":"IF(B47,\"1\",0)","v":0},null,null,null,null,{"$f":"C47-B47","v":0},{"$f":"E47-D47","v":0},null,"aan-afkoppelen",{"$f":"SUM(G46:G55)","v":3.4027777728624642E-3},null,{"$f":"IF(M47,\"1\",0)","v":0},null,null,null,null,{"$f":"N47-M47","v":0},{"$f":"P47-O47","v":0}]
[0,null,null,null,null,0,0,null,null,null,null,0,null,null,null,null,0,0]
[0,null,null,null,null,0,0,null,"Totaal uren",{"$f":"J50+J51","v":{"$error":"#REF!"}},null,0,null,null,null,null,0,0]
[0,null,null,null,null,0,0,null,"wachten instructie",{"$f":"SUM(Q46:Q55)","v":{"$error":"#REF!"}},null,0,null,null,null,null,0,0]
[0,null,null,null,null,0,0,null,"wachten koppelchauffeur",{"$f":"SUM(R46:R55)","v":0},null,0,null,null,null,null,0,0]
[0,null,null,null,null,0,0,null,null,null,null,0,null,null,null,null,0,0]
[0,null,null,null,null,0,0,null,null,null,null,0,null,null,null,null,0,0]
[0,null,null,null,null,0,0,null,null,null,null,0,null,null,null,null,0,0]
[0,null,null,null,null,0,0,null,null,null,null,0,null,null,null,null,0,0]
[]
[null,"vrijdag 02-8-2019",null,null,null,null,null,null,null,null,null,null,{"$f":"B57","v":"vrijdag 02-8-2019"}]
[null,"Begintijd","Eindtijd","Begintijd","Eindtijd","tanken","aan/afkoppelen",null,"Totaal uren",{"$f":"J59+J60","v":0},null,null,"Begintijd","Eindtijd","Begintijd","Eindtijd","wachten instructie","wachten koppelchauffeur"]
[{"$f":"IF(B59,\"1\",0)","v":0},null,null,null,null,{"$f":"C59-B59","v":0},{"$f":"E59-D59","v":0},null,"tanken",{"$f":"SUM(F59:F64)","v":0},null,{"$f":"IF(M59,\"1\",0)","v":0},null,null,null,null,{"$f":"N59-M59","v":0},{"$f":"P59-O59","v":0}]
[{"$f":"IF(B60,\"1\",0)","v":0},null,null,null,null,{"$f":"C60-B60","v":0},{"$f":"E60-D60","v":0},null,"aan-afkoppelen",{"$f":"SUM(G59:G64)","v":0},null,{"$f":"IF(M60,\"1\",0)","v":0},null,null,null,null,{"$f":"N60-M60","v":0},{"$f":"P60-O60","v":0}]
[0,null,null,null,null,0,0,null,null,null,null,0,null,null,null,null,0,0]
[0,null,null,null,null,0,0,null,"Totaal uren",{"$f":"J63+J64","v":0},null,0,null,null,null,null,0,0]
[0,null,null,null,null,0,0,null,"wachten instructie",{"$f":"SUM(Q59:Q68)","v":0},null,0,null,null,null,null,0,0]
[0,null,null,null,null,0,0,null,"wachten koppelchauffeur",{"$f":"SUM(R59:R68)","v":0},null,0,null,null,null,null,0,0]
[0,null,null,null,null,0,0,null,null,null,null,0,null,null,null,null,0,0]
[0,null,null,null,null,0,0,null,null,null,null,0,null,null,null,null,0,0]
[0,null,null,null,null,0,0,null,null,null,null,0,null,null,null,null,0,0]
[0,null,null,null,null,0,0,null,null,null,null,0,null,null,null,null,0,0]
[]
[null,"zaterdag 03-8-2019",null,null,null,null,null,null,null,null,null,null,{"$f":"B70","v":"zaterdag 03-8-2019"}]
[null,"Begintijd","Eindtijd","Begintijd","Eindtijd","tanken","aan/afkoppelen",null,"Totaal uren",{"$f":"J72+J73","v":0},null,null,"Begintijd","Eindtijd","Begintijd","Eindtijd","wachten instructie","wachten koppelchauffeur"]
[{"$f":"IF(B72,\"1\",0)","v":0},null,null,null,null,{"$f":"C72-B72","v":0},{"$f":"E72-D72","v":0},null,"tanken",{"$f":"SUM(F72:F81)","v":0},null,{"$f":"IF(M72,\"1\",0)","v":0},null,null,null,null,{"$f":"N72-M72","v":0},{"$f":"P72-O72","v":0}]
[{"$f":"IF(B73,\"1\",0)","v":0},null,null,null,null,{"$f":"C73-B73","v":0},{"$f":"E73-D73","v":0},null,"aan-afkoppelen",{"$f":"SUM(G72:G81)","v":0},null,{"$f":"IF(M73,\"1\",0)","v":0},null,null,null,null,{"$f":"N73-M73","v":0},{"$f":"P73-O73","v":0}]
[0,null,null,null,null,0,0,null,null,null,null,0,null,null,null,null,0,0]
[0,null,null,null,null,0,0,null,"Totaal uren",{"$f":"J76+J77","v":0},null,0,null,null,null,null,0,0]
[0,null,null,null,null,0,0,null,"wachten instructie",{"$f":"SUM(Q72:Q81)","v":0},null,0,null,null,null,null,0,0]
[0,null,null,null,null,0,0,null," wachten koppelchauffeur",{"$f":"SUM(R72:R81)","v":0},null,0,null,null,null,null,0,0]
[0,null,null,null,null,0,0,null,null,null,null,0,null,null,null,null,0,0]
[0,null,null,null,null,0,0,null,null,null,null,0,null,null,null,null,0,0]
[0,null,null,null,null,0,0,null,null,null,null,0,null,null,null,null,0,0]
[0,null,null,null,null,0,0,null,null,null,null,0,null,null,null,null,0,0]
[]
[null,"zondag 04-8-2019",null,null,null,null,null,null,null,null,null,null,{"$f":"B83","v":"zondag 04-8-2019"}]
[null,"Begintijd","Eindtijd","Begintijd","Eindtijd","tanken","aan/afkoppelen",null,"Totaal uren",{"$f":"J85+J86","v":0},null,null,"Begintijd","Eindtijd","Begintijd","Eindtijd","wachten instructie","wachten koppelchauffeur"]
[{"$f":"IF(B85,\"1\",0)","v":0},null,null,null,null,{"$f":"C85-B85","v":0},{"$f":"E85-D85","v":0},null,"tanken",{"$f":"SUM(F85:F90)","v":0},null,{"$f":"IF(M85,\"1\",0)","v":0},null,null,null,null,{"$f":"N85-M85","v":0},{"$f":"P85-O85","v":0}]
[{"$f":"IF(B86,\"1\",0)","v":0},null,null,null,null,{"$f":"C86-B86","v":0},{"$f":"E86-D86","v":0},null,"aan-afkoppelen",{"$f":"SUM(G85:G90)","v":0},null,{"$f":"IF(M86,\"1\",0)","v":0},null,null,null,null,0,0]
[0,null,null,null,null,0,0,null,null,null,null,0,null,null,null,null,0,0]
[0,null,null,null,null,0,0,null,"Totaal uren",{"$f":"J89+J90","v":0},null,0,null,null,null,null,0,0]
[0,null,null,null,null,0,0,null,"wachten instructie",{"$f":"SUM(Q85:Q94)","v":0},null,0,null,null,null,null,0,0]
[0,null,null,null,null,0,0,null,"wachten koppelchauffeur",{"$f":"SUM(R85:R94)","v":0},null,0,null,null,null,null,0,0]
[0,null,null,null,null,0,0,null,null,null,null,0,null,null,null,null,0,0]
[0,null,null,null,null,0,0,null,null,null,null,0,null,null,null,null,0,0]
[0,null,null,null,null,0,0,null,null,null,null,0,null,null,null,null,0,0]
[0,null,null,null,null,0,0,null,null,null,null,0,null,null,null,null,0,0]
[]
[null,null,null,null,null,null,null,null,"tanken",{"$f":"J85+J72+J59+J46+J33+J20+J7","v":2.7986111119389534E-2}]
[]
[null,null,null,null,null,null,null,null,"aan-afkoppelen",{"$f":"J86+J73+J60+J47+J34+J21+J8","v":5.8437499988940544E-2}]
[]
[null,null,null,null,null,null,null,null,"Totaal uren",{"$f":"J98+J96","v":8.6423611108330078E-2}]
[]
[]
[null,null,null,null,null,null,null,null,"wachten instructie",{"$f":"J89+J76+J63+J50+J37+J24+J11","v":{"$error":"#REF!"}}]
[]
[null,null,null,null,null,null,null,null,"wachten koppelchauffeur",{"$f":"J90+J77+J64+J51+J38+J25+J12","v":{"$error":"#REF!"}}]
[]
[null,null,null,null,null,null,null,null,"Totaal uren",{"$f":"J105+J103","v":{"$error":"#REF!"}}]
[]
[]
[null,"Einde dag-taken week 31"]

{"sheet":"Dag-taken week (30)","index":31,"n_rows":110,"n_cols":18,"rows_kept":110,"cut":false,"hidden":true,"merged":[[30,1,30,6],[30,12,30,17],[0,12,0,17],[4,1,4,6],[4,12,4,17],[17,1,17,6],[17,12,17,17],[43,1,43,6],[43,12,43,17],[56,1,56,6],[56,12,56,17],[69,1,69,6],[69,12,69,17],[82,1,82,6],[82,12,82,17],[95,8,96,8],[95,9,96,10],[97,8,98,8],[97,9,98,10],[106,8,108,8],[106,9,108,10],[109,1,112,17],[99,8,100,8],[99,9,100,10],[102,8,103,8],[102,9,103,10],[104,8,105,8],[104,9,105,10]]}
[null,"Dag-taken week 30",null,null,null,null,null,null,null,null,null,null,{"$f":"B1","v":"Dag-taken week 30"}]
[null,"tanken",null,"aan/afkoppelen",null,"Totaal",{"$f":"Q2","v":"Tijden"},null,null,null,null,null,"wachten instructie",null,"wachten koppelchauffeur",null,"Tijden"]
[]
[]
[null,"maandag 22-7-2019",null,null,null,null,null,null,null,null,null,null,{"$f":"B5","v":"maandag 22-7-2019"}]
[null,"Begintijd","Eindtijd","Begintijd","Eindtijd","tanken","aan/afkoppelen",null,"Totaal uren",{"$f":"J7+J8","v":2.0023148150357883E-2},null,null,"Begintijd","Eindtijd","Begintijd","Eindtijd","wachten instructie","wachten koppelchauffeur"]
[1,"2015-07-21T02:55:03","2015-07-21T03:11:03","2015-07-21T02:34:06","2015-07-21T02:46:56",{"$f":"C7-B7","v":1.1111111110949423E-2},{"$f":"E7-D7","v":8.9120370394084603E-3},null,"tanken",{"$f":"SUM(F7:F12)","v":1.1111111110949423E-2},null,{"$f":"IF(M7,\"1\",0)","v":0},null,null,null,null,{"$f":"N7-M7","v":0},{"$f":"P7-O7","v":0}]
[{"$f":"IF(B8,\"1\",0)","v":0},null,null,null,null,{"$f":"C8-B8","v":0},{"$f":"E8-D8","v":0},null,"aan-afkoppelen",{"$f":"SUM(G7:G12)","v":8.9120370394084603E-3},null,0,null,null,null,null,{"$f":"N8-M8","v":0},{"$f":"P8-O8","v":0}]
[0,null,null,null,null,0,0,null,null,null,null,0,null,null,null,null,0,0]
[0,null,null,null,null,0,0,null,"Totaal uren",{"$f":"J11+J12","v":0},null,0,null,null,null,null,0,0]
[0,null,null,null,null,0,0,null,"wachten instructie",{"$f":"SUM(Q7:Q16)","v":0},null,0,null,null,null,null,0,0]
[0,null,null,null,null,0,0,null," wachten koppelchauffeur",{"$f":"SUM(R7:R16)","v":0},null,0,null,null,null,null,0,0]
[0,null,null,null,null,0,0,null,null,null,null,0,null,null,null,null,0,0]
[0,null,null,null,null,0,0,null,null,null,null,0,null,null,null,null,0,0]
[0,null,null,null,null,0,0,null,null,null,null,0,null,null,null,null,0,0]
[0,null,null,null,null,0,0,null,null,null,null,0,null,null,null,null,0,0]
[]
[null,"dinsdag 23-7-2019",null,null,null,null,null,null,null,null,null,null,{"$f":"B18","v":"dinsdag 23-7-2019"}]
[null,"Begintijd","Eindtijd","Begintijd","Eindtijd","tanken","aan/afkoppelen",null,"Totaal uren",{"$f":"J20+J21","v":0},null,null,"Begintijd","Eindtijd","Begintijd","Eindtijd","wachten instructie","wachten koppelchauffeur"]
[{"$f":"IF(B20,\"1\",0)","v":0},null,null,null,null,{"$f":"C20-B20","v":0},{"$f":"E20-D20","v":0},null,"tanken",{"$f":"SUM(F20:F29)","v":0},null,{"$f":"IF(M20,\"1\",0)","v":"1"},"2015-07-22T14:45:29","2015-07-22T17:16:30",null,null,{"$f":"N20-M20","v":0.10487268518772908},{"$f":"R7","v":0}]
[{"$f":"IF(B21,\"1\",0)","v":0},null,null,null,null,{"$f":"C21-B21","v":0},{"$f":"E21-D21","v":0},null,"aan-afkoppelen",{"$f":"SUM(G20:G29)","v":0},null,{"$f":"IF(M21,\"1\",0)","v":0},null,null,null,null,0,0]
[0,null,null,null,null,0,0,null,null,null,null,0,null,null,null,null,0,0]
[0,null,null,null,null,0,0,null,"Totaal uren",{"$f":"J24+J25","v":0.10487268518772908},null,0,null,null,null,null,0,0]
[0,null,null,null,null,0,0,null,"wachten instructie",{"$f":"SUM(Q20:Q29)","v":0.10487268518772908},null,0,null,null,null,null,0,0]
[0,null,null,null,null,0,0,null,"wachten koppelchauffeur",{"$f":"SUM(R20:R29)","v":0},null,0,null,null,null,null,0,0]
[0,null,null,null,null,0,0,null,null,null,null,0,null,null,null,null,0,0]
[0,null,null,null,null,0,0,null,null,null,null,0,null,null,null,null,0,0]
[0,null,null,null,null,0,0,null,null,{"$f":"J19+J23","v":0.10487268518772908},null,0,null,null,null,null,0,0]
[0,null,null,null,null,0,0,null,null,null,null,0,null,null,null,null,{"$f":"Q16","v":0},{"$f":"R16","v":0}]
[]
[null,"woensdag 24-7-2019",null,null,null,null,null,null,null,null,null,null,{"$f":"B31","v":"woensdag 24-7-2019"}]
[null,"Begintijd","Eindtijd","Begintijd","Eindtijd","tanken","aan/afkoppelen",null,"Totaal uren",{"$f":"J33+J34","v":1.4085648152104113E-2},null,null,"Begintijd","Eindtijd","Begintijd","Eindtijd","wachten instructie","wachten koppelchauffeur"]
[{"$f":"IF(M46,\"1\",0)","v":0},null,null,"2015-07-23T18:48:34","2015-07-23T19:08:51",{"$f":"C33-B33","v":0},{"$f":"E33-D33","v":1.4085648152104113E-2},null,"tanken",{"$f":"SUM(F33:F38)","v":0},null,1,null,null,null,null,0,{"$f":"N33-M33","v":0}]
[{"$f":"IF(B34,\"1\",0)","v":0},null,null,null,null,{"$f":"C34-B34","v":0},{"$f":"E34-D34","v":0},null,"aan-afkoppelen",{"$f":"SUM(G33:G38)","v":1.4085648152104113E-2},null,{"$f":"IF(M34,\"1\",0)","v":0},null,null,null,null,0,0]
[0,null,null,null,null,0,0,null,null,null,null,0,null,null,null,null,0,0]
[0,null,null,null,null,0,0,null,"Totaal uren",{"$f":"J37+J38","v":0},null,0,null,null,null,null,0,0]
[0,null,null,null,null,0,0,null,"wachten instructie",{"$f":"SUM(Q33:Q42)","v":0},null,0,null,null,null,null,0,0]
[0,null,null,null,null,0,0,null,"wachten koppelchauffeur",{"$f":"SUM(R33:R42)","v":0},null,0,null,null,null,null,0,0]
[0,null,null,null,null,0,0,null,null,null,null,0,null,null,null,null,0,0]
[0,null,null,null,null,0,0,null,null,null,null,0,null,null,null,null,0,0]
[0,null,null,null,null,0,0,null,null,null,null,0,null,null,null,null,0,0]
[0,null,null,null,null,0,0,null,null,null,null,0,null,null,null,null,0,0]
[]
[null,"donderdag 25-7-2019",null,null,null,null,null,null,null,null,null,null,{"$f":"B44","v":"donderdag 25-7-2019"}]
[null,"Begintijd","Eindtijd","Begintijd","Eindtijd","tanken","aan/afkoppelen",null,"Totaal uren",{"$f":"J46+J47","v":1.4988425929914229E-2},null,null,"Begintijd","Eindtijd","Begintijd","Eindtijd","wachten instructie","wachten koppelchauffeur"]
[{"$f":"IF(B46,\"1\",0)","v":"1"},"2015-07-24T04:55:29","2015-07-24T05:10:36","2015-07-24T04:44:45","2015-07-24T04:51:13",{"$f":"C46-B46","v":1.0497685187146999E-2},{"$f":"E46-D46","v":4.4907407427672297E-3},null,"tanken",{"$f":"SUM(F46:F55)","v":1.0497685187146999E-2},null,{"$f":"IF(M46,\"1\",0)","v":0},null,null,null,null,{"$f":"N46-M46","v":0},{"$f":"P46-O46","v":0}]
[{"$f":"IF(B47,\"1\",0)","v":0},null,null,null,null,{"$f":"C47-B47","v":0},{"$f":"E47-D47","v":0},null,"aan-afkoppelen",{"$f":"SUM(G46:G55)","v":4.4907407427672297E-3},null,0,null,null,null,null,{"$f":"N47-M47","v":0},{"$f":"P47-O47","v":0}]
[0,null,null,null,null,0,0,null,null,null,null,0,null,null,null,null,0,0]
[0,null,null,null,null,0,0,null,"Totaal uren",{"$f":"J50+J51","v":0},null,0,null,null,null,null,0,0]
[0,null,null,null,null,0,0,null,"wachten instructie",{"$f":"SUM(Q46:Q55)","v":0},null,0,null,null,null,null,0,0]
[0,null,null,null,null,0,0,null,"wachten koppelchauffeur",{"$f":"SUM(R46:R55)","v":0},null,0,null,null,null,null,0,0]
[0,null,null,null,null,0,0,null,null,null,null,0,null,null,null,null,0,0]
[0,null,null,null,null,0,0,null,null,null,null,0,null,null,null,null,0,0]
[0,null,null,null,null,0,0,null,null,null,null,0,null,null,null,null,0,0]
[0,null,null,null,null,0,0,null,null,null,null,0,null,null,null,null,0,0]
[]
[null,"vrijdag 26-7-2019",null,null,null,null,null,null,null,null,null,null,{"$f":"B57","v":"vrijdag 26-7-2019"}]
[null,"Begintijd","Eindtijd","Begintijd","Eindtijd","tanken","aan/afkoppelen",null,"Totaal uren",{"$f":"J59+J60","v":3.0740740738110617E-2},null,null,"Begintijd","Eindtijd","Begintijd","Eindtijd","wachten instructie","wachten koppelchauffeur"]
[{"$f":"IF(B59,\"1\",0)","v":0},null,null,"2015-07-25T17:48:22","2015-07-25T17:56:07",{"$f":"C59-B59","v":0},{"$f":"E59-D59","v":5.3819444437976927E-3},null,"tanken",{"$f":"SUM(F59:F64)","v":0},null,{"$f":"IF(M59,\"1\",0)","v":0},null,null,null,null,{"$f":"N59-M59","v":0},{"$f":"P59-O59","v":0}]
[{"$f":"IF(B60,\"1\",0)","v":0},null,null,"2015-07-25T18:14:38","2015-07-25T18:19:18",{"$f":"C60-B60","v":0},{"$f":"E60-D60","v":3.2407407343271188E-3},null,"aan-afkoppelen",{"$f":"SUM(G59:G64)","v":3.0740740738110617E-2},null,{"$f":"IF(M60,\"1\",0)","v":0},null,null,null,null,{"$f":"N60-M60","v":0},{"$f":"P60-O60","v":0}]
[0,null,null,"2015-07-25T18:21:54","2015-07-25T18:27:35",0,3.9467592650908045E-3,null,null,null,null,0,null,null,null,null,0,0]
[0,null,null,"2015-07-25T18:27:43","2015-07-25T18:43:28",0,1.0937499995634425E-2,null,"Totaal uren",{"$f":"J63+J64","v":0},null,0,null,null,null,null,0,0]
[0,null,null,"2015-07-25T19:02:28","2015-07-25T19:12:53",0,7.2337962992605753E-3,null,"wachten instructie",{"$f":"SUM(Q59:Q68)","v":0},null,0,null,null,null,null,0,0]
[0,null,null,null,null,0,0,null,"wachten koppelchauffeur",{"$f":"SUM(R59:R68)","v":0},null,0,null,null,null,null,0,0]
[0,null,null,null,null,0,0,null,null,null,null,0,null,null,null,null,0,0]
[0,null,null,null,null,0,0,null,null,null,null,0,null,null,null,null,0,0]
[0,null,null,null,null,0,0,null,null,null,null,0,null,null,null,null,0,0]
[0,null,null,null,null,0,0,null,null,null,null,0,null,null,null,null,0,0]
[]
[null,"zaterdag 27-7-2019",null,null,null,null,null,null,null,null,null,null,{"$f":"B70","v":"zaterdag 27-7-2019"}]
[null,"Begintijd","Eindtijd","Begintijd","Eindtijd","tanken","aan/afkoppelen",null,"Totaal uren",{"$f":"J72+J73","v":0},null,null,"Begintijd","Eindtijd","Begintijd","Eindtijd","wachten instructie","wachten koppelchauffeur"]
[{"$f":"IF(B72,\"1\",0)","v":0},null,null,null,null,{"$f":"C72-B72","v":0},{"$f":"E72-D72","v":0},null,"tanken",{"$f":"SUM(F72:F81)","v":0},null,{"$f":"IF(M72,\"1\",0)","v":0},null,null,null,null,{"$f":"N72-M72","v":0},{"$f":"P72-O72","v":0}]
[{"$f":"IF(B73,\"1\",0)","v":0},null,null,null,null,{"$f":"C73-B73","v":0},{"$f":"E73-D73","v":0},null,"aan-afkoppelen",{"$f":"SUM(G72:G81)","v":0},null,{"$f":"IF(M73,\"1\",0)","v":0},null,null,null,null,{"$f":"N73-M73","v":0},{"$f":"P73-O73","v":0}]
[0,null,null,null,null,0,0,null,null,null,null,0,null,null,null,null,0,0]
[0,null,null,null,null,0,0,null,"Totaal uren",{"$f":"J76+J77","v":0},null,0,null,null,null,null,0,0]
[0,null,null,null,null,0,0,null,"wachten instructie",{"$f":"SUM(Q72:Q81)","v":0},null,0,null,null,null,null,0,0]
[0,null,null,null,null,0,0,null," wachten koppelchauffeur",{"$f":"SUM(R72:R81)","v":0},null,0,null,null,null,null,0,0]
[0,null,null,null,null,0,0,null,null,null,null,0,null,null,null,null,0,0]
[0,null,null,null,null,0,0,null,null,null,null,0,null,null,null,null,0,0]
[0,null,null,null,null,0,0,null,null,null,null,0,null,null,null,null,0,0]
[0,null,null,null,null,0,0,null,null,null,null,0,null,null,null,null,0,0]
[]
[null,"zondag 28-7-2019",null,null,null,null,null,null,null,null,null,null,{"$f":"B83","v":"zondag 28-7-2019"}]
[null,"Begintijd","Eindtijd","Begintijd","Eindtijd","tanken","aan/afkoppelen",null,"Totaal uren",{"$f":"J85+J86","v":0},null,null,"Begintijd","Eindtijd","Begintijd","Eindtijd","wachten instructie","wachten koppelchauffeur"]
[{"$f":"IF(B85,\"1\",0)","v":0},null,null,null,null,{"$f":"C85-B85","v":0},{"$f":"E85-D85","v":0},null,"tanken",{"$f":"SUM(F85:F90)","v":0},null,{"$f":"IF(M85,\"1\",0)","v":0},null,null,null,null,{"$f":"N85-M85","v":0},{"$f":"P85-O85","v":0}]
[{"$f":"IF(B86,\"1\",0)","v":0},null,null,null,null,{"$f":"C86-B86","v":0},{"$f":"E86-D86","v":0},null,"aan-afkoppelen",{"$f":"SUM(G85:G90)","v":0},null,{"$f":"IF(M86,\"1\",0)","v":0},null,null,null,null,0,0]
[0,null,null,null,null,0,0,null,null,null,null,0,null,null,null,null,0,0]
[0,null,null,null,null,0,0,null,"Totaal uren",{"$f":"J89+J90","v":0},null,0,null,null,null,null,0,0]
[0,null,null,null,null,0,0,null,"wachten instructie",{"$f":"SUM(Q85:Q94)","v":0},null,0,null,null,null,null,0,0]
[0,null,null,null,null,0,0,null,"wachten koppelchauffeur",{"$f":"SUM(R85:R94)","v":0},null,0,null,null,null,null,0,0]
[0,null,null,null,null,0,0,null,null,null,null,0,null,null,null,null,0,0]
[0,null,null,null,null,0,0,null,null,null,null,0,null,null,null,null,0,0]
[0,null,null,null,null,0,0,null,null,null,null,0,null,null,null,null,0,0]
[0,null,null,null,null,0,0,null,null,null,null,0,null,null,null,null,0,0]
[]
[null,null,null,null,null,null,null,null,"tanken",{"$f":"J85+J72+J59+J46+J33+J20+J7","v":2.1608796298096422E-2}]
[]
[null,null,null,null,null,null,null,null,"aan-afkoppelen",{"$f":"J86+J73+J60+J47+J34+J21+J8","v":5.822916667239042E-2}]
[]
[null,null,null,null,null,null,null,null,"Totaal uren",{"$f":"J98+J96","v":7.9837962970486842E-2}]
[]
[]
[null,null,null,null,null,null,null,null,"wachten instructie",{"$f":"J89+J76+J63+J50+J37+J24+J11","v":0.10487268518772908}]
[]
[null,null,null,null,null,null,null,null,"wachten koppelchauffeur",{"$f":"J90+J77+J64+J51+J38+J25+J12","v":0}]
[]
[null,null,null,null,null,null,null,null,"Totaal uren",{"$f":"J105+J103","v":0.10487268518772908}]
[]
[]
[null,"Einde dag-taken week 30"]

{"sheet":"Dag-taken week (29)","index":32,"n_rows":110,"n_cols":18,"rows_kept":110,"cut":false,"hidden":true,"merged":[[30,1,30,6],[30,12,30,17],[0,12,0,17],[4,1,4,6],[4,12,4,17],[17,1,17,6],[17,12,17,17],[43,1,43,6],[43,12,43,17],[56,1,56,6],[56,12,56,17],[69,1,69,6],[69,12,69,17],[82,1,82,6],[82,12,82,17],[95,8,96,8],[95,9,96,10],[97,8,98,8],[97,9,98,10],[106,8,108,8],[106,9,108,10],[109,1,112,17],[99,8,100,8],[99,9,100,10],[102,8,103,8],[102,9,103,10],[104,8,105,8],[104,9,105,10]]}
[null,"Dag-taken week 29",null,null,null,null,null,null,null,null,null,null,{"$f":"B1","v":"Dag-taken week 29"}]
[null,"tanken",null,"aan/afkoppelen",null,"Totaal",{"$f":"Q2","v":"Tijden"},null,null,null,null,null,"wachten instructie",null,"wachten koppelchauffeur",null,"Tijden"]
[]
[]
[null,"maandag 15-7-2019",null,null,null,null,null,null,null,null,null,null,{"$f":"B5","v":"maandag 15-7-2019"}]
[null,"Begintijd","Eindtijd","Begintijd","Eindtijd","tanken","aan/afkoppelen",null,"Totaal uren",{"$f":"J7+J8","v":1.3460648144246079E-2},null,null,"Begintijd","Eindtijd","Begintijd","Eindtijd","wachten instructie","wachten koppelchauffeur"]
[{"$f":"IF(B7,\"1\",0)","v":"1"},"2015-07-14T04:41:47","2015-07-14T04:49:50","2015-07-14T04:24:16","2015-07-14T04:35:36",{"$f":"C7-B7","v":5.5902777748997323E-3},{"$f":"E7-D7","v":7.8703703693463467E-3},null,"tanken",{"$f":"SUM(F7:F12)","v":5.5902777748997323E-3},null,{"$f":"IF(M7,\"1\",0)","v":0},null,null,null,null,{"$f":"N7-M7","v":0},{"$f":"P7-O7","v":0}]
[0,null,null,null,null,0,0,null,"aan-afkoppelen",{"$f":"SUM(G7:G12)","v":7.8703703693463467E-3},null,0,null,null,null,null,0,0]
[0,null,null,null,null,0,0,null,null,null,null,0,null,null,null,null,0,0]
[0,null,null,null,null,0,0,null,"Totaal uren",{"$f":"J11+J12","v":0},null,0,null,null,null,null,0,0]
[0,null,null,null,null,0,0,null,"wachten instructie",{"$f":"SUM(Q7:Q16)","v":0},null,0,null,null,null,null,0,0]
[0,null,null,null,null,0,0,null," wachten koppelchauffeur",{"$f":"SUM(R7:R16)","v":0},null,0,null,null,null,null,0,0]
[0,null,null,null,null,0,0,null,null,null,null,0,null,null,null,null,0,0]
[0,null,null,null,null,0,0,null,null,null,null,0,null,null,null,null,0,0]
[0,null,null,null,null,0,0,null,null,null,null,0,null,null,null,null,0,0]
[0,null,null,null,null,0,0,null,null,null,null,0,null,null,null,null,0,0]
[]
[null,"dinsdag 16-7-2019",null,null,null,null,null,null,null,null,null,null,{"$f":"B18","v":"dinsdag 16-7-2019"}]
[null,"Begintijd","Eindtijd","Begintijd","Eindtijd","tanken","aan/afkoppelen",null,"Totaal uren",{"$f":"J20+J21","v":0},null,null,"Begintijd","Eindtijd","Begintijd","Eindtijd","wachten instructie","wachten koppelchauffeur"]
[{"$f":"IF(B20,\"1\",0)","v":0},null,null,null,null,{"$f":"C20-B20","v":0},{"$f":"E20-D20","v":0},null,"tanken",{"$f":"SUM(F20:F29)","v":0},null,{"$f":"IF(M20,\"1\",0)","v":0},null,null,null,null,{"$f":"N20-M20","v":0},{"$f":"R7","v":0}]
[0,null,null,null,null,0,0,null,"aan-afkoppelen",{"$f":"SUM(G20:G29)","v":0},null,0,null,null,null,null,0,0]
[0,null,null,null,null,0,0,null,null,null,null,0,null,null,null,null,0,0]
[0,null,null,null,null,0,0,null,"Totaal uren",{"$f":"J24+J25","v":0},null,0,null,null,null,null,0,0]
[0,null,null,null,null,0,0,null,"wachten instructie",{"$f":"SUM(Q20:Q29)","v":0},null,0,null,null,null,null,0,0]
[0,null,null,null,null,0,0,null,"wachten koppelchauffeur",{"$f":"SUM(R20:R29)","v":0},null,0,null,null,null,null,0,0]
[0,null,null,null,null,0,0,null,null,null,null,0,null,null,null,null,0,0]
[0,null,null,null,null,0,0,null,null,null,null,0,null,null,null,null,0,0]
[0,null,null,null,null,0,0,null,null,{"$f":"J19+J23","v":0},null,0,null,null,null,null,0,0]
[0,null,null,null,null,0,0,null,null,null,null,0,null,null,null,null,{"$f":"Q16","v":0},0]
[]
[null,"woensdag 17-7-2019",null,null,null,null,null,null,null,null,null,null,{"$f":"B31","v":"woensdag 17-7-2019"}]
[null,"Begintijd","Eindtijd","Begintijd","Eindtijd","tanken","aan/afkoppelen",null,"Totaal uren",{"$f":"J33+J34","v":1.5451388884685002E-2},null,null,"Begintijd","Eindtijd","Begintijd","Eindtijd","wachten instructie","wachten koppelchauffeur"]
[{"$f":"IF(M46,\"1\",0)","v":0},null,null,"2015-07-16T03:07:33","2015-07-16T03:29:48",{"$f":"C33-B33","v":0},{"$f":"E33-D33","v":1.5451388884685002E-2},null,"tanken",{"$f":"SUM(F33:F38)","v":0},null,1,"2015-07-16T15:06:03","2015-07-16T15:26:12",null,null,0,{"$f":"N33-M33","v":1.3993055552418809E-2}]
[{"$f":"IF(B34,\"1\",0)","v":0},null,null,null,null,0,0,null,"aan-afkoppelen",{"$f":"SUM(G33:G38)","v":1.5451388884685002E-2},null,{"$f":"IF(M34,\"1\",0)","v":0},null,null,null,null,0,0]
[0,null,null,null,null,0,0,null,null,null,null,0,null,null,null,null,0,0]
[0,null,null,null,null,0,0,null,"Totaal uren",{"$f":"J37+J38","v":1.3993055552418809E-2},null,0,null,null,null,null,0,0]
[0,null,null,null,null,0,0,null,"wachten instructie",{"$f":"SUM(Q33:Q42)","v":0},null,0,null,null,null,null,0,0]
[0,null,null,null,null,0,0,null,"wachten koppelchauffeur",{"$f":"SUM(R33:R42)","v":1.3993055552418809E-2},null,0,null,null,null,null,0,0]
[0,null,null,null,null,0,0,null,null,null,null,0,null,null,null,null,0,0]
[0,null,null,null,null,0,0,null,null,null,null,0,null,null,null,null,0,0]
[0,null,null,null,null,0,0,null,null,null,null,0,null,null,null,null,0,0]
[0,null,null,null,null,0,0,null,null,null,null,0,null,null,null,null,0,0]
[]
[null,"donderdag 18-7-2019",null,null,null,null,null,null,null,null,null,null,{"$f":"B44","v":"donderdag 18-7-2019"}]
[null,"Begintijd","Eindtijd","Begintijd","Eindtijd","tanken","aan/afkoppelen",null,"Totaal uren",{"$f":"J46+J47","v":1.877314814919373E-2},null,null,"Begintijd","Eindtijd","Begintijd","Eindtijd","wachten instructie","wachten koppelchauffeur"]
[{"$f":"IF(B46,\"1\",0)","v":0},null,null,"2015-07-17T12:01:42","2015-07-17T12:16:25",{"$f":"C46-B46","v":0},{"$f":"E46-D46","v":1.021990740991896E-2},null,"tanken",{"$f":"SUM(F46:F55)","v":0},null,{"$f":"IF(M46,\"1\",0)","v":0},null,null,null,null,{"$f":"N46-M46","v":0},{"$f":"P46-O46","v":0}]
[0,null,null,"2015-07-17T12:16:55","2015-07-17T12:29:14",0,8.55324073927477E-3,null,"aan-afkoppelen",{"$f":"SUM(G46:G55)","v":1.877314814919373E-2},null,0,null,null,null,null,0,0]
[0,null,null,null,null,0,0,null,null,null,null,0,null,null,null,null,0,0]
[0,null,null,null,null,0,0,null,"Totaal uren",{"$f":"J50+J51","v":0},null,0,null,null,null,null,0,0]
[0,null,null,null,null,0,0,null,"wachten instructie",{"$f":"SUM(Q46:Q55)","v":0},null,0,null,null,null,null,0,0]
[0,null,null,null,null,0,0,null,"wachten koppelchauffeur",{"$f":"SUM(R46:R55)","v":0},null,0,null,null,null,null,0,0]
[0,null,null,null,null,0,0,null,null,null,null,0,null,null,null,null,0,0]
[0,null,null,null,null,0,0,null,null,null,null,0,null,null,null,null,0,0]
[0,null,null,null,null,0,0,null,null,null,null,0,null,null,null,null,0,0]
[0,null,null,null,null,0,0,null,null,null,null,0,null,null,null,null,0,0]
[]
[null,"vrijdag 19-7-2019",null,null,null,null,null,null,null,null,null,null,{"$f":"B57","v":"vrijdag 19-7-2019"}]
[null,"Begintijd","Eindtijd","Begintijd","Eindtijd","tanken","aan/afkoppelen",null,"Totaal uren",{"$f":"J59+J60","v":4.3541666665987577E-2},null,null,"Begintijd","Eindtijd","Begintijd","Eindtijd","wachten instructie","wachten koppelchauffeur"]
[{"$f":"IF(B59,\"1\",0)","v":"1"},"2015-07-18T09:20:27","2015-07-18T09:53:14","2015-07-18T10:04:22","2015-07-18T10:11:03",{"$f":"C59-B59","v":2.2766203699575271E-2},{"$f":"E59-D59","v":4.6412037045229226E-3},null,"tanken",{"$f":"SUM(F59:F64)","v":2.2766203699575271E-2},null,{"$f":"IF(M59,\"1\",0)","v":0},null,null,null,null,{"$f":"N59-M59","v":0},{"$f":"P59-O59","v":0}]
[0,null,null,"2015-07-18T10:17:54","2015-07-18T10:20:38",0,1.898148148029577E-3,null,"aan-afkoppelen",{"$f":"SUM(G59:G64)","v":2.0775462966412306E-2},null,0,null,null,null,null,0,0]
[0,null,null,"2015-07-18T18:26:26","2015-07-18T18:46:56",0,1.4236111113859806E-2,null,null,null,null,0,null,null,null,null,0,0]
[0,null,null,null,null,0,0,null,"Totaal uren",{"$f":"J63+J64","v":0},null,0,null,null,null,null,0,0]
[0,null,null,null,null,0,0,null,"wachten instructie",{"$f":"SUM(Q59:Q68)","v":0},null,0,null,null,null,null,0,0]
[0,null,null,null,null,0,0,null,"wachten koppelchauffeur",{"$f":"SUM(R59:R68)","v":0},null,0,null,null,null,null,0,0]
[0,null,null,null,null,0,0,null,null,null,null,0,null,null,null,null,0,0]
[0,null,null,null,null,0,0,null,null,null,null,0,null,null,null,null,0,0]
[0,null,null,null,null,0,0,null,null,null,null,0,null,null,null,null,0,0]
[0,null,null,null,null,0,0,null,null,null,null,0,null,null,null,null,0,0]
[]
[null,"zaterdag 20-7-2019",null,null,null,null,null,null,null,null,null,null,{"$f":"B70","v":"zaterdag 20-7-2019"}]
[null,"Begintijd","Eindtijd","Begintijd","Eindtijd","tanken","aan/afkoppelen",null,"Totaal uren",{"$f":"J72+J73","v":0},null,null,"Begintijd","Eindtijd","Begintijd","Eindtijd","wachten instructie","wachten koppelchauffeur"]
[{"$f":"IF(B72,\"1\",0)","v":0},null,null,null,null,{"$f":"C72-B72","v":0},{"$f":"E72-D72","v":0},null,"tanken",{"$f":"SUM(F72:F81)","v":0},null,{"$f":"IF(M72,\"1\",0)","v":0},null,null,null,null,{"$f":"N72-M72","v":0},{"$f":"P72-O72","v":0}]
[0,null,null,null,null,0,0,null,"aan-afkoppelen",{"$f":"SUM(G72:G81)","v":0},null,0,null,null,null,null,0,0]
[0,null,null,null,null,0,0,null,null,null,null,0,null,null,null,null,0,0]
[0,null,null,null,null,0,0,null,"Totaal uren",{"$f":"J76+J77","v":0},null,0,null,null,null,null,0,0]
[0,null,null,null,null,0,0,null,"wachten instructie",{"$f":"SUM(Q72:Q81)","v":0},null,0,null,null,null,null,0,0]
[0,null,null,null,null,0,0,null," wachten koppelchauffeur",{"$f":"SUM(R72:R81)","v":0},null,0,null,null,null,null,0,0]
[0,null,null,null,null,0,0,null,null,null,null,0,null,null,null,null,0,0]
[0,null,null,null,null,0,0,null,null,null,null,0,null,null,null,null,0,0]
[0,null,null,null,null,0,0,null,null,null,null,0,null,null,null,null,0,0]
[0,null,null,null,null,0,0,null,null,null,null,0,null,null,null,null,0,0]
[]
[null,"zondag 21-7-2019",null,null,null,null,null,null,null,null,null,null,{"$f":"B83","v":"zondag 21-7-2019"}]
[null,"Begintijd","Eindtijd","Begintijd","Eindtijd","tanken","aan/afkoppelen",null,"Totaal uren",{"$f":"J85+J86","v":2.0023148150357883E-2},null,null,"Begintijd","Eindtijd","Begintijd","Eindtijd","wachten instructie","wachten koppelchauffeur"]
[{"$f":"IF('Dag-taken week (30)'!B7,\"1\",0)","v":"1"},null,null,null,null,{"$f":"'Dag-taken week (30)'!C7-'Dag-taken week (30)'!B7","v":1.1111111110949423E-2},{"$f":"'Dag-taken week (30)'!E7-'Dag-taken week (30)'!D7","v":8.9120370394084603E-3},null,"tanken",{"$f":"SUM(F85:F90)","v":1.1111111110949423E-2},null,{"$f":"IF(M85,\"1\",0)","v":0},null,null,null,null,{"$f":"N85-M85","v":0},{"$f":"P85-O85","v":0}]
[{"$f":"IF(B86,\"1\",0)","v":0},null,null,null,null,{"$f":"C86-B86","v":0},{"$f":"E86-D86","v":0},null,"aan-afkoppelen",{"$f":"SUM(G85:G90)","v":8.9120370394084603E-3},null,0,null,null,null,null,0,0]
[0,null,null,null,null,0,0,null,null,null,null,0,null,null,null,null,0,0]
[0,null,null,null,null,0,0,null,"Totaal uren",{"$f":"J89+J90","v":0},null,0,null,null,null,null,0,0]
[0,null,null,null,null,0,0,null,"wachten instructie",{"$f":"SUM(Q85:Q94)","v":0},null,0,null,null,null,null,0,0]
[0,null,null,null,null,0,0,null,"wachten koppelchauffeur",{"$f":"SUM(R85:R94)","v":0},null,0,null,null,null,null,0,0]
[0,null,null,null,null,0,0,null,null,null,null,0,null,null,null,null,0,0]
[0,null,null,null,null,0,0,null,null,null,null,0,null,null,null,null,0,0]
[0,null,null,null,null,0,0,null,null,null,null,0,null,null,null,null,0,0]
[0,null,null,null,null,0,0,null,null,null,null,0,null,null,null,null,0,0]
[]
[null,null,null,null,null,null,null,null,"tanken",{"$f":"J85+J72+J59+J46+J33+J20+J7","v":3.9467592585424427E-2}]
[]
[null,null,null,null,null,null,null,null,"aan-afkoppelen",{"$f":"J86+J73+J60+J47+J34+J21+J8","v":7.1782407409045845E-2}]
[]
[null,null,null,null,null,null,null,null,"Totaal uren",{"$f":"J98+J96","v":0.11124999999447027}]
[]
[]
[null,null,null,null,null,null,null,null,"wachten instructie",{"$f":"J89+J76+J63+J50+J37+J24+J11","v":0}]
[]
[null,null,null,null,null,null,null,null,"wachten koppelchauffeur",{"$f":"J90+J77+J64+J51+J38+J25+J12","v":1.3993055552418809E-2}]
[]
[null,null,null,null,null,null,null,null,"Totaal uren",{"$f":"J105+J103","v":1.3993055552418809E-2}]
[]
[]
[null,"Einde dag-taken week 29"]

{"sheet":"Dag-taken week (26)","index":33,"n_rows":110,"n_cols":18,"rows_kept":110,"cut":false,"hidden":true,"merged":[[30,1,30,6],[30,12,30,17],[0,12,0,17],[4,1,4,6],[4,12,4,17],[17,1,17,6],[17,12,17,17],[43,1,43,6],[43,12,43,17],[56,1,56,6],[56,12,56,17],[69,1,69,6],[69,12,69,17],[82,1,82,6],[82,12,82,17],[95,8,96,8],[95,9,96,10],[97,8,98,8],[97,9,98,10],[106,8,108,8],[106,9,108,10],[109,1,112,17],[99,8,100,8],[99,9,100,10],[102,8,103,8],[102,9,103,10],[104,8,105,8],[104,9,105,10]]}
[null,"Dag-taken week 26",null,null,null,null,null,null,null,null,null,null,{"$f":"B1","v":"Dag-taken week 26"}]
[null,"tanken",null,"aan/afkoppelen",null,"Totaal",{"$f":"Q2","v":"Tijden"},null,null,null,null,null,"wachten instructie",null,"wachten koppelchauffeur",null,"Tijden"]
[]
[]
[null,"maandag 24-6-2019",null,null,null,null,null,null,null,null,null,null,{"$f":"B5","v":"maandag 24-6-2019"}]
[null,"Begintijd","Eindtijd","Begintijd","Eindtijd","tanken","aan/afkoppelen",null,"Totaal uren",{"$f":"J7+J8","v":0},null,null,"Begintijd","Eindtijd","Begintijd","Eindtijd","wachten instructie","wachten koppelchauffeur"]
[{"$f":"IF(B7,\"1\",0)","v":0},null,null,null,null,{"$f":"C7-B7","v":0},{"$f":"E7-D7","v":0},null,"tanken",{"$f":"SUM(F7:F12)","v":0},null,{"$f":"IF(M7,\"1\",0)","v":0},null,null,null,null,{"$f":"N7-M7","v":0},{"$f":"P7-O7","v":0}]
[{"$f":"IF(B8,\"1\",0)","v":0},null,null,null,null,{"$f":"C8-B8","v":0},{"$f":"E8-D8","v":0},null,"aan-afkoppelen",{"$f":"SUM(G7:G12)","v":0},null,0,null,null,null,null,{"$f":"N8-M8","v":0},{"$f":"P8-O8","v":0}]
[0,null,null,null,null,0,0,null,null,null,null,0,null,null,null,null,0,0]
[0,null,null,null,null,0,0,null,"Totaal uren",{"$f":"J11+J12","v":0},null,0,null,null,null,null,0,0]
[0,null,null,null,null,0,0,null,"wachten instructie",{"$f":"SUM(Q7:Q16)","v":0},null,0,null,null,null,null,0,0]
[0,null,null,null,null,0,0,null," wachten koppelchauffeur",{"$f":"SUM(R7:R16)","v":0},null,0,null,null,null,null,0,0]
[0,null,null,null,null,0,0,null,null,null,null,0,null,null,null,null,0,0]
[0,null,null,null,null,0,0,null,null,null,null,0,null,null,null,null,0,0]
[0,null,null,null,null,0,0,null,null,null,null,0,null,null,null,null,0,0]
[0,null,null,null,null,0,0,null,null,null,null,0,null,null,null,null,0,0]
[]
[null,"dinsdag 25-6-2019",null,null,null,null,null,null,null,null,null,null,{"$f":"B18","v":"dinsdag 25-6-2019"}]
[null,"Begintijd","Eindtijd","Begintijd","Eindtijd","tanken","aan/afkoppelen",null,"Totaal uren",{"$f":"J20+J21","v":0},null,null,"Begintijd","Eindtijd","Begintijd","Eindtijd","wachten instructie","wachten koppelchauffeur"]
[{"$f":"IF(B20,\"1\",0)","v":0},null,null,null,null,{"$f":"C20-B20","v":0},{"$f":"E20-D20","v":0},null,"tanken",{"$f":"SUM(F20:F29)","v":0},null,{"$f":"IF(M20,\"1\",0)","v":0},null,null,null,null,{"$f":"N20-M20","v":0},{"$f":"R7","v":0}]
[{"$f":"IF(B21,\"1\",0)","v":0},null,null,null,null,{"$f":"C21-B21","v":0},{"$f":"E21-D21","v":0},null,"aan-afkoppelen",{"$f":"SUM(G20:G29)","v":0},null,{"$f":"IF(M21,\"1\",0)","v":0},null,null,null,null,0,0]
[0,null,null,null,null,0,0,null,null,null,null,0,null,null,null,null,0,0]
[0,null,null,null,null,0,0,null,"Totaal uren",{"$f":"J24+J25","v":0},null,0,null,null,null,null,0,0]
[0,null,null,null,null,0,0,null,"wachten instructie",{"$f":"SUM(Q20:Q29)","v":0},null,0,null,null,null,null,0,0]
[0,null,null,null,null,0,0,null,"wachten koppelchauffeur",{"$f":"SUM(R20:R29)","v":0},null,0,null,null,null,null,0,0]
[0,null,null,null,null,0,0,null,null,null,null,0,null,null,null,null,0,0]
[0,null,null,null,null,0,0,null,null,null,null,0,null,null,null,null,0,0]
[0,null,null,null,null,0,0,null,null,null,null,0,null,null,null,null,0,0]
[0,null,null,null,null,0,0,null,null,null,null,0,null,null,null,null,{"$f":"Q16","v":0},{"$f":"R16","v":0}]
[]
[null,"woensdag 26-6-2019",null,null,null,null,null,null,null,null,null,null,{"$f":"B31","v":"woensdag 26-6-2019"}]
[null,"Begintijd","Eindtijd","Begintijd","Eindtijd","tanken","aan/afkoppelen",null,"Totaal uren",{"$f":"J33+J34","v":0},null,null,"Begintijd","Eindtijd","Begintijd","Eindtijd","wachten instructie","wachten koppelchauffeur"]
[{"$f":"IF(M46,\"1\",0)","v":"1"},null,null,null,null,{"$f":"C33-B33","v":0},{"$f":"E33-D33","v":0},null,"tanken",{"$f":"SUM(F33:F38)","v":0},null,1,"2015-06-25T14:27:50","2015-06-25T15:02:37",null,null,0,{"$f":"N33-M33","v":2.4155092592991423E-2}]
[{"$f":"IF(B34,\"1\",0)","v":0},null,null,null,null,0,{"$f":"E34-D34","v":0},null,"aan-afkoppelen",{"$f":"SUM(G33:G38)","v":0},null,{"$f":"IF(M34,\"1\",0)","v":0},null,null,null,null,0,0]
[0,null,null,null,null,0,0,null,null,null,null,0,null,null,null,null,0,0]
[0,null,null,null,null,0,0,null,"Totaal uren",{"$f":"J37+J38","v":2.4155092592991423E-2},null,0,null,null,null,null,0,0]
[0,null,null,null,null,0,0,null,"wachten instructie",{"$f":"SUM(Q33:Q42)","v":0},null,0,null,null,null,null,0,0]
[0,null,null,null,null,0,0,null,"wachten koppelchauffeur",{"$f":"SUM(R33:R42)","v":2.4155092592991423E-2},null,0,null,null,null,null,0,0]
[0,null,null,null,null,0,0,null,null,null,null,0,null,null,null,null,0,0]
[0,null,null,null,null,0,0,null,null,null,null,0,null,null,null,null,0,0]
[0,null,null,null,null,0,0,null,null,null,null,0,null,null,null,null,0,0]
[0,null,null,null,null,0,0,null,null,null,null,0,null,null,null,null,0,0]
[]
[null,"donderdag 27-6-2019",null,null,null,null,null,null,null,null,null,null,{"$f":"B44","v":"donderdag 27-6-2019"}]
[null,"Begintijd","Eindtijd","Begintijd","Eindtijd","tanken","aan/afkoppelen",null,"Totaal uren",{"$f":"J46+J47","v":2.9189814820711035E-2},null,null,"Begintijd","Eindtijd","Begintijd","Eindtijd","wachten instructie","wachten koppelchauffeur"]
[{"$f":"IF(B46,\"1\",0)","v":"1"},"2015-06-26T18:26:13","2015-06-26T18:38:58","2015-06-26T23:42:30","2015-06-26T23:57:35",{"$f":"C46-B46","v":8.8541666700621136E-3},{"$f":"E46-D46","v":1.0474537040863652E-2},null,"tanken",{"$f":"SUM(F46:F55)","v":1.8715277779847383E-2},null,{"$f":"IF(M46,\"1\",0)","v":"1"},"2015-06-26T11:48:33","2015-06-26T15:21:26",null,null,{"$f":"N46-M46","v":0.14783564815297723},{"$f":"P46-O46","v":0}]
[{"$f":"IF(B47,\"1\",0)","v":"1"},"2015-06-26T23:09:54","2015-06-26T23:24:06",null,null,{"$f":"C47-B47","v":9.8611111097852699E-3},{"$f":"E47-D47","v":0},null,"aan-afkoppelen",{"$f":"SUM(G46:G55)","v":1.0474537040863652E-2},null,0,null,null,null,null,{"$f":"N47-M47","v":0},{"$f":"P47-O47","v":0}]
[0,null,null,null,null,0,0,null,null,null,null,0,null,null,null,null,0,0]
[0,null,null,null,null,0,0,null,"Totaal uren",{"$f":"J50+J51","v":0.14783564815297723},null,0,null,null,null,null,0,0]
[0,null,null,null,null,0,0,null,"wachten instructie",{"$f":"SUM(Q46:Q55)","v":0.14783564815297723},null,0,null,null,null,null,0,0]
[0,null,null,null,null,0,0,null,"wachten koppelchauffeur",{"$f":"SUM(R46:R55)","v":0},null,0,null,null,null,null,0,0]
[0,null,null,null,null,0,0,null,null,null,null,0,null,null,null,null,0,0]
[0,null,null,null,null,0,0,null,null,null,null,0,null,null,null,null,0,0]
[0,null,null,null,null,0,0,null,null,null,null,0,null,null,null,null,0,0]
[0,null,null,null,null,0,0,null,null,null,null,0,null,null,null,null,0,0]
[]
[null,"vrijdag 28-6-2019",null,null,null,null,null,null,null,null,null,null,{"$f":"B57","v":"vrijdag 28-6-2019"}]
[null,"Begintijd","Eindtijd","Begintijd","Eindtijd","tanken","aan/afkoppelen",null,"Totaal uren",{"$f":"J59+J60","v":0},null,null,"Begintijd","Eindtijd","Begintijd","Eindtijd","wachten instructie","wachten koppelchauffeur"]
[{"$f":"IF(B59,\"1\",0)","v":0},null,null,null,null,{"$f":"C59-B59","v":0},{"$f":"E59-D59","v":0},null,"tanken",{"$f":"SUM(F59:F64)","v":0},null,{"$f":"IF(M59,\"1\",0)","v":0},null,null,null,null,{"$f":"N59-M59","v":0},{"$f":"P59-O59","v":0}]
[{"$f":"IF(B60,\"1\",0)","v":0},null,null,null,null,{"$f":"C60-B60","v":0},{"$f":"E60-D60","v":0},null,"aan-afkoppelen",{"$f":"SUM(G59:G64)","v":0},null,{"$f":"IF(M60,\"1\",0)","v":0},null,null,null,null,{"$f":"N60-M60","v":0},{"$f":"P60-O60","v":0}]
[0,null,null,null,null,0,0,null,null,null,null,0,null,null,null,null,0,0]
[0,null,null,null,null,0,0,null,"Totaal uren",{"$f":"J63+J64","v":0},null,0,null,null,null,null,0,0]
[0,null,null,null,null,0,0,null,"wachten instructie",{"$f":"SUM(Q59:Q68)","v":0},null,0,null,null,null,null,0,0]
[0,null,null,null,null,0,0,null,"wachten koppelchauffeur",{"$f":"SUM(R59:R68)","v":0},null,0,null,null,null,null,0,0]
[0,null,null,null,null,0,0,null,null,null,null,0,null,null,null,null,0,0]
[0,null,null,null,null,0,0,null,null,null,null,0,null,null,null,null,0,0]
[0,null,null,null,null,0,0,null,null,null,null,0,null,null,null,null,0,0]
[0,null,null,null,null,0,0,null,null,null,null,0,null,null,null,null,0,0]
[]
[null,"zaterdag 29-6-2019",null,null,null,null,null,null,null,null,null,null,{"$f":"B70","v":"zaterdag 29-6-2019"}]
[null,"Begintijd","Eindtijd","Begintijd","Eindtijd","tanken","aan/afkoppelen",null,"Totaal uren",{"$f":"J72+J73","v":0},null,null,"Begintijd","Eindtijd","Begintijd","Eindtijd","wachten instructie","wachten koppelchauffeur"]
[{"$f":"IF(B72,\"1\",0)","v":0},null,null,null,null,{"$f":"C72-B72","v":0},{"$f":"E72-D72","v":0},null,"tanken",{"$f":"SUM(F72:F81)","v":0},null,{"$f":"IF(M72,\"1\",0)","v":0},null,null,null,null,{"$f":"N72-M72","v":0},{"$f":"P72-O72","v":0}]
[{"$f":"IF(B73,\"1\",0)","v":0},null,null,null,null,{"$f":"C73-B73","v":0},{"$f":"E73-D73","v":0},null,"aan-afkoppelen",{"$f":"SUM(G72:G81)","v":0},null,{"$f":"IF(M73,\"1\",0)","v":0},null,null,null,null,{"$f":"N73-M73","v":0},{"$f":"P73-O73","v":0}]
[0,null,null,null,null,0,0,null,null,null,null,0,null,null,null,null,0,0]
[0,null,null,null,null,0,0,null,"Totaal uren",{"$f":"J76+J77","v":0},null,0,null,null,null,null,0,0]
[0,null,null,null,null,0,0,null,"wachten instructie",{"$f":"SUM(Q72:Q81)","v":0},null,0,null,null,null,null,0,0]
[0,null,null,null,null,0,0,null," wachten koppelchauffeur",{"$f":"SUM(R72:R81)","v":0},null,0,null,null,null,null,0,0]
[0,null,null,null,null,0,0,null,null,null,null,0,null,null,null,null,0,0]
[0,null,null,null,null,0,0,null,null,null,null,0,null,null,null,null,0,0]
[0,null,null,null,null,0,0,null,null,null,null,0,null,null,null,null,0,0]
[0,null,null,null,null,0,0,null,null,null,null,0,null,null,null,null,0,0]
[]
[null,"zondag 30-6-2019",null,null,null,null,null,null,null,null,null,null,{"$f":"B83","v":"zondag 30-6-2019"}]
[null,"Begintijd","Eindtijd","Begintijd","Eindtijd","tanken","aan/afkoppelen",null,"Totaal uren",{"$f":"J85+J86","v":2.2638888884102926E-2},null,null,"Begintijd","Eindtijd","Begintijd","Eindtijd","wachten instructie","wachten koppelchauffeur"]
[{"$f":"IF(B85,\"1\",0)","v":0},null,null,"2015-06-29T08:49:54","2015-06-29T09:00:23",{"$f":"C85-B85","v":0},{"$f":"E85-D85","v":7.2800925918272696E-3},null,"tanken",{"$f":"SUM(F85:F90)","v":1.5358796292275656E-2},null,{"$f":"IF(M85,\"1\",0)","v":0},null,null,null,null,{"$f":"N85-M85","v":0},{"$f":"P85-O85","v":0}]
[{"$f":"IF(B86,\"1\",0)","v":"1"},"2015-06-29T09:04:11","2015-06-29T09:26:18",null,null,{"$f":"C86-B86","v":1.5358796292275656E-2},{"$f":"E86-D86","v":0},null,"aan-afkoppelen",{"$f":"SUM(G85:G90)","v":7.2800925918272696E-3},null,{"$f":"IF(M86,\"1\",0)","v":0},null,null,null,null,0,0]
[0,null,null,null,null,0,0,null,null,null,null,0,null,null,null,null,0,0]
[0,null,null,null,null,0,0,null,"Totaal uren",{"$f":"J89+J90","v":0},null,0,null,null,null,null,0,0]
[0,null,null,null,null,0,0,null,"wachten instructie",{"$f":"SUM(Q85:Q94)","v":0},null,0,null,null,null,null,0,0]
[0,null,null,null,null,0,0,null,"wachten koppelchauffeur",{"$f":"SUM(R85:R94)","v":0},null,0,null,null,null,null,0,0]
[0,null,null,null,null,0,0,null,null,null,null,0,null,null,null,null,0,0]
[0,null,null,null,null,0,0,null,null,null,null,0,null,null,null,null,0,0]
[0,null,null,null,null,0,0,null,null,null,null,0,null,null,null,null,0,0]
[0,null,null,null,null,0,0,null,null,null,null,0,null,null,null,null,0,0]
[]
[null,null,null,null,null,null,null,null,"tanken",{"$f":"J85+J72+J59+J46+J33+J20+J7","v":3.407407407212304E-2}]
[]
[null,null,null,null,null,null,null,null,"aan-afkoppelen",{"$f":"J86+J73+J60+J47+J34+J21+J8","v":1.7754629632690921E-2}]
[]
[null,null,null,null,null,null,null,null,"Totaal uren",{"$f":"J98+J96","v":5.1828703704813961E-2}]
[]
[]
[null,null,null,null,null,null,null,null,"wachten instructie",{"$f":"J89+J76+J63+J50+J37+J24+J11","v":0.14783564815297723}]
[]
[null,null,null,null,null,null,null,null,"wachten koppelchauffeur",{"$f":"J90+J77+J64+J51+J38+J25+J12","v":2.4155092592991423E-2}]
[]
[null,null,null,null,null,null,null,null,"Totaal uren",{"$f":"J105+J103","v":0.17199074074596865}]
[]
[]
[null,"Einde dag-taken week 26"]

{"sheet":"Dag-taken week (27)","index":34,"n_rows":110,"n_cols":18,"rows_kept":110,"cut":false,"hidden":true,"merged":[[30,1,30,6],[30,12,30,17],[0,12,0,17],[4,1,4,6],[4,12,4,17],[17,1,17,6],[17,12,17,17],[43,1,43,6],[43,12,43,17],[56,1,56,6],[56,12,56,17],[69,1,69,6],[69,12,69,17],[82,1,82,6],[82,12,82,17],[95,8,96,8],[95,9,96,10],[97,8,98,8],[97,9,98,10],[106,8,108,8],[106,9,108,10],[109,1,112,17],[99,8,100,8],[99,9,100,10],[102,8,103,8],[102,9,103,10],[104,8,105,8],[104,9,105,10]]}
[null,"Dag-taken week 27",null,null,null,null,null,null,null,null,null,null,{"$f":"B1","v":"Dag-taken week 27"}]
[null,"tanken",null,"aan/afkoppelen",null,"Totaal",{"$f":"Q2","v":"Tijden"},null,null,null,null,null,"wachten instructie",null,"wachten koppelchauffeur",null,"Tijden"]
[]
[]
[null,"maandag 01-7-2019",null,null,null,null,null,null,null,null,null,null,{"$f":"B5","v":"maandag 01-7-2019"}]
[null,"Begintijd","Eindtijd","Begintijd","Eindtijd","tanken","aan/afkoppelen",null,"Totaal uren",{"$f":"J7+J8","v":1.4340277783048805E-2},null,null,"Begintijd","Eindtijd","Begintijd","Eindtijd","wachten instructie","wachten koppelchauffeur"]
[{"$f":"IF(B7,\"1\",0)","v":"1"},"2015-07-01T04:33:07","2015-07-01T04:53:46",null,null,{"$f":"C7-B7","v":1.4340277783048805E-2},{"$f":"E7-D7","v":0},null,"tanken",{"$f":"SUM(F7:F12)","v":1.4340277783048805E-2},null,{"$f":"IF(M7,\"1\",0)","v":0},null,null,null,null,{"$f":"N7-M7","v":0},{"$f":"P7-O7","v":0}]
[{"$f":"IF(B8,\"1\",0)","v":0},null,null,null,null,{"$f":"C8-B8","v":0},{"$f":"E8-D8","v":0},null,"aan-afkoppelen",{"$f":"SUM(G7:G12)","v":0},null,0,null,null,null,null,{"$f":"N8-M8","v":0},{"$f":"P8-O8","v":0}]
[0,null,null,null,null,0,0,null,null,null,null,0,null,null,null,null,0,0]
[0,null,null,null,null,0,0,null,"Totaal uren",{"$f":"J11+J12","v":0},null,0,null,null,null,null,0,0]
[0,null,null,null,null,0,0,null,"wachten instructie",{"$f":"SUM(Q7:Q16)","v":0},null,0,null,null,null,null,0,0]
[0,null,null,null,null,0,0,null," wachten koppelchauffeur",{"$f":"SUM(R7:R16)","v":0},null,0,null,null,null,null,0,0]
[0,null,null,null,null,0,0,null,null,null,null,0,null,null,null,null,0,0]
[0,null,null,null,null,0,0,null,null,null,null,0,null,null,null,null,0,0]
[0,null,null,null,null,0,0,null,null,null,null,0,null,null,null,null,0,0]
[0,null,null,null,null,0,0,null,null,null,null,0,null,null,null,null,0,0]
[]
[null,"dinsdag 02-7-2019",null,null,null,null,null,null,null,null,null,null,{"$f":"B18","v":"dinsdag 02-7-2019"}]
[null,"Begintijd","Eindtijd","Begintijd","Eindtijd","tanken","aan/afkoppelen",null,"Totaal uren",{"$f":"J20+J21","v":0},null,null,"Begintijd","Eindtijd","Begintijd","Eindtijd","wachten instructie","wachten koppelchauffeur"]
[{"$f":"IF(B20,\"1\",0)","v":0},null,null,null,null,{"$f":"C20-B20","v":0},{"$f":"E20-D20","v":0},null,"tanken",{"$f":"SUM(F20:F29)","v":0},null,{"$f":"IF(M20,\"1\",0)","v":0},null,null,null,null,{"$f":"N20-M20","v":0},{"$f":"R7","v":0}]
[{"$f":"IF(B21,\"1\",0)","v":0},null,null,null,null,{"$f":"C21-B21","v":0},{"$f":"E21-D21","v":0},null,"aan-afkoppelen",{"$f":"SUM(G20:G29)","v":0},null,{"$f":"IF(M21,\"1\",0)","v":0},null,null,null,null,0,0]
[0,null,null,null,null,0,0,null,null,null,null,0,null,null,null,null,0,0]
[0,null,null,null,null,0,0,null,"Totaal uren",{"$f":"J24+J25","v":0},null,0,null,null,null,null,0,0]
[0,null,null,null,null,0,0,null,"wachten instructie",{"$f":"SUM(Q20:Q29)","v":0},null,0,null,null,null,null,0,0]
[0,null,null,null,null,0,0,null,"wachten koppelchauffeur",{"$f":"SUM(R20:R29)","v":0},null,0,null,null,null,null,0,0]
[0,null,null,null,null,0,0,null,null,null,null,0,null,null,null,null,0,0]
[0,null,null,null,null,0,0,null,null,null,null,0,null,null,null,null,0,0]
[0,null,null,null,null,0,0,null,null,null,null,0,null,null,null,null,0,0]
[0,null,null,null,null,0,0,null,null,null,null,0,null,null,null,null,{"$f":"Q16","v":0},{"$f":"R16","v":0}]
[]
[null,"woensdag 03-7-2019",null,null,null,null,null,null,null,null,null,null,{"$f":"B31","v":"woensdag 03-7-2019"}]
[null,"Begintijd","Eindtijd","Begintijd","Eindtijd","tanken","aan/afkoppelen",null,"Totaal uren",{"$f":"J33+J34","v":0},null,null,"Begintijd","Eindtijd","Begintijd","Eindtijd","wachten instructie","wachten koppelchauffeur"]
[{"$f":"IF(M46,\"1\",0)","v":0},null,null,null,null,{"$f":"C33-B33","v":0},{"$f":"E33-D33","v":0},null,"tanken",{"$f":"SUM(F33:F38)","v":0},null,1,null,null,null,null,0,{"$f":"N33-M33","v":0}]
[{"$f":"IF(B34,\"1\",0)","v":0},null,null,null,null,0,{"$f":"E34-D34","v":0},null,"aan-afkoppelen",{"$f":"SUM(G33:G38)","v":0},null,{"$f":"IF(M34,\"1\",0)","v":0},null,null,null,null,0,0]
[0,null,null,null,null,0,0,null,null,null,null,0,null,null,null,null,0,0]
[0,null,null,null,null,0,0,null,"Totaal uren",{"$f":"J37+J38","v":0},null,0,null,null,null,null,0,0]
[0,null,null,null,null,0,0,null,"wachten instructie",{"$f":"SUM(Q33:Q42)","v":0},null,0,null,null,null,null,0,0]
[0,null,null,null,null,0,0,null,"wachten koppelchauffeur",{"$f":"SUM(R33:R42)","v":0},null,0,null,null,null,null,0,0]
[0,null,null,null,null,0,0,null,null,null,null,0,null,null,null,null,0,0]
[0,null,null,null,null,0,0,null,null,null,null,0,null,null,null,null,0,0]
[0,null,null,null,null,0,0,null,null,null,null,0,null,null,null,null,0,0]
[0,null,null,null,null,0,0,null,null,null,null,0,null,null,null,null,0,0]
[]
[null,"donderdag 04-7-2019",null,null,null,null,null,null,null,null,null,null,{"$f":"B44","v":"donderdag 04-7-2019"}]
[null,"Begintijd","Eindtijd","Begintijd","Eindtijd","tanken","aan/afkoppelen",null,"Totaal uren",{"$f":"J46+J47","v":0},null,null,"Begintijd","Eindtijd","Begintijd","Eindtijd","wachten instructie","wachten koppelchauffeur"]
[{"$f":"IF(B46,\"1\",0)","v":0},null,null,null,null,{"$f":"C46-B46","v":0},{"$f":"E46-D46","v":0},null,"tanken",{"$f":"SUM(F46:F55)","v":0},null,{"$f":"IF(M46,\"1\",0)","v":0},null,null,null,null,{"$f":"N46-M46","v":0},{"$f":"P46-O46","v":0}]
[{"$f":"IF(B47,\"1\",0)","v":0},null,null,null,null,{"$f":"C47-B47","v":0},{"$f":"E47-D47","v":0},null,"aan-afkoppelen",{"$f":"SUM(G46:G55)","v":0},null,0,null,null,null,null,{"$f":"N47-M47","v":0},{"$f":"P47-O47","v":0}]
[0,null,null,null,null,0,0,null,null,null,null,0,null,null,null,null,0,0]
[0,null,null,null,null,0,0,null,"Totaal uren",{"$f":"J50+J51","v":0},null,0,null,null,null,null,0,0]
[0,null,null,null,null,0,0,null,"wachten instructie",{"$f":"SUM(Q46:Q55)","v":0},null,0,null,null,null,null,0,0]
[0,null,null,null,null,0,0,null,"wachten koppelchauffeur",{"$f":"SUM(R46:R55)","v":0},null,0,null,null,null,null,0,0]
[0,null,null,null,null,0,0,null,null,null,null,0,null,null,null,null,0,0]
[0,null,null,null,null,0,0,null,null,null,null,0,null,null,null,null,0,0]
[0,null,null,null,null,0,0,null,null,null,null,0,null,null,null,null,0,0]
[0,null,null,null,null,0,0,null,null,null,null,0,null,null,null,null,0,0]
[]
[null,"vrijdag 05-7-2019",null,null,null,null,null,null,null,null,null,null,{"$f":"B57","v":"vrijdag 05-7-2019"}]
[null,"Begintijd","Eindtijd","Begintijd","Eindtijd","tanken","aan/afkoppelen",null,"Totaal uren",{"$f":"J59+J60","v":1.7349537032714579E-2},null,null,"Begintijd","Eindtijd","Begintijd","Eindtijd","wachten instructie","wachten koppelchauffeur"]
[{"$f":"IF(B59,\"1\",0)","v":"1"},"2015-07-04T03:10:22","2015-07-04T03:35:21",null,null,{"$f":"C59-B59","v":1.7349537032714579E-2},{"$f":"E59-D59","v":0},null,"tanken",{"$f":"SUM(F59:F64)","v":1.7349537032714579E-2},null,{"$f":"IF(M59,\"1\",0)","v":0},null,null,null,null,{"$f":"N59-M59","v":0},{"$f":"P59-O59","v":0}]
[{"$f":"IF(B60,\"1\",0)","v":0},null,null,null,null,{"$f":"C60-B60","v":0},{"$f":"E60-D60","v":0},null,"aan-afkoppelen",{"$f":"SUM(G59:G64)","v":0},null,{"$f":"IF(M60,\"1\",0)","v":0},null,null,null,null,{"$f":"N60-M60","v":0},{"$f":"P60-O60","v":0}]
[0,null,null,null,null,0,0,null,null,null,null,0,null,null,null,null,0,0]
[0,null,null,null,null,0,0,null,"Totaal uren",{"$f":"J63+J64","v":0},null,0,null,null,null,null,0,0]
[0,null,null,null,null,0,0,null,"wachten instructie",{"$f":"SUM(Q59:Q68)","v":0},null,0,null,null,null,null,0,0]
[0,null,null,null,null,0,0,null,"wachten koppelchauffeur",{"$f":"SUM(R59:R68)","v":0},null,0,null,null,null,null,0,0]
[0,null,null,null,null,0,0,null,null,null,null,0,null,null,null,null,0,0]
[0,null,null,null,null,0,0,null,null,null,null,0,null,null,null,null,0,0]
[0,null,null,null,null,0,0,null,null,null,null,0,null,null,null,null,0,0]
[0,null,null,null,null,0,0,null,null,null,null,0,null,null,null,null,0,0]
[]
[null,"zaterdag 06-7-2019",null,null,null,null,null,null,null,null,null,null,{"$f":"B70","v":"zaterdag 06-7-2019"}]
[null,"Begintijd","Eindtijd","Begintijd","Eindtijd","tanken","aan/afkoppelen",null,"Totaal uren",{"$f":"J72+J73","v":0},null,null,"Begintijd","Eindtijd","Begintijd","Eindtijd","wachten instructie","wachten koppelchauffeur"]
[{"$f":"IF(B72,\"1\",0)","v":0},null,null,null,null,{"$f":"C72-B72","v":0},{"$f":"E72-D72","v":0},null,"tanken",{"$f":"SUM(F72:F81)","v":0},null,{"$f":"IF(M72,\"1\",0)","v":0},null,null,null,null,{"$f":"N72-M72","v":0},{"$f":"P72-O72","v":0}]
[{"$f":"IF(B73,\"1\",0)","v":0},null,null,null,null,{"$f":"C73-B73","v":0},{"$f":"E73-D73","v":0},null,"aan-afkoppelen",{"$f":"SUM(G72:G81)","v":0},null,{"$f":"IF(M73,\"1\",0)","v":0},null,null,null,null,{"$f":"N73-M73","v":0},{"$f":"P73-O73","v":0}]
[0,null,null,null,null,0,0,null,null,null,null,0,null,null,null,null,0,0]
[0,null,null,null,null,0,0,null,"Totaal uren",{"$f":"J76+J77","v":0},null,0,null,null,null,null,0,0]
[0,null,null,null,null,0,0,null,"wachten instructie",{"$f":"SUM(Q72:Q81)","v":0},null,0,null,null,null,null,0,0]
[0,null,null,null,null,0,0,null," wachten koppelchauffeur",{"$f":"SUM(R72:R81)","v":0},null,0,null,null,null,null,0,0]
[0,null,null,null,null,0,0,null,null,null,null,0,null,null,null,null,0,0]
[0,null,null,null,null,0,0,null,null,null,null,0,null,null,null,null,0,0]
[0,null,null,null,null,0,0,null,null,null,null,0,null,null,null,null,0,0]
[0,null,null,null,null,0,0,null,null,null,null,0,null,null,null,null,0,0]
[]
[null,"zondag 07-7-2019",null,null,null,null,null,null,null,null,null,null,{"$f":"B83","v":"zondag 07-7-2019"}]
[null,"Begintijd","Eindtijd","Begintijd","Eindtijd","tanken","aan/afkoppelen",null,"Totaal uren",{"$f":"J85+J86","v":5.1157407360733487E-3},null,null,"Begintijd","Eindtijd","Begintijd","Eindtijd","wachten instructie","wachten koppelchauffeur"]
[{"$f":"IF(B85,\"1\",0)","v":"1"},"2015-07-06T09:37:26","2015-07-06T09:44:48",null,null,{"$f":"C85-B85","v":5.1157407360733487E-3},{"$f":"E85-D85","v":0},null,"tanken",{"$f":"SUM(F85:F90)","v":5.1157407360733487E-3},null,{"$f":"IF(M85,\"1\",0)","v":0},null,null,null,null,{"$f":"N85-M85","v":0},{"$f":"P85-O85","v":0}]
[{"$f":"IF(B86,\"1\",0)","v":0},null,null,null,null,{"$f":"C86-B86","v":0},{"$f":"E86-D86","v":0},null,"aan-afkoppelen",{"$f":"SUM(G85:G90)","v":0},null,{"$f":"IF(M86,\"1\",0)","v":0},null,null,null,null,0,0]
[0,null,null,null,null,0,0,null,null,null,null,0,null,null,null,null,0,0]
[0,null,null,null,null,0,0,null,"Totaal uren",{"$f":"J89+J90","v":0},null,0,null,null,null,null,0,0]
[0,null,null,null,null,0,0,null,"wachten instructie",{"$f":"SUM(Q85:Q94)","v":0},null,0,null,null,null,null,0,0]
[0,null,null,null,null,0,0,null,"wachten koppelchauffeur",{"$f":"SUM(R85:R94)","v":0},null,0,null,null,null,null,0,0]
[0,null,null,null,null,0,0,null,null,null,null,0,null,null,null,null,0,0]
[0,null,null,null,null,0,0,null,null,null,null,0,null,null,null,null,0,0]
[0,null,null,null,null,0,0,null,null,null,null,0,null,null,null,null,0,0]
[0,null,null,null,null,0,0,null,null,null,null,0,null,null,null,null,0,0]
[]
[null,null,null,null,null,null,null,null,"tanken",{"$f":"J85+J72+J59+J46+J33+J20+J7","v":3.6805555551836733E-2}]
[]
[null,null,null,null,null,null,null,null,"aan-afkoppelen",{"$f":"J86+J73+J60+J47+J34+J21+J8","v":0}]
[]
[null,null,null,null,null,null,null,null,"Totaal uren",{"$f":"J98+J96","v":3.6805555551836733E-2}]
[]
[]
[null,null,null,null,null,null,null,null,"wachten instructie",{"$f":"J89+J76+J63+J50+J37+J24+J11","v":0}]
[]
[null,null,null,null,null,null,null,null,"wachten koppelchauffeur",{"$f":"J90+J77+J64+J51+J38+J25+J12","v":0}]
[]
[null,null,null,null,null,null,null,null,"Totaal uren",{"$f":"J105+J103","v":0}]
[]
[]
[null,"Einde dag-taken week 27"]

{"sheet":"Dag-taken week (28)","index":35,"n_rows":110,"n_cols":18,"rows_kept":110,"cut":false,"hidden":true,"merged":[[106,8,108,8],[106,9,108,10],[109,1,112,17],[99,8,100,8],[99,9,100,10],[102,8,103,8],[102,9,103,10],[104,8,105,8],[104,9,105,10],[82,1,82,6],[82,12,82,17],[95,8,96,8],[95,9,96,10],[97,8,98,8],[97,9,98,10],[43,1,43,6],[43,12,43,17],[56,1,56,6],[56,12,56,17],[69,1,69,6],[69,12,69,17],[30,1,30,6],[30,12,30,17],[0,12,0,17],[4,1,4,6],[4,12,4,17],[17,1,17,6],[17,12,17,17]]}
[null,"Dag-taken week 28",null,null,null,null,null,null,null,null,null,null,{"$f":"B1","v":"Dag-taken week 28"}]
[null,"tanken",null,"aan/afkoppelen",null,"Totaal",{"$f":"Q2","v":"Tijden"},null,null,null,null,null,"wachten instructie",null,"wachten koppelchauffeur",null,"Tijden"]
[]
[]
[null,"maandag 08-7-2019",null,null,null,null,null,null,null,null,null,null,{"$f":"B5","v":"maandag 08-7-2019"}]
[null,"Begintijd","Eindtijd","Begintijd","Eindtijd","tanken","aan/afkoppelen",null,"Totaal uren",{"$f":"J7+J8","v":1.1539351849933155E-2},null,null,"Begintijd","Eindtijd","Begintijd","Eindtijd","wachten instructie","wachten koppelchauffeur"]
[{"$f":"IF(B7,\"1\",0)","v":"1"},"2015-07-07T13:06:39","2015-07-07T13:17:38","2015-07-07T14:25:01","2015-07-07T14:30:39",{"$f":"C7-B7","v":7.6273148151813075E-3},{"$f":"E7-D7","v":3.9120370347518474E-3},null,"tanken",{"$f":"SUM(F7:F12)","v":7.6273148151813075E-3},null,{"$f":"IF(M7,\"1\",0)","v":0},null,null,null,null,{"$f":"N7-M7","v":0},{"$f":"P7-O7","v":0}]
[{"$f":"IF(B8,\"1\",0)","v":0},null,null,null,null,{"$f":"C8-B8","v":0},{"$f":"E8-D8","v":0},null,"aan-afkoppelen",{"$f":"SUM(G7:G12)","v":3.9120370347518474E-3},null,0,null,null,null,null,{"$f":"N8-M8","v":0},{"$f":"P8-O8","v":0}]
[0,null,null,null,null,0,0,null,null,null,null,0,null,null,null,null,0,0]
[0,null,null,null,null,0,0,null,"Totaal uren",{"$f":"J11+J12","v":0},null,0,null,null,null,null,0,0]
[0,null,null,null,null,0,0,null,"wachten instructie",{"$f":"SUM(Q7:Q16)","v":0},null,0,null,null,null,null,0,0]
[0,null,null,null,null,0,0,null," wachten koppelchauffeur",{"$f":"SUM(R7:R16)","v":0},null,0,null,null,null,null,0,0]
[0,null,null,null,null,0,0,null,null,null,null,0,null,null,null,null,0,0]
[0,null,null,null,null,0,0,null,null,null,null,0,null,null,null,null,0,0]
[0,null,null,null,null,0,0,null,null,null,null,0,null,null,null,null,0,0]
[0,null,null,null,null,0,0,null,null,null,null,0,null,null,null,null,0,0]
[]
[null,"dinsdag 09-7-2019",null,null,null,null,null,null,null,null,null,null,{"$f":"B18","v":"dinsdag 09-7-2019"}]
[null,"Begintijd","Eindtijd","Begintijd","Eindtijd","tanken","aan/afkoppelen",null,"Totaal uren",{"$f":"J20+J21","v":1.9120370372547768E-2},null,null,"Begintijd","Eindtijd","Begintijd","Eindtijd","wachten instructie","wachten koppelchauffeur"]
[{"$f":"IF(B20,\"1\",0)","v":"1"},"2015-07-08T04:41:58","2015-07-08T04:48:57","2015-07-08T04:52:24","2015-07-08T05:12:57",{"$f":"C20-B20","v":4.8495370356249623E-3},{"$f":"E20-D20","v":1.4270833336922806E-2},null,"tanken",{"$f":"SUM(F20:F29)","v":4.8495370356249623E-3},null,{"$f":"IF(M20,\"1\",0)","v":"1"},"2015-07-08T14:53:31","2015-07-08T15:53:26",null,null,{"$f":"N20-M20","v":4.1608796294895001E-2},{"$f":"R7","v":0}]
[{"$f":"IF(B21,\"1\",0)","v":0},null,null,null,null,{"$f":"C21-B21","v":0},{"$f":"E21-D21","v":0},null,"aan-afkoppelen",{"$f":"SUM(G20:G29)","v":1.4270833336922806E-2},null,{"$f":"IF(M21,\"1\",0)","v":0},null,null,null,null,0,0]
[0,null,null,null,null,0,0,null,null,null,null,0,null,null,null,null,0,0]
[0,null,null,null,null,0,0,null,"Totaal uren",{"$f":"J24+J25","v":4.1608796294895001E-2},null,0,null,null,null,null,0,0]
[0,null,null,null,null,0,0,null,"wachten instructie",{"$f":"SUM(Q20:Q29)","v":4.1608796294895001E-2},null,0,null,null,null,null,0,0]
[0,null,null,null,null,0,0,null,"wachten koppelchauffeur",{"$f":"SUM(R20:R29)","v":0},null,0,null,null,null,null,0,0]
[0,null,null,null,null,0,0,null,null,null,null,0,null,null,null,null,0,0]
[0,null,null,null,null,0,0,null,null,null,null,0,null,null,null,null,0,0]
[0,null,null,null,null,0,0,null,null,{"$f":"J19+J23","v":6.0729166667442769E-2},null,0,null,null,null,null,0,0]
[0,null,null,null,null,0,0,null,null,null,null,0,null,null,null,null,{"$f":"Q16","v":0},{"$f":"R16","v":0}]
[]
[null,"woensdag 10-7-2019",null,null,null,null,null,null,null,null,null,null,{"$f":"B31","v":"woensdag 10-7-2019"}]
[null,"Begintijd","Eindtijd","Begintijd","Eindtijd","tanken","aan/afkoppelen",null,"Totaal uren",{"$f":"J33+J34","v":1.3460648144246079E-2},null,null,"Begintijd","Eindtijd","Begintijd","Eindtijd","wachten instructie","wachten koppelchauffeur"]
[{"$f":"IF(M46,\"1\",0)","v":0},"2015-07-14T04:41:47","2015-07-14T04:49:50","2015-07-14T04:24:16","2015-07-14T04:35:36",{"$f":"C33-B33","v":5.5902777748997323E-3},{"$f":"E33-D33","v":7.8703703693463467E-3},null,"tanken",{"$f":"SUM(F33:F38)","v":5.5902777748997323E-3},null,1,"2015-07-09T10:25:50","2015-07-09T11:25:41",null,null,0,{"$f":"N33-M33","v":4.1562500002328306E-2}]
[{"$f":"IF(B34,\"1\",0)","v":0},null,null,null,null,0,{"$f":"E34-D34","v":0},null,"aan-afkoppelen",{"$f":"SUM(G33:G38)","v":7.8703703693463467E-3},null,{"$f":"IF(M34,\"1\",0)","v":0},null,null,null,null,0,0]
[0,null,null,null,null,0,0,null,null,null,null,0,null,null,null,null,0,0]
[0,null,null,null,null,0,0,null,"Totaal uren",{"$f":"J37+J38","v":4.1562500002328306E-2},null,0,null,null,null,null,0,0]
[0,null,null,null,null,0,0,null,"wachten instructie",{"$f":"SUM(Q33:Q42)","v":0},null,0,null,null,null,null,0,0]
[0,null,null,null,null,0,0,null,"wachten koppelchauffeur",{"$f":"SUM(R33:R42)","v":4.1562500002328306E-2},null,0,null,null,null,null,0,0]
[0,null,null,null,null,0,0,null,null,null,null,0,null,null,null,null,0,0]
[0,null,null,null,null,0,0,null,null,null,null,0,null,null,null,null,0,0]
[0,null,null,null,null,0,0,null,null,null,null,0,null,null,null,null,0,0]
[0,null,null,null,null,0,0,null,null,null,null,0,null,null,null,null,0,0]
[]
[null,"donderdag 11-7-2019",null,null,null,null,null,null,null,null,null,null,{"$f":"B44","v":"donderdag 11-7-2019"}]
[null,"Begintijd","Eindtijd","Begintijd","Eindtijd","tanken","aan/afkoppelen",null,"Totaal uren",{"$f":"J46+J47","v":4.6145833337504882E-2},null,null,"Begintijd","Eindtijd","Begintijd","Eindtijd","wachten instructie","wachten koppelchauffeur"]
[{"$f":"IF(B46,\"1\",0)","v":"1"},"2015-07-10T06:41:47","2015-07-10T06:56:39","2015-07-10T06:08:03","2015-07-10T06:38:26",{"$f":"C46-B46","v":1.0324074071832001E-2},{"$f":"E46-D46","v":2.1099537043482997E-2},null,"tanken",{"$f":"SUM(F46:F55)","v":1.0324074071832001E-2},null,{"$f":"IF(M46,\"1\",0)","v":0},null,null,null,null,{"$f":"N46-M46","v":0},{"$f":"P46-O46","v":0}]
[{"$f":"IF(B47,\"1\",0)","v":0},null,null,"2015-07-10T15:21:26","2015-07-10T15:33:00",{"$f":"C47-B47","v":0},{"$f":"E47-D47","v":8.0324074078816921E-3},null,"aan-afkoppelen",{"$f":"SUM(G46:G55)","v":3.5821759265672881E-2},null,0,null,null,null,null,{"$f":"N47-M47","v":0},{"$f":"P47-O47","v":0}]
[0,null,null,"2015-07-10T15:37:30","2015-07-10T15:47:08",0,6.6898148143081926E-3,null,null,null,null,0,null,null,null,null,0,0]
[0,null,null,null,null,0,0,null,"Totaal uren",{"$f":"J50+J51","v":0},null,0,null,null,null,null,0,0]
[0,null,null,null,null,0,0,null,"wachten instructie",{"$f":"SUM(Q46:Q55)","v":0},null,0,null,null,null,null,0,0]
[0,null,null,null,null,0,0,null,"wachten koppelchauffeur",{"$f":"SUM(R46:R55)","v":0},null,0,null,null,null,null,0,0]
[0,null,null,null,null,0,0,null,null,null,null,0,null,null,null,null,0,0]
[0,null,null,null,null,0,0,null,null,null,null,0,null,null,null,null,0,0]
[0,null,null,null,null,0,0,null,null,null,null,0,null,null,null,null,0,0]
[0,null,null,null,null,0,0,null,null,null,null,0,null,null,null,null,0,0]
[]
[null,"vrijdag 12-7-2019",null,null,null,null,null,null,null,null,null,null,{"$f":"B57","v":"vrijdag 12-7-2019"}]
[null,"Begintijd","Eindtijd","Begintijd","Eindtijd","tanken","aan/afkoppelen",null,"Totaal uren",{"$f":"J59+J60","v":2.2013888890796807E-2},null,null,"Begintijd","Eindtijd","Begintijd","Eindtijd","wachten instructie","wachten koppelchauffeur"]
[{"$f":"IF(B59,\"1\",0)","v":"1"},"2015-07-11T12:12:59","2015-07-11T12:35:48","2015-07-11T13:08:08","2015-07-11T13:17:01",{"$f":"C59-B59","v":1.5844907407881692E-2},{"$f":"E59-D59","v":6.1689814829151146E-3},null,"tanken",{"$f":"SUM(F59:F64)","v":1.5844907407881692E-2},null,{"$f":"IF(M59,\"1\",0)","v":0},null,null,null,null,{"$f":"N59-M59","v":0},{"$f":"P59-O59","v":0}]
[{"$f":"IF(B60,\"1\",0)","v":0},null,null,null,null,{"$f":"C60-B60","v":0},{"$f":"E60-D60","v":0},null,"aan-afkoppelen",{"$f":"SUM(G59:G64)","v":6.1689814829151146E-3},null,{"$f":"IF(M60,\"1\",0)","v":0},null,null,null,null,{"$f":"N60-M60","v":0},{"$f":"P60-O60","v":0}]
[0,null,null,null,null,0,0,null,null,null,null,0,null,null,null,null,0,0]
[0,null,null,null,null,0,0,null,"Totaal uren",{"$f":"J63+J64","v":0},null,0,null,null,null,null,0,0]
[0,null,null,null,null,0,0,null,"wachten instructie",{"$f":"SUM(Q59:Q68)","v":0},null,0,null,null,null,null,0,0]
[0,null,null,null,null,0,0,null,"wachten koppelchauffeur",{"$f":"SUM(R59:R68)","v":0},null,0,null,null,null,null,0,0]
[0,null,null,null,null,0,0,null,null,null,null,0,null,null,null,null,0,0]
[0,null,null,null,null,0,0,null,null,null,null,0,null,null,null,null,0,0]
[0,null,null,null,null,0,0,null,null,null,null,0,null,null,null,null,0,0]
[0,null,null,null,null,0,0,null,null,null,null,0,null,null,null,null,0,0]
[]
[null,"zaterdag 13-7-2019",null,null,null,null,null,null,null,null,null,null,{"$f":"B70","v":"zaterdag 13-7-2019"}]
[null,"Begintijd","Eindtijd","Begintijd","Eindtijd","tanken","aan/afkoppelen",null,"Totaal uren",{"$f":"J72+J73","v":0},null,null,"Begintijd","Eindtijd","Begintijd","Eindtijd","wachten instructie","wachten koppelchauffeur"]
[{"$f":"IF(B72,\"1\",0)","v":0},null,null,null,null,{"$f":"C72-B72","v":0},{"$f":"E72-D72","v":0},null,"tanken",{"$f":"SUM(F72:F81)","v":0},null,{"$f":"IF(M72,\"1\",0)","v":0},null,null,null,null,{"$f":"N72-M72","v":0},{"$f":"P72-O72","v":0}]
[{"$f":"IF(B73,\"1\",0)","v":0},null,null,null,null,{"$f":"C73-B73","v":0},{"$f":"E73-D73","v":0},null,"aan-afkoppelen",{"$f":"SUM(G72:G81)","v":0},null,{"$f":"IF(M73,\"1\",0)","v":0},null,null,null,null,{"$f":"N73-M73","v":0},{"$f":"P73-O73","v":0}]
[0,null,null,null,null,0,0,null,null,null,null,0,null,null,null,null,0,0]
[0,null,null,null,null,0,0,null,"Totaal uren",{"$f":"J76+J77","v":0},null,0,null,null,null,null,0,0]
[0,null,null,null,null,0,0,null,"wachten instructie",{"$f":"SUM(Q72:Q81)","v":0},null,0,null,null,null,null,0,0]
[0,null,null,null,null,0,0,null," wachten koppelchauffeur",{"$f":"SUM(R72:R81)","v":0},null,0,null,null,null,null,0,0]
[0,null,null,null,null,0,0,null,null,null,null,0,null,null,null,null,0,0]
[0,null,null,null,null,0,0,null,null,null,null,0,null,null,null,null,0,0]
[0,null,null,null,null,0,0,null,null,null,null,0,null,null,null,null,0,0]
[0,null,null,null,null,0,0,null,null,null,null,0,null,null,null,null,0,0]
[]
[null,"zondag 14-7-2019",null,null,null,null,null,null,null,null,null,null,{"$f":"B83","v":"zondag 14-7-2019"}]
[null,"Begintijd","Eindtijd","Begintijd","Eindtijd","tanken","aan/afkoppelen",null,"Totaal uren",{"$f":"J85+J86","v":0},null,null,"Begintijd","Eindtijd","Begintijd","Eindtijd","wachten instructie","wachten koppelchauffeur"]
[{"$f":"IF(B85,\"1\",0)","v":0},null,null,null,null,{"$f":"C85-B85","v":0},{"$f":"E85-D85","v":0},null,"tanken",{"$f":"SUM(F85:F90)","v":0},null,{"$f":"IF(M85,\"1\",0)","v":0},null,null,null,null,{"$f":"N85-M85","v":0},{"$f":"P85-O85","v":0}]
[{"$f":"IF(B86,\"1\",0)","v":0},null,null,null,null,{"$f":"C86-B86","v":0},{"$f":"E86-D86","v":0},null,"aan-afkoppelen",{"$f":"SUM(G85:G90)","v":0},null,{"$f":"IF(M86,\"1\",0)","v":0},null,null,null,null,0,0]
[0,null,null,null,null,0,0,null,null,null,null,0,null,null,null,null,0,0]
[0,null,null,null,null,0,0,null,"Totaal uren",{"$f":"J89+J90","v":0},null,0,null,null,null,null,0,0]
[0,null,null,null,null,0,0,null,"wachten instructie",{"$f":"SUM(Q85:Q94)","v":0},null,0,null,null,null,null,0,0]
[0,null,null,null,null,0,0,null,"wachten koppelchauffeur",{"$f":"SUM(R85:R94)","v":0},null,0,null,null,null,null,0,0]
[0,null,null,null,null,0,0,null,null,null,null,0,null,null,null,null,0,0]
[0,null,null,null,null,0,0,null,null,null,null,0,null,null,null,null,0,0]
[0,null,null,null,null,0,0,null,null,null,null,0,null,null,null,null,0,0]
[0,null,null,null,null,0,0,null,null,null,null,0,null,null,null,null,0,0]
[]
[null,null,null,null,null,null,null,null,"tanken",{"$f":"J85+J72+J59+J46+J33+J20+J7","v":4.4236111105419695E-2}]
[]
[null,null,null,null,null,null,null,null,"aan-afkoppelen",{"$f":"J86+J73+J60+J47+J34+J21+J8","v":6.8043981489608996E-2}]
[]
[null,null,null,null,null,null,null,null,"Totaal uren",{"$f":"J98+J96","v":0.11228009259502869}]
[]
[]
[null,null,null,null,null,null,null,null,"wachten instructie",{"$f":"J89+J76+J63+J50+J37+J24+J11","v":4.1608796294895001E-2}]
[]
[null,null,null,null,null,null,null,null,"wachten koppelchauffeur",{"$f":"J90+J77+J64+J51+J38+J25+J12","v":4.1562500002328306E-2}]
[]
[null,null,null,null,null,null,null,null,"Totaal uren",{"$f":"J105+J103","v":8.3171296297223307E-2}]
[]
[]
[null,"Einde dag-taken week 28"]

{"sheet":"Landen","index":36,"n_rows":31,"n_cols":5,"rows_kept":31,"cut":false,"hidden":true,"merged":[]}
[]
[]
[null,"Belgie"]
[null,"Nederland"]
[null,"Luxemburg"]
[null,"Frankrijk"]
[null,"Italie"]
[null,"Duitsland"]
[null,"Engeland"]
[null,"Ierland"]
[null,"Spanje",null,"Spanje =","An"]
[null,"Portugal",null,null,"Ar"]
[null,"Slowakije",null,null,"Ast"]
[null,"Tsjechen",null,null,"C"]
[null,"Hongarije",null,null,"Cat"]
[null,"Zwitserland",null,null,"Cl"]
[null,"Oosterijk",null,null,"Cm"]
[null,"Polen",null,null,"Cv"]
[null,"Litouwen",null,null,"Ext"]
[null,"Estland",null,null,"G"]
[null,"Letland",null,null,"Ib"]
[null,"Denemarken",null,null,"Ic"]
[null,"Zweden",null,null,"Lr"]
[null,"Noorwegen",null,null,"M"]
[null,"Finland",null,null,"Mu"]
[null,"Roemenie",null,null,"Na"]
[null,"Kroatie",null,null,"Pw"]
[null,"Slovenie"]
[null,"Griekenland"]
[null,"Malta"]
[null,"Bulgarije"]

{"sheet":"Blad3","index":37,"n_rows":0,"n_cols":0,"rows_kept":0,"cut":false,"hidden":true,"merged":[]}