{"text_format":"1","workbook":"xlsx","n_sheets":7,"sheets":["Weekplanning","Verlof","Jaaroverzicht","Info uitzendburo","EMB weekplanning","EMB verlof","EMB jaaroverzicht"],"not_rendered":{"charts":0,"images":12,"macros":1,"external_links":0,"defined_names":11,"comments":0,"pivot_tables":0},"unopened":[],"bounds":{"document_bytes":16777216,"sheet_cells":100000,"rows_first":2000,"rows_last":500,"rows_between":2000,"halvings":0,"cell_chars":16384,"cell_head_chars":4096},"cells_cut":0,"cells_raw":0,"read":"whole","date_system":"1900"}

{"sheet":"Weekplanning","index":0,"n_rows":119,"n_cols":6,"rows_kept":119,"cut":false,"hidden":false,"merged":[]}
[null,null,null,"PLANNING","2019-12-20"]
[]
["Afdeling","Verlof","FTE"]
["AFV"]
[null,null,1]
[null,null,2]
[null,null,3]
[null,null,4]
[null,null,5]
[null,null,6]
[null,null,7]
[null,null,8]
["SCHM",null,"WERKTIIJDEN"]
[null,null,1]
[null,null,2]
[null,null,3]
[null,null,4]
[null,null,5]
[null,null,6]
[null,null,7]
[null,null,8]
["HAS",null,"WERKTIIJDEN"]
[null,null,1]
[null,null,2]
[null,null,3]
[null,null,4]
[null,null,5]
[null,null,6]
[null,null,7]
["LCR"]
[null,null,1]
[null,null,2]
[null,null,3]
[null,null,4]
[null,null,5]
[null,null,6]
[null,null,7]
["ABB"]
[null,null,1]
[null,null,2]
[null,null,3]
[null,null,4]
[null,null,5]
[null,null,6]
[null,null,7]
["MEP"]
[null,null,1]
[null,null,2]
[null,null,3]
[null,null,4]
[null,null,5]
[null,null,6]
[]
[]
[]
[]
[]
[]
[]
[]
[]
[]
[]
[]
[]
[]
[]
[]
[]
[]
[]
[]
[]
[]
[null,null,null,{"$f":"WEEKDAY(E75)","v":"1900-01-07"},"2019-11-30",{"$f":"\"Week nr.\" & WEEKNUM(E75)","v":"Week nr.48"}]
[null,null,null,"Vroeg","Laat","Nacht"]
[null,null,null,"06:00/14:45","14:45/23:30","22:00/06:45"]
[]
[]
[]
[]
[]
[]
[]
[]
[null,null,null,"06:00/14:45","14:45/23:30","22:00/06:45"]
[]
[]
[]
[]
[]
[]
[]
[]
[null,null,null,"06:00/14:45","13:45/22:30","22:00/06:45"]
[]
[]
[]
[]
[]
[]
[]
[null,null,null,"06:00/14:45","14:45/23:30","22:00/06:45"]
[]
[]
[]
[]
[]
[]
[]
[null,null,null,{"$f":"IF(WEEKDAY(E75)=7,\"08:00/21:00 \",IF(WEEKDAY(E75)=1,\"08:00/14:45\",\"06:00/14:45\"))","v":"08:00/21:00 "},{"$f":"IF(WEEKDAY(E75)=1,\"13:45/22:30\",\"14:45/23:30\")","v":"14:45/23:30"},{"$f":"IF(OR(WEEKDAY(E75)=7,WEEKDAY(E75)=1),\" \",\"22:00/06:45\")","v":" "}]
[]
[]
[]
[]
[]
[]
[]
[null,null,null,"06:00/14:45","14:45/23:30","22:00/06:45"]

{"sheet":"Verlof","index":1,"n_rows":234,"n_cols":6,"rows_kept":234,"cut":false,"hidden":false,"merged":[]}
["Weeknummer","Datum","Naam","Afdeling",null,"Goedgekeurd/ afgekeurd (reden)"]
[{"$f":"IF(B2<>\"\",WEEKNUM(B2),\"\")","v":3},"2020-01-12","Baki Achternaam2",{"$f":"IF(C2<>\"\",VLOOKUP(C2,verlof,2,0),\"\")","v":"AFV"},5]
[{"$f":"IF(B3<>\"\",WEEKNUM(B3),\"\")","v":3},"2020-01-12","Flavi Achternaam1",{"$f":"IF(C3<>\"\",VLOOKUP(C3,verlof,2,0),\"\")","v":"AFV"},3]
[{"$f":"IF(B4<>\"\",WEEKNUM(B4),\"\")","v":4},"2020-01-20","Baki Achternaam2",{"$f":"IF(C4<>\"\",VLOOKUP(C4,verlof,2,0),\"\")","v":"AFV"},2]
[{"$f":"IF(B5<>\"\",WEEKNUM(B5),\"\")","v":7},"2020-02-12","Baki Achternaam2",{"$f":"IF(C5<>\"\",VLOOKUP(C5,verlof,2,0),\"\")","v":"AFV"},6]
[{"$f":"IF(B6<>\"\",WEEKNUM(B6),\"\")","v":""},null,null,{"$f":"IF(C6<>\"\",VLOOKUP(C6,verlof,2,0),\"\")","v":""}]
[{"$f":"IF(B7<>\"\",WEEKNUM(B7),\"\")","v":""},null,null,{"$f":"IF(C7<>\"\",VLOOKUP(C7,verlof,2,0),\"\")","v":""}]
[{"$f":"IF(B8<>\"\",WEEKNUM(B8),\"\")","v":""},null,null,{"$f":"IF(C8<>\"\",VLOOKUP(C8,verlof,2,0),\"\")","v":""}]
[{"$f":"IF(B9<>\"\",WEEKNUM(B9),\"\")","v":""},null,null,{"$f":"IF(C9<>\"\",VLOOKUP(C9,verlof,2,0),\"\")","v":""}]
[{"$f":"IF(B10<>\"\",WEEKNUM(B10),\"\")","v":""},null,null,{"$f":"IF(C10<>\"\",VLOOKUP(C10,verlof,2,0),\"\")","v":""}]
[{"$f":"IF(B11<>\"\",WEEKNUM(B11),\"\")","v":""},null,null,{"$f":"IF(C11<>\"\",VLOOKUP(C11,verlof,2,0),\"\")","v":""}]
["",null,null,""]
["",null,null,""]
[""]
["",null,null,""]
["",null,null,""]
["",null,null,""]
["",null,null,""]
["",null,null,""]
["",null,null,""]
["",null,null,""]
["",null,null,""]
["",null,null,""]
["",null,null,""]
["",null,null,""]
["",null,null,""]
["",null,null,""]
["",null,null,""]
["",null,null,""]
["",null,null,""]
["",null,null,""]
["",null,null,""]
["",null,null,""]
["",null,null,""]
["",null,null,""]
["",null,null,""]
["",null,null,""]
["",null,null,""]
["",null,null,""]
["",null,null,""]
["",null,null,""]
["",null,null,""]
["",null,null,""]
["",null,null,""]
["",null,null,""]
["",null,null,""]
["",null,null,""]
["",null,null,""]
["",null,null,""]
["",null,null,""]
["",null,null,""]
["",null,null,""]
["",null,null,""]
["",null,null,""]
["",null,null,""]
["",null,null,""]
["",null,null,""]
["",null,null,""]
["",null,null,""]
["",null,null,""]
["",null,null,""]
[{"$f":"IF(B62<>\"\",WEEKNUM(B62),\"\")","v":""},null,null,""]
["",null,null,""]
["",null,null,""]
["",null,null,""]
["",null,null,{"$f":"IF(C66<>\"\",VLOOKUP(C66,verlof,2,0),\"\")","v":""}]
["",null,null,""]
["",null,null,""]
["",null,null,""]
["",null,null,""]
["",null,null,""]
["",null,null,""]
["",null,null,""]
["",null,null,""]
["",null,null,""]
["",null,null,""]
["",null,null,""]
["",null,null,""]
["",null,null,""]
["",null,null,""]
["",null,null,""]
["",null,null,""]
["",null,null,""]
["",null,null,""]
["",null,null,""]
["",null,null,""]
["",null,null,""]
["",null,null,""]
["",null,null,""]
["",null,null,""]
["",null,null,""]
["",null,null,""]
["",null,null,""]
["",null,null,""]
["",null,null,""]
["",null,null,""]
["",null,null,""]
["",null,null,""]
["",null,null,""]
["",null,null,""]
["",null,null,""]
["",null,null,""]
["",null,null,""]
["",null,null,""]
["",null,null,""]
["",null,null,""]
["",null,null,""]
["",null,null,""]
["",null,null,""]
["",null,null,""]
["",null,null,""]
["",null,null,""]
["",null,null,""]
["",null,null,""]
["",null,null,""]
["",null,null,""]
["",null,null,""]
["",null,null,""]
["",null,null,""]
["",null,null,""]
["",null,null,""]
["",null,null,""]
["",null,null,""]
["",null,null,""]
["",null,null,""]
[{"$f":"IF(B126<>\"\",WEEKNUM(B126),\"\")","v":""},null,null,""]
["",null,null,""]
["",null,null,""]
["",null,null,""]
["",null,null,{"$f":"IF(C130<>\"\",VLOOKUP(C130,verlof,2,0),\"\")","v":""}]
["",null,null,""]
["",null,null,""]
["",null,null,""]
["",null,null,""]
["",null,null,""]
["",null,null,""]
["",null,null,""]
["",null,null,""]
["",null,null,""]
["",null,null,""]
["",null,null,""]
["",null,null,""]
["",null,null,""]
["",null,null,""]
["",null,null,""]
["",null,null,""]
["",null,null,""]
["",null,null,""]
["",null,null,""]
["",null,null,""]
["",null,null,""]
["",null,null,""]
["",null,null,""]
["",null,null,""]
["",null,null,""]
["",null,null,""]
["",null,null,""]
["",null,null,""]
["",null,null,""]
["",null,null,""]
["",null,null,""]
["",null,null,""]
["",null,null,""]
["",null,null,""]
["",null,null,""]
["",null,null,""]
["",null,null,""]
["",null,null,""]
["",null,null,""]
["",null,null,""]
["",null,null,""]
["",null,null,""]
["",null,null,""]
["",null,null,""]
["",null,null,""]
["",null,null,""]
["",null,null,""]
["",null,null,""]
["",null,null,""]
["",null,null,""]
["",null,null,""]
["",null,null,""]
["",null,null,""]
["",null,null,""]
["",null,null,""]
["",null,null,""]
["",null,null,""]
["",null,null,""]
["",null,null,""]
[{"$f":"IF(B190<>\"\",WEEKNUM(B190),\"\")","v":""},null,null,""]
["",null,null,""]
["",null,null,""]
["",null,null,""]
["",null,null,{"$f":"IF(C194<>\"\",VLOOKUP(C194,verlof,2,0),\"\")","v":""}]
["",null,null,""]
["",null,null,""]
["",null,null,""]
["",null,null,""]
["",null,null,""]
["",null,null,""]
["",null,null,""]
["",null,null,""]
["",null,null,""]
["",null,null,""]
["",null,null,""]
["",null,null,""]
["",null,null,""]
["",null,null,""]
["",null,null,""]
["",null,null,""]
["",null,null,""]
["",null,null,""]
["",null,null,""]
["",null,null,""]
["",null,null,""]
["",null,null,""]
["",null,null,""]
["",null,null,""]
["",null,null,""]
["",null,null,""]
["",null,null,""]
["",null,null,""]
["",null,null,""]
["",null,null,""]
["",null,null,""]
["",null,null,""]
["",null,null,""]
["",null,null,""]
["",null,null,""]
["",null,null,""]
["",null,null,""]
["",null,null,""]
["",null,null,""]
["",null,null,""]

{"sheet":"Jaaroverzicht","index":2,"n_rows":52,"n_cols":24,"rows_kept":52,"cut":false,"hidden":false,"merged":[]}
[null,null,null,"JAARPLANNING"]
[null,null,null,{"$f":"WEEKDAY(E2)","v":"1900-01-01"},"2019-12-01",{"$f":"\"Week nr.\" & WEEKNUM(E2)","v":"Week nr.49"},{"$f":"WEEKDAY(H2)","v":"1900-01-02"},"2019-12-02",{"$f":"\"Week nr.\" & WEEKNUM(H2)","v":"Week nr.49"},{"$f":"WEEKDAY(K2)","v":"1900-01-03"},"2019-12-03",{"$f":"\"Week nr.\" & WEEKNUM(K2)","v":"Week nr.49"},{"$f":"WEEKDAY(N2)","v":"1900-01-04"},"2019-12-04",{"$f":"\"Week nr.\" & WEEKNUM(N2)","v":"Week nr.49"},{"$f":"WEEKDAY(Q2)","v":"1900-01-05"},"2019-12-05",{"$f":"\"Week nr.\" & WEEKNUM(Q2)","v":"Week nr.49"},{"$f":"WEEKDAY(T2)","v":"1900-01-06"},"2019-12-06",{"$f":"\"Week nr.\" & WEEKNUM(T2)","v":"Week nr.49"},{"$f":"WEEKDAY(W2)","v":"1900-01-07"},"2019-12-07",{"$f":"\"Week nr.\" & WEEKNUM(W2)","v":"Week nr.49"}]
["Afdeling","Verlof","FTE","Vroeg","Laat","Nacht","Vroeg","Laat","Nacht","Vroeg","Laat","Nacht","Vroeg","Laat","Nacht","Vroeg","Laat","Nacht","Vroeg","Laat","Nacht","Vroeg","Laat","Nacht"]
["AFV",null,null,"06:00/14:45","14:45/23:30","22:00/06:45","06:00/14:45","14:45/23:30","22:00/06:45","06:00/14:45","14:45/23:30","22:00/06:45","06:00/14:45","14:45/23:30","22:00/06:45","06:00/14:45","14:45/23:30","22:00/06:45","06:00/14:45","14:45/23:30","22:00/06:45","06:00/14:45","14:45/23:30","22:00/06:45"]
[null,null,1,null,null,null,"Baki Achternaam2","Jan Achternaam79",null,"Baki Achternaam2","Jan Achternaam79",null,"Baki Achternaam2","Jan Achternaam79",null,"Baki Achternaam2","Jan Achternaam79",null,"Baki Achternaam2","Jan Achternaam79"]
[null,null,2,null,null,null,"Ilker Achternaam38","Boyan Achternaam80",null,"Ilker Achternaam38","Boyan Achternaam80",null,"Ilker Achternaam38","Boyan Achternaam80",null,"Ilker Achternaam38","Boyan Achternaam80",null,"Ilker Achternaam38","Boyan Achternaam80"]
[null,null,3,null,null,null,"Miquel Achternaam39","Sami Achternaam81",null,"Miquel Achternaam39","Sami Achternaam81",null,"Miquel Achternaam39","Sami Achternaam81",null,"Miquel Achternaam39","Sami Achternaam81",null,"Miquel Achternaam39","Sami Achternaam81"]
[null,null,4,null,null,null,null,"Henri Achternaam82",null,"Klaas Achternaam40","Henri Achternaam82",null,"Klaas Achternaam40","Henri Achternaam82",null,"Klaas Achternaam40","Henri Achternaam82",null,"Klaas Achternaam40","Henri Achternaam82"]
[null,null,5,null,null,null,null,"Michel Achternaam83",null,null,"Michel Achternaam83",null,null,"Michel Achternaam83",null,null,"Michel Achternaam83",null,null,"Michel Achternaam83"]
[null,null,6]
[null,null,7]
[null,null,8]
["SCHM",null,"WERKTIIJDEN","06:00/14:45","14:45/23:30","22:00/06:45","06:00/14:45","14:45/23:30","22:00/06:45","06:00/14:45","14:45/23:30","22:00/06:45","06:00/14:45","14:45/23:30","22:00/06:45","06:00/14:45","14:45/23:30","22:00/06:45","06:00/14:45","14:45/23:30","22:00/06:45","06:00/14:45","14:45/23:30","22:00/06:45"]
[null,null,1,null,null,"Rolinka Achternaam3","Rachid Achternaam34","Marjolein Achternaam76","Patrick Achternaam88","Rachid Achternaam34","Marjolein Achternaam76","Patrick Achternaam88","Rachid Achternaam34","Marjolein Achternaam76","Patrick Achternaam88","Rachid Achternaam34","Roy Achternaam77","Patrick Achternaam88","Rachid Achternaam34","Roy Achternaam77"]
[null,null,2,null,null,"Erik Achternaam4","Evans Achternaam35","Roy Achternaam77","Rolinka Achternaam3","Evans Achternaam35","Roy Achternaam77","Rolinka Achternaam3","Evans Achternaam35","Roy Achternaam77","Rolinka Achternaam3","Evans Achternaam35",null,"Rolinka Achternaam3","Evans Achternaam35","Piet Achternaam78"]
[null,null,3,null,null,null,"Kevin Achternaam36","Piet Achternaam78","Erik Achternaam4","Kevin Achternaam36","Piet Achternaam78","Erik Achternaam4","Kevin Achternaam36","Piet Achternaam78","Erik Achternaam4","Kevin Achternaam36",null,"Erik Achternaam4","Kevin Achternaam36"]
[null,null,4]
[null,null,5]
[null,null,6]
[null,null,7]
[null,null,8]
["HAS",null,"WERKTIIJDEN","06:00/14:45","13:45/22:30","22:00/06:45","06:00/14:45","13:45/22:30","22:00/06:45","06:00/14:45","13:45/22:30","22:00/06:45","06:00/14:45","13:45/22:30","22:00/06:45","06:00/14:45","13:45/22:30","22:00/06:45","06:00/14:45","13:45/22:30","22:00/06:45","06:00/14:45","13:45/22:30","22:00/06:45"]
[null,null,1,null,null,null,"Norbert Achternaam6","Paul Achternaam49",null,"Norbert Achternaam6","Paul Achternaam49",null,"Norbert Achternaam6","Paul Achternaam49",null,"Norbert Achternaam6","Paul Achternaam49",null,"Norbert Achternaam6","Paul Achternaam49"]
[null,null,2,null,null,null,"Norbert Achternaam6","Paul Achternaam49",null,"Norbert Achternaam6","Paul Achternaam49",null,"Norbert Achternaam6","Paul Achternaam49",null,"Norbert Achternaam6","Paul Achternaam49",null,"Norbert Achternaam6","Paul Achternaam49"]
[null,null,3]
[null,null,4]
[null,null,5]
[null,null,6]
[null,null,7]
["LCR",null,null,"06:00/14:45","14:45/23:30","22:00/06:45","06:00/14:45","14:45/23:30","22:00/06:45","06:00/14:45","14:45/23:30","22:00/06:45","06:00/14:45","14:45/23:30","22:00/06:45","06:00/14:45","14:45/23:30","22:00/06:45","06:00/14:45","14:45/23:30","22:00/06:45","06:00/14:45","14:45/23:30","22:00/06:45"]
[null,null,1,null,null,null,"Wolter Achternaam8","Christiaan Achternaam51",null,"Wolter Achternaam8","Christiaan Achternaam51",null,"Wolter Achternaam8","Christiaan Achternaam51",null,"Wolter Achternaam8","Christiaan Achternaam51",null,"Wolter Achternaam8","Christiaan Achternaam51"]
[null,null,2]
[null,null,3]
[null,null,4]
[null,null,5]
[null,null,6]
[null,null,7]
["ABB",null,null,{"$f":"IF(WEEKDAY(E2)=7,\"08:00/21:00 \",IF(WEEKDAY(E2)=1,\"08:00/14:45\",\"06:00/14:45\"))","v":"08:00/14:45"},{"$f":"IF(WEEKDAY(E2)=1,\"13:45/22:30\",\"14:45/23:30\")","v":"13:45/22:30"},{"$f":"IF(OR(WEEKDAY(E2)=7,WEEKDAY(E2)=1),\" \",\"22:00/06:45\")","v":" "},{"$f":"IF(WEEKDAY(H2)=7,\"08:00/21:00 \",IF(WEEKDAY(H2)=1,\"08:00/14:45\",\"06:00/14:45\"))","v":"06:00/14:45"},{"$f":"IF(WEEKDAY(H2)=1,\"13:45/22:30\",\"14:45/23:30\")","v":"14:45/23:30"},{"$f":"IF(OR(WEEKDAY(H2)=7,WEEKDAY(H2)=1),\" \",\"22:00/06:45\")","v":"22:00/06:45"},{"$f":"IF(WEEKDAY(K2)=7,\"08:00/21:00 \",IF(WEEKDAY(K2)=1,\"08:00/14:45\",\"06:00/14:45\"))","v":"06:00/14:45"},{"$f":"IF(WEEKDAY(K2)=1,\"13:45/22:30\",\"14:45/23:30\")","v":"14:45/23:30"},{"$f":"IF(OR(WEEKDAY(K2)=7,WEEKDAY(K2)=1),\" \",\"22:00/06:45\")","v":"22:00/06:45"},{"$f":"IF(WEEKDAY(N2)=7,\"08:00/21:00 \",IF(WEEKDAY(N2)=1,\"08:00/14:45\",\"06:00/14:45\"))","v":"06:00/14:45"},{"$f":"IF(WEEKDAY(N2)=1,\"13:45/22:30\",\"14:45/23:30\")","v":"14:45/23:30"},{"$f":"IF(OR(WEEKDAY(N2)=7,WEEKDAY(N2)=1),\" \",\"22:00/06:45\")","v":"22:00/06:45"},{"$f":"IF(WEEKDAY(Q2)=7,\"08:00/21:00 \",IF(WEEKDAY(Q2)=1,\"08:00/14:45\",\"06:00/14:45\"))","v":"06:00/14:45"},{"$f":"IF(WEEKDAY(Q2)=1,\"13:45/22:30\",\"14:45/23:30\")","v":"14:45/23:30"},{"$f":"IF(OR(WEEKDAY(Q2)=7,WEEKDAY(Q2)=1),\" \",\"22:00/06:45\")","v":"22:00/06:45"},{"$f":"IF(WEEKDAY(T2)=7,\"08:00/21:00 \",IF(WEEKDAY(T2)=1,\"08:00/14:45\",\"06:00/14:45\"))","v":"06:00/14:45"},{"$f":"IF(WEEKDAY(T2)=1,\"13:45/22:30\",\"14:45/23:30\")","v":"14:45/23:30"},{"$f":"IF(OR(WEEKDAY(T2)=7,WEEKDAY(T2)=1),\" \",\"22:00/06:45\")","v":"22:00/06:45"},{"$f":"IF(WEEKDAY(W2)=7,\"08:00/21:00 \",IF(WEEKDAY(W2)=1,\"08:00/14:45\",\"06:00/14:45\"))","v":"08:00/21:00 "},{"$f":"IF(WEEKDAY(W2)=1,\"13:45/22:30\",\"14:45/23:30\")","v":"14:45/23:30"},{"$f":"IF(OR(WEEKDAY(W2)=7,WEEKDAY(W2)=1),\" \",\"22:00/06:45\")","v":" "}]
[null,"Flavi Achternaam1",1,"Flavi Achternaam1","Baki Achternaam2",null,"Flavi Achternaam1","Trienko Achternaam48",null,"Flavi Achternaam1","Trienko Achternaam48",null,"Flavi Achternaam1","Trienko Achternaam48",null,"Flavi Achternaam1","Trienko Achternaam48",null,"Flavi Achternaam1","Trienko Achternaam48",null,"Arkan Achternaam455"]
[null,null,2]
[null,null,3]
[null,null,4]
[null,null,5]
[null,null,6]
[null,null,7]
["MEP",null,null,"06:00/14:45","14:45/23:30","22:00/06:45","06:00/14:45","14:45/23:30","22:00/06:45","06:00/14:45","14:45/23:30","22:00/06:45","06:00/14:45","14:45/23:30","22:00/06:45","06:00/14:45","14:45/23:30","22:00/06:45","06:00/14:45","14:45/23:30","22:00/06:45","06:00/14:45","14:45/23:30","22:00/06:45"]
[null,null,1,null,null,null,"Houcin Achternaam7","Rijk Achternaam50",null,"Houcin Achternaam7","Rijk Achternaam50",null,"Houcin Achternaam7","Rijk Achternaam50",null,"Houcin Achternaam7","Rijk Achternaam50",null,"Houcin Achternaam7","Rijk Achternaam50"]
[null,null,2,null,null,null,"Rudolf Achternaam44",null,null,"Rudolf Achternaam44",null,null,"Rudolf Achternaam44",null,null,"Rudolf Achternaam44",null,null,"Rudolf Achternaam44"]
[null,null,3]
[null,null,4]
[null,null,5]
[null,null,6]

{"sheet":"Info uitzendburo","index":3,"n_rows":484,"n_cols":24,"rows_kept":484,"cut":false,"hidden":false,"merged":[]}
[1,"Functie","Starttijd","Eindtijd","Voornaam","Achternaam",null,null,null,null,"Mijn afdelingen","Planning afdeling ",null,"NIET mijn afdelingen",null,null,null,null,"personeel",null,null,null,"personeel EMB"]
["2019-12-08","ABBweekenddienst",43807.333333333336,43807.614583333336,"Baki","Achternaam2",null,null,null,null,"ABBweekenddienst","ABB",null,"PALL HAS",null,null,null,null,"Baki Achternaam2","AFV",null,null,"Henk Achternaam886","TRSP"]
["2019-12-08","ABBmiddag",43807.572916666664,43807.9375,"Flavi","Achternaam1",null,null,null,null,"ABBmiddag","ABB",null,"PALL MEP",null,null,null,null,"Flavi Achternaam1","AFV",null,null,"Wenaron Achternaam847","PALME"]
["2019-12-08","SCHM",43807.999305555553,43808.364583333336,"Rachid","Achternaam34",null,null,null,null,"ABBochtend","ABB",null,"PALL Rweg",null,null,null,null,"Rachid Achternaam34","SCHM",null,null,"Salahadin Achternaam848","PALME"]
["2019-12-08","SCHM",43807.999305555553,43808.364583333336,"Evans","Achternaam35",null,null,null,null,null,null,null,"Reserve ochtend",null,null,null,null,"Evans Achternaam35","SCHM",null,null,"Dikkie Achternaam849","PALME"]
["2019-12-08","SCHM",43807.999305555553,43808.364583333336,"Kevin","Achternaam36",null,null,null,null,"AFVMEP","MEP",null,"Reserve middag",null,null,null,null,"Kevin Achternaam36","SCHM",null,null,"Rene Achternaam850","PALME"]
["2019-12-09","ABBochtend",43808.25,43808.614583333336,"Trienko","Achternaam48",null,null,null,null,null,null,null,null,null,null,null,null,"Trienko Achternaam48","ABB",null,null,"Richard Achternaam851","PALME"]
["2019-12-09","AFVHAS",43808.25,43808.40625,"Paul","Achternaam49",null,null,null,null,"SCHMAFV","AFV",null,null,null,null,null,null,"Paul Achternaam49","AFV",null,null,"Felicia Achternaam852","PALRW"]
["2019-12-09","AFVMEP",43808.25,43808.614583333336,"Rudolf","Achternaam44",null,null,null,null,null,null,null,null,null,null,null,null,"Rudolf Achternaam44","MEP",null,null,"Shawn Achternaam854","PALRW"]
["2019-12-09","LCRochtend",43808.25,43808.614583333336,"Sami","Achternaam81",null,null,null,null,"SCHM","SCHM",null,"In de planning ",null,null,null,null,"Sami Achternaam81","LCR",null,null,"Elroy Achternaam855","PALRW"]
["2019-12-09","LCRochtend",43808.25,43808.614583333336,"Wolter","Achternaam8",null,null,null,null,null,null,null,"06:00/14:45","14:45/23:30",null,null,null,"Wolter Achternaam8","LCR",null,null,"Swen Achternaam869","PALRW"]
["2019-12-09","PALLHAS",43808.25,43808.614583333336,"Henk","Achternaam466",null,null,null,null,"AFVHAS","HAS",null,"Voornaam + achternaam","Voornaam + achternaam",null,null,null,"Marjolein Achternaam76","SCHM",null,null,"Arsenio Achternaam856","PALRW"]
["2019-12-09","PALLMEP",43808.25,43808.614583333336,"Wenaron","Achternaam467",null,null,null,null,"SCHMHAS","HAS",null,null,null,null,null,null,"Piet Achternaam78","SCHM",null,null,"Viorel Achternaam857","PALRW"]
["2019-12-09","PALLMEP",43808.25,43808.614583333336,"Salahadin","Achternaam468",null,null,null,null,null,null,null,null,null,null,null,null,"Roy Achternaam77","SCHM",null,null,"Olcay Achternaam874","RESER"]
["2019-12-09","PALLMEP",43808.25,43808.614583333336,"Dikkie","Achternaam469",null,null,null,null,"LCRmiddag","LCR",null,null,null,null,null,null,"Christiaan Achternaam51","AFV",null,null,"Sebastiaan Achternaam858","PALRW"]
["2019-12-09","PALLMEP",43808.25,43808.614583333336,"Rene","Achternaam470",null,null,null,null,"LCRochtend","LCR",null,null,null,null,null,null,"Henri Achternaam82","AFV",null,null,"Amadou Achternaam859","PALRW"]
["2019-12-09","PALLMEP",43808.25,43808.614583333336,"Richard","Achternaam471",null,null,null,null,null,null,null,null,null,null,null,null,"Jan Achternaam79","AFV",null,null,"Wout Achternaam860","PALRW"]
["2019-12-09","PALLRweg",43808.25,43808.614583333336,"Felicia","Achternaam472",null,null,null,null,null,null,null,null,null,null,null,null,"Boyan Achternaam80","AFV",null,null,"Fars Achternaam861","PALRW"]
["2019-12-09","PALLRweg",43808.25,43808.614583333336,"Shawn","Achternaam473",null,null,null,null,null,null,null,null,null,null,null,null,"Michel Achternaam83","AFV",null,null,"Magdalena Achternaam862","PALRW"]
["2019-12-09","PALLRweg",43808.25,43808.614583333336,"Elroy","Achternaam474",null,null,null,null,null,null,null,null,null,null,null,null,"Rijk Achternaam50","MEP",null,null,"Charles Achternaam863","PALRW"]
["2019-12-09","PALLRweg",43808.25,43808.614583333336,"Swen","Achternaam475",null,null,null,"Overige afdelingen EMB",null,null,null,null,null,null,null,null,"Bile Achternaam508","ABB",null,null,"Ko Achternaam864","PALRW"]
["2019-12-09","PALLRweg",43808.25,43808.614583333336,"Arsenio","Achternaam476",null,null,null,null,"TeamleiderPALL","TLPALL",null,null,null,null,null,null,"Norbert Achternaam6","HAS",null,null,"Gerrit Achternaam866","PALRW"]
["2019-12-09","PALLRweg",43808.25,43808.614583333336,"Viorel","Achternaam477",null,null,null,null,"PALLMEP","PALME",null,null,null,null,null,null,"Houcin Achternaam7","MEP",null,null,"Everon Achternaam867","PALRW"]
["2019-12-09","PALLRweg",43808.25,43808.614583333336,"Olcay","Achternaam478",null,null,null,null,"PALLRweg","PALRW",null,null,null,null,null,null,"Klaas Achternaam40","LCR",null,null,"Davood Achternaam868","PALRW"]
["2019-12-09","PALLRweg",43808.25,43808.614583333336,"Sebastiaan","Achternaam479",null,null,null,null,"TRSP","TRSP",null,null,null,null,null,null,"Erik Achternaam4","SCHM",null,null,"Saidou Achternaam870","PALRW"]
["2019-12-09","PALLRweg",43808.25,43808.614583333336,"Amadou","Achternaam480",null,null,null,null,"PALLHAS","PALHAS",null,null,null,null,null,null,"Patrick Achternaam88","SCHM",null,null,"Wim Achternaam871","PALRW"]
["2019-12-09","PALLRweg",43808.25,43808.614583333336,"Wout","Achternaam481",null,null,null,null,"HeftruckMEP","HTMEP",null,null,null,null,null,null,"Rolinka Achternaam3","SCHM",null,null,"Quincy Achternaam872","PALRW"]
["2019-12-09","PALLRweg",43808.25,43808.614583333336,"Fars","Achternaam482",null,null,null,null,"HeftruckHAS","HTHAS",null,null,null,null,null,null,"Miquel Achternaam39","AFV",null,null,"Robin Achternaam865","PALRW"]
["2019-12-09","PALLRweg",43808.25,43808.614583333336,"Magdalena","Achternaam483",null,null,null,null,"Reserveochtend","RESER",null,null,null,null,null,null,"Sebastiaan Achternaam41","AFV",null,null,"Anton Achternaam885","TRSP"]
["2019-12-09","PALLRweg",43808.25,43808.614583333336,"Charles","Achternaam484",null,null,null,null,"Reservemiddag","RESER",null,null,null,null,null,null,"Ilker Achternaam38","AFV",null,null,"Hilko Achternaam888","TLPALL"]
["2019-12-09","PALLRweg",43808.25,43808.614583333336,"Ko","Achternaam485",null,null,null,null,null,null,null,null,null,null,null,null,"Niek Achternaam937","ABB",null,null,"Harrie Achternaam889","TRSP"]
["2019-12-09","PALLRweg",43808.25,43808.614583333336,"Gerrit","Achternaam486",null,null,null,null,null,null,null,null,null,null,null,null,null,null,null,null,"Latie Achternaam895","PALME"]
["2019-12-09","PALLRweg",43808.25,43808.614583333336,"Everon","Achternaam487",null,null,null,null,null,null,null,null,null,null,null,null,null,null,null,null,"Abdurahman Ibrahim Achternaam896","PALME"]
["2019-12-09","PALLRweg",43808.25,43808.614583333336,"Davood","Achternaam488",null,null,null,null,null,null,null,null,null,null,null,null,null,null,null,null,"Michael Achternaam897","PALME"]
["2019-12-09","PALLRweg",43808.25,43808.614583333336,"Saidou","Achternaam489",null,null,null,null,null,null,null,null,null,null,null,null,null,null,null,null,"Hans Achternaam898","PALME"]
["2019-12-09","PALLRweg",43808.25,43808.614583333336,"Wim","Achternaam490",null,null,null,null,null,null,null,null,null,null,null,null,null,null,null,null,"Jeroen Achternaam899","PALME"]
["2019-12-09","PALLRweg",43808.25,43808.614583333336,"Quincy","Achternaam491",null,null,null,null,null,null,null,null,null,null,null,null,null,null,null,null,"Akela Achternaam900","PALRW"]
["2019-12-09","PALLRweg",43808.25,43808.614583333336,"Henk","Achternaam492",null,null,null,null,null,null,null,null,null,null,null,null,null,null,null,null,"Karrar Achternaam901","PALRW"]
["2019-12-09","Reserveochtend",43808.25,43808.614583333336,"Robin","Achternaam493",null,null,null,null,null,null,null,null,null,null,null,null,null,null,null,null,"Sebastian Achternaam902","PALRW"]
["2019-12-09","SCHM",43808.25,43808.614583333336,"Marjolein","Achternaam76",null,null,null,null,null,null,null,null,null,null,null,null,null,null,null,null,"Harry Achternaam903","PALRW"]
["2019-12-09","SCHM",43808.25,43808.614583333336,"Piet","Achternaam78",null,null,null,null,null,null,null,null,null,null,null,null,null,null,null,null,"Apollonia Achternaam904","PALRW"]
["2019-12-09","SCHM",43808.25,43808.614583333336,"Roy","Achternaam77",null,null,null,null,null,null,null,null,null,null,null,null,null,null,null,null,"Agathe Achternaam906","PALRW"]
["2019-12-09","SCHMAFV",43808.25,43808.614583333336,"Christiaan","Achternaam51",null,null,null,null,null,null,null,null,null,null,null,null,null,null,null,null,"Heruy Achternaam908","PALRW"]
["2019-12-09","SCHMAFV",43808.25,43808.614583333336,"Henri","Achternaam82",null,null,null,null,null,null,null,null,null,null,null,null,null,null,null,null,"Hassan Achternaam909","PALRW"]
["2019-12-09","SCHMAFV",43808.25,43808.614583333336,"Jan","Achternaam79",null,null,null,null,null,null,null,null,null,null,null,null,null,null,null,null,"Samantha Achternaam910","PALRW"]
["2019-12-09","SCHMAFV",43808.25,43808.614583333336,"Boyan","Achternaam80",null,null,null,null,null,null,null,null,null,null,null,null,null,null,null,null,"Sied Achternaam911","PALRW"]
["2019-12-09","SCHMAFV",43808.25,43808.614583333336,"Michel","Achternaam83",null,null,null,null,null,null,null,null,null,null,null,null,null,null,null,null,"Laszlo Achternaam912","PALRW"]
["2019-12-09","TRSP",43808.25,43808.614583333336,"Anton","Achternaam502",null,null,null,null,null,null,null,null,null,null,null,null,null,null,null,null,"Atobhran Achternaam913","PALRW"]
["2019-12-09","TRSP",43808.25,43808.614583333336,"Henk","Achternaam503",null,null,null,null,null,null,null,null,null,null,null,null,null,null,null,null,"Abdul Achternaam914","PALRW"]
["2019-12-09","AFVMEP",43808.291666666664,43808.65625,"Rijk","Achternaam50",null,null,null,null,null,null,null,null,null,null,null,null,null,null,null,null,"Naoufel Achternaam915","PALRW"]
["2019-12-09","TeamleiderPALL",43808.3125,43808.677083333336,"Hilko","Achternaam505",null,null,null,null,null,null,null,null,null,null,null,null,null,null,null,null,"Niek Achternaam724","PALRW"]
["2019-12-09","TRSP",43808.333333333336,43808.697916666664,"Harrie","Achternaam506",null,null,null,null,null,null,null,null,null,null,null,null,null,null,null,null,"Jarek Achternaam916","PALRW"]
["2019-12-09","SCHMHAS",43808.40625,43808.614583333336,"Paul","Achternaam49",null,null,null,null,null,null,null,null,null,null,null,null,null,null,null,null,"Martijn Achternaam917","PALRW"]
["2019-12-09","ABBmiddag",43808.572916666664,43808.9375,"Bile","Achternaam508",null,null,null,null,null,null,null,null,null,null,null,null,null,null,null,null,"Mark Achternaam918","PALRW"]
["2019-12-09","ABBmiddag",43808.572916666664,43808.9375,"Flavi","Achternaam1",null,null,null,null,null,null,null,null,null,null,null,null,null,null,null,null,"Abdiqadir Achternaam919","PALRW"]
["2019-12-09","AFVHAS",43808.572916666664,43808.697916666664,"Norbert","Achternaam6",null,null,null,null,null,null,null,null,null,null,null,null,null,null,null,null,"Nexhmedi Achternaam920","PALRW"]
["2019-12-09","AFVMEP",43808.572916666664,43808.9375,"Houcin","Achternaam7",null,null,null,null,null,null,null,null,null,null,null,null,null,null,null,null,"Emsud Achternaam930","TRSP"]
["2019-12-09","LCRmiddag",43808.572916666664,43808.9375,"Klaas","Achternaam40",null,null,null,null,null,null,null,null,null,null,null,null,null,null,null,null,"Reinder Achternaam931","TRSP"]
["2019-12-09","PALLMEP",43808.614583333336,43808.979166666664,"Latie","Achternaam513",null,null,null,null,null,null,null,null,null,null,null,null,null,null,null,null,"Amanuel Achternaam932","PALRW"]
["2019-12-09","PALLMEP",43808.614583333336,43808.979166666664,"Abdurahman Ibrahim","Achternaam514",null,null,null,null,null,null,null,null,null,null,null,null,null,null,null,null,"Gebrehiwet Achternaam734","RESER"]
["2019-12-09","PALLMEP",43808.614583333336,43808.979166666664,"Michael","Achternaam515",null,null,null,null,null,null,null,null,null,null,null,null,null,null,null,null,"Bereket Achternaam933","RESER"]
["2019-12-09","PALLMEP",43808.614583333336,43808.979166666664,"Hans","Achternaam516",null,null,null,null,null,null,null,null,null,null,null,null,null,null,null,null,"Chevindio Achternaam804","PALRW"]
["2019-12-09","PALLMEP",43808.614583333336,43808.979166666664,"Jeroen","Achternaam517",null,null,null,null,null,null,null,null,null,null,null,null,null,null,null,null,"Dennis Achternaam905","PALRW"]
["2019-12-09","PALLRweg",43808.614583333336,43808.979166666664,"Akela","Achternaam518",null,null,null,null,null,null,null,null,null,null,null,null,null,null,null,null,"Haben Achternaam805","PALRW"]
["2019-12-09","PALLRweg",43808.614583333336,43808.979166666664,"Karrar","Achternaam519",null,null,null,null,null,null,null,null,null,null,null,null,null,null,null,null,"Robel Achternaam935","RESER"]
["2019-12-09","PALLRweg",43808.614583333336,43808.979166666664,"Sebastian","Achternaam520",null,null,null,null,null,null,null,null,null,null,null,null,null,null,null,null,"Daniel Achternaam876","RESER"]
["2019-12-09","PALLRweg",43808.614583333336,43808.979166666664,"Harry","Achternaam521",null,null,null,null,null,null,null,null,null,null,null,null,null,null,null,null,"Mebrathu Achternaam875","RESER"]
["2019-12-09","PALLRweg",43808.614583333336,43808.979166666664,"Apollonia","Achternaam522",null,null,null,null,null,null,null,null,null,null,null,null,null,null,null,null,"Jelte Achternaam853","PALRW"]
["2019-12-09","PALLRweg",43808.614583333336,43808.979166666664,"Agathe","Achternaam523",null,null,null,null,null,null,null,null,null,null,null,null,null,null,null,null,"Ambroise Achternaam720","PALRW"]
["2019-12-09","PALLRweg",43808.614583333336,43808.979166666664,"Heruy","Achternaam524",null,null,null,null,null,null,null,null,null,null,null,null,null,null,null,null,"Tomas Achternaam810","PALRW"]
["2019-12-09","PALLRweg",43808.614583333336,43808.979166666664,"Hassan","Achternaam525",null,null,null,null,null,null,null,null,null,null,null,null,null,null,null,null,"Tesfaldet Achternaam732","RESER"]
["2019-12-09","PALLRweg",43808.614583333336,43808.979166666664,"Samantha","Achternaam526",null,null,null,null,null,null,null,null,null,null,null,null,null,null,null,null,"Hagos Achternaam907","PALRW"]
["2019-12-09","PALLRweg",43808.614583333336,43808.979166666664,"Sied","Achternaam527"]
["2019-12-09","PALLRweg",43808.614583333336,43808.979166666664,"Laszlo","Achternaam528"]
["2019-12-09","PALLRweg",43808.614583333336,43808.979166666664,"Atobhran","Achternaam529"]
["2019-12-09","PALLRweg",43808.614583333336,43808.979166666664,"Abdul","Achternaam530"]
["2019-12-09","PALLRweg",43808.614583333336,43808.979166666664,"Naoufel","Achternaam531"]
["2019-12-09","PALLRweg",43808.614583333336,43808.979166666664,"Niek","Achternaam532"]
["2019-12-09","PALLRweg",43808.614583333336,43808.979166666664,"Jarek","Achternaam533"]
["2019-12-09","PALLRweg",43808.614583333336,43808.979166666664,"Martijn","Achternaam534"]
["2019-12-09","PALLRweg",43808.614583333336,43808.979166666664,"Mark","Achternaam535"]
["2019-12-09","PALLRweg",43808.614583333336,43808.979166666664,"Abdiqadir","Achternaam536"]
["2019-12-09","PALLRweg",43808.614583333336,43808.979166666664,"Nexhmedi","Achternaam537"]
["2019-12-09","SCHM",43808.614583333336,43808.979166666664,"Erik","Achternaam4"]
["2019-12-09","SCHM",43808.614583333336,43808.979166666664,"Patrick","Achternaam88"]
["2019-12-09","SCHM",43808.614583333336,43808.979166666664,"Rolinka","Achternaam3"]
["2019-12-09","SCHMAFV",43808.614583333336,43808.979166666664,"Miquel","Achternaam39"]
["2019-12-09","SCHMAFV",43808.614583333336,43808.979166666664,"Paul","Achternaam49"]
["2019-12-09","SCHMAFV",43808.614583333336,43808.979166666664,"Sebastiaan","Achternaam41"]
["2019-12-09","SCHMAFV",43808.614583333336,43808.979166666664,"Baki","Achternaam2"]
["2019-12-09","SCHMAFV",43808.614583333336,43808.979166666664,"Ilker","Achternaam38"]
["2019-12-09","TRSP",43808.614583333336,43808.979166666664,"Emsud","Achternaam546"]
["2019-12-09","TRSP",43808.614583333336,43808.979166666664,"Reinder","Achternaam547"]
["2019-12-09","PALLRweg",43808.645833333336,43808.979166666664,"Amanuel","Achternaam548"]
["2019-12-09","PALLRweg",43808.666666666664,43808.979166666664,"Gebrehiwet","Achternaam549"]
["2019-12-09","Reservemiddag",43808.666666666664,43808.979166666664,"Bereket","Achternaam550"]
["2019-12-09","LCH",43808.697916666664,43808.9375,"Norbert","Achternaam6"]
["2019-12-09","SCHM",43808.916666666664,43809.28125,"Rachid","Achternaam34"]
["2019-12-09","SCHM",43808.916666666664,43809.28125,"Evans","Achternaam35"]
["2019-12-09","SCHM",43808.916666666664,43809.28125,"Kevin","Achternaam36"]
["2019-12-10","ABBochtend",43809.25,43809.614583333336,"Trienko","Achternaam48"]
["2019-12-10","AFVHAS",43809.25,43809.40625,"Paul","Achternaam49"]
["2019-12-10","AFVMEP",43809.25,43809.614583333336,"Rudolf","Achternaam44"]
["2019-12-10","LCRochtend",43809.25,43809.614583333336,"Sami","Achternaam81"]
["2019-12-10","LCRochtend",43809.25,43809.614583333336,"Wolter","Achternaam8"]
["2019-12-10","PALLHAS",43809.25,43809.614583333336,"Henk","Achternaam560"]
["2019-12-10","PALLMEP",43809.25,43809.614583333336,"Wenaron","Achternaam561"]
["2019-12-10","PALLMEP",43809.25,43809.614583333336,"Salahadin","Achternaam562"]
["2019-12-10","PALLMEP",43809.25,43809.614583333336,"Dikkie","Achternaam563"]
["2019-12-10","PALLMEP",43809.25,43809.614583333336,"Rene","Achternaam564"]
["2019-12-10","PALLMEP",43809.25,43809.614583333336,"Richard","Achternaam565"]
["2019-12-10","PALLRweg",43809.25,43809.614583333336,"Shawn","Achternaam566"]
["2019-12-10","PALLRweg",43809.25,43809.614583333336,"Elroy","Achternaam567"]
["2019-12-10","PALLRweg",43809.25,43809.614583333336,"Arsenio","Achternaam568"]
["2019-12-10","PALLRweg",43809.25,43809.614583333336,"Viorel","Achternaam569"]
["2019-12-10","PALLRweg",43809.25,43809.614583333336,"Olcay","Achternaam570"]
["2019-12-10","PALLRweg",43809.25,43809.614583333336,"Amadou","Achternaam571"]
["2019-12-10","PALLRweg",43809.25,43809.614583333336,"Wout","Achternaam572"]
["2019-12-10","PALLRweg",43809.25,43809.614583333336,"Magdalena","Achternaam573"]
["2019-12-10","PALLRweg",43809.25,43809.614583333336,"Charles","Achternaam574"]
["2019-12-10","PALLRweg",43809.25,43809.614583333336,"Ko","Achternaam575"]
["2019-12-10","PALLRweg",43809.25,43809.614583333336,"Robin","Achternaam576"]
["2019-12-10","PALLRweg",43809.25,43809.614583333336,"Gerrit","Achternaam577"]
["2019-12-10","PALLRweg",43809.25,43809.614583333336,"Everon","Achternaam578"]
["2019-12-10","PALLRweg",43809.25,43809.614583333336,"Davood","Achternaam579"]
["2019-12-10","PALLRweg",43809.25,43809.614583333336,"Swen","Achternaam580"]
["2019-12-10","PALLRweg",43809.25,43809.614583333336,"Saidou","Achternaam581"]
["2019-12-10","PALLRweg",43809.25,43809.614583333336,"Wim","Achternaam582"]
["2019-12-10","PALLRweg",43809.25,43809.614583333336,"Quincy","Achternaam583"]
["2019-12-10","PALLRweg",43809.25,43809.614583333336,"Henk","Achternaam584"]
["2019-12-10","SCHM",43809.25,43809.614583333336,"Marjolein","Achternaam76"]
["2019-12-10","SCHM",43809.25,43809.614583333336,"Piet","Achternaam78"]
["2019-12-10","SCHM",43809.25,43809.614583333336,"Roy","Achternaam77"]
["2019-12-10","SCHMAFV",43809.25,43809.614583333336,"Christiaan","Achternaam51"]
["2019-12-10","SCHMAFV",43809.25,43809.614583333336,"Henri","Achternaam82"]
["2019-12-10","SCHMAFV",43809.25,43809.614583333336,"Jan","Achternaam79"]
["2019-12-10","SCHMAFV",43809.25,43809.614583333336,"Boyan","Achternaam80"]
["2019-12-10","SCHMAFV",43809.25,43809.614583333336,"Michel","Achternaam83"]
["2019-12-10","TRSP",43809.25,43809.614583333336,"Anton","Achternaam593"]
["2019-12-10","TRSP",43809.25,43809.614583333336,"Henk","Achternaam594"]
["2019-12-10","AFVMEP",43809.291666666664,43809.65625,"Rijk","Achternaam50"]
["2019-12-10","TeamleiderPALL",43809.3125,43809.677083333336,"Hilko","Achternaam596"]
["2019-12-10","TRSP",43809.333333333336,43809.697916666664,"Harrie","Achternaam597"]
["2019-12-10","SCHMHAS",43809.40625,43809.614583333336,"Paul","Achternaam49"]
["2019-12-10","Reserveochtend",43809.458333333336,43809.614583333336,"Fars","Achternaam599"]
["2019-12-10","ABBmiddag",43809.572916666664,43809.9375,"Bile","Achternaam508"]
["2019-12-10","ABBmiddag",43809.572916666664,43809.9375,"Flavi","Achternaam1"]
["2019-12-10","AFVHAS",43809.572916666664,43809.697916666664,"Norbert","Achternaam6"]
["2019-12-10","AFVMEP",43809.572916666664,43809.9375,"Houcin","Achternaam7"]
["2019-12-10","LCRmiddag",43809.572916666664,43809.9375,"Klaas","Achternaam40"]
["2019-12-10","PALLMEP",43809.614583333336,43809.979166666664,"Latie","Achternaam605"]
["2019-12-10","PALLMEP",43809.614583333336,43809.979166666664,"Abdurahman Ibrahim","Achternaam606"]
["2019-12-10","PALLMEP",43809.614583333336,43809.979166666664,"Michael","Achternaam607"]
["2019-12-10","PALLMEP",43809.614583333336,43809.979166666664,"Hans","Achternaam608"]
["2019-12-10","PALLMEP",43809.614583333336,43809.979166666664,"Jeroen","Achternaam609"]
["2019-12-10","PALLRweg",43809.614583333336,43809.979166666664,"Akela","Achternaam610"]
["2019-12-10","PALLRweg",43809.614583333336,43809.979166666664,"Karrar","Achternaam611"]
["2019-12-10","PALLRweg",43809.614583333336,43809.979166666664,"Sebastian","Achternaam612"]
["2019-12-10","PALLRweg",43809.614583333336,43809.979166666664,"Chevindio","Achternaam613"]
["2019-12-10","PALLRweg",43809.614583333336,43809.979166666664,"Harry","Achternaam614"]
["2019-12-10","PALLRweg",43809.614583333336,43809.979166666664,"Apollonia","Achternaam615"]
["2019-12-10","PALLRweg",43809.614583333336,43809.979166666664,"Dennis","Achternaam616"]
["2019-12-10","PALLRweg",43809.614583333336,43809.979166666664,"Agathe","Achternaam617"]
["2019-12-10","PALLRweg",43809.614583333336,43809.979166666664,"Heruy","Achternaam618"]
["2019-12-10","PALLRweg",43809.614583333336,43809.979166666664,"Hassan","Achternaam619"]
["2019-12-10","PALLRweg",43809.614583333336,43809.979166666664,"Samantha","Achternaam620"]
["2019-12-10","PALLRweg",43809.614583333336,43809.979166666664,"Sied","Achternaam621"]
["2019-12-10","PALLRweg",43809.614583333336,43809.979166666664,"Atobhran","Achternaam622"]
["2019-12-10","PALLRweg",43809.614583333336,43809.979166666664,"Abdul","Achternaam623"]
["2019-12-10","PALLRweg",43809.614583333336,43809.979166666664,"Naoufel","Achternaam624"]
["2019-12-10","PALLRweg",43809.614583333336,43809.979166666664,"Niek","Achternaam625"]
["2019-12-10","PALLRweg",43809.614583333336,43809.979166666664,"Jarek","Achternaam626"]
["2019-12-10","PALLRweg",43809.614583333336,43809.979166666664,"Martijn","Achternaam627"]
["2019-12-10","PALLRweg",43809.614583333336,43809.979166666664,"Mark","Achternaam628"]
["2019-12-10","PALLRweg",43809.614583333336,43809.979166666664,"Abdiqadir","Achternaam629"]
["2019-12-10","PALLRweg",43809.614583333336,43809.979166666664,"Nexhmedi","Achternaam630"]
["2019-12-10","SCHM",43809.614583333336,43809.979166666664,"Erik","Achternaam4"]
["2019-12-10","SCHM",43809.614583333336,43809.979166666664,"Patrick","Achternaam88"]
["2019-12-10","SCHM",43809.614583333336,43809.979166666664,"Rolinka","Achternaam3"]
["2019-12-10","SCHMAFV",43809.614583333336,43809.979166666664,"Miquel","Achternaam39"]
["2019-12-10","SCHMAFV",43809.614583333336,43809.979166666664,"Paul","Achternaam49"]
["2019-12-10","SCHMAFV",43809.614583333336,43809.979166666664,"Sebastiaan","Achternaam41"]
["2019-12-10","SCHMAFV",43809.614583333336,43809.979166666664,"Baki","Achternaam2"]
["2019-12-10","SCHMAFV",43809.614583333336,43809.979166666664,"Ilker","Achternaam38"]
["2019-12-10","TRSP",43809.614583333336,43809.979166666664,"Emsud","Achternaam639"]
["2019-12-10","TRSP",43809.614583333336,43809.979166666664,"Reinder","Achternaam640"]
["2019-12-10","PALLRweg",43809.645833333336,43809.979166666664,"Amanuel","Achternaam641"]
["2019-12-10","Reservemiddag",43809.666666666664,43809.979166666664,"Haben","Achternaam642"]
["2019-12-10","Reservemiddag",43809.666666666664,43809.979166666664,"Bereket","Achternaam643"]
["2019-12-10","BakiAchternaam2",43809.666666666664,43809.979166666664,"Gebrehiwet","Achternaam644"]
["2019-12-10","Reservemiddag",43809.666666666664,43809.979166666664,"Robel","Achternaam645"]
["2019-12-10","SCHMHAS",43809.697916666664,43809.9375,"Norbert","Achternaam6"]
["2019-12-10","SCHM",43809.916666666664,43810.28125,"Rachid","Achternaam34"]
["2019-12-10","SCHM",43809.916666666664,43810.28125,"Evans","Achternaam35"]
["2019-12-10","SCHM",43809.916666666664,43810.28125,"Kevin","Achternaam36"]
["2019-12-11","ABBochtend",43810.25,43810.614583333336,"Trienko","Achternaam48"]
["2019-12-11","AFVHAS",43810.25,43810.40625,"Paul","Achternaam49"]
["2019-12-11","AFVMEP",43810.25,43810.614583333336,"Rudolf","Achternaam44"]
["2019-12-11","LCRochtend",43810.25,43810.614583333336,"Sami","Achternaam81"]
["2019-12-11","LCRochtend",43810.25,43810.614583333336,"Wolter","Achternaam8"]
["2019-12-11","PALLHAS",43810.25,43810.614583333336,"Henk","Achternaam655"]
["2019-12-11","PALLMEP",43810.25,43810.614583333336,"Wenaron","Achternaam656"]
["2019-12-11","PALLMEP",43810.25,43810.614583333336,"Salahadin","Achternaam657"]
["2019-12-11","PALLMEP",43810.25,43810.614583333336,"Dikkie","Achternaam658"]
["2019-12-11","PALLMEP",43810.25,43810.614583333336,"Rene","Achternaam659"]
["2019-12-11","PALLMEP",43810.25,43810.614583333336,"Richard","Achternaam660"]
["2019-12-11","PALLRweg",43810.25,43810.614583333336,"Felicia","Achternaam661"]
["2019-12-11","PALLRweg",43810.25,43810.614583333336,"Elroy","Achternaam662"]
["2019-12-11","PALLRweg",43810.25,43810.614583333336,"Arsenio","Achternaam663"]
["2019-12-11","PALLRweg",43810.25,43810.614583333336,"Viorel","Achternaam664"]
["2019-12-11","PALLRweg",43810.25,43810.614583333336,"Olcay","Achternaam665"]
["2019-12-11","PALLRweg",43810.25,43810.614583333336,"Sebastiaan","Achternaam666"]
["2019-12-11","PALLRweg",43810.25,43810.614583333336,"Amadou","Achternaam667"]
["2019-12-11","PALLRweg",43810.25,43810.614583333336,"Wout","Achternaam668"]
["2019-12-11","PALLRweg",43810.25,43810.614583333336,"Magdalena","Achternaam669"]
["2019-12-11","PALLRweg",43810.25,43810.614583333336,"Charles","Achternaam670"]
["2019-12-11","PALLRweg",43810.25,43810.614583333336,"Ko","Achternaam671"]
["2019-12-11","PALLRweg",43810.25,43810.614583333336,"Robin","Achternaam672"]
["2019-12-11","PALLRweg",43810.25,43810.614583333336,"Gerrit","Achternaam673"]
["2019-12-11","PALLRweg",43810.25,43810.614583333336,"Everon","Achternaam674"]
["2019-12-11","PALLRweg",43810.25,43810.614583333336,"Davood","Achternaam675"]
["2019-12-11","PALLRweg",43810.25,43810.614583333336,"Swen","Achternaam676"]
["2019-12-11","PALLRweg",43810.25,43810.614583333336,"Saidou","Achternaam677"]
["2019-12-11","PALLRweg",43810.25,43810.614583333336,"Wim","Achternaam678"]
["2019-12-11","PALLRweg",43810.25,43810.614583333336,"Quincy","Achternaam679"]
["2019-12-11","PALLRweg",43810.25,43810.614583333336,"Daniel","Achternaam680"]
["2019-12-11","PALLRweg",43810.25,43810.614583333336,"Henk","Achternaam681"]
["2019-12-11","Reserveochtend",43810.25,43810.614583333336,"Shawn","Achternaam682"]
["2019-12-11","Reserveochtend",43810.25,43810.614583333336,"Fars","Achternaam683"]
["2019-12-11","Reserveochtend",43810.25,43810.614583333336,"Mebrathu","Achternaam684"]
["2019-12-11","SCHM",43810.25,43810.614583333336,"Marjolein","Achternaam76"]
["2019-12-11","SCHM",43810.25,43810.614583333336,"Piet","Achternaam78"]
["2019-12-11","SCHM",43810.25,43810.614583333336,"Roy","Achternaam77"]
["2019-12-11","SCHMAFV",43810.25,43810.614583333336,"Christiaan","Achternaam51"]
["2019-12-11","SCHMAFV",43810.25,43810.614583333336,"Henri","Achternaam82"]
["2019-12-11","SCHMAFV",43810.25,43810.614583333336,"Jan","Achternaam79"]
["2019-12-11","SCHMAFV",43810.25,43810.614583333336,"Boyan","Achternaam80"]
["2019-12-11","SCHMAFV",43810.25,43810.614583333336,"Michel","Achternaam83"]
["2019-12-11","TRSP",43810.25,43810.614583333336,"Anton","Achternaam693"]
["2019-12-11","TRSP",43810.25,43810.614583333336,"Henk","Achternaam694"]
["2019-12-11","AFVMEP",43810.291666666664,43810.65625,"Rijk","Achternaam50"]
["2019-12-11","TeamleiderPALL",43810.3125,43810.677083333336,"Hilko","Achternaam696"]
["2019-12-11","TRSP",43810.333333333336,43810.697916666664,"Harrie","Achternaam697"]
["2019-12-11","SCHMHAS",43810.40625,43810.614583333336,"Paul","Achternaam49"]
["2019-12-11","ABBmiddag",43810.572916666664,43810.9375,"Bile","Achternaam508"]
["2019-12-11","AFVHAS",43810.572916666664,43810.697916666664,"Norbert","Achternaam6"]
["2019-12-11","AFVMEP",43810.572916666664,43810.9375,"Houcin","Achternaam7"]
["2019-12-11","LCRmiddag",43810.572916666664,43810.9375,"Sebastiaan","Achternaam41"]
["2019-12-11","PALLMEP",43810.614583333336,43810.979166666664,"Latie","Achternaam703"]
["2019-12-11","PALLMEP",43810.614583333336,43810.979166666664,"Abdurahman Ibrahim","Achternaam704"]
["2019-12-11","PALLMEP",43810.614583333336,43810.979166666664,"Michael","Achternaam705"]
["2019-12-11","PALLMEP",43810.614583333336,43810.979166666664,"Hans","Achternaam706"]
["2019-12-11","PALLMEP",43810.614583333336,43810.979166666664,"Jeroen","Achternaam707"]
["2019-12-11","PALLRweg",43810.614583333336,43810.979166666664,"Akela","Achternaam708"]
["2019-12-11","PALLRweg",43810.614583333336,43810.979166666664,"Karrar","Achternaam709"]
["2019-12-11","PALLRweg",43810.614583333336,43810.979166666664,"Sebastian","Achternaam710"]
["2019-12-11","PALLRweg",43810.614583333336,43810.979166666664,"Chevindio","Achternaam711"]
["2019-12-11","PALLRweg",43810.614583333336,43810.979166666664,"Harry","Achternaam712"]
["2019-12-11","PALLRweg",43810.614583333336,43810.979166666664,"Dennis","Achternaam713"]
["2019-12-11","PALLRweg",43810.614583333336,43810.979166666664,"Jelte","Achternaam714"]
["2019-12-11","PALLRweg",43810.614583333336,43810.979166666664,"Agathe","Achternaam715"]
["2019-12-11","PALLRweg",43810.614583333336,43810.979166666664,"Amanuel","Achternaam716"]
["2019-12-11","PALLRweg",43810.614583333336,43810.979166666664,"Hassan","Achternaam717"]
["2019-12-11","PALLRweg",43810.614583333336,43810.979166666664,"Samantha","Achternaam718"]
["2019-12-11","PALLRweg",43810.614583333336,43810.979166666664,"Sied","Achternaam719"]
["2019-12-11","PALLRweg",43810.614583333336,43810.979166666664,"Ambroise","Achternaam720"]
["2019-12-11","PALLRweg",43810.614583333336,43810.979166666664,"Atobhran","Achternaam721"]
["2019-12-11","PALLRweg",43810.614583333336,43810.979166666664,"Abdul","Achternaam722"]
["2019-12-11","PALLRweg",43810.614583333336,43810.979166666664,"Naoufel","Achternaam723"]
["2019-12-11","PALLRweg",43810.614583333336,43810.979166666664,"Niek","Achternaam724"]
["2019-12-11","PALLRweg",43810.614583333336,43810.979166666664,"Jarek","Achternaam725"]
["2019-12-11","PALLRweg",43810.614583333336,43810.979166666664,"Martijn","Achternaam726"]
["2019-12-11","PALLRweg",43810.614583333336,43810.979166666664,"Mark","Achternaam727"]
["2019-12-11","PALLRweg",43810.614583333336,43810.979166666664,"Abdiqadir","Achternaam728"]
["2019-12-11","PALLRweg",43810.614583333336,43810.979166666664,"Nexhmedi","Achternaam729"]
["2019-12-11","Reservemiddag",43810.614583333336,43810.979166666664,"Tomas","Achternaam730"]
["2019-12-11","Reservemiddag",43810.614583333336,43810.979166666664,"Heruy","Achternaam731"]
["2019-12-11","Reservemiddag",43810.614583333336,43810.979166666664,"Tesfaldet","Achternaam732"]
["2019-12-11","Reservemiddag",43810.614583333336,43810.979166666664,"Laszlo","Achternaam733"]
["2019-12-11","Reservemiddag",43810.614583333336,43810.979166666664,"Gebrehiwet","Achternaam734"]
["2019-12-11","SCHM",43810.614583333336,43810.979166666664,"Erik","Achternaam4"]
["2019-12-11","SCHM",43810.614583333336,43810.979166666664,"Patrick","Achternaam88"]
["2019-12-11","SCHM",43810.614583333336,43810.979166666664,"Rolinka","Achternaam3"]
["2019-12-11","SCHMAFV",43810.614583333336,43810.979166666664,"Paul","Achternaam49"]
["2019-12-11","SCHMAFV",43810.614583333336,43810.979166666664,"Baki","Achternaam2"]
["2019-12-11","SCHMAFV",43810.614583333336,43810.979166666664,"Ilker","Achternaam38"]
["2019-12-11","SCHMAFV",43810.614583333336,43810.979166666664,"Flavi","Achternaam1"]
["2019-12-11","TRSP",43810.614583333336,43810.979166666664,"Emsud","Achternaam742"]
["2019-12-11","TRSP",43810.614583333336,43810.979166666664,"Reinder","Achternaam743"]
["2019-12-11","LCR",43810.697916666664,43810.9375,"Norbert","Achternaam6"]
["2019-12-11","SCHM",43810.916666666664,43811.28125,"Rachid","Achternaam34"]
["2019-12-11","SCHM",43810.916666666664,43811.28125,"Evans","Achternaam35"]
["2019-12-11","SCHM",43810.916666666664,43811.28125,"Kevin","Achternaam36"]
["2019-12-12","ABBochtend",43811.25,43811.614583333336,"Trienko","Achternaam48"]
["2019-12-12","AFVHAS",43811.25,43811.40625,"Paul","Achternaam49"]
["2019-12-12","AFVMEP",43811.25,43811.614583333336,"Rudolf","Achternaam44"]
["2019-12-12","LCRochtend",43811.25,43811.614583333336,"Sami","Achternaam81"]
["2019-12-12","PALLHAS",43811.25,43811.614583333336,"Henk","Achternaam752"]
["2019-12-12","PALLMEP",43811.25,43811.614583333336,"Wenaron","Achternaam753"]
["2019-12-12","PALLMEP",43811.25,43811.614583333336,"Salahadin","Achternaam754"]
["2019-12-12","PALLMEP",43811.25,43811.614583333336,"Dikkie","Achternaam755"]
["2019-12-12","PALLMEP",43811.25,43811.614583333336,"Rene","Achternaam756"]
["2019-12-12","PALLMEP",43811.25,43811.614583333336,"Richard","Achternaam757"]
["2019-12-12","PALLRweg",43811.25,43811.614583333336,"Elroy","Achternaam758"]
["2019-12-12","PALLRweg",43811.25,43811.614583333336,"Arsenio","Achternaam759"]
["2019-12-12","PALLRweg",43811.25,43811.614583333336,"Viorel","Achternaam760"]
["2019-12-12","PALLRweg",43811.25,43811.614583333336,"Olcay","Achternaam761"]
["2019-12-12","PALLRweg",43811.25,43811.614583333336,"Sebastiaan","Achternaam762"]
["2019-12-12","PALLRweg",43811.25,43811.614583333336,"Amadou","Achternaam763"]
["2019-12-12","PALLRweg",43811.25,43811.614583333336,"Wout","Achternaam764"]
["2019-12-12","PALLRweg",43811.25,43811.614583333336,"Fars","Achternaam765"]
["2019-12-12","PALLRweg",43811.25,43811.614583333336,"Magdalena","Achternaam766"]
["2019-12-12","PALLRweg",43811.25,43811.614583333336,"Charles","Achternaam767"]
["2019-12-12","PALLRweg",43811.25,43811.614583333336,"Ko","Achternaam768"]
["2019-12-12","PALLRweg",43811.25,43811.614583333336,"Robin","Achternaam769"]
["2019-12-12","PALLRweg",43811.25,43811.614583333336,"Gerrit","Achternaam770"]
["2019-12-12","PALLRweg",43811.25,43811.614583333336,"Everon","Achternaam771"]
["2019-12-12","PALLRweg",43811.25,43811.614583333336,"Davood","Achternaam772"]
["2019-12-12","PALLRweg",43811.25,43811.614583333336,"Swen","Achternaam773"]
["2019-12-12","PALLRweg",43811.25,43811.614583333336,"Saidou","Achternaam774"]
["2019-12-12","PALLRweg",43811.25,43811.614583333336,"Wim","Achternaam775"]
["2019-12-12","PALLRweg",43811.25,43811.614583333336,"Quincy","Achternaam776"]
["2019-12-12","PALLRweg",43811.25,43811.614583333336,"Daniel","Achternaam777"]
["2019-12-12","PALLRweg",43811.25,43811.614583333336,"Henk","Achternaam778"]
["2019-12-12","SCHM",43811.25,43811.614583333336,"Marjolein","Achternaam76"]
["2019-12-12","SCHM",43811.25,43811.614583333336,"Piet","Achternaam78"]
["2019-12-12","SCHM",43811.25,43811.614583333336,"Roy","Achternaam77"]
["2019-12-12","SCHMAFV",43811.25,43811.614583333336,"Christiaan","Achternaam51"]
["2019-12-12","SCHMAFV",43811.25,43811.614583333336,"Henri","Achternaam82"]
["2019-12-12","SCHMAFV",43811.25,43811.614583333336,"Jan","Achternaam79"]
["2019-12-12","SCHMAFV",43811.25,43811.614583333336,"Boyan","Achternaam80"]
["2019-12-12","SCHMAFV",43811.25,43811.614583333336,"Michel","Achternaam83"]
["2019-12-12","TRSP",43811.25,43811.614583333336,"Anton","Achternaam787"]
["2019-12-12","TRSP",43811.25,43811.614583333336,"Henk","Achternaam788"]
["2019-12-12","AFVMEP",43811.291666666664,43811.65625,"Rijk","Achternaam50"]
["2019-12-12","TeamleiderPALL",43811.3125,43811.677083333336,"Hilko","Achternaam790"]
["2019-12-12","TRSP",43811.333333333336,43811.697916666664,"Harrie","Achternaam791"]
["2019-12-12","SCHMHAS",43811.40625,43811.614583333336,"Paul","Achternaam49"]
["2019-12-12","ABBmiddag",43811.572916666664,43811.9375,"Bile","Achternaam508"]
["2019-12-12","AFVHAS",43811.572916666664,43811.697916666664,"Norbert","Achternaam6"]
["2019-12-12","AFVMEP",43811.572916666664,43811.9375,"Houcin","Achternaam7"]
["2019-12-12","LCRmiddag",43811.572916666664,43811.9375,"Klaas","Achternaam40"]
["2019-12-12","PALLMEP",43811.614583333336,43811.979166666664,"Latie","Achternaam797"]
["2019-12-12","PALLMEP",43811.614583333336,43811.979166666664,"Abdurahman Ibrahim","Achternaam798"]
["2019-12-12","PALLMEP",43811.614583333336,43811.979166666664,"Michael","Achternaam799"]
["2019-12-12","PALLMEP",43811.614583333336,43811.979166666664,"Hans","Achternaam800"]
["2019-12-12","PALLMEP",43811.614583333336,43811.979166666664,"Jeroen","Achternaam801"]
["2019-12-12","PALLRweg",43811.614583333336,43811.979166666664,"Akela","Achternaam802"]
["2019-12-12","PALLRweg",43811.614583333336,43811.979166666664,"Karrar","Achternaam803"]
["2019-12-12","PALLRweg",43811.614583333336,43811.979166666664,"Chevindio","Achternaam804"]
["2019-12-12","PALLRweg",43811.614583333336,43811.979166666664,"Haben","Achternaam805"]
["2019-12-12","PALLRweg",43811.614583333336,43811.979166666664,"Harry","Achternaam806"]
["2019-12-12","PALLRweg",43811.614583333336,43811.979166666664,"Apollonia","Achternaam807"]
["2019-12-12","PALLRweg",43811.614583333336,43811.979166666664,"Dennis","Achternaam808"]
["2019-12-12","PALLRweg",43811.614583333336,43811.979166666664,"Agathe","Achternaam809"]
["2019-12-12","PALLRweg",43811.614583333336,43811.979166666664,"Tomas","Achternaam810"]
["2019-12-12","PALLRweg",43811.614583333336,43811.979166666664,"Heruy","Achternaam811"]
["2019-12-12","PALLRweg",43811.614583333336,43811.979166666664,"Hassan","Achternaam812"]
["2019-12-12","PALLRweg",43811.614583333336,43811.979166666664,"Samantha","Achternaam813"]
["2019-12-12","PALLRweg",43811.614583333336,43811.979166666664,"Sied","Achternaam814"]
["2019-12-12","PALLRweg",43811.614583333336,43811.979166666664,"Laszlo","Achternaam815"]
["2019-12-12","PALLRweg",43811.614583333336,43811.979166666664,"Atobhran","Achternaam816"]
["2019-12-12","PALLRweg",43811.614583333336,43811.979166666664,"Abdul","Achternaam817"]
["2019-12-12","PALLRweg",43811.614583333336,43811.979166666664,"Naoufel","Achternaam818"]
["2019-12-12","PALLRweg",43811.614583333336,43811.979166666664,"Jarek","Achternaam819"]
["2019-12-12","PALLRweg",43811.614583333336,43811.979166666664,"Martijn","Achternaam820"]
["2019-12-12","PALLRweg",43811.614583333336,43811.979166666664,"Mark","Achternaam821"]
["2019-12-12","PALLRweg",43811.614583333336,43811.979166666664,"Abdiqadir","Achternaam822"]
["2019-12-12","PALLRweg",43811.614583333336,43811.979166666664,"Nexhmedi","Achternaam823"]
["2019-12-12","Reservemiddag",43811.614583333336,43811.979166666664,"Sebastian","Achternaam824"]
["2019-12-12","Reservemiddag",43811.614583333336,43811.979166666664,"Amanuel","Achternaam825"]
["2019-12-12","SCHM",43811.614583333336,43811.979166666664,"Erik","Achternaam4"]
["2019-12-12","SCHM",43811.614583333336,43811.979166666664,"Patrick","Achternaam88"]
["2019-12-12","SCHM",43811.614583333336,43811.979166666664,"Rolinka","Achternaam3"]
["2019-12-12","SCHMAFV",43811.614583333336,43811.979166666664,"Miquel","Achternaam39"]
["2019-12-12","SCHMAFV",43811.614583333336,43811.979166666664,"Paul","Achternaam49"]
["2019-12-12","SCHMAFV",43811.614583333336,43811.979166666664,"Sebastiaan","Achternaam41"]
["2019-12-12","SCHMAFV",43811.614583333336,43811.979166666664,"Baki","Achternaam2"]
["2019-12-12","SCHMAFV",43811.614583333336,43811.979166666664,"Ilker","Achternaam38"]
["2019-12-12","SCHMAFV",43811.614583333336,43811.979166666664,"Flavi","Achternaam1"]
["2019-12-12","TRSP",43811.614583333336,43811.979166666664,"Emsud","Achternaam835"]
["2019-12-12","TRSP",43811.614583333336,43811.979166666664,"Reinder","Achternaam836"]
["2019-12-12","LCR",43811.697916666664,43811.9375,"Norbert","Achternaam6"]
["2019-12-12","SCHM",43811.916666666664,43812.28125,"Rachid","Achternaam34"]
["2019-12-12","SCHM",43811.916666666664,43812.28125,"Evans","Achternaam35"]
["2019-12-12","SCHM",43811.916666666664,43812.28125,"Kevin","Achternaam36"]
["2019-12-13","ABBochtend",43812.25,43812.614583333336,"Trienko","Achternaam48"]
["2019-12-13","AFVHAS",43812.25,43812.40625,"Paul","Achternaam49"]
["2019-12-13","AFVMEP",43812.25,43812.614583333336,"Rudolf","Achternaam44"]
["2019-12-13","LCRochtend",43812.25,43812.614583333336,"Sami","Achternaam81"]
["2019-12-13","LCRochtend",43812.25,43812.614583333336,"Wolter","Achternaam8"]
["2019-12-13","PALLHAS",43812.25,43812.614583333336,"Henk","Achternaam846"]
["2019-12-13","PALLMEP",43812.25,43812.614583333336,"Wenaron","Achternaam847"]
["2019-12-13","PALLMEP",43812.25,43812.614583333336,"Salahadin","Achternaam848"]
["2019-12-13","PALLMEP",43812.25,43812.614583333336,"Dikkie","Achternaam849"]
["2019-12-13","PALLMEP",43812.25,43812.614583333336,"Rene","Achternaam850"]
["2019-12-13","PALLMEP",43812.25,43812.614583333336,"Richard","Achternaam851"]
["2019-12-13","PALLRweg",43812.25,43812.614583333336,"Felicia","Achternaam852"]
["2019-12-13","PALLRweg",43812.25,43812.614583333336,"Jelte","Achternaam853"]
["2019-12-13","PALLRweg",43812.25,43812.614583333336,"Shawn","Achternaam854"]
["2019-12-13","PALLRweg",43812.25,43812.614583333336,"Elroy","Achternaam855"]
["2019-12-13","PALLRweg",43812.25,43812.614583333336,"Arsenio","Achternaam856"]
["2019-12-13","PALLRweg",43812.25,43812.614583333336,"Viorel","Achternaam857"]
["2019-12-13","PALLRweg",43812.25,43812.614583333336,"Sebastiaan","Achternaam858"]
["2019-12-13","PALLRweg",43812.25,43812.614583333336,"Amadou","Achternaam859"]
["2019-12-13","PALLRweg",43812.25,43812.614583333336,"Wout","Achternaam860"]
["2019-12-13","PALLRweg",43812.25,43812.614583333336,"Fars","Achternaam861"]
["2019-12-13","PALLRweg",43812.25,43812.614583333336,"Magdalena","Achternaam862"]
["2019-12-13","PALLRweg",43812.25,43812.614583333336,"Charles","Achternaam863"]
["2019-12-13","PALLRweg",43812.25,43812.614583333336,"Ko","Achternaam864"]
["2019-12-13","PALLRweg",43812.25,43812.614583333336,"Robin","Achternaam865"]
["2019-12-13","PALLRweg",43812.25,43812.614583333336,"Gerrit","Achternaam866"]
["2019-12-13","PALLRweg",43812.25,43812.614583333336,"Everon","Achternaam867"]
["2019-12-13","PALLRweg",43812.25,43812.614583333336,"Davood","Achternaam868"]
["2019-12-13","PALLRweg",43812.25,43812.614583333336,"Swen","Achternaam869"]
["2019-12-13","PALLRweg",43812.25,43812.614583333336,"Saidou","Achternaam870"]
["2019-12-13","PALLRweg",43812.25,43812.614583333336,"Wim","Achternaam871"]
["2019-12-13","PALLRweg",43812.25,43812.614583333336,"Quincy","Achternaam872"]
["2019-12-13","PALLRweg",43812.25,43812.614583333336,"Henk","Achternaam873"]
["2019-12-13","Reserveochtend",43812.25,43812.614583333336,"Olcay","Achternaam874"]
["2019-12-13","Reserveochtend",43812.25,43812.614583333336,"Mebrathu","Achternaam875"]
["2019-12-13","Reserveochtend",43812.25,43812.614583333336,"Daniel","Achternaam876"]
["2019-12-13","SCHM",43812.25,43812.614583333336,"Marjolein","Achternaam76"]
["2019-12-13","SCHM",43812.25,43812.614583333336,"Piet","Achternaam78"]
["2019-12-13","SCHM",43812.25,43812.614583333336,"Roy","Achternaam77"]
["2019-12-13","SCHMAFV",43812.25,43812.614583333336,"Christiaan","Achternaam51"]
["2019-12-13","SCHMAFV",43812.25,43812.614583333336,"Henri","Achternaam82"]
["2019-12-13","SCHMAFV",43812.25,43812.614583333336,"Jan","Achternaam79"]
["2019-12-13","SCHMAFV",43812.25,43812.614583333336,"Boyan","Achternaam80"]
["2019-12-13","SCHMAFV",43812.25,43812.614583333336,"Michel","Achternaam83"]
["2019-12-13","TRSP",43812.25,43812.614583333336,"Anton","Achternaam885"]
["2019-12-13","TRSP",43812.25,43812.614583333336,"Henk","Achternaam886"]
["2019-12-13","AFVMEP",43812.291666666664,43812.65625,"Rijk","Achternaam50"]
["2019-12-13","TeamleiderPALL",43812.3125,43812.677083333336,"Hilko","Achternaam888"]
["2019-12-13","TRSP",43812.333333333336,43812.697916666664,"Harrie","Achternaam889"]
["2019-12-13","SCHMHAS",43812.40625,43812.614583333336,"Paul","Achternaam49"]
["2019-12-13","ABBmiddag",43812.572916666664,43812.9375,"Bile","Achternaam508"]
["2019-12-13","AFVHAS",43812.572916666664,43812.697916666664,"Norbert","Achternaam6"]
["2019-12-13","AFVMEP",43812.572916666664,43812.9375,"Houcin","Achternaam7"]
["2019-12-13","LCRmiddag",43812.572916666664,43812.9375,"Klaas","Achternaam40"]
["2019-12-13","PALLMEP",43812.614583333336,43812.979166666664,"Latie","Achternaam895"]
["2019-12-13","PALLMEP",43812.614583333336,43812.979166666664,"Abdurahman Ibrahim","Achternaam896"]
["2019-12-13","PALLMEP",43812.614583333336,43812.979166666664,"Michael","Achternaam897"]
["2019-12-13","PALLMEP",43812.614583333336,43812.979166666664,"Hans","Achternaam898"]
["2019-12-13","PALLMEP",43812.614583333336,43812.979166666664,"Jeroen","Achternaam899"]
["2019-12-13","PALLRweg",43812.614583333336,43812.979166666664,"Akela","Achternaam900"]
["2019-12-13","PALLRweg",43812.614583333336,43812.979166666664,"Karrar","Achternaam901"]
["2019-12-13","PALLRweg",43812.614583333336,43812.979166666664,"Sebastian","Achternaam902"]
["2019-12-13","PALLRweg",43812.614583333336,43812.979166666664,"Harry","Achternaam903"]
["2019-12-13","PALLRweg",43812.614583333336,43812.979166666664,"Apollonia","Achternaam904"]
["2019-12-13","PALLRweg",43812.614583333336,43812.979166666664,"Dennis","Achternaam905"]
["2019-12-13","PALLRweg",43812.614583333336,43812.979166666664,"Agathe","Achternaam906"]
["2019-12-13","PALLRweg",43812.614583333336,43812.979166666664,"Hagos","Achternaam907"]
["2019-12-13","PALLRweg",43812.614583333336,43812.979166666664,"Heruy","Achternaam908"]
["2019-12-13","PALLRweg",43812.614583333336,43812.979166666664,"Hassan","Achternaam909"]
["2019-12-13","PALLRweg",43812.614583333336,43812.979166666664,"Samantha","Achternaam910"]
["2019-12-13","PALLRweg",43812.614583333336,43812.979166666664,"Sied","Achternaam911"]
["2019-12-13","PALLRweg",43812.614583333336,43812.979166666664,"Laszlo","Achternaam912"]
["2019-12-13","PALLRweg",43812.614583333336,43812.979166666664,"Atobhran","Achternaam913"]
["2019-12-13","PALLRweg",43812.614583333336,43812.979166666664,"Abdul","Achternaam914"]
["2019-12-13","PALLRweg",43812.614583333336,43812.979166666664,"Naoufel","Achternaam915"]
["2019-12-13","PALLRweg",43812.614583333336,43812.979166666664,"Jarek","Achternaam916"]
["2019-12-13","PALLRweg",43812.614583333336,43812.979166666664,"Martijn","Achternaam917"]
["2019-12-13","PALLRweg",43812.614583333336,43812.979166666664,"Mark","Achternaam918"]
["2019-12-13","PALLRweg",43812.614583333336,43812.979166666664,"Abdiqadir","Achternaam919"]
["2019-12-13","PALLRweg",43812.614583333336,43812.979166666664,"Nexhmedi","Achternaam920"]
["2019-12-13","SCHM",43812.614583333336,43812.979166666664,"Erik","Achternaam4"]
["2019-12-13","SCHM",43812.614583333336,43812.979166666664,"Patrick","Achternaam88"]
["2019-12-13","SCHM",43812.614583333336,43812.979166666664,"Rolinka","Achternaam3"]
["2019-12-13","SCHMAFV",43812.614583333336,43812.979166666664,"Miquel","Achternaam39"]
["2019-12-13","SCHMAFV",43812.614583333336,43812.979166666664,"Paul","Achternaam49"]
["2019-12-13","SCHMAFV",43812.614583333336,43812.979166666664,"Sebastiaan","Achternaam41"]
["2019-12-13","SCHMAFV",43812.614583333336,43812.979166666664,"Baki","Achternaam2"]
["2019-12-13","SCHMAFV",43812.614583333336,43812.979166666664,"Ilker","Achternaam38"]
["2019-12-13","SCHMAFV",43812.614583333336,43812.979166666664,"Flavi","Achternaam1"]
["2019-12-13","TRSP",43812.614583333336,43812.979166666664,"Emsud","Achternaam930"]
["2019-12-13","TRSP",43812.614583333336,43812.979166666664,"Reinder","Achternaam931"]
["2019-12-13","PALLRweg",43812.645833333336,43812.979166666664,"Amanuel","Achternaam932"]
["2019-12-13","Reservemiddag",43812.666666666664,43812.979166666664,"Bereket","Achternaam933"]
["2019-12-13","BakiAchternaam2",43812.666666666664,43812.979166666664,"Gebrehiwet","Achternaam934"]
["2019-12-13","Reservemiddag",43812.666666666664,43812.979166666664,"Robel","Achternaam935"]
["2019-12-13","SCHMHAS",43812.697916666664,43812.9375,"Norbert","Achternaam6"]
["2019-12-14","ABBweekenddienst",43813.333333333336,43813.875,"Niek","Achternaam937"]
["2019-12-10","HeftruckMEP","06:00:00","14:45:00","eddy","merckx"]

{"sheet":"EMB weekplanning","index":4,"n_rows":159,"n_cols":23,"rows_kept":159,"cut":false,"hidden":false,"merged":[]}
[7,null,null,"PLANNING EMB","2019-12-26"]
[null,null,null,{"$f":"WEEKDAY(E2)","v":"1900-01-02"},"2019-12-09",null,{"$f":"\"Week nr.\" & WEEKNUM(E2)","v":"Week nr.50"},{"$f":"WEEKDAY(I2)","v":"1900-01-03"},"2019-12-10",null,{"$f":"\"Week nr.\" & WEEKNUM(I2)","v":"Week nr.50"},{"$f":"WEEKDAY(M2)","v":"1900-01-04"},"2019-12-11",null,{"$f":"\"Week nr.\" & WEEKNUM(M2)","v":"Week nr.50"},{"$f":"WEEKDAY(Q2)","v":"1900-01-05"},"2019-12-12",null,{"$f":"\"Week nr.\" & WEEKNUM(Q2)","v":"Week nr.50"},{"$f":"WEEKDAY(U2)","v":"1900-01-06"},"2019-12-13",null,{"$f":"\"Week nr.\" & WEEKNUM(U2)","v":"Week nr.50"}]
["Afdeling","Verlof","FTE","Vroeg",null,"Laat",null,"Vroeg",null,"Laat",null,"Vroeg",null,"Laat",null,"Vroeg",null,"Laat",null,"Vroeg",null,"Laat"]
["TLPALL",null,null,"06:00/14:45","Werkelijke eindtijd","14:45/23:30","Werkelijke eindtijd","06:00/14:45","Werkelijke eindtijd","14:45/23:30","Werkelijke eindtijd","06:00/14:45","Werkelijke eindtijd","14:45/23:30","Werkelijke eindtijd","06:00/14:45","Werkelijke eindtijd","14:45/23:30","Werkelijke eindtijd","06:00/14:45","Werkelijke eindtijd","14:45/23:30","Werkelijke eindtijd"]
[null,null,1]
[null,null,2]
["PALME",null,"WERKTIIJDEN","06:00/14:45","Werkelijke eindtijd","14:45/23:30","Werkelijke eindtijd","06:00/14:45","Werkelijke eindtijd","14:45/23:30","Werkelijke eindtijd","06:00/14:45","Werkelijke eindtijd","14:45/23:30","Werkelijke eindtijd","06:00/14:45","Werkelijke eindtijd","14:45/23:30","Werkelijke eindtijd","06:00/14:45","Werkelijke eindtijd","14:45/23:30","Werkelijke eindtijd"]
[null,null,1,"Wenaron Achternaam467",null,"Latie Achternaam513",null,"Wenaron Achternaam561",null,"Latie Achternaam605",null,"Wenaron Achternaam656",null,"Latie Achternaam703",null,"Wenaron Achternaam753",null,"Latie Achternaam797",null,"Wenaron Achternaam847",null,"Latie Achternaam895"]
[null,null,2,"Salahadin Achternaam468",null,"Abdurahman Ibrahim Achternaam514",null,"Salahadin Achternaam562",null,"Abdurahman Ibrahim Achternaam606",null,"Salahadin Achternaam657",null,"Abdurahman Ibrahim Achternaam704",null,"Salahadin Achternaam754",null,"Abdurahman Ibrahim Achternaam798",null,"Salahadin Achternaam848",null,"Abdurahman Ibrahim Achternaam896"]
[null,null,3,"Dikkie Achternaam469",null,"Michael Achternaam515",null,"Dikkie Achternaam563",null,"Michael Achternaam607",null,"Dikkie Achternaam658",null,"Michael Achternaam705",null,"Dikkie Achternaam755",null,"Michael Achternaam799",null,"Dikkie Achternaam849",null,"Michael Achternaam897"]
[null,null,4,"Hilko Achternaam505",null,"Hans Achternaam516",null,"Hilko Achternaam596",null,"Hans Achternaam608",null,"Hilko Achternaam696",null,"Hans Achternaam706",null,"Hilko Achternaam790",null,"Hans Achternaam800",null,"Hilko Achternaam888",null,"Hans Achternaam898"]
[null,"Richard Achternaam851",5,"Richard Achternaam471",null,"Jeroen Achternaam517",null,"Richard Achternaam565",null,"Jeroen Achternaam609",null,"Richard Achternaam660",null,"Jeroen Achternaam707",null,"Richard Achternaam757",null,"Jeroen Achternaam801",null,"Richard Achternaam851",null,"Jeroen Achternaam899"]
[null,null,6]
[null,null,7]
[null,null,8]
["PALRW",null,"WERKTIIJDEN","06:00/14:45","Werkelijke eindtijd","13:45/22:30","Werkelijke eindtijd","06:00/14:45","Werkelijke eindtijd","13:45/22:30","Werkelijke eindtijd","06:00/14:45","Werkelijke eindtijd","13:45/22:30","Werkelijke eindtijd","06:00/14:45","Werkelijke eindtijd","13:45/22:30","Werkelijke eindtijd","06:00/14:45","Werkelijke eindtijd","13:45/22:30","Werkelijke eindtijd"]
[null,null,1,"Felicia Achternaam472",null,"Akela Achternaam518",null,"Shawn Achternaam566",null,"Akela Achternaam610",null,"Felicia Achternaam661",null,"Akela Achternaam708",null,"Elroy Achternaam758",null,"Akela Achternaam802",null,"Felicia Achternaam852",null,"Akela Achternaam900"]
[null,null,2,"Shawn Achternaam473",null,"Karrar Achternaam519",null,"Elroy Achternaam567",null,"Karrar Achternaam611",null,"Elroy Achternaam662",null,"Karrar Achternaam709",null,"Arsenio Achternaam759",null,"Karrar Achternaam803",null,"Jelte Achternaam853",null,"Karrar Achternaam901"]
[null,null,3,"Elroy Achternaam474",null,"Sebastian Achternaam520",null,"Arsenio Achternaam568",null,"Sebastian Achternaam612",null,"Arsenio Achternaam663",null,"Sebastian Achternaam710",null,"Viorel Achternaam760",null,"Chevindio Achternaam804",null,"Shawn Achternaam854",null,"Sebastian Achternaam902"]
[null,null,4,"Swen Achternaam475",null,"Harry Achternaam521",null,"Viorel Achternaam569",null,"Chevindio Achternaam613",null,"Viorel Achternaam664",null,"Chevindio Achternaam711",null,"Olcay Achternaam761",null,"Haben Achternaam805",null,"Elroy Achternaam855",null,"Harry Achternaam903"]
[null,null,5,"Arsenio Achternaam476",null,"Apollonia Achternaam522",null,"Olcay Achternaam570",null,"Harry Achternaam614",null,"Olcay Achternaam665",null,"Harry Achternaam712",null,"Sebastiaan Achternaam762",null,"Harry Achternaam806",null,"Arsenio Achternaam856",null,"Apollonia Achternaam904"]
[null,null,6,"Viorel Achternaam477",null,"Agathe Achternaam523",null,"Amadou Achternaam571",null,"Apollonia Achternaam615",null,"Sebastiaan Achternaam666",null,"Dennis Achternaam713",null,"Amadou Achternaam763",null,"Apollonia Achternaam807",null,"Viorel Achternaam857",null,"Dennis Achternaam905"]
[null,null,7,"Olcay Achternaam478",null,"Heruy Achternaam524",null,"Wout Achternaam572",null,"Dennis Achternaam616",null,"Amadou Achternaam667",null,"Jelte Achternaam714",null,"Wout Achternaam764",null,"Dennis Achternaam808",null,"Sebastiaan Achternaam858",null,"Agathe Achternaam906"]
[null,null,8,"Sebastiaan Achternaam479",null,"Hassan Achternaam525",null,"Magdalena Achternaam573",null,"Agathe Achternaam617",null,"Wout Achternaam668",null,"Agathe Achternaam715",null,"Fars Achternaam765",null,"Agathe Achternaam809",null,"Amadou Achternaam859",null,"Hagos Achternaam907"]
[null,null,9,"Henk Achternaam492",null,"Gebrehiwet Achternaam549",null,"Henk Achternaam584",null,"Amanuel Achternaam641",null,"Henk Achternaam681",null,"Nexhmedi Achternaam729",null,"Henk Achternaam778",null,"Nexhmedi Achternaam823",null,"Henk Achternaam873",null,"Amanuel Achternaam932"]
[null,null,10]
["TRSP",null,null,"06:00/14:45","Werkelijke eindtijd","14:45/23:30","Werkelijke eindtijd","06:00/14:45","Werkelijke eindtijd","14:45/23:30","Werkelijke eindtijd","06:00/14:45","Werkelijke eindtijd","14:45/23:30","Werkelijke eindtijd","06:00/14:45","Werkelijke eindtijd","14:45/23:30","Werkelijke eindtijd","06:00/14:45","Werkelijke eindtijd","14:45/23:30","Werkelijke eindtijd"]
[null,null,1]
[null,null,2,"Anton Achternaam502",null,"Emsud Achternaam546",null,"Anton Achternaam593",null,"Emsud Achternaam639",null,"Anton Achternaam693",null,"Emsud Achternaam742",null,"Anton Achternaam787",null,"Emsud Achternaam835",null,"Anton Achternaam885",null,"Emsud Achternaam930"]
[null,null,3,"Henk Achternaam503",null,"Reinder Achternaam547",null,"Henk Achternaam594",null,"Reinder Achternaam640",null,"Henk Achternaam694",null,"Reinder Achternaam743",null,"Henk Achternaam788",null,"Reinder Achternaam836",null,"Henk Achternaam886",null,"Reinder Achternaam931"]
[null,null,4,"Harrie Achternaam506",null,null,null,"Harrie Achternaam597",null,null,null,"Harrie Achternaam697",null,null,null,"Harrie Achternaam791",null,null,null,"Harrie Achternaam889"]
[null,null,5]
[null,null,6]
[null,null,7]
["PALHAS",null,null,{"$f":"IF(WEEKDAY(E2)=7,\"08:00/21:00 \",IF(WEEKDAY(E2)=1,\"08:00/14:45\",\"06:00/14:45\"))","v":"06:00/14:45"},"Werkelijke eindtijd",{"$f":"IF(WEEKDAY(E2)=1,\"13:45/22:30\",\"14:45/23:30\")","v":"14:45/23:30"},"Werkelijke eindtijd",{"$f":"IF(WEEKDAY(I2)=7,\"08:00/21:00 \",IF(WEEKDAY(I2)=1,\"08:00/14:45\",\"06:00/14:45\"))","v":"06:00/14:45"},"Werkelijke eindtijd",{"$f":"IF(WEEKDAY(I2)=1,\"13:45/22:30\",\"14:45/23:30\")","v":"14:45/23:30"},"Werkelijke eindtijd",{"$f":"IF(WEEKDAY(M2)=7,\"08:00/21:00 \",IF(WEEKDAY(M2)=1,\"08:00/14:45\",\"06:00/14:45\"))","v":"06:00/14:45"},"Werkelijke eindtijd",{"$f":"IF(WEEKDAY(M2)=1,\"13:45/22:30\",\"14:45/23:30\")","v":"14:45/23:30"},"Werkelijke eindtijd",{"$f":"IF(WEEKDAY(Q2)=7,\"08:00/21:00 \",IF(WEEKDAY(Q2)=1,\"08:00/14:45\",\"06:00/14:45\"))","v":"06:00/14:45"},"Werkelijke eindtijd",{"$f":"IF(WEEKDAY(Q2)=1,\"13:45/22:30\",\"14:45/23:30\")","v":"14:45/23:30"},"Werkelijke eindtijd",{"$f":"IF(WEEKDAY(U2)=7,\"08:00/21:00 \",IF(WEEKDAY(U2)=1,\"08:00/14:45\",\"06:00/14:45\"))","v":"06:00/14:45"},"Werkelijke eindtijd",{"$f":"IF(WEEKDAY(U2)=1,\"13:45/22:30\",\"14:45/23:30\")","v":"14:45/23:30"},"Werkelijke eindtijd"]
[null,null,1]
[null,null,2,"Henk Achternaam466",null,null,null,"Henk Achternaam560",null,null,null,"Henk Achternaam655",null,null,null,"Henk Achternaam752",null,null,null,"Henk Achternaam846"]
[null,null,3]
[null,null,4]
[null,null,5]
[null,null,6]
[null,null,7]
["HTMEP",null,null,"06:00/14:45","Werkelijke eindtijd","14:45/23:30","Werkelijke eindtijd","06:00/14:45","Werkelijke eindtijd","14:45/23:30","Werkelijke eindtijd","06:00/14:45","Werkelijke eindtijd","14:45/23:30","Werkelijke eindtijd","06:00/14:45","Werkelijke eindtijd","14:45/23:30","Werkelijke eindtijd","06:00/14:45","Werkelijke eindtijd","14:45/23:30","Werkelijke eindtijd"]
[null,null,1,null,null,null,null,"eddy merckx"]
[null,null,2]
[null,null,3]
[null,null,4]
[null,null,5]
[null,null,6]
[null,null,7]
[null,null,8]
["HTHAS",null,null,"06:00/14:45","Werkelijke eindtijd","14:45/23:30","Werkelijke eindtijd","06:00/14:45","Werkelijke eindtijd","14:45/23:30","Werkelijke eindtijd","06:00/14:45","Werkelijke eindtijd","14:45/23:30","Werkelijke eindtijd","06:00/14:45","Werkelijke eindtijd","14:45/23:30","Werkelijke eindtijd","06:00/14:45","Werkelijke eindtijd","14:45/23:30","Werkelijke eindtijd"]
[null,null,1]
[null,null,2]
[null,null,3]
[null,null,4]
[null,null,5]
[null,null,6]
[null,null,7]
[null,null,8]
["RESER",null,null,"06:00/14:45","Werkelijke eindtijd","14:45/23:30","Werkelijke eindtijd","06:00/14:45","Werkelijke eindtijd","14:45/23:30","Werkelijke eindtijd","06:00/14:45","Werkelijke eindtijd","14:45/23:30","Werkelijke eindtijd","06:00/14:45","Werkelijke eindtijd","14:45/23:30","Werkelijke eindtijd","06:00/14:45","Werkelijke eindtijd","14:45/23:30","Werkelijke eindtijd"]
[null,null,1,"Robin Achternaam493",null,"Bereket Achternaam550",null,"Fars Achternaam599",null,"Haben Achternaam642",null,"Shawn Achternaam682",null,"Tomas Achternaam730",null,null,null,"Sebastian Achternaam824",null,"Olcay Achternaam874",null,"Bereket Achternaam933"]
[null,null,2,null,null,null,null,null,null,"Bereket Achternaam643",null,"Fars Achternaam683",null,"Heruy Achternaam731",null,null,null,"Amanuel Achternaam825",null,"Mebrathu Achternaam875",null,"Robel Achternaam935"]
[null,null,3,null,null,null,null,null,null,"Robel Achternaam645",null,"Mebrathu Achternaam684",null,"Tesfaldet Achternaam732",null,null,null,null,null,"Daniel Achternaam876"]
[null,null,4,null,null,null,null,null,null,null,null,null,null,"Laszlo Achternaam733"]
[null,null,5,null,null,null,null,null,null,null,null,null,null,"Gebrehiwet Achternaam734"]
[null,null,6]
["RESER"]
[null,null,1]
[null,null,2]
[null,null,3]
[null,null,4]
[null,null,5]
[null,null,6]
["RESER"]
[null,null,1]
[null,null,2]
[null,null,3]
[null,null,4]
[null,null,5]
[null,null,6]
["RESER"]
[null,null,1]
[null,null,2]
[null,null,3]
[null,null,4]
[null,null,5]
[null,null,6]
[]
[]
[]
[]
[]
[]
[]
[]
[]
[]
[]
[null,null,null,{"$f":"WEEKDAY(E100)","v":"1900-01-07"},"2019-11-30",null,{"$f":"\"Week nr.\" & WEEKNUM(E100)","v":"Week nr.48"}]
[null,null,null,"Vroeg",null,"Laat"]
[null,null,null,"06:00/14:45","Werkelijke eindtijd","14:45/23:30","Werkelijke eindtijd"]
[]
[]
[null,null,null,"06:00/14:45","Werkelijke eindtijd","14:45/23:30","Werkelijke eindtijd"]
[]
[]
[]
[]
[]
[]
[]
[]
[null,null,null,"06:00/14:45","Werkelijke eindtijd","13:45/22:30","Werkelijke eindtijd"]
[]
[]
[]
[]
[]
[]
[]
[]
[]
[]
[null,null,null,"06:00/14:45","Werkelijke eindtijd","14:45/23:30","Werkelijke eindtijd"]
[]
[]
[]
[]
[]
[]
[]
[null,null,null,{"$f":"IF(WEEKDAY(E100)=7,\"08:00/21:00 \",IF(WEEKDAY(E100)=1,\"08:00/14:45\",\"06:00/14:45\"))","v":"08:00/21:00 "},"Werkelijke eindtijd",{"$f":"IF(WEEKDAY(E100)=1,\"13:45/22:30\",\"14:45/23:30\")","v":"14:45/23:30"},"Werkelijke eindtijd"]
[]
[]
[]
[]
[]
[]
[]
[null,null,null,"06:00/14:45","Werkelijke eindtijd","14:45/23:30","Werkelijke eindtijd"]
[]
[]
[]
[]
[]
[]
[]
[]
[null,null,null,"06:00/14:45","Werkelijke eindtijd","14:45/23:30","Werkelijke eindtijd"]
[]
[]
[]
[]
[]
[]
[]
[]
[null,null,null,"06:00/14:45","Werkelijke eindtijd","14:45/23:30","Werkelijke eindtijd"]

{"sheet":"EMB verlof","index":5,"n_rows":500,"n_cols":6,"rows_kept":500,"cut":false,"hidden":false,"merged":[]}
["Weeknummer","Datum","Naam","Afdeling","aantal dagen","Goedgekeurd/ afgekeurd (reden)"]
[{"$f":"IF(B2<>\"\",WEEKNUM(B2),\"\")","v":51},"2019-12-21","Shawn Achternaam854",{"$f":"IF(C2<>\"\",VLOOKUP(C2,verlofEMB,2,0),\"\")","v":"PALRW"},14,"goedgekeurd"]
[50,"2019-12-10","Salahadin Achternaam848","PALME",6,"afgekeurd"]
[50,"2019-12-11","Richard Achternaam851","PALME",2,"goedgekeurd"]
[52,"2019-12-23","Henk Achternaam886","TRSP",3,"goedgekeurd"]
[2,"2020-01-10","Henk Achternaam886","TRSP",1]
[3,"2020-01-12","Henk Achternaam886","TRSP",1]
[3,"2020-01-15","Henk Achternaam886","TRSP",3]
[7,"2020-02-15","Henk Achternaam886","TRSP",1]
[8,"2020-02-19","Henk Achternaam886","TRSP",2,"goedgekeurd"]
[11,"2020-03-10","Henk Achternaam886","TRSP",2]
[12,"2020-03-15","Henk Achternaam886","TRSP",10]
[{"$f":"IF(B13<>\"\",WEEKNUM(B13),\"\")","v":""},null,null,{"$f":"IF(C13<>\"\",VLOOKUP(C13,verlofEMB,2,0),\"\")","v":""}]
["",null,null,""]
["",null,null,""]
["",null,null,""]
["",null,null,""]
["",null,null,""]
["",null,null,""]
["",null,null,""]
["",null,null,""]
["",null,null,""]
["",null,null,""]
["",null,null,""]
["",null,null,""]
["",null,null,""]
["",null,null,""]
["",null,null,""]
["",null,null,""]
["",null,null,""]
["",null,null,""]
["",null,null,""]
["",null,null,""]
["",null,null,""]
["",null,null,""]
["",null,null,""]
["",null,null,""]
["",null,null,""]
["",null,null,""]
["",null,null,""]
["",null,null,""]
["",null,null,""]
["",null,null,""]
["",null,null,""]
["",null,null,""]
["",null,null,""]
["",null,null,""]
["",null,null,""]
["",null,null,""]
["",null,null,""]
["",null,null,""]
["",null,null,""]
["",null,null,""]
["",null,null,""]
["",null,null,""]
["",null,null,""]
["",null,null,""]
["",null,null,""]
["",null,null,""]
["",null,null,""]
["",null,null,""]
["",null,null,""]
["",null,null,""]
["",null,null,""]
["",null,null,""]
["",null,null,{"$f":"IF(C66<>\"\",VLOOKUP(C66,verlofEMB,2,0),\"\")","v":""}]
[{"$f":"IF(B67<>\"\",WEEKNUM(B67),\"\")","v":""},null,null,""]
["",null,null,""]
["",null,null,""]
["",null,null,""]
["",null,null,""]
["",null,null,""]
["",null,null,""]
["",null,null,""]
["",null,null,""]
["",null,null,""]
["",null,null,""]
["",null,null,""]
["",null,null,""]
["",null,null,""]
["",null,null,""]
["",null,null,""]
["",null,null,""]
["",null,null,""]
["",null,null,""]
["",null,null,""]
["",null,null,""]
["",null,null,""]
["",null,null,""]
["",null,null,""]
["",null,null,""]
["",null,null,""]
["",null,null,""]
["",null,null,""]
["",null,null,""]
["",null,null,""]
["",null,null,""]
["",null,null,""]
["",null,null,""]
["",null,null,""]
["",null,null,""]
["",null,null,""]
["",null,null,""]
["",null,null,""]
["",null,null,""]
["",null,null,""]
["",null,null,""]
["",null,null,""]
["",null,null,""]
["",null,null,""]
["",null,null,""]
["",null,null,""]
["",null,null,""]
["",null,null,""]
["",null,null,""]
["",null,null,""]
["",null,null,""]
["",null,null,""]
["",null,null,""]
["",null,null,""]
["",null,null,""]
["",null,null,""]
["",null,null,""]
["",null,null,""]
["",null,null,""]
["",null,null,""]
["",null,null,""]
["",null,null,""]
["",null,null,""]
["",null,null,{"$f":"IF(C130<>\"\",VLOOKUP(C130,verlofEMB,2,0),\"\")","v":""}]
[{"$f":"IF(B131<>\"\",WEEKNUM(B131),\"\")","v":""},null,null,""]
["",null,null,""]
["",null,null,""]
["",null,null,""]
["",null,null,""]
["",null,null,""]
["",null,null,""]
["",null,null,""]
["",null,null,""]
["",null,null,""]
["",null,null,""]
["",null,null,""]
["",null,null,""]
["",null,null,""]
["",null,null,""]
["",null,null,""]
["",null,null,""]
["",null,null,""]
["",null,null,""]
["",null,null,""]
["",null,null,""]
["",null,null,""]
["",null,null,""]
["",null,null,""]
["",null,null,""]
["",null,null,""]
["",null,null,""]
["",null,null,""]
["",null,null,""]
["",null,null,""]
["",null,null,""]
["",null,null,""]
["",null,null,""]
["",null,null,""]
["",null,null,""]
["",null,null,""]
["",null,null,""]
["",null,null,""]
["",null,null,""]
["",null,null,""]
["",null,null,""]
["",null,null,""]
["",null,null,""]
["",null,null,""]
["",null,null,""]
["",null,null,""]
["",null,null,""]
["",null,null,""]
["",null,null,""]
["",null,null,""]
["",null,null,""]
["",null,null,""]
["",null,null,""]
["",null,null,""]
["",null,null,""]
["",null,null,""]
["",null,null,""]
["",null,null,""]
["",null,null,""]
["",null,null,""]
["",null,null,""]
["",null,null,""]
["",null,null,""]
["",null,null,{"$f":"IF(C194<>\"\",VLOOKUP(C194,verlofEMB,2,0),\"\")","v":""}]
[{"$f":"IF(B195<>\"\",WEEKNUM(B195),\"\")","v":""},null,null,""]
["",null,null,""]
["",null,null,""]
["",null,null,""]
["",null,null,""]
["",null,null,""]
["",null,null,""]
["",null,null,""]
["",null,null,""]
["",null,null,""]
["",null,null,""]
["",null,null,""]
["",null,null,""]
["",null,null,""]
["",null,null,""]
["",null,null,""]
["",null,null,""]
["",null,null,""]
["",null,null,""]
["",null,null,""]
["",null,null,""]
["",null,null,""]
["",null,null,""]
["",null,null,""]
["",null,null,""]
["",null,null,""]
["",null,null,""]
["",null,null,""]
["",null,null,""]
["",null,null,""]
["",null,null,""]
["",null,null,""]
["",null,null,""]
["",null,null,""]
["",null,null,""]
["",null,null,""]
["",null,null,""]
["",null,null,""]
["",null,null,""]
["",null,null,""]
["",null,null,""]
["",null,null,""]
["",null,null,""]
["",null,null,""]
["",null,null,""]
["",null,null,""]
["",null,null,""]
["",null,null,""]
["",null,null,""]
["",null,null,""]
["",null,null,""]
["",null,null,""]
["",null,null,""]
["",null,null,""]
["",null,null,""]
["",null,null,""]
[]
[]
[]
["",null,null,{"$f":"IF(C254<>\"\",VLOOKUP(C254,verlofEMB,2,0),\"\")","v":""}]
["",null,null,""]
["",null,null,""]
["",null,null,""]
["",null,null,""]
[{"$f":"IF(B259<>\"\",WEEKNUM(B259),\"\")","v":""},null,null,""]
["",null,null,""]
["",null,null,""]
["",null,null,""]
["",null,null,""]
["",null,null,""]
["",null,null,""]
["",null,null,""]
["",null,null,""]
["",null,null,""]
["",null,null,""]
["",null,null,""]
["",null,null,""]
["",null,null,""]
["",null,null,""]
["",null,null,""]
["",null,null,""]
["",null,null,""]
["",null,null,""]
["",null,null,""]
["",null,null,""]
["",null,null,""]
["",null,null,""]
["",null,null,""]
["",null,null,""]
["",null,null,""]
["",null,null,""]
["",null,null,""]
["",null,null,""]
["",null,null,""]
["",null,null,""]
["",null,null,""]
["",null,null,""]
["",null,null,""]
["",null,null,""]
["",null,null,""]
["",null,null,""]
["",null,null,""]
["",null,null,""]
["",null,null,""]
["",null,null,""]
["",null,null,""]
["",null,null,""]
["",null,null,""]
["",null,null,""]
["",null,null,""]
["",null,null,""]
["",null,null,""]
["",null,null,""]
["",null,null,""]
["",null,null,""]
["",null,null,""]
["",null,null,""]
["",null,null,""]
["",null,null,""]
["",null,null,""]
["",null,null,""]
["",null,null,{"$f":"IF(C316<>\"\",VLOOKUP(C316,verlofEMB,2,0),\"\")","v":""}]
["",null,null,""]
["",null,null,""]
["",null,null,""]
["",null,null,""]
["",null,null,""]
["",null,null,""]
[{"$f":"IF(B323<>\"\",WEEKNUM(B323),\"\")","v":""},null,null,""]
["",null,null,""]
["",null,null,""]
["",null,null,""]
["",null,null,""]
["",null,null,""]
["",null,null,""]
["",null,null,""]
["",null,null,""]
["",null,null,""]
["",null,null,""]
["",null,null,""]
["",null,null,""]
["",null,null,""]
["",null,null,""]
["",null,null,""]
["",null,null,""]
["",null,null,""]
["",null,null,""]
["",null,null,""]
["",null,null,""]
["",null,null,""]
["",null,null,""]
["",null,null,""]
["",null,null,""]
["",null,null,""]
["",null,null,""]
["",null,null,""]
["",null,null,""]
["",null,null,""]
["",null,null,""]
["",null,null,""]
["",null,null,""]
["",null,null,""]
["",null,null,""]
["",null,null,""]
["",null,null,""]
["",null,null,""]
["",null,null,""]
["",null,null,""]
["",null,null,""]
["",null,null,""]
["",null,null,""]
["",null,null,""]
["",null,null,""]
["",null,null,""]
["",null,null,""]
["",null,null,""]
["",null,null,""]
["",null,null,""]
["",null,null,""]
[null,null,null,""]
[null,null,null,""]
[null,null,null,""]
[null,null,null,""]
[null,null,null,""]
[null,null,null,""]
[null,null,null,{"$f":"IF(C380<>\"\",VLOOKUP(C380,verlofEMB,2,0),\"\")","v":""}]
[null,null,null,""]
[null,null,null,""]
[null,null,null,""]
[null,null,null,""]
[null,null,null,""]
[null,null,null,""]
[null,null,null,""]
[null,null,null,""]
[null,null,null,""]
[null,null,null,""]
[null,null,null,""]
[null,null,null,""]
[null,null,null,""]
[null,null,null,""]
[null,null,null,""]
[null,null,null,""]
[null,null,null,""]
[null,null,null,""]
[null,null,null,""]
[null,null,null,""]
[null,null,null,""]
[null,null,null,""]
[null,null,null,""]
[null,null,null,""]
[null,null,null,""]
[null,null,null,""]
[null,null,null,""]
[null,null,null,""]
[null,null,null,""]
[null,null,null,""]
[null,null,null,""]
[null,null,null,""]
[null,null,null,""]
[null,null,null,""]
[null,null,null,""]
[null,null,null,""]
[null,null,null,""]
[null,null,null,""]
[null,null,null,""]
[null,null,null,""]
[null,null,null,""]
[null,null,null,""]
[null,null,null,""]
[null,null,null,""]
[null,null,null,""]
[null,null,null,""]
[null,null,null,""]
[null,null,null,""]
[null,null,null,""]
[null,null,null,""]
[null,null,null,""]
[null,null,null,""]
[null,null,null,""]
[null,null,null,""]
[null,null,null,""]
[null,null,null,""]
[null,null,null,""]
[null,null,null,""]
[null,null,null,""]
[null,null,null,""]
[null,null,null,""]
[null,null,null,""]
[null,null,null,""]
[null,null,null,{"$f":"IF(C444<>\"\",VLOOKUP(C444,verlofEMB,2,0),\"\")","v":""}]
[null,null,null,""]
[null,null,null,""]
[null,null,null,""]
[null,null,null,""]
[null,null,null,""]
[null,null,null,""]
[null,null,null,""]
[null,null,null,""]
[null,null,null,""]
[null,null,null,""]
[null,null,null,""]
[null,null,null,""]
[null,null,null,""]
[null,null,null,""]
[null,null,null,""]
[null,null,null,""]
[null,null,null,""]
[null,null,null,""]
[null,null,null,""]
[null,null,null,""]
[null,null,null,""]
[null,null,null,""]
[null,null,null,""]
[null,null,null,""]
[null,null,null,""]
[null,null,null,""]
[null,null,null,""]
[null,null,null,""]
[null,null,null,""]
[null,null,null,""]
[null,null,null,""]
[null,null,null,""]
[null,null,null,""]
[null,null,null,""]
[null,null,null,""]
[null,null,null,""]
[null,null,null,""]
[null,null,null,""]
[null,null,null,""]
[null,null,null,""]
[null,null,null,""]
[null,null,null,""]
[null,null,null,""]
[null,null,null,""]
[null,null,null,""]
[null,null,null,""]
[null,null,null,""]
[null,null,null,""]
[null,null,null,""]
[null,null,null,""]
[null,null,null,""]
[null,null,null,""]
[null,null,null,""]
[null,null,null,""]
[null,null,null,""]
[null,null,null,""]

{"sheet":"EMB jaaroverzicht","index":6,"n_rows":0,"n_cols":0,"rows_kept":0,"cut":false,"hidden":false,"merged":[]}