{"text_format":"1","workbook":"xlsx","n_sheets":4,"sheets":["factuur","Herinnering","Aangetekende","klantenlisting"],"not_rendered":{"charts":0,"images":1,"macros":1,"external_links":0,"defined_names":3,"comments":0,"pivot_tables":0},"unopened":[],"bounds":{"document_bytes":16777216,"sheet_cells":100000,"rows_first":2000,"rows_last":500,"rows_between":2000,"halvings":0,"cell_chars":16384,"cell_head_chars":4096},"cells_cut":0,"cells_raw":0,"read":"whole","date_system":"1900"}

{"sheet":"factuur","index":0,"n_rows":447,"n_cols":19,"rows_kept":447,"cut":false,"hidden":false,"merged":[[446,0,446,13],[10,4,11,7],[10,3,11,3],[18,3,18,8],[10,1,11,2],[194,8,194,9],[3,10,3,12],[4,10,4,12],[17,6,17,7],[17,10,17,11],[53,12,53,13],[194,10,194,11],[175,2,175,5],[176,2,176,5],[177,2,177,5],[168,2,168,5],[169,2,169,5],[161,10,161,11],[162,10,162,11],[163,10,163,11],[164,10,164,11],[165,10,165,11],[166,10,166,11],[165,6,165,7],[14,12,14,13],[7,10,7,13],[8,10,8,13],[9,10,9,11],[19,10,19,11],[20,10,20,11],[21,10,21,11],[22,10,22,11],[23,10,23,11],[24,10,24,11],[29,10,29,11],[49,12,50,13],[49,7,50,11],[24,1,24,8],[26,1,26,8],[20,1,20,8],[30,1,30,8],[22,1,22,8],[28,1,28,8],[36,1,36,8],[35,10,35,11],[29,1,29,8],[31,1,31,8],[23,3,23,8],[25,3,25,8],[27,3,27,8],[32,10,32,11],[44,9,44,11],[36,10,36,11],[37,10,37,11],[28,10,28,11],[30,10,30,11],[31,10,31,11],[39,9,40,11],[163,2,163,5],[164,2,164,5],[158,6,158,7],[159,6,159,7],[160,6,160,7],[161,6,161,7],[161,2,161,5],[162,2,162,5],[158,2,158,5],[159,2,159,5],[160,2,160,5],[163,6,163,7],[164,6,164,7],[159,10,159,11],[160,10,160,11],[157,6,157,7],[53,3,53,9],[157,2,157,5],[56,3,56,7],[155,0,155,13],[62,0,62,13],[54,12,54,13],[158,10,158,11],[39,12,40,13],[43,3,43,8],[34,1,34,8],[35,1,35,8],[45,3,45,8],[37,1,37,8],[38,1,38,8],[47,3,47,8],[47,9,47,11],[45,9,45,11],[46,9,46,11],[46,3,46,8],[14,3,14,6],[18,10,18,11],[38,10,38,11],[33,10,33,11],[34,10,34,11],[171,2,171,5],[172,2,172,5],[173,2,173,5],[165,2,165,5],[166,2,166,5],[167,2,167,5],[172,6,172,7],[173,6,173,7],[32,1,32,8],[33,1,33,8],[25,10,25,11],[26,10,26,11],[27,10,27,11],[14,8,14,9],[16,1,16,13],[44,3,44,8],[44,12,47,13],[43,12,43,13],[43,9,43,11],[170,2,170,5],[174,2,174,5],[166,6,166,7],[167,6,167,7],[167,10,167,11],[168,6,168,7],[178,6,178,7],[175,6,175,7],[176,6,176,7],[169,6,169,7],[170,6,170,7],[174,6,174,7],[171,6,171,7],[168,10,168,11],[169,10,169,11],[170,10,170,11],[171,10,171,11],[172,10,172,11],[173,10,173,11],[174,10,174,11],[175,10,175,11],[176,10,176,11],[177,6,177,7],[6,10,6,14],[210,10,210,12],[184,6,184,7],[185,6,185,7],[186,6,186,7],[187,6,187,7],[188,6,188,7],[189,6,189,7],[190,6,190,7],[191,6,191,7],[192,6,192,7],[185,10,185,11],[186,10,186,11],[187,10,187,11],[188,10,188,11],[189,10,189,11],[190,10,190,11],[191,10,191,11],[180,6,180,7],[181,6,181,7],[182,6,182,7],[183,6,183,7],[183,10,183,11],[162,6,162,7],[192,10,192,11],[184,10,184,11],[177,10,177,11],[178,10,178,11],[179,10,179,11],[180,10,180,11],[187,2,187,5],[188,2,188,5],[189,2,189,5],[190,2,190,5],[191,2,191,5],[192,2,192,5],[182,2,182,5],[183,2,183,5],[184,2,184,5],[185,2,185,5],[186,2,186,5],[181,10,181,11],[182,10,182,11],[179,2,179,5],[179,6,179,7],[180,2,180,5],[181,2,181,5],[178,2,178,5],[196,0,196,14],[197,2,197,5],[197,6,197,7],[197,10,197,11],[198,2,198,5],[198,6,198,7],[198,10,198,11],[200,0,200,14],[201,2,201,5],[201,6,201,7],[201,10,201,11],[272,0,273,14],[274,0,274,14],[202,2,202,5],[202,6,202,7],[202,10,202,11],[203,2,203,5],[203,6,203,7],[203,10,203,11],[204,2,204,5],[204,6,204,7],[204,10,204,11],[393,0,394,14],[395,0,395,14],[325,0,325,13],[317,4,317,7],[438,4,438,7]]}
["2021-01-10","Markata",null,null,null,null,null,null,null,null,null,null,null,null,null,null,null,null,1]
[null,"***",null,null,null,null,null,null,null,null,null,null,null,null,null,null,null,null,2]
[null,"***",null,null,null,null,null,null,null,null,null,null,null,null,null,null,null,null,3]
[null,"***",null,null,null,null,null,null,null,null,{"$f":"IF(B11=\"Bestelbon :\",\"Leverancier :\",\"Klantnummer :\")","v":"Klantnummer :"},null,null,null,null,null,null,null,4]
[null,"Ondn°:",null,"***",null,null,null,null,null,null,{"$f":"_xlfn.XLOOKUP(K7,klantenlisting!B:B,klantenlisting!A:A,\" \")","v":"cust-001"},null,null,null,null,null,null,null,5]
[null,null,null,null,null,null,null,null,null,null,null,null,null,null,null,null,null,null,6]
[null,null,null,null,null,null,null,null,null,null,"klant1",null,null,null,null,null,null,null,7]
[null,null,null,null,null,null,null,null,null,null,{"$f":"_xlfn.XLOOKUP(K7,klantenlisting!B:B,klantenlisting!C:C,\" \")","v":"adres1"},null,null,null,null,null,null,null,8]
[null,null,null,null,null,null,null,null,null,null,{"$f":"_xlfn.XLOOKUP(K7,klantenlisting!B:B,klantenlisting!D:D)","v":"postcode 1"},null,null,null,null,null,null,null,9]
[null,null,null,null,null,null,null,null,null,null,{"$f":"IF(M10>0,\"Ondn°:\",\"\")","v":""},null,{"$f":"_xlfn.XLOOKUP(K7,klantenlisting!B:B,klantenlisting!G:G)","v":0},null,null,"Offerte :","of",null,10]
[null,"Factuur :",null,{"$f":"_xlfn.XLOOKUP(B11,P10:P14,Q10:Q14,\"\")","v":"vk"},"2021 - 0",null,null,null,null,null,null,null,null,null,null,"Order :","or",null,11]
[null,null,null,null,null,null,null,null,null,null,null,null,null,null,null,"Factuur :","vk",null,12]
[null,null,null,null,null,null,null,null,null,null,null,null,null,null,null,"Creditnota :","cn",null,13]
[null,null,null,{"$f":"IF(B11=P10,\"Opmaakdatum :\",\"Datum :\")","v":"Datum :"},null,null,null,null,{"$f":"IF(B11=\"Factuur :\",\"Datum opeisbaarheid BTW :\",0)","v":"Datum opeisbaarheid BTW :"},null,null,null,{"$f":"IF(B11=\"Factuur :\",\"Leverdatum :\",0)","v":"Leverdatum :"},null,null,"Bestelbon :","bb",null,14]
[null,null,null,"22 februari 2021",null,null,null,null,{"$f":"IF(B11=\"Factuur :\",D15,0)","v":"22 februari 2021"},null,null,null,{"$f":"IF(AND(B11=\"Factuur :\",D15>1/1/2020),D15-15,\"\")","v":"2021-02-07"},null,null,null,null,null,15]
[null,null,null,null,null,null,null,null,null,null,null,null,null,null,null,null,null,null,16]
[null," Plaats levering of uitvoering werf :",null,null,null,null,null,null,null,null,null,null,null,null,null,",",null,null,17]
[null,"Diverse werven",null,null,null,null,null,null,null,null,null,null,null,null,null,{"$f":"K8&\", \"&K9","v":"adres1, postcode 1"},null,null,18]
[null,"Artikel",null,"Aard goederen / werkuren",null,null,null,null,null,"Aantal","Eenheid",null,"Bedrag","BTW %",null,"Diverse werven",null,null,19]
[null,"Goederen",null,{"$f":"IF(B20=P34,\"(zie bijlage)\",\"\")","v":"(zie bijlage)"},null,null,null,null,null,{"$f":"IF(K7=\"VSS\",SUM(A159:A193),)","v":0},{"$f":"_xlfn.IFNA(INDEX($P$26:$Q$36,MATCH($B$20,$P$26:$P$36,0),2),0)","v":0},null,{"$f":"_xlfn.IFNA(SUM(J20*K20),0)","v":0},6,null,"Andere : ",null,null,20]
[null,null,null,null,null,null,null,null,null,null,{"$f":"_xlfn.IFS(B21=\"\",Q26,B21=\"Werkuren\",Q27,B21=\"Levering\",Q28,B21=\"Verzending\",Q29,B21=\"Afhaling\",Q30,B21=\"Voorrijkosten\",Q31,B21=\"KM-vergoeding\",Q32)","v":0},null,null,null,null,"home adres",null,null,21]
[null,"Werkuren",null,{"$f":"IF(B22=P27,\"(zie bijlage)\",\"\")","v":"(zie bijlage)"},null,null,null,null,null,{"$f":"IF(K7=\"VSS\",SUM(B159:B193),)","v":0},{"$f":"_xlfn.IFNA(INDEX($P$26:$Q$36,MATCH($B$22,$P$26:$P$36,0),2),0)","v":100},null,{"$f":"_xlfn.IFNA(SUM(J22*K22),0)","v":0},6,null,null,null,null,22]
[null,null,null,null,null,null,null,null,null,null,null,null,null,null,null,null,null,null,23]
[null,"Voorrijkosten",null,null,null,null,null,null,null,{"$f":"IF(AND(K7=\"VSS\",G198>1/1/2020),SUM(J198:J199),0)","v":0},{"$f":"_xlfn.IFNA(INDEX($P$26:$Q$36,MATCH(B24,$P$26:$P$36,0),2),0)","v":3.363E-2},null,{"$f":"_xlfn.IFNA(SUM(J24*K24),0)","v":0},6,null,null,null,null,24]
[null,null,null,null,null,null,null,null,null,null,null,null,null,null,null,null,null,null,25]
[null,"KM-vergoeding",null,null,null,null,null,null,null,{"$f":"IF(AND(K7=\"VSS\",G202>1/1/2020),SUM(J202:J205),0)","v":0},{"$f":"_xlfn.IFNA(INDEX($P$26:$Q$36,MATCH(B26,$P$26:$P$36,0),2),0)","v":0.35420000000000001},null,{"$f":"_xlfn.IFNA(SUM(J26*K26),0)","v":0},6,null," ",0,null,26]
[null,null,null,null,null,null,null,null,null,null,null,null,null,null,null,"Werkuren",100,null,27]
[null," ",null,null,null,null,null,null,null,null,{"$f":"_xlfn.IFNA(INDEX($P$26:$Q$36,MATCH($B$28,$P$26:$P$36,0),2),\"\")","v":0},null,{"$f":"_xlfn.IFNA(SUM(J28*K28),0)","v":0},null,null,"Levering",null,null,28]
[null,null,null,null,null,null,null,null,null,null,null,null,{"$f":"SUM(J29*K29)","v":0},null,null,"Verzending",0,null,29]
[null,null,null,null,null,null,null,null,null,null,null,null,0,null,null,"Afhaling",0,null,30]
[null,null,null,null,null,null,null,null,null,null,null,null,0,null,null,"Voorrijkosten",3.363E-2,null,31]
[null,null,null,null,null,null,null,null,null,null,null,null,0,null,null,"KM-vergoeding",0.35420000000000001,null,32]
[null,null,null,null,null,null,null,null,null,null,null,null,0,null,null,"Maaltijd",30,null,33]
[null,null,null,null,null,null,null,null,null,null,null,null,0,null,null,"Goederen",{"$f":"K195","v":0},null,34]
[null,null,null,null,null,null,null,null,null,null,null,null,0,null,null,"Gepresteerde dagen",450,null,35]
[null,null,null,null,null,null,null,null,null,null,null,null,0,null,null,"Gepresteerde lange dagen",525,null,36]
[null,null,null,null,null,null,null,null,null,null,null,null,0,null,null,null,null,null,37]
[null,null,null,null,null,null,null,null,null,null,null,null,0,null,null,null,null,null,38]
[null,null,null,null,null,null,null,null,null,null,null,null,0,null,null,null,null,null,39]
[null,null,null,null,null,null,null,null,null,"Totaal excl. BTW",null,null,{"$f":"SUM(M20:M39)","v":0},null,null,null,null,null,40]
[null,null,null,null,null,null,null,null,null,null,null,null,null,null,null,null,null,null,41]
[null,null,null,null,null,null,null,null,null,null,null,null,null,null,null,null,null,null,42]
[null,null,null,null,null,null,null,null,null,null,null,null,null,null,null,null,null,null,43]
[null,null,"BTW %","Maatstaf van heffing",null,null,null,null,null,"Bedrag BTW",null,null,{"$f":"IF(B11=\"Creditnota :\",\"Terugbetaling van :\",\"Totaal te betalen :\")","v":"Totaal te betalen :"},null,null,null,null,null,44]
[null,"Medecontractant","O",{"$f":"SUM(IF(N20=0,M20,),IF(N22=0,M22,),IF(N24=0,M24,),IF(N26=0,M26,),IF(N28=0,M28,))","v":0},null,null,null,null,null,0,null,null,{"$f":"IF(B11=\"Creditnota :\",SUM(-(D48:L48)),SUM(D48:L48))","v":0},null,null,null,null,null,45]
[null,null,6,{"$f":"SUM(IF(N20=6,M20,),IF(N22=6,M22,),IF(N24=6,M24,),IF(N26=6,M26,),IF(N28=6,M26,))","v":0},null,null,null,null,null,{"$f":"SUM(D46*0.06)","v":0},null,null,null,null,null,null,null,null,46]
[null,null,21,{"$f":"SUM(IF(N20=21,M20,),IF(N22=21,M22,),IF(N24=21,M24,),IF(N26=21,M26,),IF(N28=21,M28,))","v":0},null,null,null,null,null,{"$f":"SUM(D47*0.21)","v":0},null,null,null,null,null,null,null,null,47]
[null,null,null,{"$f":"SUM(D45:I47)","v":0},null,null,null,null,null,{"$f":"SUM(J45:L47)","v":0},null,null,null,null,null,null,null,null,48]
[null,null,null,null,null,null,null,null,null,null,null,null,null,null,null,null,null,null,49]
[null,null,null,null,null,null,null,{"$f":"IF(B11=\"Offerte :\",\"Minimum bedrag te voldoen voor akkoord :\",\"\")","v":""},null,null,null,null,{"$f":"IF(B11=\"Offerte :\",M45*0.3,\"\")","v":""},null,null,null,null,null,50]
[null,null,null,null,null,null,null,null,null,null,null,null,null,null,null,null,null,null,51]
[null,null,null,null,null,null,null,null,null,null,null,null,null,null,null,null,null,null,52]
[null,null,null,null,null,null,null,null,null,null,null,null,null,null,null,"Zakelijk","BE123456789",null,53]
[null,null,null,{"$f":"IF(OR(B11=P10,B11=P12),\"Netto te betalen op rekening :\",\"\")","v":"Netto te betalen op rekening :"},null,null,null,null,null,null,null,{"$f":"IF(OR(B11=P10,B11=P12),\"IBAN:  \",\"\")","v":"IBAN:  "},{"$f":"IF(OR(B11=P10,B11=P12),Q53,\"\")","v":"BE123456789"},null,null,"Privé","BE987654321",null,54]
[null,null,null,null,null,null,null,null,null,null,null,{"$f":"IF(OR(B11=P10,B11=P12),\"BIC:  \",\"\")","v":"BIC:  "},{"$f":"IF(OR(B11=P10,B11=P12),\"KREDBEBB\",\"\")","v":"KREDBEBB"},null,null,null,null,null,55]
[null,null,null,null,null,null,null,null,null,null,null,null,null,null,null,null,null,null,56]
[null,null,null,{"$f":"_xlfn.IFS(B11=P9,\"\",B11=\"Offerte :\",\"Geldigheid :\",B11=\"Factuur :\",\"Factuurvoorwaarden :\",B11=\"Creditnota :\",\"\",B11=\"Bestelbon :\",\"\",B11=\"Order :\",\"\")","v":"Factuurvoorwaarden :"},null,null,null,null,{"$f":"_xlfn.IFS(B11=P9,\"\",B11=\"Offerte :\",\"30 dagen na opmaakdatum\",B11=\"Factuur :\",\"Betaalbaar contant\",B11=\"Creditnota :\",\"Het bedrag wordt binnen 30 dagen terug gestort op uw rekening,\",B11=\"Bestelbon :\",\"\",B11=\"Order :\",\"\")","v":"Betaalbaar contant"},null,null,null,null,null,null,null,null,null,57]
[null,null,null,null,null,null,null,{"$f":"IF(B11=\"Offerte :\",\"Voorwaarden :\",)","v":0},{"$f":"_xlfn.IFS(B11=P9,\"\",B11=\"Factuur :\",\"Algemene verkoopsvoorwaarden op achterzijde, u hebt kennis \",B11=\"Offerte :\",\"Voor akkoord dient een voorschot van minimum 30% voldaan te worden\",B11=\"Creditnota :\",\"of verrekend met een volgende factuur.\",B11=\"Bestelbon :\",\"\",B11=\"Order :\",\"\")","v":"Algemene verkoopsvoorwaarden op achterzijde, u hebt kennis "},null,null,null,null,null,null,null,null,null,58]
[null,null,null,null,null,null,null,null,{"$f":"_xlfn.IFS(B11=P9,\"\",B11=\"Factuur :\",\"genomen hier van en gaat akkoord met de voorwaarden.\",B11=\"Offerte :\",\"binnen de termijn van geldigheid van de offerte.\",B11=\"Creditnota :\",\"\",B11=\"Bestelbon :\",\"\",B11=\"Order :\",\"\")","v":"genomen hier van en gaat akkoord met de voorwaarden."},null,null,null,null,null,null,"14 dagen",null,null,59]
[null,null,null,null,null,null,null,{"$f":"_xlfn.IFS(B11=P9,\"\",B11=\"Offerte :\",\"\",B11=\"Factuur :\",\"Factuurclausule :\",B11=\"Creditnota :\",\"\",B11=\"Bestelbon :\",\"\",B11=\"Order :\",\"\")","v":"Factuurclausule :"},{"$f":"_xlfn.IFS(B11=P9,\"\",B11=\"Offerte :\",\"\",B11=\"Factuur :\",\"Te betalen binnen een termijn van:\",B11=\"Creditnota :\",\"\",B11=\"Bestelbon :\",\"\",B11=\"Order :\",\"\")","v":"Te betalen binnen een termijn van:"},null,null,{"$f":"IF(B11=P12,IF(M10>1,P60,P59),)","v":"14 dagen"},null,"1/5",null,"30 dagen",null,null,60]
{"$rows_left_out":388}
{"sheet":"Herinnering","index":1,"n_rows":144,"n_cols":48,"rows_kept":144,"cut":false,"hidden":false,"merged":[[30,51,30,52],[10,40,11,45],[12,52,12,53],[14,43,14,46],[14,48,14,49],[14,52,14,53],[3,50,3,52],[4,50,4,52],[7,50,7,53],[8,50,8,53],[9,50,9,51],[60,0,60,15],[10,1,11,6],[14,4,14,7],[14,9,14,10],[14,13,14,14],[23,2,23,3],[12,13,12,15],[22,14,22,15],[9,11,9,12],[27,4,27,8],[3,11,3,13],[4,11,4,13],[6,11,6,15],[7,11,7,14],[8,11,8,14]]}
["2021-01-10",{"$f":"factuur!B1","v":"Markata"}]
[null,"***"]
[null,"***"]
[1,"***",null,null,null,null,null,null,null,null,null,{"$f":"IF(B11=\"Bestelbon :\",\"Leverancier :\",\"Klantnummer :\")","v":"Klantnummer :"}]
[null,{"$f":"factuur!B5","v":"Ondn°:"},null,null,{"$f":"factuur!D5","v":"***"},123456789,null,null,null,null,null,{"$f":"IF(B11=\"Bestelbon\",_xlfn.XLOOKUP(L7,klantenlisting!B:B,klantenlisting!A:A),_xlfn.XLOOKUP(L7,klantenlisting!B:B,klantenlisting!A:A,klantenlisting!A6))","v":"cust-001"}]
[2]
[null,null,null,null,null,null,null,null,null,null,null,{"$f":"factuur!K7","v":"klant1"}]
[null,null,null,null,null,null,null,null,null,null,null,{"$f":"factuur!K8","v":"adres1"}]
[3,null,null,null,null,null,null,null,null,null,null,{"$f":"factuur!K9","v":"postcode 1"}]
[null,null,null,null,null,null,null,null,null,null,null,{"$f":"IF(N10>0,\"Ondn°:\",\"\")","v":""},null,{"$f":"_xlfn.XLOOKUP(L7,klantenlisting!B:B,klantenlisting!G:G,\" \")","v":0},null,null,"Herinnering"]
[null,null,null,null,null,null,null,null,null,null,null,null,null,null,null,null,"Aanmaning"]
[4,null,null,null,null,null,null,null,null,null,null,null,null,null,null,null,"2e Aanmaning"]
[null,null,null,null,null,null,null,null,null,null,null,null,"Pelt,",{"$f":"factuur!D15","v":"22 februari 2021"}]
[]
[]
[5]
[null,"Betreft factuur :",null,{"$f":"factuur!E11","v":"2021 - 0"}]
[]
[]
[null,"Geachte Heer, Mevrouw,"]
[]
[]
[null,"Hierbij willen wij u informeren dat uw rekening nog een openstaand saldo vertoond van",null,null,null,null,null,null,null,null,null,null,null,null,{"$f":"(factuur!M45)","v":0}]
[null,"op factuur :",{"$f":"D17","v":"2021 - 0"}]
[]
[]
[null,"Wij gaan er van uit dat u de betaling over het hoofd hebt gezien en vragen u dan ook het achterstallige bedrag"]
[null,"over te maken op onze rekening :",null,null,{"$f":"factuur!M54","v":"BE123456789"},null,null,null,null,"BIC: ******",null,null,"met vermelding van het"]
[null,"factuurnummer."]
[null,"Als u intussen het bedrag gestort heeft, mag u deze kennisgeving als onbestaand beschouwen."]
[]
[]
[null,"Bij vragen of betalingsproblemen kan u ons steeds bereiken op het nummer : +32(0)***"]
[null,"of per mail ","info@me.be"]
[]
[]
[]
[]
[null,"Met beleefde groeten,"]
[]
[]
[]
[]
[null,"Katarzynski Mark"]
[null,"Zaakvoerder."]
[]
[]
[]
[]
[]
[]
[]
[]
[]
[]
[]
[]
[]
[]
[]
{"$rows_left_out":85}
{"sheet":"Aangetekende","index":2,"n_rows":189,"n_cols":14,"rows_kept":189,"cut":false,"hidden":false,"merged":[[157,6,157,8],[157,9,157,10],[157,12,157,14],[154,0,154,9],[154,10,154,15],[9,11,9,12],[3,11,3,13],[4,11,4,13],[6,11,6,15],[7,11,7,14],[8,11,8,14],[10,1,11,7],[12,13,12,14],[14,4,14,7],[14,9,14,10],[14,13,14,14],[59,0,59,15],[26,9,26,11],[33,9,33,10],[33,6,33,8],[33,12,33,14]]}
["2021-01-10","Markata"]
[null,"***"]
[null,"***"]
[null,"***",null,null,null,null,null,null,null,null,null,{"$f":"IF(B11=\"Bestelbon :\",\"Leverancier :\",\"Klantnummer :\")","v":"Klantnummer :"}]
[null,"Ondn°:",null,null,"***",123456789,null,null,null,null,null,{"$f":"IF(B11=\"Bestelbon\",_xlfn.XLOOKUP(L7,klantenlisting!B:B,klantenlisting!A:A),_xlfn.XLOOKUP(L7,klantenlisting!B:B,klantenlisting!A:A,\"\"))","v":"cust-001"}]
[]
[null,null,null,null,null,null,null,null,null,null,null,{"$f":"factuur!K7","v":"klant1"}]
[null,null,null,null,null,null,null,null,null,null,null,{"$f":"_xlfn.XLOOKUP(L7,klantenlisting!B:B,klantenlisting!C:C,\" \")","v":"adres1"}]
[null,null,null,null,null,null,null,null,null,null,null,{"$f":"_xlfn.XLOOKUP(L7,klantenlisting!B:B,klantenlisting!D:D,\" \")","v":"postcode 1"}]
[null,null,null,null,null,null,null,null,null,null,null,{"$f":"IF(N10>1,\"Ondn°:\",\"\")","v":""},null,{"$f":"_xlfn.XLOOKUP(L7,klantenlisting!B:B,klantenlisting!G:G,\" \")","v":0}]
[null,"Aangetekende zending"]
[]
[null,null,null,null,null,null,null,null,null,null,null,null,"home",{"$f":"factuur!D15","v":"22 februari 2021"}]
[]
[]
[]
[null,"Betreft factuur:",null,{"$f":"factuur!E11","v":"2021 - 0"}]
[]
[]
[null,"Geachte Heer, Mevrouw,"]
[]
[]
[null,"Alle vorige aanmaningen bleven zonder gevolg. Behoudens betaling of reactie binnen de 8 dagen "]
[null,"op dit voorstel tot minnelijke schikking, zullen wij laten dagvaarden."]
[]
[null,"Indien u deze dagvaarding niet wenst te ontvangen, manen wij u aan om het volledige bedrag van"]
[null,{"$f":"M34","v":75},"per kerende te betalen op onze rekening :",null,null,null,null,null,null,{"$f":"factuur!M54","v":"BE123456789"},null,null,"BIC: ****,"]
[null,"of ons een voorstel ",null,"tot afbetaling ","te zenden per post of per mail op het volgend adres :",null,null,null,null,null,null,null,null,"info@me.be"]
[null,{"$f":"IF(B12=Q14,\"\",\"Als u het bedrag intussen gestort hebt, mag u deze kennisgeving als onbestaand beschouwen.\")","v":""}]
[]
[]
[]
[null,{"$f":"IF(B12=Q14,\"Factuur\",\"\")","v":"Factuur"},null,{"$f":"IF(B12=Q14,\"bedrag\",\"\")","v":"bedrag"},null,null,{"$f":"IF(B12=Q14,\"intrest\",\"\")","v":"intrest"},null,null,{"$f":"IF(B12=Q14,\"schadebeding\",\"\")","v":"schadebeding"},null,null,{"$f":"IF(B12=Q14,\"Totaal te betalen\",\"\")","v":"Totaal te betalen"}]
[null,{"$f":"D17","v":"2021 - 0"},null,{"$f":"factuur!M45","v":0},null,null,{"$f":"SUM(D34*0.1)","v":0},null,null,{"$f":"IF(D34*0.1>75,D34*0.1,75)","v":75},null,null,{"$f":"SUM(D34,G34,J34)","v":75}]
[]
[]
[]
[]
[null,"Met beleefde groeten,"]
[]
[null,"Katarzynski Mark"]
[null,"Zaakvoerder."]
[]
[]
[]
[]
[]
[]
[]
[]
[]
[]
[]
[]
[]
[]
[]
[]
[]
["Algemene verkoopsvoorwaarden."]
{"$rows_left_out":130}
{"sheet":"klantenlisting","index":3,"n_rows":5,"n_cols":8,"rows_kept":5,"cut":false,"hidden":false,"merged":[]}
["cust-000","Benaming","Adres","Postcode & gemeente","Tel / GSM","email","BTW-nr","herkenbare benaming"]
["cust-001","klant1","adres1","postcode 1",null,"mail1@hotmail.com"]
["cust-002","klant2","adres2","postcode2",null,"mail2@hotmail.com","BE123456789"]
["cust-003","klant3","adres3","postcode3",null,"mail3@hotmail.com"]
["cust-004","klant4","adres4","postcode4",null,"mail4@hotmail.com"]