{"text_format":"1","workbook":"xlsx","n_sheets":2,"sheets":["Blad1","Blad2"],"not_rendered":{"charts":0,"images":0,"macros":1,"external_links":0,"defined_names":1,"comments":0,"pivot_tables":0},"unopened":[],"bounds":{"document_bytes":16777216,"sheet_cells":100000,"rows_first":2000,"rows_last":500,"rows_between":2000,"halvings":0,"cell_chars":16384,"cell_head_chars":4096},"cells_cut":0,"cells_raw":0,"read":"whole","date_system":"1900"}

{"sheet":"Blad1","index":0,"n_rows":7,"n_cols":2,"rows_kept":7,"cut":false,"hidden":false,"merged":[]}
["Naam","Waarde"]
["Jan",1]
["Karel",2]
["An",0]
["Katrien",1]
["Joris",1]
["Corneel",0]

{"sheet":"Blad2","index":1,"n_rows":22,"n_cols":6,"rows_kept":22,"cut":false,"hidden":false,"merged":[]}
["Naam",null,null,null,"naam"]
["Joris",1,null,null,{"$f":"_xlfn._xlws.SORT(IF(Blad1!B2:B22>0,Blad1!A2:A22,\"\"),,-1)","v":"Katrien"},{"$f":"IF(E2<>\"\",VLOOKUP(E2,Blad1!$A$2:$B$22,2,0),\"\")","v":1}]
["Katrien",1,null,null,"Karel",{"$f":"IF(E3<>\"\",VLOOKUP(E3,Blad1!$A$2:$B$22,2,0),\"\")","v":2}]
["Karel",2,null,null,"Joris",{"$f":"IF(E4<>\"\",VLOOKUP(E4,Blad1!$A$2:$B$22,2,0),\"\")","v":1}]
["Jan",1,null,null,"Jan",{"$f":"IF(E5<>\"\",VLOOKUP(E5,Blad1!$A$2:$B$22,2,0),\"\")","v":1}]
[null,null,null,null,"",{"$f":"IF(E6<>\"\",VLOOKUP(E6,Blad1!$A$2:$B$22,2,0),\"\")","v":""}]
[null,null,null,null,"",{"$f":"IF(E7<>\"\",VLOOKUP(E7,Blad1!$A$2:$B$22,2,0),\"\")","v":""}]
[null,null,null,null,"",{"$f":"IF(E8<>\"\",VLOOKUP(E8,Blad1!$A$2:$B$22,2,0),\"\")","v":""}]
[null,null,null,null,"",{"$f":"IF(E9<>\"\",VLOOKUP(E9,Blad1!$A$2:$B$22,2,0),\"\")","v":""}]
[null,null,null,null,"",{"$f":"IF(E10<>\"\",VLOOKUP(E10,Blad1!$A$2:$B$22,2,0),\"\")","v":""}]
[null,null,null,null,"",{"$f":"IF(E11<>\"\",VLOOKUP(E11,Blad1!$A$2:$B$22,2,0),\"\")","v":""}]
[null,null,null,null,"",{"$f":"IF(E12<>\"\",VLOOKUP(E12,Blad1!$A$2:$B$22,2,0),\"\")","v":""}]
[null,null,null,null,"",{"$f":"IF(E13<>\"\",VLOOKUP(E13,Blad1!$A$2:$B$22,2,0),\"\")","v":""}]
[null,null,null,null,"",{"$f":"IF(E14<>\"\",VLOOKUP(E14,Blad1!$A$2:$B$22,2,0),\"\")","v":""}]
[null,null,null,null,"",{"$f":"IF(E15<>\"\",VLOOKUP(E15,Blad1!$A$2:$B$22,2,0),\"\")","v":""}]
[null,null,null,null,"",{"$f":"IF(E16<>\"\",VLOOKUP(E16,Blad1!$A$2:$B$22,2,0),\"\")","v":""}]
[null,null,null,null,"",{"$f":"IF(E17<>\"\",VLOOKUP(E17,Blad1!$A$2:$B$22,2,0),\"\")","v":""}]
[null,null,null,null,"",{"$f":"IF(E18<>\"\",VLOOKUP(E18,Blad1!$A$2:$B$22,2,0),\"\")","v":""}]
[null,null,null,null,"",{"$f":"IF(E19<>\"\",VLOOKUP(E19,Blad1!$A$2:$B$22,2,0),\"\")","v":""}]
[null,null,null,null,"",{"$f":"IF(E20<>\"\",VLOOKUP(E20,Blad1!$A$2:$B$22,2,0),\"\")","v":""}]
[null,null,null,null,"",{"$f":"IF(E21<>\"\",VLOOKUP(E21,Blad1!$A$2:$B$22,2,0),\"\")","v":""}]
[null,null,null,null,"",{"$f":"IF(E22<>\"\",VLOOKUP(E22,Blad1!$A$2:$B$22,2,0),\"\")","v":""}]