{"text_format":"1","workbook":"xlsx","n_sheets":6,"sheets":["factuur","Herinnering","Aangetekende","klantenlisting","Artikelen","Locatie"],"not_rendered":{"charts":0,"images":1,"macros":1,"external_links":0,"defined_names":11,"comments":0,"pivot_tables":0},"unopened":[],"bounds":{"document_bytes":16777216,"sheet_cells":100000,"rows_first":2000,"rows_last":500,"rows_between":2000,"halvings":0,"cell_chars":16384,"cell_head_chars":4096},"cells_cut":0,"cells_raw":0,"read":"whole","date_system":"1900"}

{"sheet":"factuur","index":0,"n_rows":445,"n_cols":19,"rows_kept":445,"cut":false,"hidden":false,"merged":[[392,0,393,14],[394,0,394,14],[186,10,186,11],[187,10,187,11],[192,10,192,11],[10,4,11,8],[5,9,5,13],[444,0,444,14],[324,0,324,13],[272,0,273,14],[274,0,274,14],[202,2,202,5],[202,6,202,7],[202,10,202,11],[203,2,203,5],[203,6,203,7],[203,10,203,11],[204,2,204,5],[204,6,204,7],[204,10,204,11],[198,2,198,5],[198,6,198,7],[198,10,198,11],[200,0,200,14],[201,2,201,5],[201,6,201,7],[187,6,187,7],[188,6,188,7],[189,6,189,7],[179,2,179,5],[180,2,180,5],[181,2,181,5],[201,10,201,11],[189,10,189,11],[190,10,190,11],[191,10,191,11],[180,6,180,7],[181,6,181,7],[182,6,182,7],[183,6,183,7],[183,10,183,11],[180,10,180,11],[181,10,181,11],[182,10,182,11],[184,6,184,7],[185,6,185,7],[186,6,186,7],[178,2,178,5],[196,0,196,14],[197,2,197,5],[197,6,197,7],[197,10,197,11],[187,2,187,5],[188,2,188,5],[189,2,189,5],[190,2,190,5],[191,2,191,5],[192,2,192,5],[182,2,182,5],[183,2,183,5],[184,2,184,5],[185,2,185,5],[186,2,186,5],[192,6,192,7],[185,10,185,11],[194,8,194,9],[194,10,194,11],[184,10,184,11],[190,6,190,7],[191,6,191,7],[188,10,188,11],[162,6,162,7],[44,3,44,8],[159,10,159,11],[160,10,160,11],[157,6,157,7],[168,2,168,5],[169,2,169,5],[161,10,161,11],[162,10,162,11],[53,3,53,9],[157,2,157,5],[56,3,56,7],[163,10,163,11],[164,10,164,11],[165,10,165,11],[166,10,166,11],[165,6,165,7],[165,2,165,5],[166,2,166,5],[167,2,167,5],[158,10,158,11],[158,6,158,7],[159,6,159,7],[160,6,160,7],[176,10,176,11],[177,6,177,7],[177,10,177,11],[171,2,171,5],[173,2,173,5],[178,10,178,11],[179,10,179,11],[178,6,178,7],[175,6,175,7],[176,6,176,7],[179,6,179,7],[176,2,176,5],[177,2,177,5],[171,10,171,11],[172,10,172,11],[173,10,173,11],[175,10,175,11],[175,2,175,5],[173,6,173,7],[172,2,172,5],[174,2,174,5],[174,6,174,7],[171,6,171,7],[174,10,174,11],[172,6,172,7],[163,6,163,7],[164,6,164,7],[163,2,163,5],[164,2,164,5],[170,2,170,5],[166,6,166,7],[167,6,167,7],[167,10,167,11],[168,6,168,7],[169,6,169,7],[170,6,170,7],[168,10,168,11],[169,10,169,11],[170,10,170,11],[158,2,158,5],[159,2,159,5],[160,2,160,5],[157,10,157,11],[49,12,50,13],[49,7,50,11],[53,12,53,13],[46,3,46,8],[39,9,40,11],[25,10,25,11],[26,10,26,11],[27,10,27,11],[32,1,32,8],[18,10,18,11],[38,10,38,11],[33,10,33,11],[34,10,34,11],[21,3,21,8],[19,3,19,8],[27,3,27,8],[32,10,32,11],[36,10,36,11],[28,10,28,11],[30,10,30,11],[31,10,31,11],[24,10,24,11],[14,12,14,13],[19,10,19,11],[20,10,20,11],[21,10,21,11],[22,10,22,11],[33,1,33,8],[10,3,11,3],[18,3,18,8],[22,1,22,8],[28,1,28,8],[17,6,17,7],[17,10,17,11],[14,8,14,9],[16,1,16,13],[29,10,29,11],[24,1,24,8],[26,1,26,8],[10,1,11,2],[20,1,20,8],[23,10,23,11],[31,1,31,8],[23,3,23,8],[25,3,25,8],[30,1,30,8],[161,6,161,7],[161,2,161,5],[162,2,162,5],[44,12,47,13],[43,12,43,13],[43,9,43,11],[39,12,40,13],[43,3,43,8],[34,1,34,8],[35,1,35,8],[45,3,45,8],[37,1,37,8],[38,1,38,8],[47,3,47,8],[47,9,47,11],[45,9,45,11],[36,1,36,8],[35,10,35,11],[155,0,155,13],[62,0,62,13],[54,12,54,13],[44,9,44,11],[37,10,37,11],[46,9,46,11]]}
["2021-01-10","Markata",null,null,null,null,null,null,null,null,null,null,null,null,null,null,null,null,0]
[null,null,null,null,null,null,null,null,null,null,null,null,null,null,null,null,null,null,1]
[null,null,null,null,null,null,null,null,null,{"$f":"IF(B11=\"Bestelbon :\",\"Leverancier :\",\"Klantnummer :\")","v":"Klantnummer :"},null,null,null,null,null,null,null,null,2]
[null,null,null,null,null,null,null,null,null,{"$f":"_xlfn.XLOOKUP(J6,klantenlisting!B:B,klantenlisting!A:A,\" \")","v":0},null,null,null,null,null,null,null,null,3]
[null,"Ondn°:",null,null,null,null,null,null,null,null,null,null,null,null,null,null,null,null,4]
[null,null,null,null,null,null,null,null,null,null,null,null,null,null,null,null,null,null,5]
[null,{"$f":"IF(AND($L$10>1,_xlfn.XLOOKUP($J$6,klantenlisting!B:B,klantenlisting!K:K)>1),\"Klantnummer : \" & _xlfn.XLOOKUP($J$6,klantenlisting!B:B,klantenlisting!K:K),)","v":0},null,null,null,null,null,null,null,{"$f":"IF(L10>1,\"t.a.v. \" & (_xlfn.XLOOKUP(J6,Tabel3[Benaming],Tabel3[Aanspreektitel])),)","v":0},null,null,null,null,null,null,null,null,6]
[null,null,null,null,null,null,null,null,null,{"$f":"_xlfn.XLOOKUP(J6,Tabel3[Benaming],Tabel3[Adres],\" \")","v":0},null,null,null,null,null,"Offerte :","OF",null,7]
[null,null,null,null,null,null,null,null,null,{"$f":"_xlfn.XLOOKUP(J6,Tabel3[Benaming],Tabel3[Postcode & gemeente])","v":0},null,null,null,null,null,"Order :","OR",null,8]
[null,null,null,null,null,null,null,null,null,{"$f":"IF(L10>0,\"Ondn°:\",\"\")","v":""},null,{"$f":"_xlfn.XLOOKUP($J$6,Tabel3[Benaming],Tabel3[BTW-nr])","v":0},null,null,null,"Factuur :","VK",null,9]
[null," ",null,{"$f":"_xlfn.XLOOKUP(B11,P8:P13,Q8:Q13,\"\")","v":""},{"$f":"YEAR(D15) &\"-0\"","v":"1900-0"},null,null,null,null,null,null,null,null,null,null,"Creditnota :","CN",null,10]
[null,null,null,null,null,null,null,null,null,null,null,null,null,null,null,"Bestelbon :","BB",null,11]
[null,null,null,null,null,null,null,null,null,null,null,null,null,null,null,"Verkoop :","SA",null,12]
[null,null,null,{"$f":"IF(B11=P8,\"Opmaakdatum :\",\"Datum :\")","v":"Datum :"},null,null,null,null,{"$f":"IF(B11=P10,\"Datum opeisbaarheid BTW :\",0)","v":0},null,null,null,{"$f":"IF(B11=P10,\"Leverdatum :\",0)","v":0},null,null," "," ",null,13]
[null,null,null,null,null,null,null,null,{"$f":"IF(B11=P10,D15,0)","v":"00:00:00"},null,null,null,{"$f":"IF(AND(B11=P10,D15>1/1/2020),D15-5,\"\")","v":""},null,null,null,null,null,14]
[null,null,null,null,null,null,null,null,null,null,null,null,null,null,null,null,null,null,15]
[null," Plaats levering of uitvoering werf :",null,null,null,null,null,null,null,null,null,null,null,null,null,",",null,null,16]
[null,null,null,null,null,null,null,null,null,null,null,null,null,null,null,{"$f":"J8&\", \"&J9","v":"0, 0"},null,null,17]
[null,"Artikel",null,"Aard goederen / werkuren",null,null,null,null,null,"Aantal","Eenheid",null,"Bedrag","BTW %",null,"Diverse werven",null,null,18]
[null,{"$f":"_xlfn.IFS($B$11=P14,P14,$B$11=\"\",\"\",AND($J$6=\"Vanhaeren Services & Scaffoldings BVBA\",$C$158=P154),P35,$C$158=P155,P34,$C$158=P153,\"\")","v":" "},null,{"$f":"IF(B20=P34,\"(zie bijlage)\",\"\")","v":""},null,null,null,null,null,{"$f":"_xlfn.IFS($B$20=\"\",0,$B$20=P26,0,$J$6=\"Vanhaeren Services & Scaffoldings BVBA\",SUM(A159:A193),$B$20=P34,1)","v":0},{"$f":"_xlfn.IFNA(INDEX($P$26:$Q$36,MATCH($B$20,$P$26:$P$36,0),2),0)","v":0},null,{"$f":"_xlfn.IFNA(SUM(J20*K20),0)","v":0},{"$f":"IF(AND($J$6=\"Vanhaeren Services & Scaffoldings BVBA\",B20=P35),21,)","v":0},null,"Andere : ",null,null,19]
[null,null,null,null,null,null,null,null,null,null,null,null,null,null,null,"home adres",null,null,20]
[null,{"$f":"_xlfn.IFS($B$11=P14,P14,$B$11=\"\",\"\",AND($J$6=\"Vanhaeren Services & Scaffoldings BVBA\",$C$158=P154),P36,$B$11=P9,P26,$B$11=P11,P26,$B$11=P12,P26,$B$11=P13,P26,$C$158=P155,P27,$C$158=P153,\"\")","v":" "},null,{"$f":"_xlfn.IFS($B$22=P26,P26,$B$22=\"\",P26,AND($B$22=P27,$B$11=P8),\"(geschatte aantal uren)\",$B$22=P27,\"(zie bijlage)\",$B$22=P36,\"\",$B$22=P29,\"\",$B$22=P30,\"\",$B$22=P31,\"\",$B$22=P32,\"\",$B$22=P33,\"\")","v":" "},null,null,null,null,null,{"$f":"IF($J$6=\"Vanhaeren Services & Scaffoldings BVBA\",SUM(B159:B193),SUM(J202:J205))","v":0},{"$f":"_xlfn.IFNA(INDEX($P$26:$Q$36,MATCH($B$22,$P$26:$P$36,0),2),0)","v":0},null,{"$f":"_xlfn.IFNA(SUM(J22*K22),\"\")","v":0},{"$f":"IF(AND($J$6=\"Vanhaeren Services & Scaffoldings BVBA\",B22=P36),21,)","v":0},null,"Ophaling filiaal",null,null,21]
[null,null,null,null,null,null,null,null,null,null,null,null,null,null,null,null,null,null,22]
[null," ",null,null,null,null,null,null,null,{"$f":"IF(AND($J$6=\"Vanhaeren Services & Scaffoldings BVBA\",G198>1/1/2020),SUM(J198:J199),0)","v":0},{"$f":"_xlfn.IFNA(INDEX($P$26:$Q$36,MATCH(B24,$P$26:$P$36,0),2),0)","v":0},null,{"$f":"_xlfn.IFNA(SUM(J24*K24),0)","v":0},{"$f":"IF(AND($J$6=\"Vanhaeren Services & Scaffoldings BVBA\",OR(B24=P32,B24=P33)),21,)","v":0},null,null,null,null,23]
[null,null,null,null,null,null,null,null,null,null,null,null,null,null,null,null,null,null,24]
[null," ",null,null,null,null,null,null,null,{"$f":"IF(AND(J6=\"Vanhaeren Services & Scaffoldings BVBA\",G202>1/1/2020),SUM(J202:J205),0)","v":0},{"$f":"_xlfn.IFNA(INDEX($P$26:$Q$36,MATCH(B26,$P$26:$P$36,0),2),0)","v":0},null,{"$f":"_xlfn.IFNA(SUM(J26*K26),0)","v":0},{"$f":"IF(AND($J$6=\"Vanhaeren Services & Scaffoldings BVBA\",OR(B26=P32,B26=P33)),21,)","v":0},null," ",0,null,25]
[null,null,null,null,null,null,null,null,null,null,null,null,null,null,null,"Werkuren",80,null,26]
[null," ",null,null,null,null,null,null,null,null,{"$f":"_xlfn.IFNA(INDEX($P$26:$Q$36,MATCH($B$28,$P$26:$P$36,0),2),\"\")","v":0},null,{"$f":"_xlfn.IFNA(SUM(J28*K28),0)","v":0},null,null,"Levering",null,null,27]
[null,null,null,null,null,null,null,null,null,null,null,null,{"$f":"SUM(J29*K29)","v":0},null,null,"Verzending",0,null,28]
[null,null,null,null,null,null,null,null,null,null,null,null,0,null,null,"Afhaling",0,null,29]
{"$rows_left_out":416}
{"sheet":"Herinnering","index":1,"n_rows":105,"n_cols":46,"rows_kept":105,"cut":false,"hidden":false,"merged":[[2,10,2,12],[3,10,3,12],[5,10,5,13],[7,10,7,13],[8,10,8,13],[60,0,60,13],[10,1,11,6],[14,12,14,13],[3,48,3,50],[4,48,4,50],[7,48,7,51],[8,48,8,51],[9,48,9,49],[30,49,30,50],[10,38,11,43],[12,50,12,51],[14,41,14,44],[14,46,14,47],[14,50,14,51],[9,10,9,11]]}
["2021-01-10",{"$f":"factuur!B1","v":"Markata"}]
[]
[null,null,null,null,null,null,null,null,null,null,{"$f":"IF(B11=\"Bestelbon :\",\"Leverancier :\",\"Klantnummer :\")","v":"Klantnummer :"}]
[1,null,null,null,null,null,null,null,null,null,{"$f":"IF(B11=\"Bestelbon\",_xlfn.XLOOKUP(K6,klantenlisting!B:B,klantenlisting!A:A),_xlfn.XLOOKUP(K6,klantenlisting!B:B,klantenlisting!A:A,klantenlisting!A7))","v":"supp-002"}]
[null,{"$f":"factuur!B5","v":"Ondn°:"},null,null,{"$f":"factuur!D5","v":0}]
[2,null,null,null,null,null,null,null,null,null,{"$f":"factuur!J6","v":0}]
[null,{"$f":"IF(AND(factuur!L10>1,_xlfn.XLOOKUP(K6,klantenlisting!B:B,klantenlisting!K:K)>1),\"Klantnummer : \" & _xlfn.XLOOKUP(K6,klantenlisting!B:B,klantenlisting!K:K),\"\")","v":{"$error":"#N/A"}},null,null,null,null,null,null,null,null,{"$f":"IF(M10>1,\"t.a.v. \" & (_xlfn.XLOOKUP($K$6,klantenlisting!$B:$B,klantenlisting!$J:$J)),)","v":{"$error":"#N/A"}}]
[null,null,null,null,null,null,null,null,null,null,{"$f":"factuur!J8","v":0}]
[3,null,null,null,null,null,null,null,null,null,{"$f":"factuur!J9","v":0}]
[null,null,null,null,null,null,null,null,null,null,{"$f":"factuur!J10","v":""},null,{"$f":"_xlfn.XLOOKUP(K6,klantenlisting!B:B,klantenlisting!H:H,\" \")","v":" "},null,"Herinnering."]
[null,"Herinnering.",null,null,null,null,null,null,null,null,null,null,null,null,"2e Herinnering."]
[4,null,null,null,null,null,null,null,null,null,null,null,null,null,"Aanmaning."]
[null,null,null,null,null,null,null,null,null,null,null,{"$f":"\"Pelt, \" & factuur!$D$15","v":"Pelt, "},null,null,"2e Aanmaning."]
[]
[]
[5]
[null,{"$f":"\"Betreft factuur : \" & factuur!D11 & \" \" & factuur!E11","v":"Betreft factuur :  1900-0"}]
[]
[]
[null,"Geachte Heer, Mevrouw,"]
[]
[]
[null,{"$f":"\"Hierbij willen wij u informeren dat uw rekening nog een openstaand saldo vertoond van \" & factuur!$M$45 & \"€\"","v":"Hierbij willen wij u informeren dat uw rekening nog een openstaand saldo vertoond van €"}]
[null,{"$f":"\"op factuur : \" & factuur!D11 & \" \" & factuur!E11","v":"op factuur :  1900-0"}]
[]
[]
[null,"Wij gaan er van uit dat u de betaling over het hoofd hebt gezien en vragen u dan ook het achterstallige bedrag"]
[null,{"$f":"\"over te maken op onze rekening : \" & factuur!M54 & \" BIC: sfsdd met vermelding van het\"","v":"over te maken op onze rekening :  BIC: sfsdd met vermelding van het"}]
[null,"factuurnummer."]
[null,"Als u intussen het bedrag gestort heeft, mag u deze kennisgeving als onbestaand beschouwen."]
{"$rows_left_out":76}
{"sheet":"Aangetekende","index":2,"n_rows":189,"n_cols":13,"rows_kept":189,"cut":false,"hidden":false,"merged":[[5,10,5,14],[10,1,11,7],[14,9,14,10],[14,13,14,14],[59,0,59,15],[33,9,33,10],[33,6,33,8],[33,12,33,14],[157,6,157,8],[157,9,157,10],[157,12,157,14],[154,0,154,9],[154,10,154,15]]}
["2021-01-10","Markata"]
[]
[null,null,null,null,null,null,null,null,null,null,{"$f":"IF(B11=\"Bestelbon :\",\"Leverancier :\",\"Klantnummer :\")","v":"Klantnummer :"}]
[null,null,null,null,null,null,null,null,null,null,{"$f":"IF(B11=\"Bestelbon\",_xlfn.XLOOKUP(K6,klantenlisting!B:B,klantenlisting!A:A),_xlfn.XLOOKUP(K6,klantenlisting!B:B,klantenlisting!A:A,\"\"))","v":""}]
[null,"Ondn°:"]
[null,null,null,null,null,null,null,null,null,null,{"$f":"factuur!J6","v":0}]
[null,{"$f":"IF(AND(M10>1,_xlfn.XLOOKUP(K6,klantenlisting!B:B,klantenlisting!K:K)>1),\"Klantnummer : \" & _xlfn.XLOOKUP(K6,klantenlisting!B:B,klantenlisting!K:K),)","v":{"$error":"#N/A"}},null,null,null,null,null,null,null,null,{"$f":"IF(M10>1,\"t.a.v. \" & (_xlfn.XLOOKUP(K6,klantenlisting!$B:$B,klantenlisting!$J:$J)),)","v":{"$error":"#N/A"}}]
[null,null,null,null,null,null,null,null,null,null,{"$f":"_xlfn.XLOOKUP(K6,klantenlisting!B:B,klantenlisting!C:C,\" \")","v":" "}]
[null,null,null,null,null,null,null,null,null,null,{"$f":"_xlfn.XLOOKUP(K6,klantenlisting!B:B,klantenlisting!E:E,\" \")","v":" "}]
[null,null,null,null,null,null,null,null,null,null,{"$f":"IF(M10>0,\"Ondn°:\",\"\")","v":"Ondn°:"},null,{"$f":"_xlfn.XLOOKUP(K6,klantenlisting!B:B,klantenlisting!H:H,\" \")","v":" "}]
[null,"Aangetekende zending."]
[]
[null,null,null,null,null,null,null,null,null,null,null,null,{"$f":"\"Pelt, \" & factuur!$D$15","v":"Pelt, "}]
[]
[]
[]
[null,{"$f":"\"Betreft factuur : \"&factuur!$D$11&\" \"&factuur!$E$11","v":"Betreft factuur :  1900-0"}]
[]
[]
[null,"Geachte Heer, Mevrouw,"]
[]
[]
[null,"Alle vorige aanmaningen bleven zonder gevolg. Behoudens betaling of reactie binnen de 8 dagen "]
[null,"op dit voorstel tot minnelijke schikking, zullen wij laten dagvaarden."]
[]
[null,"Indien u deze dagvaarding niet wenst te ontvangen, manen wij u aan om het volledige bedrag van"]
[null,{"$f":"M34 &\"€\" & \" per kerende te betalen op onze rekening : \" & factuur!$M$54 & \"   BIC: dshfsgn,\"","v":{"$error":"#VALUE!"}}]
[null,"of ons een voorstel tot afbetaling te zenden per post of per mail op het volgend adres :"]
[null,{"$f":"IF(B12=Q14,\"\",\"Als u het bedrag intussen gestort hebt, mag u deze kennisgeving als onbestaand beschouwen.\")","v":""}]
[]
{"$rows_left_out":160}
{"sheet":"klantenlisting","index":3,"n_rows":41,"n_cols":11,"rows_kept":41,"cut":false,"hidden":false,"merged":[]}
["Nummer","Benaming","Adres","Adres 2","Postcode & gemeente","Tel / GSM","email","BTW-nr","herkenbare benaming","Aanspreektitel","klantnummer"]
["cust-001","cust 01"]
["cust-002","Vanhaeren Services & Scaffoldings BVBA",null,null,null,null,null,"be0345234234"]
["cust-003","cust-003"]
["cust-004","cust-004"]
["supp-001","lev5",null,null,null,null,null,"BE0654123321"]
["supp-002","lev34"]
["supp-003","lev22"]
["supp-004","lev10"]
["supp-005","lev27"]
["supp-006","lev1"]
["supp-007","lev34"]
["supp-008","lev7"]
["supp-009","lev21"]
["supp-010","lev32"]
["supp-011","lev4"]
["supp-012","lev33"]
["supp-013","lev31"]
["supp-014","lev19"]
["supp-015","lev3"]
["supp-016","lev20"]
["supp-017","lev28"]
["supp-018","lev9"]
["supp-019","lev15"]
["supp-020","lev2"]
["supp-021","lev12"]
["supp-022","lev18"]
["supp-023","lev29"]
["supp-024","lev16"]
["supp-025","lev26"]
{"$rows_left_out":12}
{"sheet":"Artikelen","index":4,"n_rows":155,"n_cols":8,"rows_kept":155,"cut":false,"hidden":false,"merged":[]}
["Benaming","referentie","Aankoopprijs","Leverancier","Categorie","Originele prijs","% factor","per"]
[" ",null,{"$f":"IF(AND(lijst[[#This Row],[Originele prijs]]>0,lijst[[#This Row],[% factor]]>0),SUM(lijst[[#This Row],[Originele prijs]]*lijst[[#This Row],[% factor]]),lijst[[#This Row],[Originele prijs]])","v":0}]
["1mod autom 2p 20a","abb2cdb111201R0204",{"$f":"IF(AND(lijst[[#This Row],[Originele prijs]]>0,lijst[[#This Row],[% factor]]>0),SUM(lijst[[#This Row],[Originele prijs]]*lijst[[#This Row],[% factor]]),lijst[[#This Row],[Originele prijs]])","v":0},null,"zekering"]
["2x 1/2 toets lens cream","NIK10061507",{"$f":"IF(AND(lijst[[#This Row],[Originele prijs]]>0,lijst[[#This Row],[% factor]]>0),SUM(lijst[[#This Row],[Originele prijs]]*lijst[[#This Row],[% factor]]),lijst[[#This Row],[Originele prijs]])","v":0},null,"schakelaar"]
["52M kamgeleider L1-L2-L3-N / L1+N/L","FTGE89452130",{"$f":"IF(AND(lijst[[#This Row],[Originele prijs]]>0,lijst[[#This Row],[% factor]]>0),SUM(lijst[[#This Row],[Originele prijs]]*lijst[[#This Row],[% factor]]),lijst[[#This Row],[Originele prijs]])","v":0},null,"zekeringkast"]
["54M kamgeleider 4P L1NL2NL3N - pin","FTGE86354130",{"$f":"IF(AND(lijst[[#This Row],[Originele prijs]]>0,lijst[[#This Row],[% factor]]>0),SUM(lijst[[#This Row],[Originele prijs]]*lijst[[#This Row],[% factor]]),lijst[[#This Row],[Originele prijs]])","v":0},null,"zekeringkast"]
["56M kamgeleider 2P=L1 L2(N) - pin","FTGE80258100",{"$f":"IF(AND(lijst[[#This Row],[Originele prijs]]>0,lijst[[#This Row],[% factor]]>0),SUM(lijst[[#This Row],[Originele prijs]]*lijst[[#This Row],[% factor]]),lijst[[#This Row],[Originele prijs]])","v":0},null,"zekeringkast"]
["aardelectrode 5/8\" 1,5m","BIZ710792",{"$f":"IF(AND(lijst[[#This Row],[Originele prijs]]>0,lijst[[#This Row],[% factor]]>0),SUM(lijst[[#This Row],[Originele prijs]]*lijst[[#This Row],[% factor]]),lijst[[#This Row],[Originele prijs]])","v":0},null,"aarding"]
["aardelectrode klem 5/8\"","HUPHUP32MU16",{"$f":"IF(AND(lijst[[#This Row],[Originele prijs]]>0,lijst[[#This Row],[% factor]]>0),SUM(lijst[[#This Row],[Originele prijs]]*lijst[[#This Row],[% factor]]),lijst[[#This Row],[Originele prijs]])","v":0},null,"aarding"]
["aardelectrode koppelstuk 5/8\"","CAW158040",{"$f":"IF(AND(lijst[[#This Row],[Originele prijs]]>0,lijst[[#This Row],[% factor]]>0),SUM(lijst[[#This Row],[Originele prijs]]*lijst[[#This Row],[% factor]]),lijst[[#This Row],[Originele prijs]])","v":0},null,"aarding"]
["aardingsbeugel 2.5-16 MM2 420MM 50-75mm","BIZ710455",{"$f":"IF(AND(lijst[[#This Row],[Originele prijs]]>0,lijst[[#This Row],[% factor]]>0),SUM(lijst[[#This Row],[Originele prijs]]*lijst[[#This Row],[% factor]]),lijst[[#This Row],[Originele prijs]])","v":0},null,"aarding"]
["aardingsonderbreker equip.","VYN600944",{"$f":"IF(AND(lijst[[#This Row],[Originele prijs]]>0,lijst[[#This Row],[% factor]]>0),SUM(lijst[[#This Row],[Originele prijs]]*lijst[[#This Row],[% factor]]),lijst[[#This Row],[Originele prijs]])","v":0},null,"aarding"]
["afdekpl. 60mm 2-voudig cream","NIK10076200",{"$f":"IF(AND(lijst[[#This Row],[Originele prijs]]>0,lijst[[#This Row],[% factor]]>0),SUM(lijst[[#This Row],[Originele prijs]]*lijst[[#This Row],[% factor]]),lijst[[#This Row],[Originele prijs]])","v":0},null,"schakelaar"]
["afdekpl. 60mm 3-voudig cream","NIK10076300",{"$f":"IF(AND(lijst[[#This Row],[Originele prijs]]>0,lijst[[#This Row],[% factor]]>0),SUM(lijst[[#This Row],[Originele prijs]]*lijst[[#This Row],[% factor]]),lijst[[#This Row],[Originele prijs]])","v":0},null,"schakelaar afwerking"]
["afdekpl. 71mm 2-voudig cream","NIK10076800",{"$f":"IF(AND(lijst[[#This Row],[Originele prijs]]>0,lijst[[#This Row],[% factor]]>0),SUM(lijst[[#This Row],[Originele prijs]]*lijst[[#This Row],[% factor]]),lijst[[#This Row],[Originele prijs]])","v":0},null,"schakelaar afwerking"]
["afdepkpl. Enkel cream","NIK10076100 ",{"$f":"IF(AND(lijst[[#This Row],[Originele prijs]]>0,lijst[[#This Row],[% factor]]>0),SUM(lijst[[#This Row],[Originele prijs]]*lijst[[#This Row],[% factor]]),lijst[[#This Row],[Originele prijs]])","v":0},null,"schakelaar afwerking"]
["aftakdoos OPB.DS IP55","HEL250",{"$f":"IF(AND(lijst[[#This Row],[Originele prijs]]>0,lijst[[#This Row],[% factor]]>0),SUM(lijst[[#This Row],[Originele prijs]]*lijst[[#This Row],[% factor]]),lijst[[#This Row],[Originele prijs]])","v":0},null,"installatiemateriaal"]
["aftakdoos plexo vierk. IP55","LEG092005",{"$f":"IF(AND(lijst[[#This Row],[Originele prijs]]>0,lijst[[#This Row],[% factor]]>0),SUM(lijst[[#This Row],[Originele prijs]]*lijst[[#This Row],[% factor]]),lijst[[#This Row],[Originele prijs]])","v":0},null,"installatiemateriaal"]
["afw.drukknopdimmer 2-100W, CREAM","NIK10031002",{"$f":"IF(AND(lijst[[#This Row],[Originele prijs]]>0,lijst[[#This Row],[% factor]]>0),SUM(lijst[[#This Row],[Originele prijs]]*lijst[[#This Row],[% factor]]),lijst[[#This Row],[Originele prijs]])","v":0},null,"schakelaar dimmer"]
["afw.drukknopdimmer CREAM","NIK10031002",{"$f":"IF(AND(lijst[[#This Row],[Originele prijs]]>0,lijst[[#This Row],[% factor]]>0),SUM(lijst[[#This Row],[Originele prijs]]*lijst[[#This Row],[% factor]]),lijst[[#This Row],[Originele prijs]])","v":0},null,"schakelaar dimmer"]
["autom. Resi9 2P 16A","SERR9F64216",{"$f":"IF(AND(lijst[[#This Row],[Originele prijs]]>0,lijst[[#This Row],[% factor]]>0),SUM(lijst[[#This Row],[Originele prijs]]*lijst[[#This Row],[% factor]]),lijst[[#This Row],[Originele prijs]])","v":0},null,"zekering"]
["autom. Resi9 2P 20A","SERR9F64220",{"$f":"IF(AND(lijst[[#This Row],[Originele prijs]]>0,lijst[[#This Row],[% factor]]>0),SUM(lijst[[#This Row],[Originele prijs]]*lijst[[#This Row],[% factor]]),lijst[[#This Row],[Originele prijs]])","v":0},null,"zekering"]
["autom. RESI9 2P 25A","SERR9F64225",{"$f":"IF(AND(lijst[[#This Row],[Originele prijs]]>0,lijst[[#This Row],[% factor]]>0),SUM(lijst[[#This Row],[Originele prijs]]*lijst[[#This Row],[% factor]]),lijst[[#This Row],[Originele prijs]])","v":0},null,"zekering"]
["autom. Resi9 4P 25A","SERR9F64425",{"$f":"IF(AND(lijst[[#This Row],[Originele prijs]]>0,lijst[[#This Row],[% factor]]>0),SUM(lijst[[#This Row],[Originele prijs]]*lijst[[#This Row],[% factor]]),lijst[[#This Row],[Originele prijs]])","v":0},null,"zekering"]
["autom. Resi9 4p 32a","SERR9F64432",{"$f":"IF(AND(lijst[[#This Row],[Originele prijs]]>0,lijst[[#This Row],[% factor]]>0),SUM(lijst[[#This Row],[Originele prijs]]*lijst[[#This Row],[% factor]]),lijst[[#This Row],[Originele prijs]])","v":0},null,"zekering"]
["bew.melder master","thethemuras180100upnwh",{"$f":"IF(AND(lijst[[#This Row],[Originele prijs]]>0,lijst[[#This Row],[% factor]]>0),SUM(lijst[[#This Row],[Originele prijs]]*lijst[[#This Row],[% factor]]),lijst[[#This Row],[Originele prijs]])","v":0},null,"schakelaar"]
["bew.melder slave","THETHEMURAS180SLAVEUPWH",{"$f":"IF(AND(lijst[[#This Row],[Originele prijs]]>0,lijst[[#This Row],[% factor]]>0),SUM(lijst[[#This Row],[Originele prijs]]*lijst[[#This Row],[% factor]]),lijst[[#This Row],[Originele prijs]])","v":0},null,"schakelaar"]
["blindpl, sokkel en afwerkingsset cream","NIK10176900",{"$f":"IF(AND(lijst[[#This Row],[Originele prijs]]>0,lijst[[#This Row],[% factor]]>0),SUM(lijst[[#This Row],[Originele prijs]]*lijst[[#This Row],[% factor]]),lijst[[#This Row],[Originele prijs]])","v":0},null,"schakelaar afwerking"]
["buisklem beugel 20mm","REY0115",{"$f":"IF(AND(lijst[[#This Row],[Originele prijs]]>0,lijst[[#This Row],[% factor]]>0),SUM(lijst[[#This Row],[Originele prijs]]*lijst[[#This Row],[% factor]]),lijst[[#This Row],[Originele prijs]])","v":0},null,"installatiemateriaal"]
["coax & UTP aansluiting","NIK17065158",{"$f":"IF(AND(lijst[[#This Row],[Originele prijs]]>0,lijst[[#This Row],[% factor]]>0),SUM(lijst[[#This Row],[Originele prijs]]*lijst[[#This Row],[% factor]]),lijst[[#This Row],[Originele prijs]])","v":0},null,"schakelaar"]
{"$rows_left_out":126}
{"sheet":"Locatie","index":5,"n_rows":112,"n_cols":6,"rows_kept":112,"cut":false,"hidden":false,"merged":[]}
["locatie","dag","lange dag","Soort","afk.soort","Datum"]
[" "]
["Antwerpen",1]
["Antwerpen - lang",null,1]
["Ardooie",1]
["Ardooie - lang",null,1]
["Baal",1]
["Baal - lang",null,1]
["Beringen",1]
["Beringen - lang",null,1]
["Boom",1]
["Boom - lang",null,1]
["Bredene",1]
["Bredene - lang",null,1]
["Dendermonde",1]
["Dendermonde - lang",null,1]
["Diegem",1]
["Diegem - lang",null,1]
["Eeklo",1]
["Eeklo - lang",null,1]
["Essen",1]
["Essen - lang",null,1]
["Gasselte - lang (NL)",null,1]
["Gasselte (NL)",1]
["Gavere",1]
["Gavere - lang",null,1]
["Gieten",1]
["Gieten - lang",null,1]
["Gullegem",1]
["Gullegem - lang",null,1]
{"$rows_left_out":82}