{"text_format":"1","workbook":"xlsx","n_sheets":4,"sheets":["Instellingen","Kalender","Relaties","Factuur"],"not_rendered":{"charts":0,"images":1,"macros":1,"external_links":0,"defined_names":36,"comments":1,"pivot_tables":0},"unopened":[],"bounds":{"document_bytes":16777216,"sheet_cells":100000,"rows_first":2000,"rows_last":500,"rows_between":2000,"halvings":0,"cell_chars":16384,"cell_head_chars":4096},"cells_cut":0,"cells_raw":0,"read":"whole","date_system":"1900"}

{"sheet":"Instellingen","index":0,"n_rows":106,"n_cols":10,"rows_kept":106,"cut":false,"hidden":false,"merged":[[0,8,0,9],[9,8,9,9]]}
[null,null,"Locaties in werkblad(en)",null,"Boekjaar: >>>",{"$f":"J4","v":2021},null,null,"Nieuw boekjaar"]
[null,null,null,null,null,null,null,null,"Pad: ","D:\\DSR Cleaning"]
["Adresgegevens",null,"Cel C7 t/m C13 in werkbladen Offerte, Opdrachtbevestiging, Factuur, Herinnering, Incasso en Credit ",null,null,null,null,null,"Bestandsnaam:","Bedrijfsadministratie"]
[null,null,null,null,null,null,null,null,"Boekjaar:",2021]
[null,null,null,null,null,null,null,null,"Eerste factuurnr:",{"$f":"J4&\"0000\"","v":"20210000"}]
[]
[]
[]
[]
[null,null,null,null,null,null,null,null,"Bestand voor administratiekantoor "]
[null,null,null,null,null,null,null,null,"Bestandsnaam:","Administratiekantoor"]
["BTW instellingen (procenten)",null,null,null,null,null,null,null,"Boekjaar:",2020]
[21,null,"Cel C39 in werkbladen Offerte, Opdrachtbevestiging, Factuur, Herinnering, Incasso en Credit "]
[9,null,"Cel C39 in werkbladen Offerte, Opdrachtbevestiging, Factuur, Herinnering, Incasso en Credit "]
[null,null,"Cel C39 in werkbladen Offerte, Opdrachtbevestiging, Factuur, Herinnering, Incasso en Credit "]
["Hoog",null,"Keuzeveld kolom R in werkblad Boekingen"]
["Laag",null,"Keuzeveld kolom R in werkblad Boekingen"]
["Geen",null,"Keuzeveld kolom R in werkblad Boekingen"]
[]
["Uurloon excl. BTW"]
[null,null,"Geheugensteun voor prijzen in cel G9 werkblad Factuur"]
[]
["Gegevens op offerte en factuur"]
["excl BTW",null,"Keuzeveld kolom Q in werkblad Boekingen"]
["incl BTW",null,"Keuzeveld kolom Q in werkblad Boekingen"]
["Reinigingswerkzaamheden volgens afspraak",null,"Keuzeveld cel B27 werkbladen Offerte, Opdrachtbevestiging, Factuur, Herinnering en Incasso"]
["Reinigingswerkzaamheden bestaande uit:",null,"Keuzeveld cel B27 werkbladen Offerte, Opdrachtbevestiging, Factuur, Herinnering en Incasso"]
[]
["Afdrukmarges"]
["Links = 2,0"]
["Rechts = 1,4"]
["Boven = 1,4"]
["Onder = 1,4"]
[]
["Geslacht"]
["dhr.","heer","Keuzeveld kolom B in werkblad Relaties"]
["mevr.","mevrouw","Keuzeveld kolom B in werkblad Relaties"]
["fam.","familie","Keuzeveld kolom B in werkblad Relaties"]
[null,null,"Keuzeveld kolom B in werkblad Relaties"]
["Dagboeken"]
["ABNA bank",null,"Keuzeveld kolom K in werkblad Boekingen"]
["Kas",null,"Keuzeveld kolom K in werkblad Boekingen"]
["Memoriaal",null,"Keuzeveld kolom K in werkblad Boekingen"]
["Verkoop",null,"Keuzeveld kolom K in werkblad Boekingen"]
[]
["Burenkorting"]
[" "]
["burenkorting 5%",null,"Keuzeveld kolom R in werkblad Relaties"]
["burenkorting 10%",null,"Keuzeveld kolom R in werkblad Relaties"]
["burenkorting 15%",null,"Keuzeveld kolom R in werkblad Relaties"]
["burenkorting 20%",null,"Keuzeveld kolom R in werkblad Relaties"]
["burenkorting toegepast",null,"Keuzeveld kolom R in werkblad Relaties"]
[]
[]
["Betaalwijze"]
["betalen met bankoverschrijving",null,"Keuzeveld cel B41 in werkblad Factuur"]
["voldaan met pinautomaat",null,"Keuzeveld cel B41 in werkblad Factuur"]
["voldaan contant",null,"Keuzeveld cel B41 in werkblad Factuur"]
[]
["Code's voor taken"]
["0"]
[1]
[2]
[3]
[4]
[5]
[6]
[7]
[8]
[9,null,"Gereserveerd voor BTW code laag (9% vanaf het jaar 2019)"]
[]
["Grootboekrekeningen"]
["Algemene kosten"]
["Advertentiekosten"]
["Bankkosten"]
["Banksaldo"]
["Belastingen"]
["BTW afdracht"]
["Energiekosten"]
["Giften"]
["Hotel en verblijf"]
["Huisvestingskosten"]
["Inkopen"]
["Investeringen"]
["Kantoorkosten"]
["Kassaldo"]
["Kruisposten"]
["Leningen"]
["Omzet"]
["Overige kosten"]
["Overige opbrengsten"]
["Prestaties Binnenland (BTW verlegd)"]
["Privé"]
["Reclame en verkoopkosten"]
["Relatiegeschenken"]
["Rente"]
["Representatiekosten"]
["Vervoerskosten"]
["Verzekeringen"]
["Werk door derden (BTW hoog)"]
["Werkkleding"]
[]
["Volgende reiniging aanpassen"]
[{"$f":"IFERROR(INDEX(Kalender!F:F,MATCH(IF(INDEX(Relaties!P:P*7,MATCH($F$1,Relaties!W:W,0))=0,0,(INDEX(Relaties!P:P*7,MATCH($F$1,Relaties!W:W,0))+D23)),Kalender!A:A,0)),\"nvt\")","v":"nvt"},"(formule)"]
["Nee"]
["Ja"]

{"sheet":"Kalender","index":1,"n_rows":733,"n_cols":20,"rows_kept":733,"cut":false,"hidden":false,"merged":[[0,16,0,17],[0,12,0,13],[0,10,0,11],[0,6,0,9],[0,14,0,15]]}
["KALENDER",null,null,null,null,null," WERKUREN",null,null,null,"BEDRIJFSAUTO A",null,"TOTAAL AANTAL KM AUTO A",null,"BEDRIJFSAUTO B",null,"TOTAAL AANTAL KM AUTO B"]
["Boekjaar >",2021,null,null,null,null,"Totaal uren Administratie >",{"$f":"SUM(H4:H733)","v":0},"Totaal uren Praktijk >",{"$f":"SUM(J4:J733)","v":0},"KM stand bij aanschaf A:",0,{"$f":"SUM(M4:M733)","v":0},{"$f":"SUM(N4:N733)","v":0},"KM stand bij aanschaf B:",80000,{"$f":"SUM(Q4:Q733)","v":0},{"$f":"SUM(R4:R733)","v":0}]
["Datum","Weeknr.","Dagnr.","Feestdag","Werkdag","Eerstvolgende werkdag","Omschrijving administratie-uren","Tijd in uren Adm.","Omschrijving praktijk uren","Tijd in uren Prakt.","KM stand begin vh jaar A:","0","Waarvan KM Privé A:","KM Zakelijk A:","KM stand begin vh jaar B:","123000","Waarvan KM Privé B:","KM Zakelijk B:"]
["2021-01-01",{"$f":"WEEKNUM(Tabel_kalender[[#This Row],[Datum]],21)","v":53},{"$f":"WEEKDAY(A4,2)","v":"1900-01-05"},null,"ja",{"$f":"IF(Tabel_kalender[[#This Row],[Werkdag]]=\"ja\",Tabel_kalender[[#This Row],[Datum]],IF(E5=\"ja\",A5,IF(E6=\"ja\",A6,IF(E7=\"ja\",A7,IF(E8=\"ja\",A8,IF(E9=\"ja\",A9,IF(E10=\"ja\",A10,IF(E11=\"ja\",A11,IF(E12=\"ja\",A12,IF(E13=\"ja\",A13,IF(E14=\"ja\",A14,IF(E15=\"ja\",A15,IF(E16=\"ja\",A16,IF(E17=\"ja\",A17,IF(E18=\"ja\",A18,IF(E19=\"ja\",A19,IF(E20=\"ja\",A20,IF(E21=\"ja\",A21,IF(A22=\"ja\",A22,\"Volgepland\")))))))))))))))))))","v":"2021-01-01"},null,null,null,null,{"$f":"L3","v":"0"},null,null,{"$f":"IF(L4>0,L4-K4,)-M4","v":0},{"$f":"P3","v":"123000"},null,null,{"$f":"IF(P4>0,P4-O4,)-Q4","v":0}]
[{"$f":"A4+1","v":"2021-01-02"},{"$f":"WEEKNUM(Tabel_kalender[[#This Row],[Datum]],21)","v":53},{"$f":"WEEKDAY(A5,2)","v":"1900-01-06"},null,"nee",{"$f":"IF(Tabel_kalender[[#This Row],[Werkdag]]=\"ja\",Tabel_kalender[[#This Row],[Datum]],IF(E6=\"ja\",A6,IF(E7=\"ja\",A7,IF(E8=\"ja\",A8,IF(E9=\"ja\",A9,IF(E10=\"ja\",A10,IF(E11=\"ja\",A11,IF(E12=\"ja\",A12,IF(E13=\"ja\",A13,IF(E14=\"ja\",A14,IF(E15=\"ja\",A15,IF(E16=\"ja\",A16,IF(E17=\"ja\",A17,IF(E18=\"ja\",A18,IF(E19=\"ja\",A19,IF(E20=\"ja\",A20,IF(E21=\"ja\",A21,IF(E22=\"ja\",A22,IF(A23=\"ja\",A23,\"Volgepland\")))))))))))))))))))","v":"2021-01-04"},null,null,null,null,0,null,null,0,0,null,null,0,null,"   "]
["2021-01-03",{"$f":"WEEKNUM(Tabel_kalender[[#This Row],[Datum]],21)","v":53},"1900-01-07",null,"nee",{"$f":"IF(Tabel_kalender[[#This Row],[Werkdag]]=\"ja\",Tabel_kalender[[#This Row],[Datum]],IF(E7=\"ja\",A7,IF(E8=\"ja\",A8,IF(E9=\"ja\",A9,IF(E10=\"ja\",A10,IF(E11=\"ja\",A11,IF(E12=\"ja\",A12,IF(E13=\"ja\",A13,IF(E14=\"ja\",A14,IF(E15=\"ja\",A15,IF(E16=\"ja\",A16,IF(E17=\"ja\",A17,IF(E18=\"ja\",A18,IF(E19=\"ja\",A19,IF(E20=\"ja\",A20,IF(E21=\"ja\",A21,IF(E22=\"ja\",A22,IF(E23=\"ja\",A23,IF(A24=\"ja\",A24,\"Volgepland\")))))))))))))))))))","v":"2021-01-04"},null,null,null,null,0,null,null,0,0,null,null,0]
["2021-01-04",{"$f":"WEEKNUM(Tabel_kalender[[#This Row],[Datum]],21)","v":1},"1900-01-01",null,"ja",{"$f":"IF(Tabel_kalender[[#This Row],[Werkdag]]=\"ja\",Tabel_kalender[[#This Row],[Datum]],IF(E8=\"ja\",A8,IF(E9=\"ja\",A9,IF(E10=\"ja\",A10,IF(E11=\"ja\",A11,IF(E12=\"ja\",A12,IF(E13=\"ja\",A13,IF(E14=\"ja\",A14,IF(E15=\"ja\",A15,IF(E16=\"ja\",A16,IF(E17=\"ja\",A17,IF(E18=\"ja\",A18,IF(E19=\"ja\",A19,IF(E20=\"ja\",A20,IF(E21=\"ja\",A21,IF(E22=\"ja\",A22,IF(E23=\"ja\",A23,IF(E24=\"ja\",A24,IF(A25=\"ja\",A25,\"Volgepland\")))))))))))))))))))","v":"2021-01-04"},null,null,null,null,0,null,null,0,0,null,null,0]
["2021-01-05",{"$f":"WEEKNUM(Tabel_kalender[[#This Row],[Datum]],21)","v":1},"1900-01-02",null,"ja",{"$f":"IF(Tabel_kalender[[#This Row],[Werkdag]]=\"ja\",Tabel_kalender[[#This Row],[Datum]],IF(E9=\"ja\",A9,IF(E10=\"ja\",A10,IF(E11=\"ja\",A11,IF(E12=\"ja\",A12,IF(E13=\"ja\",A13,IF(E14=\"ja\",A14,IF(E15=\"ja\",A15,IF(E16=\"ja\",A16,IF(E17=\"ja\",A17,IF(E18=\"ja\",A18,IF(E19=\"ja\",A19,IF(E20=\"ja\",A20,IF(E21=\"ja\",A21,IF(E22=\"ja\",A22,IF(E23=\"ja\",A23,IF(E24=\"ja\",A24,IF(E25=\"ja\",A25,IF(A26=\"ja\",A26,\"Volgepland\")))))))))))))))))))","v":"2021-01-05"},null,null,null,null,0,null,null,0,0,null,null,0]
["2021-01-06",{"$f":"WEEKNUM(Tabel_kalender[[#This Row],[Datum]],21)","v":1},"1900-01-03",null,"ja",{"$f":"IF(Tabel_kalender[[#This Row],[Werkdag]]=\"ja\",Tabel_kalender[[#This Row],[Datum]],IF(E10=\"ja\",A10,IF(E11=\"ja\",A11,IF(E12=\"ja\",A12,IF(E13=\"ja\",A13,IF(E14=\"ja\",A14,IF(E15=\"ja\",A15,IF(E16=\"ja\",A16,IF(E17=\"ja\",A17,IF(E18=\"ja\",A18,IF(E19=\"ja\",A19,IF(E20=\"ja\",A20,IF(E21=\"ja\",A21,IF(E22=\"ja\",A22,IF(E23=\"ja\",A23,IF(E24=\"ja\",A24,IF(E25=\"ja\",A25,IF(E26=\"ja\",A26,IF(A27=\"ja\",A27,\"Volgepland\")))))))))))))))))))","v":"2021-01-06"},null,null,null,null,0,null,null,0,0,null,null,0]
["2021-01-07",{"$f":"WEEKNUM(Tabel_kalender[[#This Row],[Datum]],21)","v":1},"1900-01-04",null,"ja",{"$f":"IF(Tabel_kalender[[#This Row],[Werkdag]]=\"ja\",Tabel_kalender[[#This Row],[Datum]],IF(E11=\"ja\",A11,IF(E12=\"ja\",A12,IF(E13=\"ja\",A13,IF(E14=\"ja\",A14,IF(E15=\"ja\",A15,IF(E16=\"ja\",A16,IF(E17=\"ja\",A17,IF(E18=\"ja\",A18,IF(E19=\"ja\",A19,IF(E20=\"ja\",A20,IF(E21=\"ja\",A21,IF(E22=\"ja\",A22,IF(E23=\"ja\",A23,IF(E24=\"ja\",A24,IF(E25=\"ja\",A25,IF(E26=\"ja\",A26,IF(E27=\"ja\",A27,IF(A28=\"ja\",A28,\"Volgepland\")))))))))))))))))))","v":"2021-01-07"},null,null,null,null,0,null,null,0,0,null,null,0]
["2021-01-08",{"$f":"WEEKNUM(Tabel_kalender[[#This Row],[Datum]],21)","v":1},"1900-01-05",null,"ja",{"$f":"IF(Tabel_kalender[[#This Row],[Werkdag]]=\"ja\",Tabel_kalender[[#This Row],[Datum]],IF(E12=\"ja\",A12,IF(E13=\"ja\",A13,IF(E14=\"ja\",A14,IF(E15=\"ja\",A15,IF(E16=\"ja\",A16,IF(E17=\"ja\",A17,IF(E18=\"ja\",A18,IF(E19=\"ja\",A19,IF(E20=\"ja\",A20,IF(E21=\"ja\",A21,IF(E22=\"ja\",A22,IF(E23=\"ja\",A23,IF(E24=\"ja\",A24,IF(E25=\"ja\",A25,IF(E26=\"ja\",A26,IF(E27=\"ja\",A27,IF(E28=\"ja\",A28,IF(A29=\"ja\",A29,\"Volgepland\")))))))))))))))))))","v":"2021-01-08"},null,null,null,null,0,null,null,0,0,null,null,0]
["2021-01-09",{"$f":"WEEKNUM(Tabel_kalender[[#This Row],[Datum]],21)","v":1},"1900-01-06",null,"nee",{"$f":"IF(Tabel_kalender[[#This Row],[Werkdag]]=\"ja\",Tabel_kalender[[#This Row],[Datum]],IF(E13=\"ja\",A13,IF(E14=\"ja\",A14,IF(E15=\"ja\",A15,IF(E16=\"ja\",A16,IF(E17=\"ja\",A17,IF(E18=\"ja\",A18,IF(E19=\"ja\",A19,IF(E20=\"ja\",A20,IF(E21=\"ja\",A21,IF(E22=\"ja\",A22,IF(E23=\"ja\",A23,IF(E24=\"ja\",A24,IF(E25=\"ja\",A25,IF(E26=\"ja\",A26,IF(E27=\"ja\",A27,IF(E28=\"ja\",A28,IF(E29=\"ja\",A29,IF(A30=\"ja\",A30,\"Volgepland\")))))))))))))))))))","v":"2021-01-11"},null,null,null,null,0,null,null,0,0,null,null,0]
["2021-01-10",{"$f":"WEEKNUM(Tabel_kalender[[#This Row],[Datum]],21)","v":1},"1900-01-07",null,"nee",{"$f":"IF(Tabel_kalender[[#This Row],[Werkdag]]=\"ja\",Tabel_kalender[[#This Row],[Datum]],IF(E14=\"ja\",A14,IF(E15=\"ja\",A15,IF(E16=\"ja\",A16,IF(E17=\"ja\",A17,IF(E18=\"ja\",A18,IF(E19=\"ja\",A19,IF(E20=\"ja\",A20,IF(E21=\"ja\",A21,IF(E22=\"ja\",A22,IF(E23=\"ja\",A23,IF(E24=\"ja\",A24,IF(E25=\"ja\",A25,IF(E26=\"ja\",A26,IF(E27=\"ja\",A27,IF(E28=\"ja\",A28,IF(E29=\"ja\",A29,IF(E30=\"ja\",A30,IF(A31=\"ja\",A31,\"Volgepland\")))))))))))))))))))","v":"2021-01-11"},null,null,null,null,0,null,null,0,0,null,null,0]
["2021-01-11",{"$f":"WEEKNUM(Tabel_kalender[[#This Row],[Datum]],21)","v":2},"1900-01-01",null,"ja",{"$f":"IF(Tabel_kalender[[#This Row],[Werkdag]]=\"ja\",Tabel_kalender[[#This Row],[Datum]],IF(E15=\"ja\",A15,IF(E16=\"ja\",A16,IF(E17=\"ja\",A17,IF(E18=\"ja\",A18,IF(E19=\"ja\",A19,IF(E20=\"ja\",A20,IF(E21=\"ja\",A21,IF(E22=\"ja\",A22,IF(E23=\"ja\",A23,IF(E24=\"ja\",A24,IF(E25=\"ja\",A25,IF(E26=\"ja\",A26,IF(E27=\"ja\",A27,IF(E28=\"ja\",A28,IF(E29=\"ja\",A29,IF(E30=\"ja\",A30,IF(E31=\"ja\",A31,IF(A32=\"ja\",A32,\"Volgepland\")))))))))))))))))))","v":"2021-01-11"},null,null,null,null,0,null,null,0,0,null,null,0]
["2021-01-12",{"$f":"WEEKNUM(Tabel_kalender[[#This Row],[Datum]],21)","v":2},"1900-01-02",null,"ja",{"$f":"IF(Tabel_kalender[[#This Row],[Werkdag]]=\"ja\",Tabel_kalender[[#This Row],[Datum]],IF(E16=\"ja\",A16,IF(E17=\"ja\",A17,IF(E18=\"ja\",A18,IF(E19=\"ja\",A19,IF(E20=\"ja\",A20,IF(E21=\"ja\",A21,IF(E22=\"ja\",A22,IF(E23=\"ja\",A23,IF(E24=\"ja\",A24,IF(E25=\"ja\",A25,IF(E26=\"ja\",A26,IF(E27=\"ja\",A27,IF(E28=\"ja\",A28,IF(E29=\"ja\",A29,IF(E30=\"ja\",A30,IF(E31=\"ja\",A31,IF(E32=\"ja\",A32,IF(A33=\"ja\",A33,\"Volgepland\")))))))))))))))))))","v":"2021-01-12"},null,null,null,null,0,null,null,0,0,null,null,0]
["2021-01-13",{"$f":"WEEKNUM(Tabel_kalender[[#This Row],[Datum]],21)","v":2},"1900-01-03",null,"ja",{"$f":"IF(Tabel_kalender[[#This Row],[Werkdag]]=\"ja\",Tabel_kalender[[#This Row],[Datum]],IF(E17=\"ja\",A17,IF(E18=\"ja\",A18,IF(E19=\"ja\",A19,IF(E20=\"ja\",A20,IF(E21=\"ja\",A21,IF(E22=\"ja\",A22,IF(E23=\"ja\",A23,IF(E24=\"ja\",A24,IF(E25=\"ja\",A25,IF(E26=\"ja\",A26,IF(E27=\"ja\",A27,IF(E28=\"ja\",A28,IF(E29=\"ja\",A29,IF(E30=\"ja\",A30,IF(E31=\"ja\",A31,IF(E32=\"ja\",A32,IF(E33=\"ja\",A33,IF(A34=\"ja\",A34,\"Volgepland\")))))))))))))))))))","v":"2021-01-13"},null,null,null,null,0,null,null,0,0,null,null,0]
["2021-01-14",{"$f":"WEEKNUM(Tabel_kalender[[#This Row],[Datum]],21)","v":2},"1900-01-04",null,"ja",{"$f":"IF(Tabel_kalender[[#This Row],[Werkdag]]=\"ja\",Tabel_kalender[[#This Row],[Datum]],IF(E18=\"ja\",A18,IF(E19=\"ja\",A19,IF(E20=\"ja\",A20,IF(E21=\"ja\",A21,IF(E22=\"ja\",A22,IF(E23=\"ja\",A23,IF(E24=\"ja\",A24,IF(E25=\"ja\",A25,IF(E26=\"ja\",A26,IF(E27=\"ja\",A27,IF(E28=\"ja\",A28,IF(E29=\"ja\",A29,IF(E30=\"ja\",A30,IF(E31=\"ja\",A31,IF(E32=\"ja\",A32,IF(E33=\"ja\",A33,IF(E34=\"ja\",A34,IF(A35=\"ja\",A35,\"Volgepland\")))))))))))))))))))","v":"2021-01-14"},null,null,null,null,0,null,null,0,0,null,null,0]
["2021-01-15",{"$f":"WEEKNUM(Tabel_kalender[[#This Row],[Datum]],21)","v":2},"1900-01-05",null,"ja",{"$f":"IF(Tabel_kalender[[#This Row],[Werkdag]]=\"ja\",Tabel_kalender[[#This Row],[Datum]],IF(E19=\"ja\",A19,IF(E20=\"ja\",A20,IF(E21=\"ja\",A21,IF(E22=\"ja\",A22,IF(E23=\"ja\",A23,IF(E24=\"ja\",A24,IF(E25=\"ja\",A25,IF(E26=\"ja\",A26,IF(E27=\"ja\",A27,IF(E28=\"ja\",A28,IF(E29=\"ja\",A29,IF(E30=\"ja\",A30,IF(E31=\"ja\",A31,IF(E32=\"ja\",A32,IF(E33=\"ja\",A33,IF(E34=\"ja\",A34,IF(E35=\"ja\",A35,IF(A36=\"ja\",A36,\"Volgepland\")))))))))))))))))))","v":"2021-01-15"},null,null,null,null,0,null,null,0,0,null,null,0]
["2021-01-16",{"$f":"WEEKNUM(Tabel_kalender[[#This Row],[Datum]],21)","v":2},"1900-01-06",null,"nee",{"$f":"IF(Tabel_kalender[[#This Row],[Werkdag]]=\"ja\",Tabel_kalender[[#This Row],[Datum]],IF(E20=\"ja\",A20,IF(E21=\"ja\",A21,IF(E22=\"ja\",A22,IF(E23=\"ja\",A23,IF(E24=\"ja\",A24,IF(E25=\"ja\",A25,IF(E26=\"ja\",A26,IF(E27=\"ja\",A27,IF(E28=\"ja\",A28,IF(E29=\"ja\",A29,IF(E30=\"ja\",A30,IF(E31=\"ja\",A31,IF(E32=\"ja\",A32,IF(E33=\"ja\",A33,IF(E34=\"ja\",A34,IF(E35=\"ja\",A35,IF(E36=\"ja\",A36,IF(A37=\"ja\",A37,\"Volgepland\")))))))))))))))))))","v":"2021-01-18"},null,null,null,null,0,null,null,0,0,null,null,0]
["2021-01-17",{"$f":"WEEKNUM(Tabel_kalender[[#This Row],[Datum]],21)","v":2},"1900-01-07",null,"nee",{"$f":"IF(Tabel_kalender[[#This Row],[Werkdag]]=\"ja\",Tabel_kalender[[#This Row],[Datum]],IF(E21=\"ja\",A21,IF(E22=\"ja\",A22,IF(E23=\"ja\",A23,IF(E24=\"ja\",A24,IF(E25=\"ja\",A25,IF(E26=\"ja\",A26,IF(E27=\"ja\",A27,IF(E28=\"ja\",A28,IF(E29=\"ja\",A29,IF(E30=\"ja\",A30,IF(E31=\"ja\",A31,IF(E32=\"ja\",A32,IF(E33=\"ja\",A33,IF(E34=\"ja\",A34,IF(E35=\"ja\",A35,IF(E36=\"ja\",A36,IF(E37=\"ja\",A37,IF(A38=\"ja\",A38,\"Volgepland\")))))))))))))))))))","v":"2021-01-18"},null,null,null,null,0,null,null,0,0,null,null,0]
["2021-01-18",{"$f":"WEEKNUM(Tabel_kalender[[#This Row],[Datum]],21)","v":3},"1900-01-01",null,"ja",{"$f":"IF(Tabel_kalender[[#This Row],[Werkdag]]=\"ja\",Tabel_kalender[[#This Row],[Datum]],IF(E22=\"ja\",A22,IF(E23=\"ja\",A23,IF(E24=\"ja\",A24,IF(E25=\"ja\",A25,IF(E26=\"ja\",A26,IF(E27=\"ja\",A27,IF(E28=\"ja\",A28,IF(E29=\"ja\",A29,IF(E30=\"ja\",A30,IF(E31=\"ja\",A31,IF(E32=\"ja\",A32,IF(E33=\"ja\",A33,IF(E34=\"ja\",A34,IF(E35=\"ja\",A35,IF(E36=\"ja\",A36,IF(E37=\"ja\",A37,IF(E38=\"ja\",A38,IF(A39=\"ja\",A39,\"Volgepland\")))))))))))))))))))","v":"2021-01-18"},null,null,null,null,0,null,null,0,0,null,null,0]
["2021-01-19",{"$f":"WEEKNUM(Tabel_kalender[[#This Row],[Datum]],21)","v":3},"1900-01-02",null,"ja",{"$f":"IF(Tabel_kalender[[#This Row],[Werkdag]]=\"ja\",Tabel_kalender[[#This Row],[Datum]],IF(E23=\"ja\",A23,IF(E24=\"ja\",A24,IF(E25=\"ja\",A25,IF(E26=\"ja\",A26,IF(E27=\"ja\",A27,IF(E28=\"ja\",A28,IF(E29=\"ja\",A29,IF(E30=\"ja\",A30,IF(E31=\"ja\",A31,IF(E32=\"ja\",A32,IF(E33=\"ja\",A33,IF(E34=\"ja\",A34,IF(E35=\"ja\",A35,IF(E36=\"ja\",A36,IF(E37=\"ja\",A37,IF(E38=\"ja\",A38,IF(E39=\"ja\",A39,IF(A40=\"ja\",A40,\"Volgepland\")))))))))))))))))))","v":"2021-01-19"},null,null,null,null,0,null,null,0,0,null,null,0]
["2021-01-20",{"$f":"WEEKNUM(Tabel_kalender[[#This Row],[Datum]],21)","v":3},"1900-01-03",null,"ja",{"$f":"IF(Tabel_kalender[[#This Row],[Werkdag]]=\"ja\",Tabel_kalender[[#This Row],[Datum]],IF(E24=\"ja\",A24,IF(E25=\"ja\",A25,IF(E26=\"ja\",A26,IF(E27=\"ja\",A27,IF(E28=\"ja\",A28,IF(E29=\"ja\",A29,IF(E30=\"ja\",A30,IF(E31=\"ja\",A31,IF(E32=\"ja\",A32,IF(E33=\"ja\",A33,IF(E34=\"ja\",A34,IF(E35=\"ja\",A35,IF(E36=\"ja\",A36,IF(E37=\"ja\",A37,IF(E38=\"ja\",A38,IF(E39=\"ja\",A39,IF(E40=\"ja\",A40,IF(A41=\"ja\",A41,\"Volgepland\")))))))))))))))))))","v":"2021-01-20"},null,null,null,null,0,null,null,0,0,null,null,0]
["2021-01-21",{"$f":"WEEKNUM(Tabel_kalender[[#This Row],[Datum]],21)","v":3},"1900-01-04",null,"ja",{"$f":"IF(Tabel_kalender[[#This Row],[Werkdag]]=\"ja\",Tabel_kalender[[#This Row],[Datum]],IF(E25=\"ja\",A25,IF(E26=\"ja\",A26,IF(E27=\"ja\",A27,IF(E28=\"ja\",A28,IF(E29=\"ja\",A29,IF(E30=\"ja\",A30,IF(E31=\"ja\",A31,IF(E32=\"ja\",A32,IF(E33=\"ja\",A33,IF(E34=\"ja\",A34,IF(E35=\"ja\",A35,IF(E36=\"ja\",A36,IF(E37=\"ja\",A37,IF(E38=\"ja\",A38,IF(E39=\"ja\",A39,IF(E40=\"ja\",A40,IF(E41=\"ja\",A41,IF(A42=\"ja\",A42,\"Volgepland\")))))))))))))))))))","v":"2021-01-21"},null,null,null,null,0,null,null,0,0,null,null,0]
["2021-01-22",{"$f":"WEEKNUM(Tabel_kalender[[#This Row],[Datum]],21)","v":3},"1900-01-05",null,"ja",{"$f":"IF(Tabel_kalender[[#This Row],[Werkdag]]=\"ja\",Tabel_kalender[[#This Row],[Datum]],IF(E26=\"ja\",A26,IF(E27=\"ja\",A27,IF(E28=\"ja\",A28,IF(E29=\"ja\",A29,IF(E30=\"ja\",A30,IF(E31=\"ja\",A31,IF(E32=\"ja\",A32,IF(E33=\"ja\",A33,IF(E34=\"ja\",A34,IF(E35=\"ja\",A35,IF(E36=\"ja\",A36,IF(E37=\"ja\",A37,IF(E38=\"ja\",A38,IF(E39=\"ja\",A39,IF(E40=\"ja\",A40,IF(E41=\"ja\",A41,IF(E42=\"ja\",A42,IF(A43=\"ja\",A43,\"Volgepland\")))))))))))))))))))","v":"2021-01-22"},null,null,null,null,0,null,null,0,0,null,null,0]
["2021-01-23",{"$f":"WEEKNUM(Tabel_kalender[[#This Row],[Datum]],21)","v":3},"1900-01-06",null,"nee",{"$f":"IF(Tabel_kalender[[#This Row],[Werkdag]]=\"ja\",Tabel_kalender[[#This Row],[Datum]],IF(E27=\"ja\",A27,IF(E28=\"ja\",A28,IF(E29=\"ja\",A29,IF(E30=\"ja\",A30,IF(E31=\"ja\",A31,IF(E32=\"ja\",A32,IF(E33=\"ja\",A33,IF(E34=\"ja\",A34,IF(E35=\"ja\",A35,IF(E36=\"ja\",A36,IF(E37=\"ja\",A37,IF(E38=\"ja\",A38,IF(E39=\"ja\",A39,IF(E40=\"ja\",A40,IF(E41=\"ja\",A41,IF(E42=\"ja\",A42,IF(E43=\"ja\",A43,IF(A44=\"ja\",A44,\"Volgepland\")))))))))))))))))))","v":"2021-01-25"},null,null,null,null,0,null,null,0,0,null,null,0]
["2021-01-24",{"$f":"WEEKNUM(Tabel_kalender[[#This Row],[Datum]],21)","v":3},"1900-01-07",null,"nee",{"$f":"IF(Tabel_kalender[[#This Row],[Werkdag]]=\"ja\",Tabel_kalender[[#This Row],[Datum]],IF(E28=\"ja\",A28,IF(E29=\"ja\",A29,IF(E30=\"ja\",A30,IF(E31=\"ja\",A31,IF(E32=\"ja\",A32,IF(E33=\"ja\",A33,IF(E34=\"ja\",A34,IF(E35=\"ja\",A35,IF(E36=\"ja\",A36,IF(E37=\"ja\",A37,IF(E38=\"ja\",A38,IF(E39=\"ja\",A39,IF(E40=\"ja\",A40,IF(E41=\"ja\",A41,IF(E42=\"ja\",A42,IF(E43=\"ja\",A43,IF(E44=\"ja\",A44,IF(A45=\"ja\",A45,\"Volgepland\")))))))))))))))))))","v":"2021-01-25"},null,null,null,null,0,null,null,0,0,null,null,0]
["2021-01-25",{"$f":"WEEKNUM(Tabel_kalender[[#This Row],[Datum]],21)","v":4},"1900-01-01",null,"ja",{"$f":"IF(Tabel_kalender[[#This Row],[Werkdag]]=\"ja\",Tabel_kalender[[#This Row],[Datum]],IF(E29=\"ja\",A29,IF(E30=\"ja\",A30,IF(E31=\"ja\",A31,IF(E32=\"ja\",A32,IF(E33=\"ja\",A33,IF(E34=\"ja\",A34,IF(E35=\"ja\",A35,IF(E36=\"ja\",A36,IF(E37=\"ja\",A37,IF(E38=\"ja\",A38,IF(E39=\"ja\",A39,IF(E40=\"ja\",A40,IF(E41=\"ja\",A41,IF(E42=\"ja\",A42,IF(E43=\"ja\",A43,IF(E44=\"ja\",A44,IF(E45=\"ja\",A45,IF(A46=\"ja\",A46,\"Volgepland\")))))))))))))))))))","v":"2021-01-25"},null,null,null,null,0,null,null,0,0,null,null,0]
["2021-01-26",{"$f":"WEEKNUM(Tabel_kalender[[#This Row],[Datum]],21)","v":4},"1900-01-02",null,"ja",{"$f":"IF(Tabel_kalender[[#This Row],[Werkdag]]=\"ja\",Tabel_kalender[[#This Row],[Datum]],IF(E30=\"ja\",A30,IF(E31=\"ja\",A31,IF(E32=\"ja\",A32,IF(E33=\"ja\",A33,IF(E34=\"ja\",A34,IF(E35=\"ja\",A35,IF(E36=\"ja\",A36,IF(E37=\"ja\",A37,IF(E38=\"ja\",A38,IF(E39=\"ja\",A39,IF(E40=\"ja\",A40,IF(E41=\"ja\",A41,IF(E42=\"ja\",A42,IF(E43=\"ja\",A43,IF(E44=\"ja\",A44,IF(E45=\"ja\",A45,IF(E46=\"ja\",A46,IF(A47=\"ja\",A47,\"Volgepland\")))))))))))))))))))","v":"2021-01-26"},null,null,null,null,0,null,null,0,0,null,null,0]
["2021-01-27",{"$f":"WEEKNUM(Tabel_kalender[[#This Row],[Datum]],21)","v":4},"1900-01-03",null,"ja",{"$f":"IF(Tabel_kalender[[#This Row],[Werkdag]]=\"ja\",Tabel_kalender[[#This Row],[Datum]],IF(E31=\"ja\",A31,IF(E32=\"ja\",A32,IF(E33=\"ja\",A33,IF(E34=\"ja\",A34,IF(E35=\"ja\",A35,IF(E36=\"ja\",A36,IF(E37=\"ja\",A37,IF(E38=\"ja\",A38,IF(E39=\"ja\",A39,IF(E40=\"ja\",A40,IF(E41=\"ja\",A41,IF(E42=\"ja\",A42,IF(E43=\"ja\",A43,IF(E44=\"ja\",A44,IF(E45=\"ja\",A45,IF(E46=\"ja\",A46,IF(E47=\"ja\",A47,IF(A48=\"ja\",A48,\"Volgepland\")))))))))))))))))))","v":"2021-01-27"},null,null,null,null,0,null,null,0,0,null,null,0]
["2021-01-28",{"$f":"WEEKNUM(Tabel_kalender[[#This Row],[Datum]],21)","v":4},"1900-01-04",null,"ja",{"$f":"IF(Tabel_kalender[[#This Row],[Werkdag]]=\"ja\",Tabel_kalender[[#This Row],[Datum]],IF(E32=\"ja\",A32,IF(E33=\"ja\",A33,IF(E34=\"ja\",A34,IF(E35=\"ja\",A35,IF(E36=\"ja\",A36,IF(E37=\"ja\",A37,IF(E38=\"ja\",A38,IF(E39=\"ja\",A39,IF(E40=\"ja\",A40,IF(E41=\"ja\",A41,IF(E42=\"ja\",A42,IF(E43=\"ja\",A43,IF(E44=\"ja\",A44,IF(E45=\"ja\",A45,IF(E46=\"ja\",A46,IF(E47=\"ja\",A47,IF(E48=\"ja\",A48,IF(A49=\"ja\",A49,\"Volgepland\")))))))))))))))))))","v":"2021-01-28"},null,null,null,null,0,null,null,0,0,null,null,0]
["2021-01-29",{"$f":"WEEKNUM(Tabel_kalender[[#This Row],[Datum]],21)","v":4},"1900-01-05",null,"ja",{"$f":"IF(Tabel_kalender[[#This Row],[Werkdag]]=\"ja\",Tabel_kalender[[#This Row],[Datum]],IF(E33=\"ja\",A33,IF(E34=\"ja\",A34,IF(E35=\"ja\",A35,IF(E36=\"ja\",A36,IF(E37=\"ja\",A37,IF(E38=\"ja\",A38,IF(E39=\"ja\",A39,IF(E40=\"ja\",A40,IF(E41=\"ja\",A41,IF(E42=\"ja\",A42,IF(E43=\"ja\",A43,IF(E44=\"ja\",A44,IF(E45=\"ja\",A45,IF(E46=\"ja\",A46,IF(E47=\"ja\",A47,IF(E48=\"ja\",A48,IF(E49=\"ja\",A49,IF(A50=\"ja\",A50,\"Volgepland\")))))))))))))))))))","v":"2021-01-29"},null,null,null,null,0,null,null,0,0,null,null,0]
["2021-01-30",{"$f":"WEEKNUM(Tabel_kalender[[#This Row],[Datum]],21)","v":4},"1900-01-06",null,"nee",{"$f":"IF(Tabel_kalender[[#This Row],[Werkdag]]=\"ja\",Tabel_kalender[[#This Row],[Datum]],IF(E34=\"ja\",A34,IF(E35=\"ja\",A35,IF(E36=\"ja\",A36,IF(E37=\"ja\",A37,IF(E38=\"ja\",A38,IF(E39=\"ja\",A39,IF(E40=\"ja\",A40,IF(E41=\"ja\",A41,IF(E42=\"ja\",A42,IF(E43=\"ja\",A43,IF(E44=\"ja\",A44,IF(E45=\"ja\",A45,IF(E46=\"ja\",A46,IF(E47=\"ja\",A47,IF(E48=\"ja\",A48,IF(E49=\"ja\",A49,IF(E50=\"ja\",A50,IF(A51=\"ja\",A51,\"Volgepland\")))))))))))))))))))","v":"2021-02-01"},null,null,null,null,0,null,null,0,0,null,null,0]
["2021-01-31",{"$f":"WEEKNUM(Tabel_kalender[[#This Row],[Datum]],21)","v":4},"1900-01-07",null,"nee",{"$f":"IF(Tabel_kalender[[#This Row],[Werkdag]]=\"ja\",Tabel_kalender[[#This Row],[Datum]],IF(E35=\"ja\",A35,IF(E36=\"ja\",A36,IF(E37=\"ja\",A37,IF(E38=\"ja\",A38,IF(E39=\"ja\",A39,IF(E40=\"ja\",A40,IF(E41=\"ja\",A41,IF(E42=\"ja\",A42,IF(E43=\"ja\",A43,IF(E44=\"ja\",A44,IF(E45=\"ja\",A45,IF(E46=\"ja\",A46,IF(E47=\"ja\",A47,IF(E48=\"ja\",A48,IF(E49=\"ja\",A49,IF(E50=\"ja\",A50,IF(E51=\"ja\",A51,IF(A52=\"ja\",A52,\"Volgepland\")))))))))))))))))))","v":"2021-02-01"},null,null,null,null,0,null,null,0,0,null,null,0]
["2021-02-01",{"$f":"WEEKNUM(Tabel_kalender[[#This Row],[Datum]],21)","v":5},"1900-01-01",null,"ja",{"$f":"IF(Tabel_kalender[[#This Row],[Werkdag]]=\"ja\",Tabel_kalender[[#This Row],[Datum]],IF(E36=\"ja\",A36,IF(E37=\"ja\",A37,IF(E38=\"ja\",A38,IF(E39=\"ja\",A39,IF(E40=\"ja\",A40,IF(E41=\"ja\",A41,IF(E42=\"ja\",A42,IF(E43=\"ja\",A43,IF(E44=\"ja\",A44,IF(E45=\"ja\",A45,IF(E46=\"ja\",A46,IF(E47=\"ja\",A47,IF(E48=\"ja\",A48,IF(E49=\"ja\",A49,IF(E50=\"ja\",A50,IF(E51=\"ja\",A51,IF(E52=\"ja\",A52,IF(A53=\"ja\",A53,\"Volgepland\")))))))))))))))))))","v":"2021-02-01"},null,null,null,null,0,null,null,0,0,null,null,0]
["2021-02-02",{"$f":"WEEKNUM(Tabel_kalender[[#This Row],[Datum]],21)","v":5},"1900-01-02",null,"ja",{"$f":"IF(Tabel_kalender[[#This Row],[Werkdag]]=\"ja\",Tabel_kalender[[#This Row],[Datum]],IF(E37=\"ja\",A37,IF(E38=\"ja\",A38,IF(E39=\"ja\",A39,IF(E40=\"ja\",A40,IF(E41=\"ja\",A41,IF(E42=\"ja\",A42,IF(E43=\"ja\",A43,IF(E44=\"ja\",A44,IF(E45=\"ja\",A45,IF(E46=\"ja\",A46,IF(E47=\"ja\",A47,IF(E48=\"ja\",A48,IF(E49=\"ja\",A49,IF(E50=\"ja\",A50,IF(E51=\"ja\",A51,IF(E52=\"ja\",A52,IF(E53=\"ja\",A53,IF(A54=\"ja\",A54,\"Volgepland\")))))))))))))))))))","v":"2021-02-02"},null,null,null,null,0,null,null,0,0,null,null,0]
["2021-02-03",{"$f":"WEEKNUM(Tabel_kalender[[#This Row],[Datum]],21)","v":5},"1900-01-03",null,"ja",{"$f":"IF(Tabel_kalender[[#This Row],[Werkdag]]=\"ja\",Tabel_kalender[[#This Row],[Datum]],IF(E38=\"ja\",A38,IF(E39=\"ja\",A39,IF(E40=\"ja\",A40,IF(E41=\"ja\",A41,IF(E42=\"ja\",A42,IF(E43=\"ja\",A43,IF(E44=\"ja\",A44,IF(E45=\"ja\",A45,IF(E46=\"ja\",A46,IF(E47=\"ja\",A47,IF(E48=\"ja\",A48,IF(E49=\"ja\",A49,IF(E50=\"ja\",A50,IF(E51=\"ja\",A51,IF(E52=\"ja\",A52,IF(E53=\"ja\",A53,IF(E54=\"ja\",A54,IF(A55=\"ja\",A55,\"Volgepland\")))))))))))))))))))","v":"2021-02-03"},null,null,null,null,0,null,null,0,0,null,null,0]
["2021-02-04",{"$f":"WEEKNUM(Tabel_kalender[[#This Row],[Datum]],21)","v":5},"1900-01-04",null,"ja",{"$f":"IF(Tabel_kalender[[#This Row],[Werkdag]]=\"ja\",Tabel_kalender[[#This Row],[Datum]],IF(E39=\"ja\",A39,IF(E40=\"ja\",A40,IF(E41=\"ja\",A41,IF(E42=\"ja\",A42,IF(E43=\"ja\",A43,IF(E44=\"ja\",A44,IF(E45=\"ja\",A45,IF(E46=\"ja\",A46,IF(E47=\"ja\",A47,IF(E48=\"ja\",A48,IF(E49=\"ja\",A49,IF(E50=\"ja\",A50,IF(E51=\"ja\",A51,IF(E52=\"ja\",A52,IF(E53=\"ja\",A53,IF(E54=\"ja\",A54,IF(E55=\"ja\",A55,IF(A56=\"ja\",A56,\"Volgepland\")))))))))))))))))))","v":"2021-02-04"},null,null,null,null,0,null,null,0,0,null,null,0]
["2021-02-05",{"$f":"WEEKNUM(Tabel_kalender[[#This Row],[Datum]],21)","v":5},"1900-01-05",null,"ja",{"$f":"IF(Tabel_kalender[[#This Row],[Werkdag]]=\"ja\",Tabel_kalender[[#This Row],[Datum]],IF(E40=\"ja\",A40,IF(E41=\"ja\",A41,IF(E42=\"ja\",A42,IF(E43=\"ja\",A43,IF(E44=\"ja\",A44,IF(E45=\"ja\",A45,IF(E46=\"ja\",A46,IF(E47=\"ja\",A47,IF(E48=\"ja\",A48,IF(E49=\"ja\",A49,IF(E50=\"ja\",A50,IF(E51=\"ja\",A51,IF(E52=\"ja\",A52,IF(E53=\"ja\",A53,IF(E54=\"ja\",A54,IF(E55=\"ja\",A55,IF(E56=\"ja\",A56,IF(A57=\"ja\",A57,\"Volgepland\")))))))))))))))))))","v":"2021-02-05"},null,null,null,null,0,null,null,0,0,null,null,0]
["2021-02-06",{"$f":"WEEKNUM(Tabel_kalender[[#This Row],[Datum]],21)","v":5},"1900-01-06",null,"nee",{"$f":"IF(Tabel_kalender[[#This Row],[Werkdag]]=\"ja\",Tabel_kalender[[#This Row],[Datum]],IF(E41=\"ja\",A41,IF(E42=\"ja\",A42,IF(E43=\"ja\",A43,IF(E44=\"ja\",A44,IF(E45=\"ja\",A45,IF(E46=\"ja\",A46,IF(E47=\"ja\",A47,IF(E48=\"ja\",A48,IF(E49=\"ja\",A49,IF(E50=\"ja\",A50,IF(E51=\"ja\",A51,IF(E52=\"ja\",A52,IF(E53=\"ja\",A53,IF(E54=\"ja\",A54,IF(E55=\"ja\",A55,IF(E56=\"ja\",A56,IF(E57=\"ja\",A57,IF(A58=\"ja\",A58,\"Volgepland\")))))))))))))))))))","v":"2021-02-08"},null,null,null,null,0,null,null,0,0,null,null,0]
["2021-02-07",{"$f":"WEEKNUM(Tabel_kalender[[#This Row],[Datum]],21)","v":5},"1900-01-07",null,"nee",{"$f":"IF(Tabel_kalender[[#This Row],[Werkdag]]=\"ja\",Tabel_kalender[[#This Row],[Datum]],IF(E42=\"ja\",A42,IF(E43=\"ja\",A43,IF(E44=\"ja\",A44,IF(E45=\"ja\",A45,IF(E46=\"ja\",A46,IF(E47=\"ja\",A47,IF(E48=\"ja\",A48,IF(E49=\"ja\",A49,IF(E50=\"ja\",A50,IF(E51=\"ja\",A51,IF(E52=\"ja\",A52,IF(E53=\"ja\",A53,IF(E54=\"ja\",A54,IF(E55=\"ja\",A55,IF(E56=\"ja\",A56,IF(E57=\"ja\",A57,IF(E58=\"ja\",A58,IF(A59=\"ja\",A59,\"Volgepland\")))))))))))))))))))","v":"2021-02-08"},null,null,null,null,0,null,null,0,0,null,null,0]
["2021-02-08",{"$f":"WEEKNUM(Tabel_kalender[[#This Row],[Datum]],21)","v":6},"1900-01-01",null,"ja",{"$f":"IF(Tabel_kalender[[#This Row],[Werkdag]]=\"ja\",Tabel_kalender[[#This Row],[Datum]],IF(E43=\"ja\",A43,IF(E44=\"ja\",A44,IF(E45=\"ja\",A45,IF(E46=\"ja\",A46,IF(E47=\"ja\",A47,IF(E48=\"ja\",A48,IF(E49=\"ja\",A49,IF(E50=\"ja\",A50,IF(E51=\"ja\",A51,IF(E52=\"ja\",A52,IF(E53=\"ja\",A53,IF(E54=\"ja\",A54,IF(E55=\"ja\",A55,IF(E56=\"ja\",A56,IF(E57=\"ja\",A57,IF(E58=\"ja\",A58,IF(E59=\"ja\",A59,IF(A60=\"ja\",A60,\"Volgepland\")))))))))))))))))))","v":"2021-02-08"},null,null,null,null,0,null,null,0,0,null,null,0]
["2021-02-09",{"$f":"WEEKNUM(Tabel_kalender[[#This Row],[Datum]],21)","v":6},"1900-01-02",null,"ja",{"$f":"IF(Tabel_kalender[[#This Row],[Werkdag]]=\"ja\",Tabel_kalender[[#This Row],[Datum]],IF(E44=\"ja\",A44,IF(E45=\"ja\",A45,IF(E46=\"ja\",A46,IF(E47=\"ja\",A47,IF(E48=\"ja\",A48,IF(E49=\"ja\",A49,IF(E50=\"ja\",A50,IF(E51=\"ja\",A51,IF(E52=\"ja\",A52,IF(E53=\"ja\",A53,IF(E54=\"ja\",A54,IF(E55=\"ja\",A55,IF(E56=\"ja\",A56,IF(E57=\"ja\",A57,IF(E58=\"ja\",A58,IF(E59=\"ja\",A59,IF(E60=\"ja\",A60,IF(A61=\"ja\",A61,\"Volgepland\")))))))))))))))))))","v":"2021-02-09"},null,null,null,null,0,null,null,0,0,null,null,0]
["2021-02-10",{"$f":"WEEKNUM(Tabel_kalender[[#This Row],[Datum]],21)","v":6},"1900-01-03",null,"ja",{"$f":"IF(Tabel_kalender[[#This Row],[Werkdag]]=\"ja\",Tabel_kalender[[#This Row],[Datum]],IF(E45=\"ja\",A45,IF(E46=\"ja\",A46,IF(E47=\"ja\",A47,IF(E48=\"ja\",A48,IF(E49=\"ja\",A49,IF(E50=\"ja\",A50,IF(E51=\"ja\",A51,IF(E52=\"ja\",A52,IF(E53=\"ja\",A53,IF(E54=\"ja\",A54,IF(E55=\"ja\",A55,IF(E56=\"ja\",A56,IF(E57=\"ja\",A57,IF(E58=\"ja\",A58,IF(E59=\"ja\",A59,IF(E60=\"ja\",A60,IF(E61=\"ja\",A61,IF(A62=\"ja\",A62,\"Volgepland\")))))))))))))))))))","v":"2021-02-10"},null,null,null,null,0,null,null,0,0,null,null,0]
["2021-02-11",{"$f":"WEEKNUM(Tabel_kalender[[#This Row],[Datum]],21)","v":6},"1900-01-04",null,"ja",{"$f":"IF(Tabel_kalender[[#This Row],[Werkdag]]=\"ja\",Tabel_kalender[[#This Row],[Datum]],IF(E46=\"ja\",A46,IF(E47=\"ja\",A47,IF(E48=\"ja\",A48,IF(E49=\"ja\",A49,IF(E50=\"ja\",A50,IF(E51=\"ja\",A51,IF(E52=\"ja\",A52,IF(E53=\"ja\",A53,IF(E54=\"ja\",A54,IF(E55=\"ja\",A55,IF(E56=\"ja\",A56,IF(E57=\"ja\",A57,IF(E58=\"ja\",A58,IF(E59=\"ja\",A59,IF(E60=\"ja\",A60,IF(E61=\"ja\",A61,IF(E62=\"ja\",A62,IF(A63=\"ja\",A63,\"Volgepland\")))))))))))))))))))","v":"2021-02-11"},null,null,null,null,0,null,null,0,0,null,null,0]
["2021-02-12",{"$f":"WEEKNUM(Tabel_kalender[[#This Row],[Datum]],21)","v":6},"1900-01-05",null,"ja",{"$f":"IF(Tabel_kalender[[#This Row],[Werkdag]]=\"ja\",Tabel_kalender[[#This Row],[Datum]],IF(E47=\"ja\",A47,IF(E48=\"ja\",A48,IF(E49=\"ja\",A49,IF(E50=\"ja\",A50,IF(E51=\"ja\",A51,IF(E52=\"ja\",A52,IF(E53=\"ja\",A53,IF(E54=\"ja\",A54,IF(E55=\"ja\",A55,IF(E56=\"ja\",A56,IF(E57=\"ja\",A57,IF(E58=\"ja\",A58,IF(E59=\"ja\",A59,IF(E60=\"ja\",A60,IF(E61=\"ja\",A61,IF(E62=\"ja\",A62,IF(E63=\"ja\",A63,IF(A64=\"ja\",A64,\"Volgepland\")))))))))))))))))))","v":"2021-02-12"},null,null,null,null,0,null,null,0,0,null,null,0]
["2021-02-13",{"$f":"WEEKNUM(Tabel_kalender[[#This Row],[Datum]],21)","v":6},"1900-01-06",null,"nee",{"$f":"IF(Tabel_kalender[[#This Row],[Werkdag]]=\"ja\",Tabel_kalender[[#This Row],[Datum]],IF(E48=\"ja\",A48,IF(E49=\"ja\",A49,IF(E50=\"ja\",A50,IF(E51=\"ja\",A51,IF(E52=\"ja\",A52,IF(E53=\"ja\",A53,IF(E54=\"ja\",A54,IF(E55=\"ja\",A55,IF(E56=\"ja\",A56,IF(E57=\"ja\",A57,IF(E58=\"ja\",A58,IF(E59=\"ja\",A59,IF(E60=\"ja\",A60,IF(E61=\"ja\",A61,IF(E62=\"ja\",A62,IF(E63=\"ja\",A63,IF(E64=\"ja\",A64,IF(A65=\"ja\",A65,\"Volgepland\")))))))))))))))))))","v":"2021-02-15"},null,null,null,null,0,null,null,0,0,null,null,0]
["2021-02-14",{"$f":"WEEKNUM(Tabel_kalender[[#This Row],[Datum]],21)","v":6},"1900-01-07",null,"nee",{"$f":"IF(Tabel_kalender[[#This Row],[Werkdag]]=\"ja\",Tabel_kalender[[#This Row],[Datum]],IF(E49=\"ja\",A49,IF(E50=\"ja\",A50,IF(E51=\"ja\",A51,IF(E52=\"ja\",A52,IF(E53=\"ja\",A53,IF(E54=\"ja\",A54,IF(E55=\"ja\",A55,IF(E56=\"ja\",A56,IF(E57=\"ja\",A57,IF(E58=\"ja\",A58,IF(E59=\"ja\",A59,IF(E60=\"ja\",A60,IF(E61=\"ja\",A61,IF(E62=\"ja\",A62,IF(E63=\"ja\",A63,IF(E64=\"ja\",A64,IF(E65=\"ja\",A65,IF(A66=\"ja\",A66,\"Volgepland\")))))))))))))))))))","v":"2021-02-15"},null,null,null,null,0,null,null,0,0,null,null,0]
["2021-02-15",{"$f":"WEEKNUM(Tabel_kalender[[#This Row],[Datum]],21)","v":7},"1900-01-01",null,"ja",{"$f":"IF(Tabel_kalender[[#This Row],[Werkdag]]=\"ja\",Tabel_kalender[[#This Row],[Datum]],IF(E50=\"ja\",A50,IF(E51=\"ja\",A51,IF(E52=\"ja\",A52,IF(E53=\"ja\",A53,IF(E54=\"ja\",A54,IF(E55=\"ja\",A55,IF(E56=\"ja\",A56,IF(E57=\"ja\",A57,IF(E58=\"ja\",A58,IF(E59=\"ja\",A59,IF(E60=\"ja\",A60,IF(E61=\"ja\",A61,IF(E62=\"ja\",A62,IF(E63=\"ja\",A63,IF(E64=\"ja\",A64,IF(E65=\"ja\",A65,IF(E66=\"ja\",A66,IF(A67=\"ja\",A67,\"Volgepland\")))))))))))))))))))","v":"2021-02-15"},null,null,null,null,0,null,null,0,0,null,null,0]
["2021-02-16",{"$f":"WEEKNUM(Tabel_kalender[[#This Row],[Datum]],21)","v":7},"1900-01-02",null,"ja",{"$f":"IF(Tabel_kalender[[#This Row],[Werkdag]]=\"ja\",Tabel_kalender[[#This Row],[Datum]],IF(E51=\"ja\",A51,IF(E52=\"ja\",A52,IF(E53=\"ja\",A53,IF(E54=\"ja\",A54,IF(E55=\"ja\",A55,IF(E56=\"ja\",A56,IF(E57=\"ja\",A57,IF(E58=\"ja\",A58,IF(E59=\"ja\",A59,IF(E60=\"ja\",A60,IF(E61=\"ja\",A61,IF(E62=\"ja\",A62,IF(E63=\"ja\",A63,IF(E64=\"ja\",A64,IF(E65=\"ja\",A65,IF(E66=\"ja\",A66,IF(E67=\"ja\",A67,IF(A68=\"ja\",A68,\"Volgepland\")))))))))))))))))))","v":"2021-02-16"},null,null,null,null,0,null,null,0,0,null,null,0]
["2021-02-17",{"$f":"WEEKNUM(Tabel_kalender[[#This Row],[Datum]],21)","v":7},"1900-01-03",null,"ja",{"$f":"IF(Tabel_kalender[[#This Row],[Werkdag]]=\"ja\",Tabel_kalender[[#This Row],[Datum]],IF(E52=\"ja\",A52,IF(E53=\"ja\",A53,IF(E54=\"ja\",A54,IF(E55=\"ja\",A55,IF(E56=\"ja\",A56,IF(E57=\"ja\",A57,IF(E58=\"ja\",A58,IF(E59=\"ja\",A59,IF(E60=\"ja\",A60,IF(E61=\"ja\",A61,IF(E62=\"ja\",A62,IF(E63=\"ja\",A63,IF(E64=\"ja\",A64,IF(E65=\"ja\",A65,IF(E66=\"ja\",A66,IF(E67=\"ja\",A67,IF(E68=\"ja\",A68,IF(A69=\"ja\",A69,\"Volgepland\")))))))))))))))))))","v":"2021-02-17"},null,null,null,null,0,null,null,0,0,null,null,0]
["2021-02-18",{"$f":"WEEKNUM(Tabel_kalender[[#This Row],[Datum]],21)","v":7},"1900-01-04",null,"ja",{"$f":"IF(Tabel_kalender[[#This Row],[Werkdag]]=\"ja\",Tabel_kalender[[#This Row],[Datum]],IF(E53=\"ja\",A53,IF(E54=\"ja\",A54,IF(E55=\"ja\",A55,IF(E56=\"ja\",A56,IF(E57=\"ja\",A57,IF(E58=\"ja\",A58,IF(E59=\"ja\",A59,IF(E60=\"ja\",A60,IF(E61=\"ja\",A61,IF(E62=\"ja\",A62,IF(E63=\"ja\",A63,IF(E64=\"ja\",A64,IF(E65=\"ja\",A65,IF(E66=\"ja\",A66,IF(E67=\"ja\",A67,IF(E68=\"ja\",A68,IF(E69=\"ja\",A69,IF(A70=\"ja\",A70,\"Volgepland\")))))))))))))))))))","v":"2021-02-18"},null,null,null,null,0,null,null,0,0,null,null,0]
["2021-02-19",{"$f":"WEEKNUM(Tabel_kalender[[#This Row],[Datum]],21)","v":7},"1900-01-05",null,"ja",{"$f":"IF(Tabel_kalender[[#This Row],[Werkdag]]=\"ja\",Tabel_kalender[[#This Row],[Datum]],IF(E54=\"ja\",A54,IF(E55=\"ja\",A55,IF(E56=\"ja\",A56,IF(E57=\"ja\",A57,IF(E58=\"ja\",A58,IF(E59=\"ja\",A59,IF(E60=\"ja\",A60,IF(E61=\"ja\",A61,IF(E62=\"ja\",A62,IF(E63=\"ja\",A63,IF(E64=\"ja\",A64,IF(E65=\"ja\",A65,IF(E66=\"ja\",A66,IF(E67=\"ja\",A67,IF(E68=\"ja\",A68,IF(E69=\"ja\",A69,IF(E70=\"ja\",A70,IF(A71=\"ja\",A71,\"Volgepland\")))))))))))))))))))","v":"2021-02-19"},null,null,null,null,0,null,null,0,0,null,null,0]
["2021-02-20",{"$f":"WEEKNUM(Tabel_kalender[[#This Row],[Datum]],21)","v":7},"1900-01-06",null,"nee",{"$f":"IF(Tabel_kalender[[#This Row],[Werkdag]]=\"ja\",Tabel_kalender[[#This Row],[Datum]],IF(E55=\"ja\",A55,IF(E56=\"ja\",A56,IF(E57=\"ja\",A57,IF(E58=\"ja\",A58,IF(E59=\"ja\",A59,IF(E60=\"ja\",A60,IF(E61=\"ja\",A61,IF(E62=\"ja\",A62,IF(E63=\"ja\",A63,IF(E64=\"ja\",A64,IF(E65=\"ja\",A65,IF(E66=\"ja\",A66,IF(E67=\"ja\",A67,IF(E68=\"ja\",A68,IF(E69=\"ja\",A69,IF(E70=\"ja\",A70,IF(E71=\"ja\",A71,IF(A72=\"ja\",A72,\"Volgepland\")))))))))))))))))))","v":"2021-02-22"},null,null,null,null,0,null,null,0,0,null,null,0]
["2021-02-21",{"$f":"WEEKNUM(Tabel_kalender[[#This Row],[Datum]],21)","v":7},"1900-01-07",null,"nee",{"$f":"IF(Tabel_kalender[[#This Row],[Werkdag]]=\"ja\",Tabel_kalender[[#This Row],[Datum]],IF(E56=\"ja\",A56,IF(E57=\"ja\",A57,IF(E58=\"ja\",A58,IF(E59=\"ja\",A59,IF(E60=\"ja\",A60,IF(E61=\"ja\",A61,IF(E62=\"ja\",A62,IF(E63=\"ja\",A63,IF(E64=\"ja\",A64,IF(E65=\"ja\",A65,IF(E66=\"ja\",A66,IF(E67=\"ja\",A67,IF(E68=\"ja\",A68,IF(E69=\"ja\",A69,IF(E70=\"ja\",A70,IF(E71=\"ja\",A71,IF(E72=\"ja\",A72,IF(A73=\"ja\",A73,\"Volgepland\")))))))))))))))))))","v":"2021-02-22"},null,null,null,null,0,null,null,0,0,null,null,0]
["2021-02-22",{"$f":"WEEKNUM(Tabel_kalender[[#This Row],[Datum]],21)","v":8},"1900-01-01",null,"ja",{"$f":"IF(Tabel_kalender[[#This Row],[Werkdag]]=\"ja\",Tabel_kalender[[#This Row],[Datum]],IF(E57=\"ja\",A57,IF(E58=\"ja\",A58,IF(E59=\"ja\",A59,IF(E60=\"ja\",A60,IF(E61=\"ja\",A61,IF(E62=\"ja\",A62,IF(E63=\"ja\",A63,IF(E64=\"ja\",A64,IF(E65=\"ja\",A65,IF(E66=\"ja\",A66,IF(E67=\"ja\",A67,IF(E68=\"ja\",A68,IF(E69=\"ja\",A69,IF(E70=\"ja\",A70,IF(E71=\"ja\",A71,IF(E72=\"ja\",A72,IF(E73=\"ja\",A73,IF(A74=\"ja\",A74,\"Volgepland\")))))))))))))))))))","v":"2021-02-22"},null,null,null,null,0,null,null,0,0,null,null,0]
["2021-02-23",{"$f":"WEEKNUM(Tabel_kalender[[#This Row],[Datum]],21)","v":8},"1900-01-02",null,"ja",{"$f":"IF(Tabel_kalender[[#This Row],[Werkdag]]=\"ja\",Tabel_kalender[[#This Row],[Datum]],IF(E58=\"ja\",A58,IF(E59=\"ja\",A59,IF(E60=\"ja\",A60,IF(E61=\"ja\",A61,IF(E62=\"ja\",A62,IF(E63=\"ja\",A63,IF(E64=\"ja\",A64,IF(E65=\"ja\",A65,IF(E66=\"ja\",A66,IF(E67=\"ja\",A67,IF(E68=\"ja\",A68,IF(E69=\"ja\",A69,IF(E70=\"ja\",A70,IF(E71=\"ja\",A71,IF(E72=\"ja\",A72,IF(E73=\"ja\",A73,IF(E74=\"ja\",A74,IF(A75=\"ja\",A75,\"Volgepland\")))))))))))))))))))","v":"2021-02-23"},null,null,null,null,0,null,null,0,0,null,null,0]
["2021-02-24",{"$f":"WEEKNUM(Tabel_kalender[[#This Row],[Datum]],21)","v":8},"1900-01-03",null,"ja",{"$f":"IF(Tabel_kalender[[#This Row],[Werkdag]]=\"ja\",Tabel_kalender[[#This Row],[Datum]],IF(E59=\"ja\",A59,IF(E60=\"ja\",A60,IF(E61=\"ja\",A61,IF(E62=\"ja\",A62,IF(E63=\"ja\",A63,IF(E64=\"ja\",A64,IF(E65=\"ja\",A65,IF(E66=\"ja\",A66,IF(E67=\"ja\",A67,IF(E68=\"ja\",A68,IF(E69=\"ja\",A69,IF(E70=\"ja\",A70,IF(E71=\"ja\",A71,IF(E72=\"ja\",A72,IF(E73=\"ja\",A73,IF(E74=\"ja\",A74,IF(E75=\"ja\",A75,IF(A76=\"ja\",A76,\"Volgepland\")))))))))))))))))))","v":"2021-02-24"},null,null,null,null,0,null,null,0,0,null,null,0]
["2021-02-25",{"$f":"WEEKNUM(Tabel_kalender[[#This Row],[Datum]],21)","v":8},"1900-01-04",null,"ja",{"$f":"IF(Tabel_kalender[[#This Row],[Werkdag]]=\"ja\",Tabel_kalender[[#This Row],[Datum]],IF(E60=\"ja\",A60,IF(E61=\"ja\",A61,IF(E62=\"ja\",A62,IF(E63=\"ja\",A63,IF(E64=\"ja\",A64,IF(E65=\"ja\",A65,IF(E66=\"ja\",A66,IF(E67=\"ja\",A67,IF(E68=\"ja\",A68,IF(E69=\"ja\",A69,IF(E70=\"ja\",A70,IF(E71=\"ja\",A71,IF(E72=\"ja\",A72,IF(E73=\"ja\",A73,IF(E74=\"ja\",A74,IF(E75=\"ja\",A75,IF(E76=\"ja\",A76,IF(A77=\"ja\",A77,\"Volgepland\")))))))))))))))))))","v":"2021-02-25"},null,null,null,null,0,null,null,0,0,null,null,0]
["2021-02-26",{"$f":"WEEKNUM(Tabel_kalender[[#This Row],[Datum]],21)","v":8},"1900-01-05",null,"ja",{"$f":"IF(Tabel_kalender[[#This Row],[Werkdag]]=\"ja\",Tabel_kalender[[#This Row],[Datum]],IF(E61=\"ja\",A61,IF(E62=\"ja\",A62,IF(E63=\"ja\",A63,IF(E64=\"ja\",A64,IF(E65=\"ja\",A65,IF(E66=\"ja\",A66,IF(E67=\"ja\",A67,IF(E68=\"ja\",A68,IF(E69=\"ja\",A69,IF(E70=\"ja\",A70,IF(E71=\"ja\",A71,IF(E72=\"ja\",A72,IF(E73=\"ja\",A73,IF(E74=\"ja\",A74,IF(E75=\"ja\",A75,IF(E76=\"ja\",A76,IF(E77=\"ja\",A77,IF(A78=\"ja\",A78,\"Volgepland\")))))))))))))))))))","v":"2021-02-26"},null,null,null,null,0,null,null,0,0,null,null,0]
["2021-02-27",{"$f":"WEEKNUM(Tabel_kalender[[#This Row],[Datum]],21)","v":8},"1900-01-06",null,"nee",{"$f":"IF(Tabel_kalender[[#This Row],[Werkdag]]=\"ja\",Tabel_kalender[[#This Row],[Datum]],IF(E62=\"ja\",A62,IF(E63=\"ja\",A63,IF(E64=\"ja\",A64,IF(E65=\"ja\",A65,IF(E66=\"ja\",A66,IF(E67=\"ja\",A67,IF(E68=\"ja\",A68,IF(E69=\"ja\",A69,IF(E70=\"ja\",A70,IF(E71=\"ja\",A71,IF(E72=\"ja\",A72,IF(E73=\"ja\",A73,IF(E74=\"ja\",A74,IF(E75=\"ja\",A75,IF(E76=\"ja\",A76,IF(E77=\"ja\",A77,IF(E78=\"ja\",A78,IF(A79=\"ja\",A79,\"Volgepland\")))))))))))))))))))","v":"2021-03-01"},null,null,null,null,0,null,null,0,0,null,null,0]
["2021-02-28",{"$f":"WEEKNUM(Tabel_kalender[[#This Row],[Datum]],21)","v":8},"1900-01-07",null,"nee",{"$f":"IF(Tabel_kalender[[#This Row],[Werkdag]]=\"ja\",Tabel_kalender[[#This Row],[Datum]],IF(E63=\"ja\",A63,IF(E64=\"ja\",A64,IF(E65=\"ja\",A65,IF(E66=\"ja\",A66,IF(E67=\"ja\",A67,IF(E68=\"ja\",A68,IF(E69=\"ja\",A69,IF(E70=\"ja\",A70,IF(E71=\"ja\",A71,IF(E72=\"ja\",A72,IF(E73=\"ja\",A73,IF(E74=\"ja\",A74,IF(E75=\"ja\",A75,IF(E76=\"ja\",A76,IF(E77=\"ja\",A77,IF(E78=\"ja\",A78,IF(E79=\"ja\",A79,IF(A80=\"ja\",A80,\"Volgepland\")))))))))))))))))))","v":"2021-03-01"},null,null,null,null,0,null,null,0,0,null,null,0]
["2021-03-01",{"$f":"WEEKNUM(Tabel_kalender[[#This Row],[Datum]],21)","v":9},"1900-01-01",null,"ja",{"$f":"IF(Tabel_kalender[[#This Row],[Werkdag]]=\"ja\",Tabel_kalender[[#This Row],[Datum]],IF(E64=\"ja\",A64,IF(E65=\"ja\",A65,IF(E66=\"ja\",A66,IF(E67=\"ja\",A67,IF(E68=\"ja\",A68,IF(E69=\"ja\",A69,IF(E70=\"ja\",A70,IF(E71=\"ja\",A71,IF(E72=\"ja\",A72,IF(E73=\"ja\",A73,IF(E74=\"ja\",A74,IF(E75=\"ja\",A75,IF(E76=\"ja\",A76,IF(E77=\"ja\",A77,IF(E78=\"ja\",A78,IF(E79=\"ja\",A79,IF(E80=\"ja\",A80,IF(A81=\"ja\",A81,\"Volgepland\")))))))))))))))))))","v":"2021-03-01"},null,null,null,null,0,null,null,0,0,null,null,0]
["2021-03-02",{"$f":"WEEKNUM(Tabel_kalender[[#This Row],[Datum]],21)","v":9},"1900-01-02",null,"ja",{"$f":"IF(Tabel_kalender[[#This Row],[Werkdag]]=\"ja\",Tabel_kalender[[#This Row],[Datum]],IF(E65=\"ja\",A65,IF(E66=\"ja\",A66,IF(E67=\"ja\",A67,IF(E68=\"ja\",A68,IF(E69=\"ja\",A69,IF(E70=\"ja\",A70,IF(E71=\"ja\",A71,IF(E72=\"ja\",A72,IF(E73=\"ja\",A73,IF(E74=\"ja\",A74,IF(E75=\"ja\",A75,IF(E76=\"ja\",A76,IF(E77=\"ja\",A77,IF(E78=\"ja\",A78,IF(E79=\"ja\",A79,IF(E80=\"ja\",A80,IF(E81=\"ja\",A81,IF(A82=\"ja\",A82,\"Volgepland\")))))))))))))))))))","v":"2021-03-02"},null,null,null,null,0,null,null,0,0,null,null,0]
["2021-03-03",{"$f":"WEEKNUM(Tabel_kalender[[#This Row],[Datum]],21)","v":9},"1900-01-03",null,"ja",{"$f":"IF(Tabel_kalender[[#This Row],[Werkdag]]=\"ja\",Tabel_kalender[[#This Row],[Datum]],IF(E66=\"ja\",A66,IF(E67=\"ja\",A67,IF(E68=\"ja\",A68,IF(E69=\"ja\",A69,IF(E70=\"ja\",A70,IF(E71=\"ja\",A71,IF(E72=\"ja\",A72,IF(E73=\"ja\",A73,IF(E74=\"ja\",A74,IF(E75=\"ja\",A75,IF(E76=\"ja\",A76,IF(E77=\"ja\",A77,IF(E78=\"ja\",A78,IF(E79=\"ja\",A79,IF(E80=\"ja\",A80,IF(E81=\"ja\",A81,IF(E82=\"ja\",A82,IF(A83=\"ja\",A83,\"Volgepland\")))))))))))))))))))","v":"2021-03-03"},null,null,null,null,0,null,null,0,0,null,null,0]
["2021-03-04",{"$f":"WEEKNUM(Tabel_kalender[[#This Row],[Datum]],21)","v":9},"1900-01-04",null,"ja",{"$f":"IF(Tabel_kalender[[#This Row],[Werkdag]]=\"ja\",Tabel_kalender[[#This Row],[Datum]],IF(E67=\"ja\",A67,IF(E68=\"ja\",A68,IF(E69=\"ja\",A69,IF(E70=\"ja\",A70,IF(E71=\"ja\",A71,IF(E72=\"ja\",A72,IF(E73=\"ja\",A73,IF(E74=\"ja\",A74,IF(E75=\"ja\",A75,IF(E76=\"ja\",A76,IF(E77=\"ja\",A77,IF(E78=\"ja\",A78,IF(E79=\"ja\",A79,IF(E80=\"ja\",A80,IF(E81=\"ja\",A81,IF(E82=\"ja\",A82,IF(E83=\"ja\",A83,IF(A84=\"ja\",A84,\"Volgepland\")))))))))))))))))))","v":"2021-03-04"},null,null,null,null,0,null,null,0,0,null,null,0]
["2021-03-05",{"$f":"WEEKNUM(Tabel_kalender[[#This Row],[Datum]],21)","v":9},"1900-01-05",null,"ja",{"$f":"IF(Tabel_kalender[[#This Row],[Werkdag]]=\"ja\",Tabel_kalender[[#This Row],[Datum]],IF(E68=\"ja\",A68,IF(E69=\"ja\",A69,IF(E70=\"ja\",A70,IF(E71=\"ja\",A71,IF(E72=\"ja\",A72,IF(E73=\"ja\",A73,IF(E74=\"ja\",A74,IF(E75=\"ja\",A75,IF(E76=\"ja\",A76,IF(E77=\"ja\",A77,IF(E78=\"ja\",A78,IF(E79=\"ja\",A79,IF(E80=\"ja\",A80,IF(E81=\"ja\",A81,IF(E82=\"ja\",A82,IF(E83=\"ja\",A83,IF(E84=\"ja\",A84,IF(A85=\"ja\",A85,\"Volgepland\")))))))))))))))))))","v":"2021-03-05"},null,null,null,null,0,null,null,0,0,null,null,0]
[{"$f":"A67+1","v":"2021-03-06"},{"$f":"WEEKNUM(Tabel_kalender[[#This Row],[Datum]],21)","v":9},"1900-01-06",null,"nee",{"$f":"IF(Tabel_kalender[[#This Row],[Werkdag]]=\"ja\",Tabel_kalender[[#This Row],[Datum]],IF(E69=\"ja\",A69,IF(E70=\"ja\",A70,IF(E71=\"ja\",A71,IF(E72=\"ja\",A72,IF(E73=\"ja\",A73,IF(E74=\"ja\",A74,IF(E75=\"ja\",A75,IF(E76=\"ja\",A76,IF(E77=\"ja\",A77,IF(E78=\"ja\",A78,IF(E79=\"ja\",A79,IF(E80=\"ja\",A80,IF(E81=\"ja\",A81,IF(E82=\"ja\",A82,IF(E83=\"ja\",A83,IF(E84=\"ja\",A84,IF(E85=\"ja\",A85,IF(A86=\"ja\",A86,\"Volgepland\")))))))))))))))))))","v":"2021-03-08"},null,null,null,null,{"$f":"L67","v":0},null,null,{"$f":"IF(L68>0,L68-K68,)-M68","v":0},{"$f":"P67","v":0},null,null,{"$f":"IF(P68>0,P68-O68,)-Q68","v":0}]
["2021-03-07",{"$f":"WEEKNUM(Tabel_kalender[[#This Row],[Datum]],21)","v":9},{"$f":"WEEKDAY(A69,2)","v":"1900-01-07"},null,"nee",{"$f":"IF(Tabel_kalender[[#This Row],[Werkdag]]=\"ja\",Tabel_kalender[[#This Row],[Datum]],IF(E70=\"ja\",A70,IF(E71=\"ja\",A71,IF(E72=\"ja\",A72,IF(E73=\"ja\",A73,IF(E74=\"ja\",A74,IF(E75=\"ja\",A75,IF(E76=\"ja\",A76,IF(E77=\"ja\",A77,IF(E78=\"ja\",A78,IF(E79=\"ja\",A79,IF(E80=\"ja\",A80,IF(E81=\"ja\",A81,IF(E82=\"ja\",A82,IF(E83=\"ja\",A83,IF(E84=\"ja\",A84,IF(E85=\"ja\",A85,IF(E86=\"ja\",A86,IF(A87=\"ja\",A87,\"Volgepland\")))))))))))))))))))","v":"2021-03-08"},null,null,null,null,0,null,null,0,0,null,null,0]
["2021-03-08",{"$f":"WEEKNUM(Tabel_kalender[[#This Row],[Datum]],21)","v":10},"1900-01-01",null,"ja",{"$f":"IF(Tabel_kalender[[#This Row],[Werkdag]]=\"ja\",Tabel_kalender[[#This Row],[Datum]],IF(E71=\"ja\",A71,IF(E72=\"ja\",A72,IF(E73=\"ja\",A73,IF(E74=\"ja\",A74,IF(E75=\"ja\",A75,IF(E76=\"ja\",A76,IF(E77=\"ja\",A77,IF(E78=\"ja\",A78,IF(E79=\"ja\",A79,IF(E80=\"ja\",A80,IF(E81=\"ja\",A81,IF(E82=\"ja\",A82,IF(E83=\"ja\",A83,IF(E84=\"ja\",A84,IF(E85=\"ja\",A85,IF(E86=\"ja\",A86,IF(E87=\"ja\",A87,IF(A88=\"ja\",A88,\"Volgepland\")))))))))))))))))))","v":"2021-03-08"},null,null,null,null,0,null,null,0,0,null,null,0]
["2021-03-09",{"$f":"WEEKNUM(Tabel_kalender[[#This Row],[Datum]],21)","v":10},"1900-01-02",null,"ja",{"$f":"IF(Tabel_kalender[[#This Row],[Werkdag]]=\"ja\",Tabel_kalender[[#This Row],[Datum]],IF(E72=\"ja\",A72,IF(E73=\"ja\",A73,IF(E74=\"ja\",A74,IF(E75=\"ja\",A75,IF(E76=\"ja\",A76,IF(E77=\"ja\",A77,IF(E78=\"ja\",A78,IF(E79=\"ja\",A79,IF(E80=\"ja\",A80,IF(E81=\"ja\",A81,IF(E82=\"ja\",A82,IF(E83=\"ja\",A83,IF(E84=\"ja\",A84,IF(E85=\"ja\",A85,IF(E86=\"ja\",A86,IF(E87=\"ja\",A87,IF(E88=\"ja\",A88,IF(A89=\"ja\",A89,\"Volgepland\")))))))))))))))))))","v":"2021-03-09"},null,null,null,null,0,null,null,0,0,null,null,0]
["2021-03-10",{"$f":"WEEKNUM(Tabel_kalender[[#This Row],[Datum]],21)","v":10},"1900-01-03",null,"ja",{"$f":"IF(Tabel_kalender[[#This Row],[Werkdag]]=\"ja\",Tabel_kalender[[#This Row],[Datum]],IF(E73=\"ja\",A73,IF(E74=\"ja\",A74,IF(E75=\"ja\",A75,IF(E76=\"ja\",A76,IF(E77=\"ja\",A77,IF(E78=\"ja\",A78,IF(E79=\"ja\",A79,IF(E80=\"ja\",A80,IF(E81=\"ja\",A81,IF(E82=\"ja\",A82,IF(E83=\"ja\",A83,IF(E84=\"ja\",A84,IF(E85=\"ja\",A85,IF(E86=\"ja\",A86,IF(E87=\"ja\",A87,IF(E88=\"ja\",A88,IF(E89=\"ja\",A89,IF(A90=\"ja\",A90,\"Volgepland\")))))))))))))))))))","v":"2021-03-10"},null,null,null,null,0,null,null,0,0,null,null,0]
["2021-03-11",{"$f":"WEEKNUM(Tabel_kalender[[#This Row],[Datum]],21)","v":10},"1900-01-04",null,"ja",{"$f":"IF(Tabel_kalender[[#This Row],[Werkdag]]=\"ja\",Tabel_kalender[[#This Row],[Datum]],IF(E74=\"ja\",A74,IF(E75=\"ja\",A75,IF(E76=\"ja\",A76,IF(E77=\"ja\",A77,IF(E78=\"ja\",A78,IF(E79=\"ja\",A79,IF(E80=\"ja\",A80,IF(E81=\"ja\",A81,IF(E82=\"ja\",A82,IF(E83=\"ja\",A83,IF(E84=\"ja\",A84,IF(E85=\"ja\",A85,IF(E86=\"ja\",A86,IF(E87=\"ja\",A87,IF(E88=\"ja\",A88,IF(E89=\"ja\",A89,IF(E90=\"ja\",A90,IF(A91=\"ja\",A91,\"Volgepland\")))))))))))))))))))","v":"2021-03-11"},null,null,null,null,0,null,null,0,0,null,null,0]
["2021-03-12",{"$f":"WEEKNUM(Tabel_kalender[[#This Row],[Datum]],21)","v":10},"1900-01-05",null,"ja",{"$f":"IF(Tabel_kalender[[#This Row],[Werkdag]]=\"ja\",Tabel_kalender[[#This Row],[Datum]],IF(E75=\"ja\",A75,IF(E76=\"ja\",A76,IF(E77=\"ja\",A77,IF(E78=\"ja\",A78,IF(E79=\"ja\",A79,IF(E80=\"ja\",A80,IF(E81=\"ja\",A81,IF(E82=\"ja\",A82,IF(E83=\"ja\",A83,IF(E84=\"ja\",A84,IF(E85=\"ja\",A85,IF(E86=\"ja\",A86,IF(E87=\"ja\",A87,IF(E88=\"ja\",A88,IF(E89=\"ja\",A89,IF(E90=\"ja\",A90,IF(E91=\"ja\",A91,IF(A92=\"ja\",A92,\"Volgepland\")))))))))))))))))))","v":"2021-03-12"},null,null,null,null,0,null,null,0,0,null,null,0]
["2021-03-13",{"$f":"WEEKNUM(Tabel_kalender[[#This Row],[Datum]],21)","v":10},"1900-01-06",null,"nee",{"$f":"IF(Tabel_kalender[[#This Row],[Werkdag]]=\"ja\",Tabel_kalender[[#This Row],[Datum]],IF(E76=\"ja\",A76,IF(E77=\"ja\",A77,IF(E78=\"ja\",A78,IF(E79=\"ja\",A79,IF(E80=\"ja\",A80,IF(E81=\"ja\",A81,IF(E82=\"ja\",A82,IF(E83=\"ja\",A83,IF(E84=\"ja\",A84,IF(E85=\"ja\",A85,IF(E86=\"ja\",A86,IF(E87=\"ja\",A87,IF(E88=\"ja\",A88,IF(E89=\"ja\",A89,IF(E90=\"ja\",A90,IF(E91=\"ja\",A91,IF(E92=\"ja\",A92,IF(A93=\"ja\",A93,\"Volgepland\")))))))))))))))))))","v":"2021-03-15"},null,null,null,null,0,null,null,0,0,null,null,0]
["2021-03-14",{"$f":"WEEKNUM(Tabel_kalender[[#This Row],[Datum]],21)","v":10},"1900-01-07",null,"nee",{"$f":"IF(Tabel_kalender[[#This Row],[Werkdag]]=\"ja\",Tabel_kalender[[#This Row],[Datum]],IF(E77=\"ja\",A77,IF(E78=\"ja\",A78,IF(E79=\"ja\",A79,IF(E80=\"ja\",A80,IF(E81=\"ja\",A81,IF(E82=\"ja\",A82,IF(E83=\"ja\",A83,IF(E84=\"ja\",A84,IF(E85=\"ja\",A85,IF(E86=\"ja\",A86,IF(E87=\"ja\",A87,IF(E88=\"ja\",A88,IF(E89=\"ja\",A89,IF(E90=\"ja\",A90,IF(E91=\"ja\",A91,IF(E92=\"ja\",A92,IF(E93=\"ja\",A93,IF(A94=\"ja\",A94,\"Volgepland\")))))))))))))))))))","v":"2021-03-15"},null,null,null,null,0,null,null,0,0,null,null,0]
["2021-03-15",{"$f":"WEEKNUM(Tabel_kalender[[#This Row],[Datum]],21)","v":11},"1900-01-01",null,"ja",{"$f":"IF(Tabel_kalender[[#This Row],[Werkdag]]=\"ja\",Tabel_kalender[[#This Row],[Datum]],IF(E78=\"ja\",A78,IF(E79=\"ja\",A79,IF(E80=\"ja\",A80,IF(E81=\"ja\",A81,IF(E82=\"ja\",A82,IF(E83=\"ja\",A83,IF(E84=\"ja\",A84,IF(E85=\"ja\",A85,IF(E86=\"ja\",A86,IF(E87=\"ja\",A87,IF(E88=\"ja\",A88,IF(E89=\"ja\",A89,IF(E90=\"ja\",A90,IF(E91=\"ja\",A91,IF(E92=\"ja\",A92,IF(E93=\"ja\",A93,IF(E94=\"ja\",A94,IF(A95=\"ja\",A95,\"Volgepland\")))))))))))))))))))","v":"2021-03-15"},null,null,null,null,0,null,null,0,0,null,null,0]
["2021-03-16",{"$f":"WEEKNUM(Tabel_kalender[[#This Row],[Datum]],21)","v":11},"1900-01-02",null,"ja",{"$f":"IF(Tabel_kalender[[#This Row],[Werkdag]]=\"ja\",Tabel_kalender[[#This Row],[Datum]],IF(E79=\"ja\",A79,IF(E80=\"ja\",A80,IF(E81=\"ja\",A81,IF(E82=\"ja\",A82,IF(E83=\"ja\",A83,IF(E84=\"ja\",A84,IF(E85=\"ja\",A85,IF(E86=\"ja\",A86,IF(E87=\"ja\",A87,IF(E88=\"ja\",A88,IF(E89=\"ja\",A89,IF(E90=\"ja\",A90,IF(E91=\"ja\",A91,IF(E92=\"ja\",A92,IF(E93=\"ja\",A93,IF(E94=\"ja\",A94,IF(E95=\"ja\",A95,IF(A96=\"ja\",A96,\"Volgepland\")))))))))))))))))))","v":"2021-03-16"},null,null,null,null,0,null,null,0,0,null,null,0]
["2021-03-17",{"$f":"WEEKNUM(Tabel_kalender[[#This Row],[Datum]],21)","v":11},"1900-01-03",null,"ja",{"$f":"IF(Tabel_kalender[[#This Row],[Werkdag]]=\"ja\",Tabel_kalender[[#This Row],[Datum]],IF(E80=\"ja\",A80,IF(E81=\"ja\",A81,IF(E82=\"ja\",A82,IF(E83=\"ja\",A83,IF(E84=\"ja\",A84,IF(E85=\"ja\",A85,IF(E86=\"ja\",A86,IF(E87=\"ja\",A87,IF(E88=\"ja\",A88,IF(E89=\"ja\",A89,IF(E90=\"ja\",A90,IF(E91=\"ja\",A91,IF(E92=\"ja\",A92,IF(E93=\"ja\",A93,IF(E94=\"ja\",A94,IF(E95=\"ja\",A95,IF(E96=\"ja\",A96,IF(A97=\"ja\",A97,\"Volgepland\")))))))))))))))))))","v":"2021-03-17"},null,null,null,null,0,null,null,0,0,null,null,0]
["2021-03-18",{"$f":"WEEKNUM(Tabel_kalender[[#This Row],[Datum]],21)","v":11},"1900-01-04",null,"ja",{"$f":"IF(Tabel_kalender[[#This Row],[Werkdag]]=\"ja\",Tabel_kalender[[#This Row],[Datum]],IF(E81=\"ja\",A81,IF(E82=\"ja\",A82,IF(E83=\"ja\",A83,IF(E84=\"ja\",A84,IF(E85=\"ja\",A85,IF(E86=\"ja\",A86,IF(E87=\"ja\",A87,IF(E88=\"ja\",A88,IF(E89=\"ja\",A89,IF(E90=\"ja\",A90,IF(E91=\"ja\",A91,IF(E92=\"ja\",A92,IF(E93=\"ja\",A93,IF(E94=\"ja\",A94,IF(E95=\"ja\",A95,IF(E96=\"ja\",A96,IF(E97=\"ja\",A97,IF(A98=\"ja\",A98,\"Volgepland\")))))))))))))))))))","v":"2021-03-18"},null,null,null,null,0,null,null,0,0,null,null,0]
["2021-03-19",{"$f":"WEEKNUM(Tabel_kalender[[#This Row],[Datum]],21)","v":11},"1900-01-05",null,"ja",{"$f":"IF(Tabel_kalender[[#This Row],[Werkdag]]=\"ja\",Tabel_kalender[[#This Row],[Datum]],IF(E82=\"ja\",A82,IF(E83=\"ja\",A83,IF(E84=\"ja\",A84,IF(E85=\"ja\",A85,IF(E86=\"ja\",A86,IF(E87=\"ja\",A87,IF(E88=\"ja\",A88,IF(E89=\"ja\",A89,IF(E90=\"ja\",A90,IF(E91=\"ja\",A91,IF(E92=\"ja\",A92,IF(E93=\"ja\",A93,IF(E94=\"ja\",A94,IF(E95=\"ja\",A95,IF(E96=\"ja\",A96,IF(E97=\"ja\",A97,IF(E98=\"ja\",A98,IF(A99=\"ja\",A99,\"Volgepland\")))))))))))))))))))","v":"2021-03-19"},null,null,null,null,0,null,null,0,0,null,null,0]
["2021-03-20",{"$f":"WEEKNUM(Tabel_kalender[[#This Row],[Datum]],21)","v":11},"1900-01-06",null,"nee",{"$f":"IF(Tabel_kalender[[#This Row],[Werkdag]]=\"ja\",Tabel_kalender[[#This Row],[Datum]],IF(E83=\"ja\",A83,IF(E84=\"ja\",A84,IF(E85=\"ja\",A85,IF(E86=\"ja\",A86,IF(E87=\"ja\",A87,IF(E88=\"ja\",A88,IF(E89=\"ja\",A89,IF(E90=\"ja\",A90,IF(E91=\"ja\",A91,IF(E92=\"ja\",A92,IF(E93=\"ja\",A93,IF(E94=\"ja\",A94,IF(E95=\"ja\",A95,IF(E96=\"ja\",A96,IF(E97=\"ja\",A97,IF(E98=\"ja\",A98,IF(E99=\"ja\",A99,IF(A100=\"ja\",A100,\"Volgepland\")))))))))))))))))))","v":"2021-03-22"},null,null,null,null,0,null,null,0,0,null,null,0]
["2021-03-21",{"$f":"WEEKNUM(Tabel_kalender[[#This Row],[Datum]],21)","v":11},"1900-01-07",null,"nee",{"$f":"IF(Tabel_kalender[[#This Row],[Werkdag]]=\"ja\",Tabel_kalender[[#This Row],[Datum]],IF(E84=\"ja\",A84,IF(E85=\"ja\",A85,IF(E86=\"ja\",A86,IF(E87=\"ja\",A87,IF(E88=\"ja\",A88,IF(E89=\"ja\",A89,IF(E90=\"ja\",A90,IF(E91=\"ja\",A91,IF(E92=\"ja\",A92,IF(E93=\"ja\",A93,IF(E94=\"ja\",A94,IF(E95=\"ja\",A95,IF(E96=\"ja\",A96,IF(E97=\"ja\",A97,IF(E98=\"ja\",A98,IF(E99=\"ja\",A99,IF(E100=\"ja\",A100,IF(A101=\"ja\",A101,\"Volgepland\")))))))))))))))))))","v":"2021-03-22"},null,null,null,null,0,null,null,0,0,null,null,0]
["2021-03-22",{"$f":"WEEKNUM(Tabel_kalender[[#This Row],[Datum]],21)","v":12},"1900-01-01",null,"ja",{"$f":"IF(Tabel_kalender[[#This Row],[Werkdag]]=\"ja\",Tabel_kalender[[#This Row],[Datum]],IF(E85=\"ja\",A85,IF(E86=\"ja\",A86,IF(E87=\"ja\",A87,IF(E88=\"ja\",A88,IF(E89=\"ja\",A89,IF(E90=\"ja\",A90,IF(E91=\"ja\",A91,IF(E92=\"ja\",A92,IF(E93=\"ja\",A93,IF(E94=\"ja\",A94,IF(E95=\"ja\",A95,IF(E96=\"ja\",A96,IF(E97=\"ja\",A97,IF(E98=\"ja\",A98,IF(E99=\"ja\",A99,IF(E100=\"ja\",A100,IF(E101=\"ja\",A101,IF(A102=\"ja\",A102,\"Volgepland\")))))))))))))))))))","v":"2021-03-22"},null,null,null,null,0,null,null,0,0,null,null,0]
["2021-03-23",{"$f":"WEEKNUM(Tabel_kalender[[#This Row],[Datum]],21)","v":12},"1900-01-02",null,"ja",{"$f":"IF(Tabel_kalender[[#This Row],[Werkdag]]=\"ja\",Tabel_kalender[[#This Row],[Datum]],IF(E86=\"ja\",A86,IF(E87=\"ja\",A87,IF(E88=\"ja\",A88,IF(E89=\"ja\",A89,IF(E90=\"ja\",A90,IF(E91=\"ja\",A91,IF(E92=\"ja\",A92,IF(E93=\"ja\",A93,IF(E94=\"ja\",A94,IF(E95=\"ja\",A95,IF(E96=\"ja\",A96,IF(E97=\"ja\",A97,IF(E98=\"ja\",A98,IF(E99=\"ja\",A99,IF(E100=\"ja\",A100,IF(E101=\"ja\",A101,IF(E102=\"ja\",A102,IF(A103=\"ja\",A103,\"Volgepland\")))))))))))))))))))","v":"2021-03-23"},null,null,null,null,0,null,null,0,0,null,null,0]
["2021-03-24",{"$f":"WEEKNUM(Tabel_kalender[[#This Row],[Datum]],21)","v":12},"1900-01-03",null,"ja",{"$f":"IF(Tabel_kalender[[#This Row],[Werkdag]]=\"ja\",Tabel_kalender[[#This Row],[Datum]],IF(E87=\"ja\",A87,IF(E88=\"ja\",A88,IF(E89=\"ja\",A89,IF(E90=\"ja\",A90,IF(E91=\"ja\",A91,IF(E92=\"ja\",A92,IF(E93=\"ja\",A93,IF(E94=\"ja\",A94,IF(E95=\"ja\",A95,IF(E96=\"ja\",A96,IF(E97=\"ja\",A97,IF(E98=\"ja\",A98,IF(E99=\"ja\",A99,IF(E100=\"ja\",A100,IF(E101=\"ja\",A101,IF(E102=\"ja\",A102,IF(E103=\"ja\",A103,IF(A104=\"ja\",A104,\"Volgepland\")))))))))))))))))))","v":"2021-03-24"},null,null,null,null,0,null,null,0,0,null,null,0]
["2021-03-25",{"$f":"WEEKNUM(Tabel_kalender[[#This Row],[Datum]],21)","v":12},"1900-01-04",null,"ja",{"$f":"IF(Tabel_kalender[[#This Row],[Werkdag]]=\"ja\",Tabel_kalender[[#This Row],[Datum]],IF(E88=\"ja\",A88,IF(E89=\"ja\",A89,IF(E90=\"ja\",A90,IF(E91=\"ja\",A91,IF(E92=\"ja\",A92,IF(E93=\"ja\",A93,IF(E94=\"ja\",A94,IF(E95=\"ja\",A95,IF(E96=\"ja\",A96,IF(E97=\"ja\",A97,IF(E98=\"ja\",A98,IF(E99=\"ja\",A99,IF(E100=\"ja\",A100,IF(E101=\"ja\",A101,IF(E102=\"ja\",A102,IF(E103=\"ja\",A103,IF(E104=\"ja\",A104,IF(A105=\"ja\",A105,\"Volgepland\")))))))))))))))))))","v":"2021-03-25"},null,null,null,null,0,null,null,0,0,null,null,0]
["2021-03-26",{"$f":"WEEKNUM(Tabel_kalender[[#This Row],[Datum]],21)","v":12},"1900-01-05",null,"ja",{"$f":"IF(Tabel_kalender[[#This Row],[Werkdag]]=\"ja\",Tabel_kalender[[#This Row],[Datum]],IF(E89=\"ja\",A89,IF(E90=\"ja\",A90,IF(E91=\"ja\",A91,IF(E92=\"ja\",A92,IF(E93=\"ja\",A93,IF(E94=\"ja\",A94,IF(E95=\"ja\",A95,IF(E96=\"ja\",A96,IF(E97=\"ja\",A97,IF(E98=\"ja\",A98,IF(E99=\"ja\",A99,IF(E100=\"ja\",A100,IF(E101=\"ja\",A101,IF(E102=\"ja\",A102,IF(E103=\"ja\",A103,IF(E104=\"ja\",A104,IF(E105=\"ja\",A105,IF(A106=\"ja\",A106,\"Volgepland\")))))))))))))))))))","v":"2021-03-26"},null,null,null,null,0,null,null,0,0,null,null,0]
["2021-03-27",{"$f":"WEEKNUM(Tabel_kalender[[#This Row],[Datum]],21)","v":12},"1900-01-06",null,"nee",{"$f":"IF(Tabel_kalender[[#This Row],[Werkdag]]=\"ja\",Tabel_kalender[[#This Row],[Datum]],IF(E90=\"ja\",A90,IF(E91=\"ja\",A91,IF(E92=\"ja\",A92,IF(E93=\"ja\",A93,IF(E94=\"ja\",A94,IF(E95=\"ja\",A95,IF(E96=\"ja\",A96,IF(E97=\"ja\",A97,IF(E98=\"ja\",A98,IF(E99=\"ja\",A99,IF(E100=\"ja\",A100,IF(E101=\"ja\",A101,IF(E102=\"ja\",A102,IF(E103=\"ja\",A103,IF(E104=\"ja\",A104,IF(E105=\"ja\",A105,IF(E106=\"ja\",A106,IF(A107=\"ja\",A107,\"Volgepland\")))))))))))))))))))","v":"2021-03-29"},null,null,null,null,0,null,null,0,0,null,null,0]
["2021-03-28",{"$f":"WEEKNUM(Tabel_kalender[[#This Row],[Datum]],21)","v":12},"1900-01-07",null,"nee",{"$f":"IF(Tabel_kalender[[#This Row],[Werkdag]]=\"ja\",Tabel_kalender[[#This Row],[Datum]],IF(E91=\"ja\",A91,IF(E92=\"ja\",A92,IF(E93=\"ja\",A93,IF(E94=\"ja\",A94,IF(E95=\"ja\",A95,IF(E96=\"ja\",A96,IF(E97=\"ja\",A97,IF(E98=\"ja\",A98,IF(E99=\"ja\",A99,IF(E100=\"ja\",A100,IF(E101=\"ja\",A101,IF(E102=\"ja\",A102,IF(E103=\"ja\",A103,IF(E104=\"ja\",A104,IF(E105=\"ja\",A105,IF(E106=\"ja\",A106,IF(E107=\"ja\",A107,IF(A108=\"ja\",A108,\"Volgepland\")))))))))))))))))))","v":"2021-03-29"},null,null,null,null,0,null,null,0,0,null,null,0]
["2021-03-29",{"$f":"WEEKNUM(Tabel_kalender[[#This Row],[Datum]],21)","v":13},"1900-01-01",null,"ja",{"$f":"IF(Tabel_kalender[[#This Row],[Werkdag]]=\"ja\",Tabel_kalender[[#This Row],[Datum]],IF(E92=\"ja\",A92,IF(E93=\"ja\",A93,IF(E94=\"ja\",A94,IF(E95=\"ja\",A95,IF(E96=\"ja\",A96,IF(E97=\"ja\",A97,IF(E98=\"ja\",A98,IF(E99=\"ja\",A99,IF(E100=\"ja\",A100,IF(E101=\"ja\",A101,IF(E102=\"ja\",A102,IF(E103=\"ja\",A103,IF(E104=\"ja\",A104,IF(E105=\"ja\",A105,IF(E106=\"ja\",A106,IF(E107=\"ja\",A107,IF(E108=\"ja\",A108,IF(A109=\"ja\",A109,\"Volgepland\")))))))))))))))))))","v":"2021-03-29"},null,null,null,null,0,null,null,0,0,null,null,0]
["2021-03-30",{"$f":"WEEKNUM(Tabel_kalender[[#This Row],[Datum]],21)","v":13},"1900-01-02",null,"ja",{"$f":"IF(Tabel_kalender[[#This Row],[Werkdag]]=\"ja\",Tabel_kalender[[#This Row],[Datum]],IF(E93=\"ja\",A93,IF(E94=\"ja\",A94,IF(E95=\"ja\",A95,IF(E96=\"ja\",A96,IF(E97=\"ja\",A97,IF(E98=\"ja\",A98,IF(E99=\"ja\",A99,IF(E100=\"ja\",A100,IF(E101=\"ja\",A101,IF(E102=\"ja\",A102,IF(E103=\"ja\",A103,IF(E104=\"ja\",A104,IF(E105=\"ja\",A105,IF(E106=\"ja\",A106,IF(E107=\"ja\",A107,IF(E108=\"ja\",A108,IF(E109=\"ja\",A109,IF(A110=\"ja\",A110,\"Volgepland\")))))))))))))))))))","v":"2021-03-30"},null,null,null,null,0,null,null,0,0,null,null,0]
["2021-03-31",{"$f":"WEEKNUM(Tabel_kalender[[#This Row],[Datum]],21)","v":13},"1900-01-03",null,"ja",{"$f":"IF(Tabel_kalender[[#This Row],[Werkdag]]=\"ja\",Tabel_kalender[[#This Row],[Datum]],IF(E94=\"ja\",A94,IF(E95=\"ja\",A95,IF(E96=\"ja\",A96,IF(E97=\"ja\",A97,IF(E98=\"ja\",A98,IF(E99=\"ja\",A99,IF(E100=\"ja\",A100,IF(E101=\"ja\",A101,IF(E102=\"ja\",A102,IF(E103=\"ja\",A103,IF(E104=\"ja\",A104,IF(E105=\"ja\",A105,IF(E106=\"ja\",A106,IF(E107=\"ja\",A107,IF(E108=\"ja\",A108,IF(E109=\"ja\",A109,IF(E110=\"ja\",A110,IF(A111=\"ja\",A111,\"Volgepland\")))))))))))))))))))","v":"2021-03-31"},null,null,null,null,0,null,null,0,0,null,null,0]
["2021-04-01",{"$f":"WEEKNUM(Tabel_kalender[[#This Row],[Datum]],21)","v":13},"1900-01-04",null,"ja",{"$f":"IF(Tabel_kalender[[#This Row],[Werkdag]]=\"ja\",Tabel_kalender[[#This Row],[Datum]],IF(E95=\"ja\",A95,IF(E96=\"ja\",A96,IF(E97=\"ja\",A97,IF(E98=\"ja\",A98,IF(E99=\"ja\",A99,IF(E100=\"ja\",A100,IF(E101=\"ja\",A101,IF(E102=\"ja\",A102,IF(E103=\"ja\",A103,IF(E104=\"ja\",A104,IF(E105=\"ja\",A105,IF(E106=\"ja\",A106,IF(E107=\"ja\",A107,IF(E108=\"ja\",A108,IF(E109=\"ja\",A109,IF(E110=\"ja\",A110,IF(E111=\"ja\",A111,IF(A112=\"ja\",A112,\"Volgepland\")))))))))))))))))))","v":"2021-04-01"},null,null,null,null,0,null,null,0,0,null,null,0]
["2021-04-02",{"$f":"WEEKNUM(Tabel_kalender[[#This Row],[Datum]],21)","v":13},"1900-01-05",null,"ja",{"$f":"IF(Tabel_kalender[[#This Row],[Werkdag]]=\"ja\",Tabel_kalender[[#This Row],[Datum]],IF(E96=\"ja\",A96,IF(E97=\"ja\",A97,IF(E98=\"ja\",A98,IF(E99=\"ja\",A99,IF(E100=\"ja\",A100,IF(E101=\"ja\",A101,IF(E102=\"ja\",A102,IF(E103=\"ja\",A103,IF(E104=\"ja\",A104,IF(E105=\"ja\",A105,IF(E106=\"ja\",A106,IF(E107=\"ja\",A107,IF(E108=\"ja\",A108,IF(E109=\"ja\",A109,IF(E110=\"ja\",A110,IF(E111=\"ja\",A111,IF(E112=\"ja\",A112,IF(A113=\"ja\",A113,\"Volgepland\")))))))))))))))))))","v":"2021-04-02"},null,null,null,null,0,null,null,0,0,null,null,0]
["2021-04-03",{"$f":"WEEKNUM(Tabel_kalender[[#This Row],[Datum]],21)","v":13},"1900-01-06",null,"nee",{"$f":"IF(Tabel_kalender[[#This Row],[Werkdag]]=\"ja\",Tabel_kalender[[#This Row],[Datum]],IF(E97=\"ja\",A97,IF(E98=\"ja\",A98,IF(E99=\"ja\",A99,IF(E100=\"ja\",A100,IF(E101=\"ja\",A101,IF(E102=\"ja\",A102,IF(E103=\"ja\",A103,IF(E104=\"ja\",A104,IF(E105=\"ja\",A105,IF(E106=\"ja\",A106,IF(E107=\"ja\",A107,IF(E108=\"ja\",A108,IF(E109=\"ja\",A109,IF(E110=\"ja\",A110,IF(E111=\"ja\",A111,IF(E112=\"ja\",A112,IF(E113=\"ja\",A113,IF(A114=\"ja\",A114,\"Volgepland\")))))))))))))))))))","v":"2021-04-05"},null,null,null,null,0,null,null,0,0,null,null,0]
["2021-04-04",{"$f":"WEEKNUM(Tabel_kalender[[#This Row],[Datum]],21)","v":13},"1900-01-07",null,"nee",{"$f":"IF(Tabel_kalender[[#This Row],[Werkdag]]=\"ja\",Tabel_kalender[[#This Row],[Datum]],IF(E98=\"ja\",A98,IF(E99=\"ja\",A99,IF(E100=\"ja\",A100,IF(E101=\"ja\",A101,IF(E102=\"ja\",A102,IF(E103=\"ja\",A103,IF(E104=\"ja\",A104,IF(E105=\"ja\",A105,IF(E106=\"ja\",A106,IF(E107=\"ja\",A107,IF(E108=\"ja\",A108,IF(E109=\"ja\",A109,IF(E110=\"ja\",A110,IF(E111=\"ja\",A111,IF(E112=\"ja\",A112,IF(E113=\"ja\",A113,IF(E114=\"ja\",A114,IF(A115=\"ja\",A115,\"Volgepland\")))))))))))))))))))","v":"2021-04-05"},null,null,null,null,0,null,null,0,0,null,null,0]
["2021-04-05",{"$f":"WEEKNUM(Tabel_kalender[[#This Row],[Datum]],21)","v":14},"1900-01-01",null,"ja",{"$f":"IF(Tabel_kalender[[#This Row],[Werkdag]]=\"ja\",Tabel_kalender[[#This Row],[Datum]],IF(E99=\"ja\",A99,IF(E100=\"ja\",A100,IF(E101=\"ja\",A101,IF(E102=\"ja\",A102,IF(E103=\"ja\",A103,IF(E104=\"ja\",A104,IF(E105=\"ja\",A105,IF(E106=\"ja\",A106,IF(E107=\"ja\",A107,IF(E108=\"ja\",A108,IF(E109=\"ja\",A109,IF(E110=\"ja\",A110,IF(E111=\"ja\",A111,IF(E112=\"ja\",A112,IF(E113=\"ja\",A113,IF(E114=\"ja\",A114,IF(E115=\"ja\",A115,IF(A116=\"ja\",A116,\"Volgepland\")))))))))))))))))))","v":"2021-04-05"},null,null,null,null,0,null,null,0,0,null,null,0]
["2021-04-06",{"$f":"WEEKNUM(Tabel_kalender[[#This Row],[Datum]],21)","v":14},"1900-01-02",null,"ja",{"$f":"IF(Tabel_kalender[[#This Row],[Werkdag]]=\"ja\",Tabel_kalender[[#This Row],[Datum]],IF(E100=\"ja\",A100,IF(E101=\"ja\",A101,IF(E102=\"ja\",A102,IF(E103=\"ja\",A103,IF(E104=\"ja\",A104,IF(E105=\"ja\",A105,IF(E106=\"ja\",A106,IF(E107=\"ja\",A107,IF(E108=\"ja\",A108,IF(E109=\"ja\",A109,IF(E110=\"ja\",A110,IF(E111=\"ja\",A111,IF(E112=\"ja\",A112,IF(E113=\"ja\",A113,IF(E114=\"ja\",A114,IF(E115=\"ja\",A115,IF(E116=\"ja\",A116,IF(A117=\"ja\",A117,\"Volgepland\")))))))))))))))))))","v":"2021-04-06"},null,null,null,null,0,null,null,0,0,null,null,0]
["2021-04-07",{"$f":"WEEKNUM(Tabel_kalender[[#This Row],[Datum]],21)","v":14},"1900-01-03",null,"ja",{"$f":"IF(Tabel_kalender[[#This Row],[Werkdag]]=\"ja\",Tabel_kalender[[#This Row],[Datum]],IF(E101=\"ja\",A101,IF(E102=\"ja\",A102,IF(E103=\"ja\",A103,IF(E104=\"ja\",A104,IF(E105=\"ja\",A105,IF(E106=\"ja\",A106,IF(E107=\"ja\",A107,IF(E108=\"ja\",A108,IF(E109=\"ja\",A109,IF(E110=\"ja\",A110,IF(E111=\"ja\",A111,IF(E112=\"ja\",A112,IF(E113=\"ja\",A113,IF(E114=\"ja\",A114,IF(E115=\"ja\",A115,IF(E116=\"ja\",A116,IF(E117=\"ja\",A117,IF(A118=\"ja\",A118,\"Volgepland\")))))))))))))))))))","v":"2021-04-07"},null,null,null,null,0,null,null,0,0,null,null,0]
["2021-04-08",{"$f":"WEEKNUM(Tabel_kalender[[#This Row],[Datum]],21)","v":14},"1900-01-04",null,"ja",{"$f":"IF(Tabel_kalender[[#This Row],[Werkdag]]=\"ja\",Tabel_kalender[[#This Row],[Datum]],IF(E102=\"ja\",A102,IF(E103=\"ja\",A103,IF(E104=\"ja\",A104,IF(E105=\"ja\",A105,IF(E106=\"ja\",A106,IF(E107=\"ja\",A107,IF(E108=\"ja\",A108,IF(E109=\"ja\",A109,IF(E110=\"ja\",A110,IF(E111=\"ja\",A111,IF(E112=\"ja\",A112,IF(E113=\"ja\",A113,IF(E114=\"ja\",A114,IF(E115=\"ja\",A115,IF(E116=\"ja\",A116,IF(E117=\"ja\",A117,IF(E118=\"ja\",A118,IF(A119=\"ja\",A119,\"Volgepland\")))))))))))))))))))","v":"2021-04-08"},null,null,null,null,0,null,null,0,0,null,null,0]
["2021-04-09",{"$f":"WEEKNUM(Tabel_kalender[[#This Row],[Datum]],21)","v":14},"1900-01-05",null,"ja",{"$f":"IF(Tabel_kalender[[#This Row],[Werkdag]]=\"ja\",Tabel_kalender[[#This Row],[Datum]],IF(E103=\"ja\",A103,IF(E104=\"ja\",A104,IF(E105=\"ja\",A105,IF(E106=\"ja\",A106,IF(E107=\"ja\",A107,IF(E108=\"ja\",A108,IF(E109=\"ja\",A109,IF(E110=\"ja\",A110,IF(E111=\"ja\",A111,IF(E112=\"ja\",A112,IF(E113=\"ja\",A113,IF(E114=\"ja\",A114,IF(E115=\"ja\",A115,IF(E116=\"ja\",A116,IF(E117=\"ja\",A117,IF(E118=\"ja\",A118,IF(E119=\"ja\",A119,IF(A120=\"ja\",A120,\"Volgepland\")))))))))))))))))))","v":"2021-04-09"},null,null,null,null,0,null,null,0,0,null,null,0]
["2021-04-10",{"$f":"WEEKNUM(Tabel_kalender[[#This Row],[Datum]],21)","v":14},"1900-01-06",null,"nee",{"$f":"IF(Tabel_kalender[[#This Row],[Werkdag]]=\"ja\",Tabel_kalender[[#This Row],[Datum]],IF(E104=\"ja\",A104,IF(E105=\"ja\",A105,IF(E106=\"ja\",A106,IF(E107=\"ja\",A107,IF(E108=\"ja\",A108,IF(E109=\"ja\",A109,IF(E110=\"ja\",A110,IF(E111=\"ja\",A111,IF(E112=\"ja\",A112,IF(E113=\"ja\",A113,IF(E114=\"ja\",A114,IF(E115=\"ja\",A115,IF(E116=\"ja\",A116,IF(E117=\"ja\",A117,IF(E118=\"ja\",A118,IF(E119=\"ja\",A119,IF(E120=\"ja\",A120,IF(A121=\"ja\",A121,\"Volgepland\")))))))))))))))))))","v":"2021-04-14"},null,null,null,null,0,null,null,0,0,null,null,0]
["2021-04-11",{"$f":"WEEKNUM(Tabel_kalender[[#This Row],[Datum]],21)","v":14},"1900-01-07",null,"nee",{"$f":"IF(Tabel_kalender[[#This Row],[Werkdag]]=\"ja\",Tabel_kalender[[#This Row],[Datum]],IF(E105=\"ja\",A105,IF(E106=\"ja\",A106,IF(E107=\"ja\",A107,IF(E108=\"ja\",A108,IF(E109=\"ja\",A109,IF(E110=\"ja\",A110,IF(E111=\"ja\",A111,IF(E112=\"ja\",A112,IF(E113=\"ja\",A113,IF(E114=\"ja\",A114,IF(E115=\"ja\",A115,IF(E116=\"ja\",A116,IF(E117=\"ja\",A117,IF(E118=\"ja\",A118,IF(E119=\"ja\",A119,IF(E120=\"ja\",A120,IF(E121=\"ja\",A121,IF(A122=\"ja\",A122,\"Volgepland\")))))))))))))))))))","v":"2021-04-14"},null,null,null,null,0,null,null,0,0,null,null,0]
["2021-04-12",{"$f":"WEEKNUM(Tabel_kalender[[#This Row],[Datum]],21)","v":15},"1900-01-01","Pasen","nee",{"$f":"IF(Tabel_kalender[[#This Row],[Werkdag]]=\"ja\",Tabel_kalender[[#This Row],[Datum]],IF(E106=\"ja\",A106,IF(E107=\"ja\",A107,IF(E108=\"ja\",A108,IF(E109=\"ja\",A109,IF(E110=\"ja\",A110,IF(E111=\"ja\",A111,IF(E112=\"ja\",A112,IF(E113=\"ja\",A113,IF(E114=\"ja\",A114,IF(E115=\"ja\",A115,IF(E116=\"ja\",A116,IF(E117=\"ja\",A117,IF(E118=\"ja\",A118,IF(E119=\"ja\",A119,IF(E120=\"ja\",A120,IF(E121=\"ja\",A121,IF(E122=\"ja\",A122,IF(A123=\"ja\",A123,\"Volgepland\")))))))))))))))))))","v":"2021-04-14"},null,null,null,null,0,null,null,0,0,null,null,0]
["2021-04-13",{"$f":"WEEKNUM(Tabel_kalender[[#This Row],[Datum]],21)","v":15},"1900-01-02","Pasen","nee",{"$f":"IF(Tabel_kalender[[#This Row],[Werkdag]]=\"ja\",Tabel_kalender[[#This Row],[Datum]],IF(E107=\"ja\",A107,IF(E108=\"ja\",A108,IF(E109=\"ja\",A109,IF(E110=\"ja\",A110,IF(E111=\"ja\",A111,IF(E112=\"ja\",A112,IF(E113=\"ja\",A113,IF(E114=\"ja\",A114,IF(E115=\"ja\",A115,IF(E116=\"ja\",A116,IF(E117=\"ja\",A117,IF(E118=\"ja\",A118,IF(E119=\"ja\",A119,IF(E120=\"ja\",A120,IF(E121=\"ja\",A121,IF(E122=\"ja\",A122,IF(E123=\"ja\",A123,IF(A124=\"ja\",A124,\"Volgepland\")))))))))))))))))))","v":"2021-04-14"},null,null,null,null,0,null,null,0,0,null,null,0]
["2021-04-14",{"$f":"WEEKNUM(Tabel_kalender[[#This Row],[Datum]],21)","v":15},"1900-01-03",null,"ja",{"$f":"IF(Tabel_kalender[[#This Row],[Werkdag]]=\"ja\",Tabel_kalender[[#This Row],[Datum]],IF(E108=\"ja\",A108,IF(E109=\"ja\",A109,IF(E110=\"ja\",A110,IF(E111=\"ja\",A111,IF(E112=\"ja\",A112,IF(E113=\"ja\",A113,IF(E114=\"ja\",A114,IF(E115=\"ja\",A115,IF(E116=\"ja\",A116,IF(E117=\"ja\",A117,IF(E118=\"ja\",A118,IF(E119=\"ja\",A119,IF(E120=\"ja\",A120,IF(E121=\"ja\",A121,IF(E122=\"ja\",A122,IF(E123=\"ja\",A123,IF(E124=\"ja\",A124,IF(A125=\"ja\",A125,\"Volgepland\")))))))))))))))))))","v":"2021-04-14"},null,null,null,null,0,null,null,0,0,null,null,0]
["2021-04-15",{"$f":"WEEKNUM(Tabel_kalender[[#This Row],[Datum]],21)","v":15},"1900-01-04",null,"ja",{"$f":"IF(Tabel_kalender[[#This Row],[Werkdag]]=\"ja\",Tabel_kalender[[#This Row],[Datum]],IF(E109=\"ja\",A109,IF(E110=\"ja\",A110,IF(E111=\"ja\",A111,IF(E112=\"ja\",A112,IF(E113=\"ja\",A113,IF(E114=\"ja\",A114,IF(E115=\"ja\",A115,IF(E116=\"ja\",A116,IF(E117=\"ja\",A117,IF(E118=\"ja\",A118,IF(E119=\"ja\",A119,IF(E120=\"ja\",A120,IF(E121=\"ja\",A121,IF(E122=\"ja\",A122,IF(E123=\"ja\",A123,IF(E124=\"ja\",A124,IF(E125=\"ja\",A125,IF(A126=\"ja\",A126,\"Volgepland\")))))))))))))))))))","v":"2021-04-15"},null,null,null,null,0,null,null,0,0,null,null,0]
["2021-04-16",{"$f":"WEEKNUM(Tabel_kalender[[#This Row],[Datum]],21)","v":15},"1900-01-05",null,"ja",{"$f":"IF(Tabel_kalender[[#This Row],[Werkdag]]=\"ja\",Tabel_kalender[[#This Row],[Datum]],IF(E110=\"ja\",A110,IF(E111=\"ja\",A111,IF(E112=\"ja\",A112,IF(E113=\"ja\",A113,IF(E114=\"ja\",A114,IF(E115=\"ja\",A115,IF(E116=\"ja\",A116,IF(E117=\"ja\",A117,IF(E118=\"ja\",A118,IF(E119=\"ja\",A119,IF(E120=\"ja\",A120,IF(E121=\"ja\",A121,IF(E122=\"ja\",A122,IF(E123=\"ja\",A123,IF(E124=\"ja\",A124,IF(E125=\"ja\",A125,IF(E126=\"ja\",A126,IF(A127=\"ja\",A127,\"Volgepland\")))))))))))))))))))","v":"2021-04-16"},null,null,null,null,0,null,null,0,0,null,null,0]
["2021-04-17",{"$f":"WEEKNUM(Tabel_kalender[[#This Row],[Datum]],21)","v":15},"1900-01-06",null,"nee",{"$f":"IF(Tabel_kalender[[#This Row],[Werkdag]]=\"ja\",Tabel_kalender[[#This Row],[Datum]],IF(E111=\"ja\",A111,IF(E112=\"ja\",A112,IF(E113=\"ja\",A113,IF(E114=\"ja\",A114,IF(E115=\"ja\",A115,IF(E116=\"ja\",A116,IF(E117=\"ja\",A117,IF(E118=\"ja\",A118,IF(E119=\"ja\",A119,IF(E120=\"ja\",A120,IF(E121=\"ja\",A121,IF(E122=\"ja\",A122,IF(E123=\"ja\",A123,IF(E124=\"ja\",A124,IF(E125=\"ja\",A125,IF(E126=\"ja\",A126,IF(E127=\"ja\",A127,IF(A128=\"ja\",A128,\"Volgepland\")))))))))))))))))))","v":"2021-04-19"},null,null,null,null,0,null,null,0,0,null,null,0]
["2021-04-18",{"$f":"WEEKNUM(Tabel_kalender[[#This Row],[Datum]],21)","v":15},"1900-01-07",null,"nee",{"$f":"IF(Tabel_kalender[[#This Row],[Werkdag]]=\"ja\",Tabel_kalender[[#This Row],[Datum]],IF(E112=\"ja\",A112,IF(E113=\"ja\",A113,IF(E114=\"ja\",A114,IF(E115=\"ja\",A115,IF(E116=\"ja\",A116,IF(E117=\"ja\",A117,IF(E118=\"ja\",A118,IF(E119=\"ja\",A119,IF(E120=\"ja\",A120,IF(E121=\"ja\",A121,IF(E122=\"ja\",A122,IF(E123=\"ja\",A123,IF(E124=\"ja\",A124,IF(E125=\"ja\",A125,IF(E126=\"ja\",A126,IF(E127=\"ja\",A127,IF(E128=\"ja\",A128,IF(A129=\"ja\",A129,\"Volgepland\")))))))))))))))))))","v":"2021-04-19"},null,null,null,null,0,null,null,0,0,null,null,0]
["2021-04-19",{"$f":"WEEKNUM(Tabel_kalender[[#This Row],[Datum]],21)","v":16},"1900-01-01",null,"ja",{"$f":"IF(Tabel_kalender[[#This Row],[Werkdag]]=\"ja\",Tabel_kalender[[#This Row],[Datum]],IF(E113=\"ja\",A113,IF(E114=\"ja\",A114,IF(E115=\"ja\",A115,IF(E116=\"ja\",A116,IF(E117=\"ja\",A117,IF(E118=\"ja\",A118,IF(E119=\"ja\",A119,IF(E120=\"ja\",A120,IF(E121=\"ja\",A121,IF(E122=\"ja\",A122,IF(E123=\"ja\",A123,IF(E124=\"ja\",A124,IF(E125=\"ja\",A125,IF(E126=\"ja\",A126,IF(E127=\"ja\",A127,IF(E128=\"ja\",A128,IF(E129=\"ja\",A129,IF(A130=\"ja\",A130,\"Volgepland\")))))))))))))))))))","v":"2021-04-19"},null,null,null,null,0,null,null,0,0,null,null,0]
["2021-04-20",{"$f":"WEEKNUM(Tabel_kalender[[#This Row],[Datum]],21)","v":16},"1900-01-02",null,"ja",{"$f":"IF(Tabel_kalender[[#This Row],[Werkdag]]=\"ja\",Tabel_kalender[[#This Row],[Datum]],IF(E114=\"ja\",A114,IF(E115=\"ja\",A115,IF(E116=\"ja\",A116,IF(E117=\"ja\",A117,IF(E118=\"ja\",A118,IF(E119=\"ja\",A119,IF(E120=\"ja\",A120,IF(E121=\"ja\",A121,IF(E122=\"ja\",A122,IF(E123=\"ja\",A123,IF(E124=\"ja\",A124,IF(E125=\"ja\",A125,IF(E126=\"ja\",A126,IF(E127=\"ja\",A127,IF(E128=\"ja\",A128,IF(E129=\"ja\",A129,IF(E130=\"ja\",A130,IF(A131=\"ja\",A131,\"Volgepland\")))))))))))))))))))","v":"2021-04-20"},null,null,null,null,0,null,null,0,0,null,null,0]
["2021-04-21",{"$f":"WEEKNUM(Tabel_kalender[[#This Row],[Datum]],21)","v":16},"1900-01-03",null,"ja",{"$f":"IF(Tabel_kalender[[#This Row],[Werkdag]]=\"ja\",Tabel_kalender[[#This Row],[Datum]],IF(E115=\"ja\",A115,IF(E116=\"ja\",A116,IF(E117=\"ja\",A117,IF(E118=\"ja\",A118,IF(E119=\"ja\",A119,IF(E120=\"ja\",A120,IF(E121=\"ja\",A121,IF(E122=\"ja\",A122,IF(E123=\"ja\",A123,IF(E124=\"ja\",A124,IF(E125=\"ja\",A125,IF(E126=\"ja\",A126,IF(E127=\"ja\",A127,IF(E128=\"ja\",A128,IF(E129=\"ja\",A129,IF(E130=\"ja\",A130,IF(E131=\"ja\",A131,IF(A132=\"ja\",A132,\"Volgepland\")))))))))))))))))))","v":"2021-04-21"},null,null,null,null,0,null,null,0,0,null,null,0]
["2021-04-22",{"$f":"WEEKNUM(Tabel_kalender[[#This Row],[Datum]],21)","v":16},"1900-01-04",null,"ja",{"$f":"IF(Tabel_kalender[[#This Row],[Werkdag]]=\"ja\",Tabel_kalender[[#This Row],[Datum]],IF(E116=\"ja\",A116,IF(E117=\"ja\",A117,IF(E118=\"ja\",A118,IF(E119=\"ja\",A119,IF(E120=\"ja\",A120,IF(E121=\"ja\",A121,IF(E122=\"ja\",A122,IF(E123=\"ja\",A123,IF(E124=\"ja\",A124,IF(E125=\"ja\",A125,IF(E126=\"ja\",A126,IF(E127=\"ja\",A127,IF(E128=\"ja\",A128,IF(E129=\"ja\",A129,IF(E130=\"ja\",A130,IF(E131=\"ja\",A131,IF(E132=\"ja\",A132,IF(A133=\"ja\",A133,\"Volgepland\")))))))))))))))))))","v":"2021-04-22"},null,null,null,null,0,null,null,0,0,null,null,0]
["2021-04-23",{"$f":"WEEKNUM(Tabel_kalender[[#This Row],[Datum]],21)","v":16},"1900-01-05",null,"ja",{"$f":"IF(Tabel_kalender[[#This Row],[Werkdag]]=\"ja\",Tabel_kalender[[#This Row],[Datum]],IF(E117=\"ja\",A117,IF(E118=\"ja\",A118,IF(E119=\"ja\",A119,IF(E120=\"ja\",A120,IF(E121=\"ja\",A121,IF(E122=\"ja\",A122,IF(E123=\"ja\",A123,IF(E124=\"ja\",A124,IF(E125=\"ja\",A125,IF(E126=\"ja\",A126,IF(E127=\"ja\",A127,IF(E128=\"ja\",A128,IF(E129=\"ja\",A129,IF(E130=\"ja\",A130,IF(E131=\"ja\",A131,IF(E132=\"ja\",A132,IF(E133=\"ja\",A133,IF(A134=\"ja\",A134,\"Volgepland\")))))))))))))))))))","v":"2021-04-23"},null,null,null,null,0,null,null,0,0,null,null,0]
["2021-04-24",{"$f":"WEEKNUM(Tabel_kalender[[#This Row],[Datum]],21)","v":16},"1900-01-06",null,"nee",{"$f":"IF(Tabel_kalender[[#This Row],[Werkdag]]=\"ja\",Tabel_kalender[[#This Row],[Datum]],IF(E118=\"ja\",A118,IF(E119=\"ja\",A119,IF(E120=\"ja\",A120,IF(E121=\"ja\",A121,IF(E122=\"ja\",A122,IF(E123=\"ja\",A123,IF(E124=\"ja\",A124,IF(E125=\"ja\",A125,IF(E126=\"ja\",A126,IF(E127=\"ja\",A127,IF(E128=\"ja\",A128,IF(E129=\"ja\",A129,IF(E130=\"ja\",A130,IF(E131=\"ja\",A131,IF(E132=\"ja\",A132,IF(E133=\"ja\",A133,IF(E134=\"ja\",A134,IF(A135=\"ja\",A135,\"Volgepland\")))))))))))))))))))","v":"2021-04-28"},null,null,null,null,0,null,null,0,0,null,null,0]
["2021-04-25",{"$f":"WEEKNUM(Tabel_kalender[[#This Row],[Datum]],21)","v":16},"1900-01-07",null,"nee",{"$f":"IF(Tabel_kalender[[#This Row],[Werkdag]]=\"ja\",Tabel_kalender[[#This Row],[Datum]],IF(E119=\"ja\",A119,IF(E120=\"ja\",A120,IF(E121=\"ja\",A121,IF(E122=\"ja\",A122,IF(E123=\"ja\",A123,IF(E124=\"ja\",A124,IF(E125=\"ja\",A125,IF(E126=\"ja\",A126,IF(E127=\"ja\",A127,IF(E128=\"ja\",A128,IF(E129=\"ja\",A129,IF(E130=\"ja\",A130,IF(E131=\"ja\",A131,IF(E132=\"ja\",A132,IF(E133=\"ja\",A133,IF(E134=\"ja\",A134,IF(E135=\"ja\",A135,IF(A136=\"ja\",A136,\"Volgepland\")))))))))))))))))))","v":"2021-04-28"},null,null,null,null,0,null,null,0,0,null,null,0]
["2021-04-26",{"$f":"WEEKNUM(Tabel_kalender[[#This Row],[Datum]],21)","v":17},"1900-01-01",null,"nee",{"$f":"IF(Tabel_kalender[[#This Row],[Werkdag]]=\"ja\",Tabel_kalender[[#This Row],[Datum]],IF(E120=\"ja\",A120,IF(E121=\"ja\",A121,IF(E122=\"ja\",A122,IF(E123=\"ja\",A123,IF(E124=\"ja\",A124,IF(E125=\"ja\",A125,IF(E126=\"ja\",A126,IF(E127=\"ja\",A127,IF(E128=\"ja\",A128,IF(E129=\"ja\",A129,IF(E130=\"ja\",A130,IF(E131=\"ja\",A131,IF(E132=\"ja\",A132,IF(E133=\"ja\",A133,IF(E134=\"ja\",A134,IF(E135=\"ja\",A135,IF(E136=\"ja\",A136,IF(A137=\"ja\",A137,\"Volgepland\")))))))))))))))))))","v":"2021-04-28"},null,null,null,null,0,null,null,0,0,null,null,0]
["2021-04-27",{"$f":"WEEKNUM(Tabel_kalender[[#This Row],[Datum]],21)","v":17},"1900-01-02","Koningsdag","nee",{"$f":"IF(Tabel_kalender[[#This Row],[Werkdag]]=\"ja\",Tabel_kalender[[#This Row],[Datum]],IF(E121=\"ja\",A121,IF(E122=\"ja\",A122,IF(E123=\"ja\",A123,IF(E124=\"ja\",A124,IF(E125=\"ja\",A125,IF(E126=\"ja\",A126,IF(E127=\"ja\",A127,IF(E128=\"ja\",A128,IF(E129=\"ja\",A129,IF(E130=\"ja\",A130,IF(E131=\"ja\",A131,IF(E132=\"ja\",A132,IF(E133=\"ja\",A133,IF(E134=\"ja\",A134,IF(E135=\"ja\",A135,IF(E136=\"ja\",A136,IF(E137=\"ja\",A137,IF(A138=\"ja\",A138,\"Volgepland\")))))))))))))))))))","v":"2021-04-28"},null,null,null,null,0,null,null,0,0,null,null,0]
["2021-04-28",{"$f":"WEEKNUM(Tabel_kalender[[#This Row],[Datum]],21)","v":17},"1900-01-03",null,"ja",{"$f":"IF(Tabel_kalender[[#This Row],[Werkdag]]=\"ja\",Tabel_kalender[[#This Row],[Datum]],IF(E122=\"ja\",A122,IF(E123=\"ja\",A123,IF(E124=\"ja\",A124,IF(E125=\"ja\",A125,IF(E126=\"ja\",A126,IF(E127=\"ja\",A127,IF(E128=\"ja\",A128,IF(E129=\"ja\",A129,IF(E130=\"ja\",A130,IF(E131=\"ja\",A131,IF(E132=\"ja\",A132,IF(E133=\"ja\",A133,IF(E134=\"ja\",A134,IF(E135=\"ja\",A135,IF(E136=\"ja\",A136,IF(E137=\"ja\",A137,IF(E138=\"ja\",A138,IF(A139=\"ja\",A139,\"Volgepland\")))))))))))))))))))","v":"2021-04-28"},null,null,null,null,0,null,null,0,0,null,null,0]
["2021-04-29",{"$f":"WEEKNUM(Tabel_kalender[[#This Row],[Datum]],21)","v":17},"1900-01-04",null,"ja",{"$f":"IF(Tabel_kalender[[#This Row],[Werkdag]]=\"ja\",Tabel_kalender[[#This Row],[Datum]],IF(E123=\"ja\",A123,IF(E124=\"ja\",A124,IF(E125=\"ja\",A125,IF(E126=\"ja\",A126,IF(E127=\"ja\",A127,IF(E128=\"ja\",A128,IF(E129=\"ja\",A129,IF(E130=\"ja\",A130,IF(E131=\"ja\",A131,IF(E132=\"ja\",A132,IF(E133=\"ja\",A133,IF(E134=\"ja\",A134,IF(E135=\"ja\",A135,IF(E136=\"ja\",A136,IF(E137=\"ja\",A137,IF(E138=\"ja\",A138,IF(E139=\"ja\",A139,IF(A140=\"ja\",A140,\"Volgepland\")))))))))))))))))))","v":"2021-04-29"},null,null,null,null,0,null,null,0,0,null,null,0]
["2021-04-30",{"$f":"WEEKNUM(Tabel_kalender[[#This Row],[Datum]],21)","v":17},"1900-01-05",null,"ja",{"$f":"IF(Tabel_kalender[[#This Row],[Werkdag]]=\"ja\",Tabel_kalender[[#This Row],[Datum]],IF(E124=\"ja\",A124,IF(E125=\"ja\",A125,IF(E126=\"ja\",A126,IF(E127=\"ja\",A127,IF(E128=\"ja\",A128,IF(E129=\"ja\",A129,IF(E130=\"ja\",A130,IF(E131=\"ja\",A131,IF(E132=\"ja\",A132,IF(E133=\"ja\",A133,IF(E134=\"ja\",A134,IF(E135=\"ja\",A135,IF(E136=\"ja\",A136,IF(E137=\"ja\",A137,IF(E138=\"ja\",A138,IF(E139=\"ja\",A139,IF(E140=\"ja\",A140,IF(A141=\"ja\",A141,\"Volgepland\")))))))))))))))))))","v":"2021-04-30"},null,null,null,null,0,null,null,0,0,null,null,0]
["2021-05-01",{"$f":"WEEKNUM(Tabel_kalender[[#This Row],[Datum]],21)","v":17},"1900-01-06",null,"nee",{"$f":"IF(Tabel_kalender[[#This Row],[Werkdag]]=\"ja\",Tabel_kalender[[#This Row],[Datum]],IF(E125=\"ja\",A125,IF(E126=\"ja\",A126,IF(E127=\"ja\",A127,IF(E128=\"ja\",A128,IF(E129=\"ja\",A129,IF(E130=\"ja\",A130,IF(E131=\"ja\",A131,IF(E132=\"ja\",A132,IF(E133=\"ja\",A133,IF(E134=\"ja\",A134,IF(E135=\"ja\",A135,IF(E136=\"ja\",A136,IF(E137=\"ja\",A137,IF(E138=\"ja\",A138,IF(E139=\"ja\",A139,IF(E140=\"ja\",A140,IF(E141=\"ja\",A141,IF(A142=\"ja\",A142,\"Volgepland\")))))))))))))))))))","v":"2021-05-03"},null,null,null,null,0,null,null,0,0,null,null,0]
["2021-05-02",{"$f":"WEEKNUM(Tabel_kalender[[#This Row],[Datum]],21)","v":17},"1900-01-07",null,"nee",{"$f":"IF(Tabel_kalender[[#This Row],[Werkdag]]=\"ja\",Tabel_kalender[[#This Row],[Datum]],IF(E126=\"ja\",A126,IF(E127=\"ja\",A127,IF(E128=\"ja\",A128,IF(E129=\"ja\",A129,IF(E130=\"ja\",A130,IF(E131=\"ja\",A131,IF(E132=\"ja\",A132,IF(E133=\"ja\",A133,IF(E134=\"ja\",A134,IF(E135=\"ja\",A135,IF(E136=\"ja\",A136,IF(E137=\"ja\",A137,IF(E138=\"ja\",A138,IF(E139=\"ja\",A139,IF(E140=\"ja\",A140,IF(E141=\"ja\",A141,IF(E142=\"ja\",A142,IF(A143=\"ja\",A143,\"Volgepland\")))))))))))))))))))","v":"2021-05-03"},null,null,null,null,0,null,null,0,0,null,null,0]
["2021-05-03",{"$f":"WEEKNUM(Tabel_kalender[[#This Row],[Datum]],21)","v":18},"1900-01-01",null,"ja",{"$f":"IF(Tabel_kalender[[#This Row],[Werkdag]]=\"ja\",Tabel_kalender[[#This Row],[Datum]],IF(E127=\"ja\",A127,IF(E128=\"ja\",A128,IF(E129=\"ja\",A129,IF(E130=\"ja\",A130,IF(E131=\"ja\",A131,IF(E132=\"ja\",A132,IF(E133=\"ja\",A133,IF(E134=\"ja\",A134,IF(E135=\"ja\",A135,IF(E136=\"ja\",A136,IF(E137=\"ja\",A137,IF(E138=\"ja\",A138,IF(E139=\"ja\",A139,IF(E140=\"ja\",A140,IF(E141=\"ja\",A141,IF(E142=\"ja\",A142,IF(E143=\"ja\",A143,IF(A144=\"ja\",A144,\"Volgepland\")))))))))))))))))))","v":"2021-05-03"},null,null,null,null,0,null,null,0,0,null,null,0]
["2021-05-04",{"$f":"WEEKNUM(Tabel_kalender[[#This Row],[Datum]],21)","v":18},"1900-01-02",null,"ja",{"$f":"IF(Tabel_kalender[[#This Row],[Werkdag]]=\"ja\",Tabel_kalender[[#This Row],[Datum]],IF(E128=\"ja\",A128,IF(E129=\"ja\",A129,IF(E130=\"ja\",A130,IF(E131=\"ja\",A131,IF(E132=\"ja\",A132,IF(E133=\"ja\",A133,IF(E134=\"ja\",A134,IF(E135=\"ja\",A135,IF(E136=\"ja\",A136,IF(E137=\"ja\",A137,IF(E138=\"ja\",A138,IF(E139=\"ja\",A139,IF(E140=\"ja\",A140,IF(E141=\"ja\",A141,IF(E142=\"ja\",A142,IF(E143=\"ja\",A143,IF(E144=\"ja\",A144,IF(A145=\"ja\",A145,\"Volgepland\")))))))))))))))))))","v":"2021-05-04"},null,null,null,null,0,null,null,0,0,null,null,0]
["2021-05-05",{"$f":"WEEKNUM(Tabel_kalender[[#This Row],[Datum]],21)","v":18},"1900-01-03","Bevrijdingsdag","nee",{"$f":"IF(Tabel_kalender[[#This Row],[Werkdag]]=\"ja\",Tabel_kalender[[#This Row],[Datum]],IF(E129=\"ja\",A129,IF(E130=\"ja\",A130,IF(E131=\"ja\",A131,IF(E132=\"ja\",A132,IF(E133=\"ja\",A133,IF(E134=\"ja\",A134,IF(E135=\"ja\",A135,IF(E136=\"ja\",A136,IF(E137=\"ja\",A137,IF(E138=\"ja\",A138,IF(E139=\"ja\",A139,IF(E140=\"ja\",A140,IF(E141=\"ja\",A141,IF(E142=\"ja\",A142,IF(E143=\"ja\",A143,IF(E144=\"ja\",A144,IF(E145=\"ja\",A145,IF(A146=\"ja\",A146,\"Volgepland\")))))))))))))))))))","v":"2021-05-06"},null,null,null,null,0,null,null,0,0,null,null,0]
["2021-05-06",{"$f":"WEEKNUM(Tabel_kalender[[#This Row],[Datum]],21)","v":18},"1900-01-04",null,"ja",{"$f":"IF(Tabel_kalender[[#This Row],[Werkdag]]=\"ja\",Tabel_kalender[[#This Row],[Datum]],IF(E130=\"ja\",A130,IF(E131=\"ja\",A131,IF(E132=\"ja\",A132,IF(E133=\"ja\",A133,IF(E134=\"ja\",A134,IF(E135=\"ja\",A135,IF(E136=\"ja\",A136,IF(E137=\"ja\",A137,IF(E138=\"ja\",A138,IF(E139=\"ja\",A139,IF(E140=\"ja\",A140,IF(E141=\"ja\",A141,IF(E142=\"ja\",A142,IF(E143=\"ja\",A143,IF(E144=\"ja\",A144,IF(E145=\"ja\",A145,IF(E146=\"ja\",A146,IF(A147=\"ja\",A147,\"Volgepland\")))))))))))))))))))","v":"2021-05-06"},null,null,null,null,0,null,null,0,0,null,null,0]
["2021-05-07",{"$f":"WEEKNUM(Tabel_kalender[[#This Row],[Datum]],21)","v":18},"1900-01-05",null,"ja",{"$f":"IF(Tabel_kalender[[#This Row],[Werkdag]]=\"ja\",Tabel_kalender[[#This Row],[Datum]],IF(E131=\"ja\",A131,IF(E132=\"ja\",A132,IF(E133=\"ja\",A133,IF(E134=\"ja\",A134,IF(E135=\"ja\",A135,IF(E136=\"ja\",A136,IF(E137=\"ja\",A137,IF(E138=\"ja\",A138,IF(E139=\"ja\",A139,IF(E140=\"ja\",A140,IF(E141=\"ja\",A141,IF(E142=\"ja\",A142,IF(E143=\"ja\",A143,IF(E144=\"ja\",A144,IF(E145=\"ja\",A145,IF(E146=\"ja\",A146,IF(E147=\"ja\",A147,IF(A148=\"ja\",A148,\"Volgepland\")))))))))))))))))))","v":"2021-05-07"},null,null,null,null,0,null,null,0,0,null,null,0]
["2021-05-08",{"$f":"WEEKNUM(Tabel_kalender[[#This Row],[Datum]],21)","v":18},"1900-01-06",null,"nee",{"$f":"IF(Tabel_kalender[[#This Row],[Werkdag]]=\"ja\",Tabel_kalender[[#This Row],[Datum]],IF(E132=\"ja\",A132,IF(E133=\"ja\",A133,IF(E134=\"ja\",A134,IF(E135=\"ja\",A135,IF(E136=\"ja\",A136,IF(E137=\"ja\",A137,IF(E138=\"ja\",A138,IF(E139=\"ja\",A139,IF(E140=\"ja\",A140,IF(E141=\"ja\",A141,IF(E142=\"ja\",A142,IF(E143=\"ja\",A143,IF(E144=\"ja\",A144,IF(E145=\"ja\",A145,IF(E146=\"ja\",A146,IF(E147=\"ja\",A147,IF(E148=\"ja\",A148,IF(A149=\"ja\",A149,\"Volgepland\")))))))))))))))))))","v":"2021-05-10"},null,null,null,null,0,null,null,0,0,null,null,0]
[{"$f":"A131+1","v":"2021-05-09"},{"$f":"WEEKNUM(Tabel_kalender[[#This Row],[Datum]],21)","v":18},"1900-01-07",null,"nee",{"$f":"IF(Tabel_kalender[[#This Row],[Werkdag]]=\"ja\",Tabel_kalender[[#This Row],[Datum]],IF(E133=\"ja\",A133,IF(E134=\"ja\",A134,IF(E135=\"ja\",A135,IF(E136=\"ja\",A136,IF(E137=\"ja\",A137,IF(E138=\"ja\",A138,IF(E139=\"ja\",A139,IF(E140=\"ja\",A140,IF(E141=\"ja\",A141,IF(E142=\"ja\",A142,IF(E143=\"ja\",A143,IF(E144=\"ja\",A144,IF(E145=\"ja\",A145,IF(E146=\"ja\",A146,IF(E147=\"ja\",A147,IF(E148=\"ja\",A148,IF(E149=\"ja\",A149,IF(A150=\"ja\",A150,\"Volgepland\")))))))))))))))))))","v":"2021-05-10"},null,null,null,null,{"$f":"L131","v":0},null,null,{"$f":"IF(L132>0,L132-K132,)-M132","v":0},{"$f":"P131","v":0},null,null,{"$f":"IF(P132>0,P132-O132,)-Q132","v":0}]
["2021-05-10",{"$f":"WEEKNUM(Tabel_kalender[[#This Row],[Datum]],21)","v":19},{"$f":"WEEKDAY(A133,2)","v":"1900-01-01"},null,"ja",{"$f":"IF(Tabel_kalender[[#This Row],[Werkdag]]=\"ja\",Tabel_kalender[[#This Row],[Datum]],IF(E134=\"ja\",A134,IF(E135=\"ja\",A135,IF(E136=\"ja\",A136,IF(E137=\"ja\",A137,IF(E138=\"ja\",A138,IF(E139=\"ja\",A139,IF(E140=\"ja\",A140,IF(E141=\"ja\",A141,IF(E142=\"ja\",A142,IF(E143=\"ja\",A143,IF(E144=\"ja\",A144,IF(E145=\"ja\",A145,IF(E146=\"ja\",A146,IF(E147=\"ja\",A147,IF(E148=\"ja\",A148,IF(E149=\"ja\",A149,IF(E150=\"ja\",A150,IF(A151=\"ja\",A151,\"Volgepland\")))))))))))))))))))","v":"2021-05-10"},null,null,null,null,0,null,null,0,0,null,null,0]
["2021-05-11",{"$f":"WEEKNUM(Tabel_kalender[[#This Row],[Datum]],21)","v":19},"1900-01-02",null,"ja",{"$f":"IF(Tabel_kalender[[#This Row],[Werkdag]]=\"ja\",Tabel_kalender[[#This Row],[Datum]],IF(E135=\"ja\",A135,IF(E136=\"ja\",A136,IF(E137=\"ja\",A137,IF(E138=\"ja\",A138,IF(E139=\"ja\",A139,IF(E140=\"ja\",A140,IF(E141=\"ja\",A141,IF(E142=\"ja\",A142,IF(E143=\"ja\",A143,IF(E144=\"ja\",A144,IF(E145=\"ja\",A145,IF(E146=\"ja\",A146,IF(E147=\"ja\",A147,IF(E148=\"ja\",A148,IF(E149=\"ja\",A149,IF(E150=\"ja\",A150,IF(E151=\"ja\",A151,IF(A152=\"ja\",A152,\"Volgepland\")))))))))))))))))))","v":"2021-05-11"},null,null,null,null,0,null,null,0,0,null,null,0]
["2021-05-12",{"$f":"WEEKNUM(Tabel_kalender[[#This Row],[Datum]],21)","v":19},"1900-01-03",null,"ja",{"$f":"IF(Tabel_kalender[[#This Row],[Werkdag]]=\"ja\",Tabel_kalender[[#This Row],[Datum]],IF(E136=\"ja\",A136,IF(E137=\"ja\",A137,IF(E138=\"ja\",A138,IF(E139=\"ja\",A139,IF(E140=\"ja\",A140,IF(E141=\"ja\",A141,IF(E142=\"ja\",A142,IF(E143=\"ja\",A143,IF(E144=\"ja\",A144,IF(E145=\"ja\",A145,IF(E146=\"ja\",A146,IF(E147=\"ja\",A147,IF(E148=\"ja\",A148,IF(E149=\"ja\",A149,IF(E150=\"ja\",A150,IF(E151=\"ja\",A151,IF(E152=\"ja\",A152,IF(A153=\"ja\",A153,\"Volgepland\")))))))))))))))))))","v":"2021-05-12"},null,null,null,null,0,null,null,0,0,null,null,0]
["2021-05-13",{"$f":"WEEKNUM(Tabel_kalender[[#This Row],[Datum]],21)","v":19},"1900-01-04",null,"ja",{"$f":"IF(Tabel_kalender[[#This Row],[Werkdag]]=\"ja\",Tabel_kalender[[#This Row],[Datum]],IF(E137=\"ja\",A137,IF(E138=\"ja\",A138,IF(E139=\"ja\",A139,IF(E140=\"ja\",A140,IF(E141=\"ja\",A141,IF(E142=\"ja\",A142,IF(E143=\"ja\",A143,IF(E144=\"ja\",A144,IF(E145=\"ja\",A145,IF(E146=\"ja\",A146,IF(E147=\"ja\",A147,IF(E148=\"ja\",A148,IF(E149=\"ja\",A149,IF(E150=\"ja\",A150,IF(E151=\"ja\",A151,IF(E152=\"ja\",A152,IF(E153=\"ja\",A153,IF(A154=\"ja\",A154,\"Volgepland\")))))))))))))))))))","v":"2021-05-13"},null,null,null,null,0,null,null,0,0,null,null,0]
["2021-05-14",{"$f":"WEEKNUM(Tabel_kalender[[#This Row],[Datum]],21)","v":19},"1900-01-05",null,"ja",{"$f":"IF(Tabel_kalender[[#This Row],[Werkdag]]=\"ja\",Tabel_kalender[[#This Row],[Datum]],IF(E138=\"ja\",A138,IF(E139=\"ja\",A139,IF(E140=\"ja\",A140,IF(E141=\"ja\",A141,IF(E142=\"ja\",A142,IF(E143=\"ja\",A143,IF(E144=\"ja\",A144,IF(E145=\"ja\",A145,IF(E146=\"ja\",A146,IF(E147=\"ja\",A147,IF(E148=\"ja\",A148,IF(E149=\"ja\",A149,IF(E150=\"ja\",A150,IF(E151=\"ja\",A151,IF(E152=\"ja\",A152,IF(E153=\"ja\",A153,IF(E154=\"ja\",A154,IF(A155=\"ja\",A155,\"Volgepland\")))))))))))))))))))","v":"2021-05-14"},null,null,null,null,0,null,null,0,0,null,null,0]
["2021-05-15",{"$f":"WEEKNUM(Tabel_kalender[[#This Row],[Datum]],21)","v":19},"1900-01-06",null,"nee",{"$f":"IF(Tabel_kalender[[#This Row],[Werkdag]]=\"ja\",Tabel_kalender[[#This Row],[Datum]],IF(E139=\"ja\",A139,IF(E140=\"ja\",A140,IF(E141=\"ja\",A141,IF(E142=\"ja\",A142,IF(E143=\"ja\",A143,IF(E144=\"ja\",A144,IF(E145=\"ja\",A145,IF(E146=\"ja\",A146,IF(E147=\"ja\",A147,IF(E148=\"ja\",A148,IF(E149=\"ja\",A149,IF(E150=\"ja\",A150,IF(E151=\"ja\",A151,IF(E152=\"ja\",A152,IF(E153=\"ja\",A153,IF(E154=\"ja\",A154,IF(E155=\"ja\",A155,IF(A156=\"ja\",A156,\"Volgepland\")))))))))))))))))))","v":"2021-05-17"},null,null,null,null,0,null,null,0,0,null,null,0]
["2021-05-16",{"$f":"WEEKNUM(Tabel_kalender[[#This Row],[Datum]],21)","v":19},"1900-01-07",null,"nee",{"$f":"IF(Tabel_kalender[[#This Row],[Werkdag]]=\"ja\",Tabel_kalender[[#This Row],[Datum]],IF(E140=\"ja\",A140,IF(E141=\"ja\",A141,IF(E142=\"ja\",A142,IF(E143=\"ja\",A143,IF(E144=\"ja\",A144,IF(E145=\"ja\",A145,IF(E146=\"ja\",A146,IF(E147=\"ja\",A147,IF(E148=\"ja\",A148,IF(E149=\"ja\",A149,IF(E150=\"ja\",A150,IF(E151=\"ja\",A151,IF(E152=\"ja\",A152,IF(E153=\"ja\",A153,IF(E154=\"ja\",A154,IF(E155=\"ja\",A155,IF(E156=\"ja\",A156,IF(A157=\"ja\",A157,\"Volgepland\")))))))))))))))))))","v":"2021-05-17"},null,null,null,null,0,null,null,0,0,null,null,0]
["2021-05-17",{"$f":"WEEKNUM(Tabel_kalender[[#This Row],[Datum]],21)","v":20},"1900-01-01",null,"ja",{"$f":"IF(Tabel_kalender[[#This Row],[Werkdag]]=\"ja\",Tabel_kalender[[#This Row],[Datum]],IF(E141=\"ja\",A141,IF(E142=\"ja\",A142,IF(E143=\"ja\",A143,IF(E144=\"ja\",A144,IF(E145=\"ja\",A145,IF(E146=\"ja\",A146,IF(E147=\"ja\",A147,IF(E148=\"ja\",A148,IF(E149=\"ja\",A149,IF(E150=\"ja\",A150,IF(E151=\"ja\",A151,IF(E152=\"ja\",A152,IF(E153=\"ja\",A153,IF(E154=\"ja\",A154,IF(E155=\"ja\",A155,IF(E156=\"ja\",A156,IF(E157=\"ja\",A157,IF(A158=\"ja\",A158,\"Volgepland\")))))))))))))))))))","v":"2021-05-17"},null,null,null,null,0,null,null,0,0,null,null,0]
["2021-05-18",{"$f":"WEEKNUM(Tabel_kalender[[#This Row],[Datum]],21)","v":20},"1900-01-02",null,"ja",{"$f":"IF(Tabel_kalender[[#This Row],[Werkdag]]=\"ja\",Tabel_kalender[[#This Row],[Datum]],IF(E142=\"ja\",A142,IF(E143=\"ja\",A143,IF(E144=\"ja\",A144,IF(E145=\"ja\",A145,IF(E146=\"ja\",A146,IF(E147=\"ja\",A147,IF(E148=\"ja\",A148,IF(E149=\"ja\",A149,IF(E150=\"ja\",A150,IF(E151=\"ja\",A151,IF(E152=\"ja\",A152,IF(E153=\"ja\",A153,IF(E154=\"ja\",A154,IF(E155=\"ja\",A155,IF(E156=\"ja\",A156,IF(E157=\"ja\",A157,IF(E158=\"ja\",A158,IF(A159=\"ja\",A159,\"Volgepland\")))))))))))))))))))","v":"2021-05-18"},null,null,null,null,0,null,null,0,0,null,null,0]
["2021-05-19",{"$f":"WEEKNUM(Tabel_kalender[[#This Row],[Datum]],21)","v":20},"1900-01-03",null,"ja",{"$f":"IF(Tabel_kalender[[#This Row],[Werkdag]]=\"ja\",Tabel_kalender[[#This Row],[Datum]],IF(E143=\"ja\",A143,IF(E144=\"ja\",A144,IF(E145=\"ja\",A145,IF(E146=\"ja\",A146,IF(E147=\"ja\",A147,IF(E148=\"ja\",A148,IF(E149=\"ja\",A149,IF(E150=\"ja\",A150,IF(E151=\"ja\",A151,IF(E152=\"ja\",A152,IF(E153=\"ja\",A153,IF(E154=\"ja\",A154,IF(E155=\"ja\",A155,IF(E156=\"ja\",A156,IF(E157=\"ja\",A157,IF(E158=\"ja\",A158,IF(E159=\"ja\",A159,IF(A160=\"ja\",A160,\"Volgepland\")))))))))))))))))))","v":"2021-05-19"},null,null,null,null,0,null,null,0,0,null,null,0]
["2021-05-20",{"$f":"WEEKNUM(Tabel_kalender[[#This Row],[Datum]],21)","v":20},"1900-01-04",null,"ja",{"$f":"IF(Tabel_kalender[[#This Row],[Werkdag]]=\"ja\",Tabel_kalender[[#This Row],[Datum]],IF(E144=\"ja\",A144,IF(E145=\"ja\",A145,IF(E146=\"ja\",A146,IF(E147=\"ja\",A147,IF(E148=\"ja\",A148,IF(E149=\"ja\",A149,IF(E150=\"ja\",A150,IF(E151=\"ja\",A151,IF(E152=\"ja\",A152,IF(E153=\"ja\",A153,IF(E154=\"ja\",A154,IF(E155=\"ja\",A155,IF(E156=\"ja\",A156,IF(E157=\"ja\",A157,IF(E158=\"ja\",A158,IF(E159=\"ja\",A159,IF(E160=\"ja\",A160,IF(A161=\"ja\",A161,\"Volgepland\")))))))))))))))))))","v":"2021-05-20"},null,null,null,null,0,null,null,0,0,null,null,0]
["2021-05-21",{"$f":"WEEKNUM(Tabel_kalender[[#This Row],[Datum]],21)","v":20},"1900-01-05","Hemelvaartsdag","nee",{"$f":"IF(Tabel_kalender[[#This Row],[Werkdag]]=\"ja\",Tabel_kalender[[#This Row],[Datum]],IF(E145=\"ja\",A145,IF(E146=\"ja\",A146,IF(E147=\"ja\",A147,IF(E148=\"ja\",A148,IF(E149=\"ja\",A149,IF(E150=\"ja\",A150,IF(E151=\"ja\",A151,IF(E152=\"ja\",A152,IF(E153=\"ja\",A153,IF(E154=\"ja\",A154,IF(E155=\"ja\",A155,IF(E156=\"ja\",A156,IF(E157=\"ja\",A157,IF(E158=\"ja\",A158,IF(E159=\"ja\",A159,IF(E160=\"ja\",A160,IF(E161=\"ja\",A161,IF(A162=\"ja\",A162,\"Volgepland\")))))))))))))))))))","v":"2021-05-24"},null,null,null,null,0,null,null,0,0,null,null,0]
["2021-05-22",{"$f":"WEEKNUM(Tabel_kalender[[#This Row],[Datum]],21)","v":20},"1900-01-06",null,"nee",{"$f":"IF(Tabel_kalender[[#This Row],[Werkdag]]=\"ja\",Tabel_kalender[[#This Row],[Datum]],IF(E146=\"ja\",A146,IF(E147=\"ja\",A147,IF(E148=\"ja\",A148,IF(E149=\"ja\",A149,IF(E150=\"ja\",A150,IF(E151=\"ja\",A151,IF(E152=\"ja\",A152,IF(E153=\"ja\",A153,IF(E154=\"ja\",A154,IF(E155=\"ja\",A155,IF(E156=\"ja\",A156,IF(E157=\"ja\",A157,IF(E158=\"ja\",A158,IF(E159=\"ja\",A159,IF(E160=\"ja\",A160,IF(E161=\"ja\",A161,IF(E162=\"ja\",A162,IF(A163=\"ja\",A163,\"Volgepland\")))))))))))))))))))","v":"2021-05-24"},null,null,null,null,0,null,null,0,0,null,null,0]
["2021-05-23",{"$f":"WEEKNUM(Tabel_kalender[[#This Row],[Datum]],21)","v":20},"1900-01-07",null,"nee",{"$f":"IF(Tabel_kalender[[#This Row],[Werkdag]]=\"ja\",Tabel_kalender[[#This Row],[Datum]],IF(E147=\"ja\",A147,IF(E148=\"ja\",A148,IF(E149=\"ja\",A149,IF(E150=\"ja\",A150,IF(E151=\"ja\",A151,IF(E152=\"ja\",A152,IF(E153=\"ja\",A153,IF(E154=\"ja\",A154,IF(E155=\"ja\",A155,IF(E156=\"ja\",A156,IF(E157=\"ja\",A157,IF(E158=\"ja\",A158,IF(E159=\"ja\",A159,IF(E160=\"ja\",A160,IF(E161=\"ja\",A161,IF(E162=\"ja\",A162,IF(E163=\"ja\",A163,IF(A164=\"ja\",A164,\"Volgepland\")))))))))))))))))))","v":"2021-05-24"},null,null,null,null,0,null,null,0,0,null,null,0]
["2021-05-24",{"$f":"WEEKNUM(Tabel_kalender[[#This Row],[Datum]],21)","v":21},"1900-01-01",null,"ja",{"$f":"IF(Tabel_kalender[[#This Row],[Werkdag]]=\"ja\",Tabel_kalender[[#This Row],[Datum]],IF(E148=\"ja\",A148,IF(E149=\"ja\",A149,IF(E150=\"ja\",A150,IF(E151=\"ja\",A151,IF(E152=\"ja\",A152,IF(E153=\"ja\",A153,IF(E154=\"ja\",A154,IF(E155=\"ja\",A155,IF(E156=\"ja\",A156,IF(E157=\"ja\",A157,IF(E158=\"ja\",A158,IF(E159=\"ja\",A159,IF(E160=\"ja\",A160,IF(E161=\"ja\",A161,IF(E162=\"ja\",A162,IF(E163=\"ja\",A163,IF(E164=\"ja\",A164,IF(A165=\"ja\",A165,\"Volgepland\")))))))))))))))))))","v":"2021-05-24"},null,null,null,null,0,null,null,0,0,null,null,0]
["2021-05-25",{"$f":"WEEKNUM(Tabel_kalender[[#This Row],[Datum]],21)","v":21},"1900-01-02",null,"ja",{"$f":"IF(Tabel_kalender[[#This Row],[Werkdag]]=\"ja\",Tabel_kalender[[#This Row],[Datum]],IF(E149=\"ja\",A149,IF(E150=\"ja\",A150,IF(E151=\"ja\",A151,IF(E152=\"ja\",A152,IF(E153=\"ja\",A153,IF(E154=\"ja\",A154,IF(E155=\"ja\",A155,IF(E156=\"ja\",A156,IF(E157=\"ja\",A157,IF(E158=\"ja\",A158,IF(E159=\"ja\",A159,IF(E160=\"ja\",A160,IF(E161=\"ja\",A161,IF(E162=\"ja\",A162,IF(E163=\"ja\",A163,IF(E164=\"ja\",A164,IF(E165=\"ja\",A165,IF(A166=\"ja\",A166,\"Volgepland\")))))))))))))))))))","v":"2021-05-25"},null,null,null,null,0,null,null,0,0,null,null,0]
["2021-05-26",{"$f":"WEEKNUM(Tabel_kalender[[#This Row],[Datum]],21)","v":21},"1900-01-03",null,"ja",{"$f":"IF(Tabel_kalender[[#This Row],[Werkdag]]=\"ja\",Tabel_kalender[[#This Row],[Datum]],IF(E150=\"ja\",A150,IF(E151=\"ja\",A151,IF(E152=\"ja\",A152,IF(E153=\"ja\",A153,IF(E154=\"ja\",A154,IF(E155=\"ja\",A155,IF(E156=\"ja\",A156,IF(E157=\"ja\",A157,IF(E158=\"ja\",A158,IF(E159=\"ja\",A159,IF(E160=\"ja\",A160,IF(E161=\"ja\",A161,IF(E162=\"ja\",A162,IF(E163=\"ja\",A163,IF(E164=\"ja\",A164,IF(E165=\"ja\",A165,IF(E166=\"ja\",A166,IF(A167=\"ja\",A167,\"Volgepland\")))))))))))))))))))","v":"2021-05-26"},null,null,null,null,0,null,null,0,0,null,null,0]
["2021-05-27",{"$f":"WEEKNUM(Tabel_kalender[[#This Row],[Datum]],21)","v":21},"1900-01-04",null,"ja",{"$f":"IF(Tabel_kalender[[#This Row],[Werkdag]]=\"ja\",Tabel_kalender[[#This Row],[Datum]],IF(E151=\"ja\",A151,IF(E152=\"ja\",A152,IF(E153=\"ja\",A153,IF(E154=\"ja\",A154,IF(E155=\"ja\",A155,IF(E156=\"ja\",A156,IF(E157=\"ja\",A157,IF(E158=\"ja\",A158,IF(E159=\"ja\",A159,IF(E160=\"ja\",A160,IF(E161=\"ja\",A161,IF(E162=\"ja\",A162,IF(E163=\"ja\",A163,IF(E164=\"ja\",A164,IF(E165=\"ja\",A165,IF(E166=\"ja\",A166,IF(E167=\"ja\",A167,IF(A168=\"ja\",A168,\"Volgepland\")))))))))))))))))))","v":"2021-05-27"},null,null,null,null,0,null,null,0,0,null,null,0]
["2021-05-28",{"$f":"WEEKNUM(Tabel_kalender[[#This Row],[Datum]],21)","v":21},"1900-01-05",null,"ja",{"$f":"IF(Tabel_kalender[[#This Row],[Werkdag]]=\"ja\",Tabel_kalender[[#This Row],[Datum]],IF(E152=\"ja\",A152,IF(E153=\"ja\",A153,IF(E154=\"ja\",A154,IF(E155=\"ja\",A155,IF(E156=\"ja\",A156,IF(E157=\"ja\",A157,IF(E158=\"ja\",A158,IF(E159=\"ja\",A159,IF(E160=\"ja\",A160,IF(E161=\"ja\",A161,IF(E162=\"ja\",A162,IF(E163=\"ja\",A163,IF(E164=\"ja\",A164,IF(E165=\"ja\",A165,IF(E166=\"ja\",A166,IF(E167=\"ja\",A167,IF(E168=\"ja\",A168,IF(A169=\"ja\",A169,\"Volgepland\")))))))))))))))))))","v":"2021-05-28"},null,null,null,null,0,null,null,0,0,null,null,0]
["2021-05-29",{"$f":"WEEKNUM(Tabel_kalender[[#This Row],[Datum]],21)","v":21},"1900-01-06",null,"nee",{"$f":"IF(Tabel_kalender[[#This Row],[Werkdag]]=\"ja\",Tabel_kalender[[#This Row],[Datum]],IF(E153=\"ja\",A153,IF(E154=\"ja\",A154,IF(E155=\"ja\",A155,IF(E156=\"ja\",A156,IF(E157=\"ja\",A157,IF(E158=\"ja\",A158,IF(E159=\"ja\",A159,IF(E160=\"ja\",A160,IF(E161=\"ja\",A161,IF(E162=\"ja\",A162,IF(E163=\"ja\",A163,IF(E164=\"ja\",A164,IF(E165=\"ja\",A165,IF(E166=\"ja\",A166,IF(E167=\"ja\",A167,IF(E168=\"ja\",A168,IF(E169=\"ja\",A169,IF(A170=\"ja\",A170,\"Volgepland\")))))))))))))))))))","v":"2021-06-02"},null,null,null,null,0,null,null,0,0,null,null,0]
["2021-05-30",{"$f":"WEEKNUM(Tabel_kalender[[#This Row],[Datum]],21)","v":21},"1900-01-07",null,"nee",{"$f":"IF(Tabel_kalender[[#This Row],[Werkdag]]=\"ja\",Tabel_kalender[[#This Row],[Datum]],IF(E154=\"ja\",A154,IF(E155=\"ja\",A155,IF(E156=\"ja\",A156,IF(E157=\"ja\",A157,IF(E158=\"ja\",A158,IF(E159=\"ja\",A159,IF(E160=\"ja\",A160,IF(E161=\"ja\",A161,IF(E162=\"ja\",A162,IF(E163=\"ja\",A163,IF(E164=\"ja\",A164,IF(E165=\"ja\",A165,IF(E166=\"ja\",A166,IF(E167=\"ja\",A167,IF(E168=\"ja\",A168,IF(E169=\"ja\",A169,IF(E170=\"ja\",A170,IF(A171=\"ja\",A171,\"Volgepland\")))))))))))))))))))","v":"2021-06-02"},null,null,null,null,0,null,null,0,0,null,null,0]
["2021-05-31",{"$f":"WEEKNUM(Tabel_kalender[[#This Row],[Datum]],21)","v":22},"1900-01-01","Pinksteren","nee",{"$f":"IF(Tabel_kalender[[#This Row],[Werkdag]]=\"ja\",Tabel_kalender[[#This Row],[Datum]],IF(E155=\"ja\",A155,IF(E156=\"ja\",A156,IF(E157=\"ja\",A157,IF(E158=\"ja\",A158,IF(E159=\"ja\",A159,IF(E160=\"ja\",A160,IF(E161=\"ja\",A161,IF(E162=\"ja\",A162,IF(E163=\"ja\",A163,IF(E164=\"ja\",A164,IF(E165=\"ja\",A165,IF(E166=\"ja\",A166,IF(E167=\"ja\",A167,IF(E168=\"ja\",A168,IF(E169=\"ja\",A169,IF(E170=\"ja\",A170,IF(E171=\"ja\",A171,IF(A172=\"ja\",A172,\"Volgepland\")))))))))))))))))))","v":"2021-06-02"},null,null,null,null,0,null,null,0,0,null,null,0]
["2021-06-01",{"$f":"WEEKNUM(Tabel_kalender[[#This Row],[Datum]],21)","v":22},"1900-01-02","Pinksteren","nee",{"$f":"IF(Tabel_kalender[[#This Row],[Werkdag]]=\"ja\",Tabel_kalender[[#This Row],[Datum]],IF(E156=\"ja\",A156,IF(E157=\"ja\",A157,IF(E158=\"ja\",A158,IF(E159=\"ja\",A159,IF(E160=\"ja\",A160,IF(E161=\"ja\",A161,IF(E162=\"ja\",A162,IF(E163=\"ja\",A163,IF(E164=\"ja\",A164,IF(E165=\"ja\",A165,IF(E166=\"ja\",A166,IF(E167=\"ja\",A167,IF(E168=\"ja\",A168,IF(E169=\"ja\",A169,IF(E170=\"ja\",A170,IF(E171=\"ja\",A171,IF(E172=\"ja\",A172,IF(A173=\"ja\",A173,\"Volgepland\")))))))))))))))))))","v":"2021-06-02"},null,null,null,null,0,null,null,0,0,null,null,0]
["2021-06-02",{"$f":"WEEKNUM(Tabel_kalender[[#This Row],[Datum]],21)","v":22},"1900-01-03",null,"ja",{"$f":"IF(Tabel_kalender[[#This Row],[Werkdag]]=\"ja\",Tabel_kalender[[#This Row],[Datum]],IF(E157=\"ja\",A157,IF(E158=\"ja\",A158,IF(E159=\"ja\",A159,IF(E160=\"ja\",A160,IF(E161=\"ja\",A161,IF(E162=\"ja\",A162,IF(E163=\"ja\",A163,IF(E164=\"ja\",A164,IF(E165=\"ja\",A165,IF(E166=\"ja\",A166,IF(E167=\"ja\",A167,IF(E168=\"ja\",A168,IF(E169=\"ja\",A169,IF(E170=\"ja\",A170,IF(E171=\"ja\",A171,IF(E172=\"ja\",A172,IF(E173=\"ja\",A173,IF(A174=\"ja\",A174,\"Volgepland\")))))))))))))))))))","v":"2021-06-02"},null,null,null,null,0,null,null,0,0,null,null,0]
["2021-06-03",{"$f":"WEEKNUM(Tabel_kalender[[#This Row],[Datum]],21)","v":22},"1900-01-04",null,"ja",{"$f":"IF(Tabel_kalender[[#This Row],[Werkdag]]=\"ja\",Tabel_kalender[[#This Row],[Datum]],IF(E158=\"ja\",A158,IF(E159=\"ja\",A159,IF(E160=\"ja\",A160,IF(E161=\"ja\",A161,IF(E162=\"ja\",A162,IF(E163=\"ja\",A163,IF(E164=\"ja\",A164,IF(E165=\"ja\",A165,IF(E166=\"ja\",A166,IF(E167=\"ja\",A167,IF(E168=\"ja\",A168,IF(E169=\"ja\",A169,IF(E170=\"ja\",A170,IF(E171=\"ja\",A171,IF(E172=\"ja\",A172,IF(E173=\"ja\",A173,IF(E174=\"ja\",A174,IF(A175=\"ja\",A175,\"Volgepland\")))))))))))))))))))","v":"2021-06-03"},null,null,null,null,0,null,null,0,0,null,null,0]
["2021-06-04",{"$f":"WEEKNUM(Tabel_kalender[[#This Row],[Datum]],21)","v":22},"1900-01-05",null,"ja",{"$f":"IF(Tabel_kalender[[#This Row],[Werkdag]]=\"ja\",Tabel_kalender[[#This Row],[Datum]],IF(E159=\"ja\",A159,IF(E160=\"ja\",A160,IF(E161=\"ja\",A161,IF(E162=\"ja\",A162,IF(E163=\"ja\",A163,IF(E164=\"ja\",A164,IF(E165=\"ja\",A165,IF(E166=\"ja\",A166,IF(E167=\"ja\",A167,IF(E168=\"ja\",A168,IF(E169=\"ja\",A169,IF(E170=\"ja\",A170,IF(E171=\"ja\",A171,IF(E172=\"ja\",A172,IF(E173=\"ja\",A173,IF(E174=\"ja\",A174,IF(E175=\"ja\",A175,IF(A176=\"ja\",A176,\"Volgepland\")))))))))))))))))))","v":"2021-06-04"},null,null,null,null,0,null,null,0,0,null,null,0]
["2021-06-05",{"$f":"WEEKNUM(Tabel_kalender[[#This Row],[Datum]],21)","v":22},"1900-01-06",null,"nee",{"$f":"IF(Tabel_kalender[[#This Row],[Werkdag]]=\"ja\",Tabel_kalender[[#This Row],[Datum]],IF(E160=\"ja\",A160,IF(E161=\"ja\",A161,IF(E162=\"ja\",A162,IF(E163=\"ja\",A163,IF(E164=\"ja\",A164,IF(E165=\"ja\",A165,IF(E166=\"ja\",A166,IF(E167=\"ja\",A167,IF(E168=\"ja\",A168,IF(E169=\"ja\",A169,IF(E170=\"ja\",A170,IF(E171=\"ja\",A171,IF(E172=\"ja\",A172,IF(E173=\"ja\",A173,IF(E174=\"ja\",A174,IF(E175=\"ja\",A175,IF(E176=\"ja\",A176,IF(A177=\"ja\",A177,\"Volgepland\")))))))))))))))))))","v":"2021-06-07"},null,null,null,null,0,null,null,0,0,null,null,0]
["2021-06-06",{"$f":"WEEKNUM(Tabel_kalender[[#This Row],[Datum]],21)","v":22},"1900-01-07",null,"nee",{"$f":"IF(Tabel_kalender[[#This Row],[Werkdag]]=\"ja\",Tabel_kalender[[#This Row],[Datum]],IF(E161=\"ja\",A161,IF(E162=\"ja\",A162,IF(E163=\"ja\",A163,IF(E164=\"ja\",A164,IF(E165=\"ja\",A165,IF(E166=\"ja\",A166,IF(E167=\"ja\",A167,IF(E168=\"ja\",A168,IF(E169=\"ja\",A169,IF(E170=\"ja\",A170,IF(E171=\"ja\",A171,IF(E172=\"ja\",A172,IF(E173=\"ja\",A173,IF(E174=\"ja\",A174,IF(E175=\"ja\",A175,IF(E176=\"ja\",A176,IF(E177=\"ja\",A177,IF(A178=\"ja\",A178,\"Volgepland\")))))))))))))))))))","v":"2021-06-07"},null,null,null,null,0,null,null,0,0,null,null,0]
["2021-06-07",{"$f":"WEEKNUM(Tabel_kalender[[#This Row],[Datum]],21)","v":23},"1900-01-01",null,"ja",{"$f":"IF(Tabel_kalender[[#This Row],[Werkdag]]=\"ja\",Tabel_kalender[[#This Row],[Datum]],IF(E162=\"ja\",A162,IF(E163=\"ja\",A163,IF(E164=\"ja\",A164,IF(E165=\"ja\",A165,IF(E166=\"ja\",A166,IF(E167=\"ja\",A167,IF(E168=\"ja\",A168,IF(E169=\"ja\",A169,IF(E170=\"ja\",A170,IF(E171=\"ja\",A171,IF(E172=\"ja\",A172,IF(E173=\"ja\",A173,IF(E174=\"ja\",A174,IF(E175=\"ja\",A175,IF(E176=\"ja\",A176,IF(E177=\"ja\",A177,IF(E178=\"ja\",A178,IF(A179=\"ja\",A179,\"Volgepland\")))))))))))))))))))","v":"2021-06-07"},null,null,null,null,0,null,null,0,0,null,null,0]
["2021-06-08",{"$f":"WEEKNUM(Tabel_kalender[[#This Row],[Datum]],21)","v":23},"1900-01-02",null,"ja",{"$f":"IF(Tabel_kalender[[#This Row],[Werkdag]]=\"ja\",Tabel_kalender[[#This Row],[Datum]],IF(E163=\"ja\",A163,IF(E164=\"ja\",A164,IF(E165=\"ja\",A165,IF(E166=\"ja\",A166,IF(E167=\"ja\",A167,IF(E168=\"ja\",A168,IF(E169=\"ja\",A169,IF(E170=\"ja\",A170,IF(E171=\"ja\",A171,IF(E172=\"ja\",A172,IF(E173=\"ja\",A173,IF(E174=\"ja\",A174,IF(E175=\"ja\",A175,IF(E176=\"ja\",A176,IF(E177=\"ja\",A177,IF(E178=\"ja\",A178,IF(E179=\"ja\",A179,IF(A180=\"ja\",A180,\"Volgepland\")))))))))))))))))))","v":"2021-06-08"},null,null,null,null,0,null,null,0,0,null,null,0]
["2021-06-09",{"$f":"WEEKNUM(Tabel_kalender[[#This Row],[Datum]],21)","v":23},"1900-01-03",null,"ja",{"$f":"IF(Tabel_kalender[[#This Row],[Werkdag]]=\"ja\",Tabel_kalender[[#This Row],[Datum]],IF(E164=\"ja\",A164,IF(E165=\"ja\",A165,IF(E166=\"ja\",A166,IF(E167=\"ja\",A167,IF(E168=\"ja\",A168,IF(E169=\"ja\",A169,IF(E170=\"ja\",A170,IF(E171=\"ja\",A171,IF(E172=\"ja\",A172,IF(E173=\"ja\",A173,IF(E174=\"ja\",A174,IF(E175=\"ja\",A175,IF(E176=\"ja\",A176,IF(E177=\"ja\",A177,IF(E178=\"ja\",A178,IF(E179=\"ja\",A179,IF(E180=\"ja\",A180,IF(A181=\"ja\",A181,\"Volgepland\")))))))))))))))))))","v":"2021-06-09"},null,null,null,null,0,null,null,0,0,null,null,0]
["2021-06-10",{"$f":"WEEKNUM(Tabel_kalender[[#This Row],[Datum]],21)","v":23},"1900-01-04",null,"ja",{"$f":"IF(Tabel_kalender[[#This Row],[Werkdag]]=\"ja\",Tabel_kalender[[#This Row],[Datum]],IF(E165=\"ja\",A165,IF(E166=\"ja\",A166,IF(E167=\"ja\",A167,IF(E168=\"ja\",A168,IF(E169=\"ja\",A169,IF(E170=\"ja\",A170,IF(E171=\"ja\",A171,IF(E172=\"ja\",A172,IF(E173=\"ja\",A173,IF(E174=\"ja\",A174,IF(E175=\"ja\",A175,IF(E176=\"ja\",A176,IF(E177=\"ja\",A177,IF(E178=\"ja\",A178,IF(E179=\"ja\",A179,IF(E180=\"ja\",A180,IF(E181=\"ja\",A181,IF(A182=\"ja\",A182,\"Volgepland\")))))))))))))))))))","v":"2021-06-10"},null,null,null,null,0,null,null,0,0,null,null,0]
["2021-06-11",{"$f":"WEEKNUM(Tabel_kalender[[#This Row],[Datum]],21)","v":23},"1900-01-05",null,"ja",{"$f":"IF(Tabel_kalender[[#This Row],[Werkdag]]=\"ja\",Tabel_kalender[[#This Row],[Datum]],IF(E166=\"ja\",A166,IF(E167=\"ja\",A167,IF(E168=\"ja\",A168,IF(E169=\"ja\",A169,IF(E170=\"ja\",A170,IF(E171=\"ja\",A171,IF(E172=\"ja\",A172,IF(E173=\"ja\",A173,IF(E174=\"ja\",A174,IF(E175=\"ja\",A175,IF(E176=\"ja\",A176,IF(E177=\"ja\",A177,IF(E178=\"ja\",A178,IF(E179=\"ja\",A179,IF(E180=\"ja\",A180,IF(E181=\"ja\",A181,IF(E182=\"ja\",A182,IF(A183=\"ja\",A183,\"Volgepland\")))))))))))))))))))","v":"2021-06-11"},null,null,null,null,0,null,null,0,0,null,null,0]
["2021-06-12",{"$f":"WEEKNUM(Tabel_kalender[[#This Row],[Datum]],21)","v":23},"1900-01-06",null,"nee",{"$f":"IF(Tabel_kalender[[#This Row],[Werkdag]]=\"ja\",Tabel_kalender[[#This Row],[Datum]],IF(E167=\"ja\",A167,IF(E168=\"ja\",A168,IF(E169=\"ja\",A169,IF(E170=\"ja\",A170,IF(E171=\"ja\",A171,IF(E172=\"ja\",A172,IF(E173=\"ja\",A173,IF(E174=\"ja\",A174,IF(E175=\"ja\",A175,IF(E176=\"ja\",A176,IF(E177=\"ja\",A177,IF(E178=\"ja\",A178,IF(E179=\"ja\",A179,IF(E180=\"ja\",A180,IF(E181=\"ja\",A181,IF(E182=\"ja\",A182,IF(E183=\"ja\",A183,IF(A184=\"ja\",A184,\"Volgepland\")))))))))))))))))))","v":"2021-06-14"},null,null,null,null,0,null,null,0,0,null,null,0]
["2021-06-13",{"$f":"WEEKNUM(Tabel_kalender[[#This Row],[Datum]],21)","v":23},"1900-01-07",null,"nee",{"$f":"IF(Tabel_kalender[[#This Row],[Werkdag]]=\"ja\",Tabel_kalender[[#This Row],[Datum]],IF(E168=\"ja\",A168,IF(E169=\"ja\",A169,IF(E170=\"ja\",A170,IF(E171=\"ja\",A171,IF(E172=\"ja\",A172,IF(E173=\"ja\",A173,IF(E174=\"ja\",A174,IF(E175=\"ja\",A175,IF(E176=\"ja\",A176,IF(E177=\"ja\",A177,IF(E178=\"ja\",A178,IF(E179=\"ja\",A179,IF(E180=\"ja\",A180,IF(E181=\"ja\",A181,IF(E182=\"ja\",A182,IF(E183=\"ja\",A183,IF(E184=\"ja\",A184,IF(A185=\"ja\",A185,\"Volgepland\")))))))))))))))))))","v":"2021-06-14"},null,null,null,null,0,null,null,0,0,null,null,0]
["2021-06-14",{"$f":"WEEKNUM(Tabel_kalender[[#This Row],[Datum]],21)","v":24},"1900-01-01",null,"ja",{"$f":"IF(Tabel_kalender[[#This Row],[Werkdag]]=\"ja\",Tabel_kalender[[#This Row],[Datum]],IF(E169=\"ja\",A169,IF(E170=\"ja\",A170,IF(E171=\"ja\",A171,IF(E172=\"ja\",A172,IF(E173=\"ja\",A173,IF(E174=\"ja\",A174,IF(E175=\"ja\",A175,IF(E176=\"ja\",A176,IF(E177=\"ja\",A177,IF(E178=\"ja\",A178,IF(E179=\"ja\",A179,IF(E180=\"ja\",A180,IF(E181=\"ja\",A181,IF(E182=\"ja\",A182,IF(E183=\"ja\",A183,IF(E184=\"ja\",A184,IF(E185=\"ja\",A185,IF(A186=\"ja\",A186,\"Volgepland\")))))))))))))))))))","v":"2021-06-14"},null,null,null,null,0,null,null,0,0,null,null,0]
["2021-06-15",{"$f":"WEEKNUM(Tabel_kalender[[#This Row],[Datum]],21)","v":24},"1900-01-02",null,"ja",{"$f":"IF(Tabel_kalender[[#This Row],[Werkdag]]=\"ja\",Tabel_kalender[[#This Row],[Datum]],IF(E170=\"ja\",A170,IF(E171=\"ja\",A171,IF(E172=\"ja\",A172,IF(E173=\"ja\",A173,IF(E174=\"ja\",A174,IF(E175=\"ja\",A175,IF(E176=\"ja\",A176,IF(E177=\"ja\",A177,IF(E178=\"ja\",A178,IF(E179=\"ja\",A179,IF(E180=\"ja\",A180,IF(E181=\"ja\",A181,IF(E182=\"ja\",A182,IF(E183=\"ja\",A183,IF(E184=\"ja\",A184,IF(E185=\"ja\",A185,IF(E186=\"ja\",A186,IF(A187=\"ja\",A187,\"Volgepland\")))))))))))))))))))","v":"2021-06-15"},null,null,null,null,0,null,null,0,0,null,null,0]
["2021-06-16",{"$f":"WEEKNUM(Tabel_kalender[[#This Row],[Datum]],21)","v":24},"1900-01-03",null,"ja",{"$f":"IF(Tabel_kalender[[#This Row],[Werkdag]]=\"ja\",Tabel_kalender[[#This Row],[Datum]],IF(E171=\"ja\",A171,IF(E172=\"ja\",A172,IF(E173=\"ja\",A173,IF(E174=\"ja\",A174,IF(E175=\"ja\",A175,IF(E176=\"ja\",A176,IF(E177=\"ja\",A177,IF(E178=\"ja\",A178,IF(E179=\"ja\",A179,IF(E180=\"ja\",A180,IF(E181=\"ja\",A181,IF(E182=\"ja\",A182,IF(E183=\"ja\",A183,IF(E184=\"ja\",A184,IF(E185=\"ja\",A185,IF(E186=\"ja\",A186,IF(E187=\"ja\",A187,IF(A188=\"ja\",A188,\"Volgepland\")))))))))))))))))))","v":"2021-06-16"},null,null,null,null,0,null,null,0,0,null,null,0]
["2021-06-17",{"$f":"WEEKNUM(Tabel_kalender[[#This Row],[Datum]],21)","v":24},"1900-01-04",null,"ja",{"$f":"IF(Tabel_kalender[[#This Row],[Werkdag]]=\"ja\",Tabel_kalender[[#This Row],[Datum]],IF(E172=\"ja\",A172,IF(E173=\"ja\",A173,IF(E174=\"ja\",A174,IF(E175=\"ja\",A175,IF(E176=\"ja\",A176,IF(E177=\"ja\",A177,IF(E178=\"ja\",A178,IF(E179=\"ja\",A179,IF(E180=\"ja\",A180,IF(E181=\"ja\",A181,IF(E182=\"ja\",A182,IF(E183=\"ja\",A183,IF(E184=\"ja\",A184,IF(E185=\"ja\",A185,IF(E186=\"ja\",A186,IF(E187=\"ja\",A187,IF(E188=\"ja\",A188,IF(A189=\"ja\",A189,\"Volgepland\")))))))))))))))))))","v":"2021-06-17"},null,null,null,null,0,null,null,0,0,null,null,0]
["2021-06-18",{"$f":"WEEKNUM(Tabel_kalender[[#This Row],[Datum]],21)","v":24},"1900-01-05",null,"ja",{"$f":"IF(Tabel_kalender[[#This Row],[Werkdag]]=\"ja\",Tabel_kalender[[#This Row],[Datum]],IF(E173=\"ja\",A173,IF(E174=\"ja\",A174,IF(E175=\"ja\",A175,IF(E176=\"ja\",A176,IF(E177=\"ja\",A177,IF(E178=\"ja\",A178,IF(E179=\"ja\",A179,IF(E180=\"ja\",A180,IF(E181=\"ja\",A181,IF(E182=\"ja\",A182,IF(E183=\"ja\",A183,IF(E184=\"ja\",A184,IF(E185=\"ja\",A185,IF(E186=\"ja\",A186,IF(E187=\"ja\",A187,IF(E188=\"ja\",A188,IF(E189=\"ja\",A189,IF(A190=\"ja\",A190,\"Volgepland\")))))))))))))))))))","v":"2021-06-18"},null,null,null,null,0,null,null,0,0,null,null,0]
["2021-06-19",{"$f":"WEEKNUM(Tabel_kalender[[#This Row],[Datum]],21)","v":24},"1900-01-06",null,"nee",{"$f":"IF(Tabel_kalender[[#This Row],[Werkdag]]=\"ja\",Tabel_kalender[[#This Row],[Datum]],IF(E174=\"ja\",A174,IF(E175=\"ja\",A175,IF(E176=\"ja\",A176,IF(E177=\"ja\",A177,IF(E178=\"ja\",A178,IF(E179=\"ja\",A179,IF(E180=\"ja\",A180,IF(E181=\"ja\",A181,IF(E182=\"ja\",A182,IF(E183=\"ja\",A183,IF(E184=\"ja\",A184,IF(E185=\"ja\",A185,IF(E186=\"ja\",A186,IF(E187=\"ja\",A187,IF(E188=\"ja\",A188,IF(E189=\"ja\",A189,IF(E190=\"ja\",A190,IF(A191=\"ja\",A191,\"Volgepland\")))))))))))))))))))","v":"2021-06-21"},null,null,null,null,0,null,null,0,0,null,null,0]
["2021-06-20",{"$f":"WEEKNUM(Tabel_kalender[[#This Row],[Datum]],21)","v":24},"1900-01-07",null,"nee",{"$f":"IF(Tabel_kalender[[#This Row],[Werkdag]]=\"ja\",Tabel_kalender[[#This Row],[Datum]],IF(E175=\"ja\",A175,IF(E176=\"ja\",A176,IF(E177=\"ja\",A177,IF(E178=\"ja\",A178,IF(E179=\"ja\",A179,IF(E180=\"ja\",A180,IF(E181=\"ja\",A181,IF(E182=\"ja\",A182,IF(E183=\"ja\",A183,IF(E184=\"ja\",A184,IF(E185=\"ja\",A185,IF(E186=\"ja\",A186,IF(E187=\"ja\",A187,IF(E188=\"ja\",A188,IF(E189=\"ja\",A189,IF(E190=\"ja\",A190,IF(E191=\"ja\",A191,IF(A192=\"ja\",A192,\"Volgepland\")))))))))))))))))))","v":"2021-06-21"},null,null,null,null,0,null,null,0,0,null,null,0]
["2021-06-21",{"$f":"WEEKNUM(Tabel_kalender[[#This Row],[Datum]],21)","v":25},"1900-01-01",null,"ja",{"$f":"IF(Tabel_kalender[[#This Row],[Werkdag]]=\"ja\",Tabel_kalender[[#This Row],[Datum]],IF(E176=\"ja\",A176,IF(E177=\"ja\",A177,IF(E178=\"ja\",A178,IF(E179=\"ja\",A179,IF(E180=\"ja\",A180,IF(E181=\"ja\",A181,IF(E182=\"ja\",A182,IF(E183=\"ja\",A183,IF(E184=\"ja\",A184,IF(E185=\"ja\",A185,IF(E186=\"ja\",A186,IF(E187=\"ja\",A187,IF(E188=\"ja\",A188,IF(E189=\"ja\",A189,IF(E190=\"ja\",A190,IF(E191=\"ja\",A191,IF(E192=\"ja\",A192,IF(A193=\"ja\",A193,\"Volgepland\")))))))))))))))))))","v":"2021-06-21"},null,null,null,null,0,null,null,0,0,null,null,0]
["2021-06-22",{"$f":"WEEKNUM(Tabel_kalender[[#This Row],[Datum]],21)","v":25},"1900-01-02",null,"ja",{"$f":"IF(Tabel_kalender[[#This Row],[Werkdag]]=\"ja\",Tabel_kalender[[#This Row],[Datum]],IF(E177=\"ja\",A177,IF(E178=\"ja\",A178,IF(E179=\"ja\",A179,IF(E180=\"ja\",A180,IF(E181=\"ja\",A181,IF(E182=\"ja\",A182,IF(E183=\"ja\",A183,IF(E184=\"ja\",A184,IF(E185=\"ja\",A185,IF(E186=\"ja\",A186,IF(E187=\"ja\",A187,IF(E188=\"ja\",A188,IF(E189=\"ja\",A189,IF(E190=\"ja\",A190,IF(E191=\"ja\",A191,IF(E192=\"ja\",A192,IF(E193=\"ja\",A193,IF(A194=\"ja\",A194,\"Volgepland\")))))))))))))))))))","v":"2021-06-22"},null,null,null,null,0,null,null,0,0,null,null,0]
["2021-06-23",{"$f":"WEEKNUM(Tabel_kalender[[#This Row],[Datum]],21)","v":25},"1900-01-03",null,"ja",{"$f":"IF(Tabel_kalender[[#This Row],[Werkdag]]=\"ja\",Tabel_kalender[[#This Row],[Datum]],IF(E178=\"ja\",A178,IF(E179=\"ja\",A179,IF(E180=\"ja\",A180,IF(E181=\"ja\",A181,IF(E182=\"ja\",A182,IF(E183=\"ja\",A183,IF(E184=\"ja\",A184,IF(E185=\"ja\",A185,IF(E186=\"ja\",A186,IF(E187=\"ja\",A187,IF(E188=\"ja\",A188,IF(E189=\"ja\",A189,IF(E190=\"ja\",A190,IF(E191=\"ja\",A191,IF(E192=\"ja\",A192,IF(E193=\"ja\",A193,IF(E194=\"ja\",A194,IF(A195=\"ja\",A195,\"Volgepland\")))))))))))))))))))","v":"2021-06-23"},null,null,null,null,0,null,null,0,0,null,null,0]
["2021-06-24",{"$f":"WEEKNUM(Tabel_kalender[[#This Row],[Datum]],21)","v":25},"1900-01-04",null,"ja",{"$f":"IF(Tabel_kalender[[#This Row],[Werkdag]]=\"ja\",Tabel_kalender[[#This Row],[Datum]],IF(E179=\"ja\",A179,IF(E180=\"ja\",A180,IF(E181=\"ja\",A181,IF(E182=\"ja\",A182,IF(E183=\"ja\",A183,IF(E184=\"ja\",A184,IF(E185=\"ja\",A185,IF(E186=\"ja\",A186,IF(E187=\"ja\",A187,IF(E188=\"ja\",A188,IF(E189=\"ja\",A189,IF(E190=\"ja\",A190,IF(E191=\"ja\",A191,IF(E192=\"ja\",A192,IF(E193=\"ja\",A193,IF(E194=\"ja\",A194,IF(E195=\"ja\",A195,IF(A196=\"ja\",A196,\"Volgepland\")))))))))))))))))))","v":"2021-06-24"},null,null,null,null,0,null,null,0,0,null,null,0]
["2021-06-25",{"$f":"WEEKNUM(Tabel_kalender[[#This Row],[Datum]],21)","v":25},"1900-01-05",null,"ja",{"$f":"IF(Tabel_kalender[[#This Row],[Werkdag]]=\"ja\",Tabel_kalender[[#This Row],[Datum]],IF(E180=\"ja\",A180,IF(E181=\"ja\",A181,IF(E182=\"ja\",A182,IF(E183=\"ja\",A183,IF(E184=\"ja\",A184,IF(E185=\"ja\",A185,IF(E186=\"ja\",A186,IF(E187=\"ja\",A187,IF(E188=\"ja\",A188,IF(E189=\"ja\",A189,IF(E190=\"ja\",A190,IF(E191=\"ja\",A191,IF(E192=\"ja\",A192,IF(E193=\"ja\",A193,IF(E194=\"ja\",A194,IF(E195=\"ja\",A195,IF(E196=\"ja\",A196,IF(A197=\"ja\",A197,\"Volgepland\")))))))))))))))))))","v":"2021-06-25"},null,null,null,null,0,null,null,0,0,null,null,0]
["2021-06-26",{"$f":"WEEKNUM(Tabel_kalender[[#This Row],[Datum]],21)","v":25},"1900-01-06",null,"nee",{"$f":"IF(Tabel_kalender[[#This Row],[Werkdag]]=\"ja\",Tabel_kalender[[#This Row],[Datum]],IF(E181=\"ja\",A181,IF(E182=\"ja\",A182,IF(E183=\"ja\",A183,IF(E184=\"ja\",A184,IF(E185=\"ja\",A185,IF(E186=\"ja\",A186,IF(E187=\"ja\",A187,IF(E188=\"ja\",A188,IF(E189=\"ja\",A189,IF(E190=\"ja\",A190,IF(E191=\"ja\",A191,IF(E192=\"ja\",A192,IF(E193=\"ja\",A193,IF(E194=\"ja\",A194,IF(E195=\"ja\",A195,IF(E196=\"ja\",A196,IF(E197=\"ja\",A197,IF(A198=\"ja\",A198,\"Volgepland\")))))))))))))))))))","v":"2021-06-28"},null,null,null,null,0,null,null,0,0,null,null,0]
["2021-06-27",{"$f":"WEEKNUM(Tabel_kalender[[#This Row],[Datum]],21)","v":25},"1900-01-07",null,"nee",{"$f":"IF(Tabel_kalender[[#This Row],[Werkdag]]=\"ja\",Tabel_kalender[[#This Row],[Datum]],IF(E182=\"ja\",A182,IF(E183=\"ja\",A183,IF(E184=\"ja\",A184,IF(E185=\"ja\",A185,IF(E186=\"ja\",A186,IF(E187=\"ja\",A187,IF(E188=\"ja\",A188,IF(E189=\"ja\",A189,IF(E190=\"ja\",A190,IF(E191=\"ja\",A191,IF(E192=\"ja\",A192,IF(E193=\"ja\",A193,IF(E194=\"ja\",A194,IF(E195=\"ja\",A195,IF(E196=\"ja\",A196,IF(E197=\"ja\",A197,IF(E198=\"ja\",A198,IF(A199=\"ja\",A199,\"Volgepland\")))))))))))))))))))","v":"2021-06-28"},null,null,null,null,0,null,null,0,0,null,null,0]
["2021-06-28",{"$f":"WEEKNUM(Tabel_kalender[[#This Row],[Datum]],21)","v":26},"1900-01-01",null,"ja",{"$f":"IF(Tabel_kalender[[#This Row],[Werkdag]]=\"ja\",Tabel_kalender[[#This Row],[Datum]],IF(E183=\"ja\",A183,IF(E184=\"ja\",A184,IF(E185=\"ja\",A185,IF(E186=\"ja\",A186,IF(E187=\"ja\",A187,IF(E188=\"ja\",A188,IF(E189=\"ja\",A189,IF(E190=\"ja\",A190,IF(E191=\"ja\",A191,IF(E192=\"ja\",A192,IF(E193=\"ja\",A193,IF(E194=\"ja\",A194,IF(E195=\"ja\",A195,IF(E196=\"ja\",A196,IF(E197=\"ja\",A197,IF(E198=\"ja\",A198,IF(E199=\"ja\",A199,IF(A200=\"ja\",A200,\"Volgepland\")))))))))))))))))))","v":"2021-06-28"},null,null,null,null,0,null,null,0,0,null,null,0]
["2021-06-29",{"$f":"WEEKNUM(Tabel_kalender[[#This Row],[Datum]],21)","v":26},"1900-01-02",null,"ja",{"$f":"IF(Tabel_kalender[[#This Row],[Werkdag]]=\"ja\",Tabel_kalender[[#This Row],[Datum]],IF(E184=\"ja\",A184,IF(E185=\"ja\",A185,IF(E186=\"ja\",A186,IF(E187=\"ja\",A187,IF(E188=\"ja\",A188,IF(E189=\"ja\",A189,IF(E190=\"ja\",A190,IF(E191=\"ja\",A191,IF(E192=\"ja\",A192,IF(E193=\"ja\",A193,IF(E194=\"ja\",A194,IF(E195=\"ja\",A195,IF(E196=\"ja\",A196,IF(E197=\"ja\",A197,IF(E198=\"ja\",A198,IF(E199=\"ja\",A199,IF(E200=\"ja\",A200,IF(A201=\"ja\",A201,\"Volgepland\")))))))))))))))))))","v":"2021-06-29"},null,null,null,null,0,null,null,0,0,null,null,0]
["2021-06-30",{"$f":"WEEKNUM(Tabel_kalender[[#This Row],[Datum]],21)","v":26},"1900-01-03",null,"ja",{"$f":"IF(Tabel_kalender[[#This Row],[Werkdag]]=\"ja\",Tabel_kalender[[#This Row],[Datum]],IF(E185=\"ja\",A185,IF(E186=\"ja\",A186,IF(E187=\"ja\",A187,IF(E188=\"ja\",A188,IF(E189=\"ja\",A189,IF(E190=\"ja\",A190,IF(E191=\"ja\",A191,IF(E192=\"ja\",A192,IF(E193=\"ja\",A193,IF(E194=\"ja\",A194,IF(E195=\"ja\",A195,IF(E196=\"ja\",A196,IF(E197=\"ja\",A197,IF(E198=\"ja\",A198,IF(E199=\"ja\",A199,IF(E200=\"ja\",A200,IF(E201=\"ja\",A201,IF(A202=\"ja\",A202,\"Volgepland\")))))))))))))))))))","v":"2021-06-30"},null,null,null,null,0,null,null,0,0,null,null,0]
["2021-07-01",{"$f":"WEEKNUM(Tabel_kalender[[#This Row],[Datum]],21)","v":26},"1900-01-04",null,"ja",{"$f":"IF(Tabel_kalender[[#This Row],[Werkdag]]=\"ja\",Tabel_kalender[[#This Row],[Datum]],IF(E186=\"ja\",A186,IF(E187=\"ja\",A187,IF(E188=\"ja\",A188,IF(E189=\"ja\",A189,IF(E190=\"ja\",A190,IF(E191=\"ja\",A191,IF(E192=\"ja\",A192,IF(E193=\"ja\",A193,IF(E194=\"ja\",A194,IF(E195=\"ja\",A195,IF(E196=\"ja\",A196,IF(E197=\"ja\",A197,IF(E198=\"ja\",A198,IF(E199=\"ja\",A199,IF(E200=\"ja\",A200,IF(E201=\"ja\",A201,IF(E202=\"ja\",A202,IF(A203=\"ja\",A203,\"Volgepland\")))))))))))))))))))","v":"2021-07-01"},null,null,null,null,0,null,null,0,0,null,null,0]
["2021-07-02",{"$f":"WEEKNUM(Tabel_kalender[[#This Row],[Datum]],21)","v":26},"1900-01-05",null,"ja",{"$f":"IF(Tabel_kalender[[#This Row],[Werkdag]]=\"ja\",Tabel_kalender[[#This Row],[Datum]],IF(E187=\"ja\",A187,IF(E188=\"ja\",A188,IF(E189=\"ja\",A189,IF(E190=\"ja\",A190,IF(E191=\"ja\",A191,IF(E192=\"ja\",A192,IF(E193=\"ja\",A193,IF(E194=\"ja\",A194,IF(E195=\"ja\",A195,IF(E196=\"ja\",A196,IF(E197=\"ja\",A197,IF(E198=\"ja\",A198,IF(E199=\"ja\",A199,IF(E200=\"ja\",A200,IF(E201=\"ja\",A201,IF(E202=\"ja\",A202,IF(E203=\"ja\",A203,IF(A204=\"ja\",A204,\"Volgepland\")))))))))))))))))))","v":"2021-07-02"},null,null,null,null,0,null,null,0,0,null,null,0]
["2021-07-03",{"$f":"WEEKNUM(Tabel_kalender[[#This Row],[Datum]],21)","v":26},"1900-01-06",null,"nee",{"$f":"IF(Tabel_kalender[[#This Row],[Werkdag]]=\"ja\",Tabel_kalender[[#This Row],[Datum]],IF(E188=\"ja\",A188,IF(E189=\"ja\",A189,IF(E190=\"ja\",A190,IF(E191=\"ja\",A191,IF(E192=\"ja\",A192,IF(E193=\"ja\",A193,IF(E194=\"ja\",A194,IF(E195=\"ja\",A195,IF(E196=\"ja\",A196,IF(E197=\"ja\",A197,IF(E198=\"ja\",A198,IF(E199=\"ja\",A199,IF(E200=\"ja\",A200,IF(E201=\"ja\",A201,IF(E202=\"ja\",A202,IF(E203=\"ja\",A203,IF(E204=\"ja\",A204,IF(A205=\"ja\",A205,\"Volgepland\")))))))))))))))))))","v":"2021-07-05"},null,null,null,null,0,null,null,0,0,null,null,0]
["2021-07-04",{"$f":"WEEKNUM(Tabel_kalender[[#This Row],[Datum]],21)","v":26},"1900-01-07",null,"nee",{"$f":"IF(Tabel_kalender[[#This Row],[Werkdag]]=\"ja\",Tabel_kalender[[#This Row],[Datum]],IF(E189=\"ja\",A189,IF(E190=\"ja\",A190,IF(E191=\"ja\",A191,IF(E192=\"ja\",A192,IF(E193=\"ja\",A193,IF(E194=\"ja\",A194,IF(E195=\"ja\",A195,IF(E196=\"ja\",A196,IF(E197=\"ja\",A197,IF(E198=\"ja\",A198,IF(E199=\"ja\",A199,IF(E200=\"ja\",A200,IF(E201=\"ja\",A201,IF(E202=\"ja\",A202,IF(E203=\"ja\",A203,IF(E204=\"ja\",A204,IF(E205=\"ja\",A205,IF(A206=\"ja\",A206,\"Volgepland\")))))))))))))))))))","v":"2021-07-05"},null,null,null,null,0,null,null,0,0,null,null,0]
["2021-07-05",{"$f":"WEEKNUM(Tabel_kalender[[#This Row],[Datum]],21)","v":27},"1900-01-01",null,"ja",{"$f":"IF(Tabel_kalender[[#This Row],[Werkdag]]=\"ja\",Tabel_kalender[[#This Row],[Datum]],IF(E190=\"ja\",A190,IF(E191=\"ja\",A191,IF(E192=\"ja\",A192,IF(E193=\"ja\",A193,IF(E194=\"ja\",A194,IF(E195=\"ja\",A195,IF(E196=\"ja\",A196,IF(E197=\"ja\",A197,IF(E198=\"ja\",A198,IF(E199=\"ja\",A199,IF(E200=\"ja\",A200,IF(E201=\"ja\",A201,IF(E202=\"ja\",A202,IF(E203=\"ja\",A203,IF(E204=\"ja\",A204,IF(E205=\"ja\",A205,IF(E206=\"ja\",A206,IF(A207=\"ja\",A207,\"Volgepland\")))))))))))))))))))","v":"2021-07-05"},null,null,null,null,0,null,null,0,0,null,null,0]
["2021-07-06",{"$f":"WEEKNUM(Tabel_kalender[[#This Row],[Datum]],21)","v":27},"1900-01-02",null,"ja",{"$f":"IF(Tabel_kalender[[#This Row],[Werkdag]]=\"ja\",Tabel_kalender[[#This Row],[Datum]],IF(E191=\"ja\",A191,IF(E192=\"ja\",A192,IF(E193=\"ja\",A193,IF(E194=\"ja\",A194,IF(E195=\"ja\",A195,IF(E196=\"ja\",A196,IF(E197=\"ja\",A197,IF(E198=\"ja\",A198,IF(E199=\"ja\",A199,IF(E200=\"ja\",A200,IF(E201=\"ja\",A201,IF(E202=\"ja\",A202,IF(E203=\"ja\",A203,IF(E204=\"ja\",A204,IF(E205=\"ja\",A205,IF(E206=\"ja\",A206,IF(E207=\"ja\",A207,IF(A208=\"ja\",A208,\"Volgepland\")))))))))))))))))))","v":"2021-07-06"},null,null,null,null,0,null,null,0,0,null,null,0]
["2021-07-07",{"$f":"WEEKNUM(Tabel_kalender[[#This Row],[Datum]],21)","v":27},"1900-01-03",null,"ja",{"$f":"IF(Tabel_kalender[[#This Row],[Werkdag]]=\"ja\",Tabel_kalender[[#This Row],[Datum]],IF(E192=\"ja\",A192,IF(E193=\"ja\",A193,IF(E194=\"ja\",A194,IF(E195=\"ja\",A195,IF(E196=\"ja\",A196,IF(E197=\"ja\",A197,IF(E198=\"ja\",A198,IF(E199=\"ja\",A199,IF(E200=\"ja\",A200,IF(E201=\"ja\",A201,IF(E202=\"ja\",A202,IF(E203=\"ja\",A203,IF(E204=\"ja\",A204,IF(E205=\"ja\",A205,IF(E206=\"ja\",A206,IF(E207=\"ja\",A207,IF(E208=\"ja\",A208,IF(A209=\"ja\",A209,\"Volgepland\")))))))))))))))))))","v":"2021-07-07"},null,null,null,null,0,null,null,0,0,null,null,0]
["2021-07-08",{"$f":"WEEKNUM(Tabel_kalender[[#This Row],[Datum]],21)","v":27},"1900-01-04",null,"ja",{"$f":"IF(Tabel_kalender[[#This Row],[Werkdag]]=\"ja\",Tabel_kalender[[#This Row],[Datum]],IF(E193=\"ja\",A193,IF(E194=\"ja\",A194,IF(E195=\"ja\",A195,IF(E196=\"ja\",A196,IF(E197=\"ja\",A197,IF(E198=\"ja\",A198,IF(E199=\"ja\",A199,IF(E200=\"ja\",A200,IF(E201=\"ja\",A201,IF(E202=\"ja\",A202,IF(E203=\"ja\",A203,IF(E204=\"ja\",A204,IF(E205=\"ja\",A205,IF(E206=\"ja\",A206,IF(E207=\"ja\",A207,IF(E208=\"ja\",A208,IF(E209=\"ja\",A209,IF(A210=\"ja\",A210,\"Volgepland\")))))))))))))))))))","v":"2021-07-08"},null,null,null,null,0,null,null,0,0,null,null,0]
["2021-07-09",{"$f":"WEEKNUM(Tabel_kalender[[#This Row],[Datum]],21)","v":27},"1900-01-05",null,"ja",{"$f":"IF(Tabel_kalender[[#This Row],[Werkdag]]=\"ja\",Tabel_kalender[[#This Row],[Datum]],IF(E194=\"ja\",A194,IF(E195=\"ja\",A195,IF(E196=\"ja\",A196,IF(E197=\"ja\",A197,IF(E198=\"ja\",A198,IF(E199=\"ja\",A199,IF(E200=\"ja\",A200,IF(E201=\"ja\",A201,IF(E202=\"ja\",A202,IF(E203=\"ja\",A203,IF(E204=\"ja\",A204,IF(E205=\"ja\",A205,IF(E206=\"ja\",A206,IF(E207=\"ja\",A207,IF(E208=\"ja\",A208,IF(E209=\"ja\",A209,IF(E210=\"ja\",A210,IF(A211=\"ja\",A211,\"Volgepland\")))))))))))))))))))","v":"2021-07-09"},null,null,null,null,0,null,null,0,0,null,null,0]
["2021-07-10",{"$f":"WEEKNUM(Tabel_kalender[[#This Row],[Datum]],21)","v":27},"1900-01-06",null,"nee",{"$f":"IF(Tabel_kalender[[#This Row],[Werkdag]]=\"ja\",Tabel_kalender[[#This Row],[Datum]],IF(E195=\"ja\",A195,IF(E196=\"ja\",A196,IF(E197=\"ja\",A197,IF(E198=\"ja\",A198,IF(E199=\"ja\",A199,IF(E200=\"ja\",A200,IF(E201=\"ja\",A201,IF(E202=\"ja\",A202,IF(E203=\"ja\",A203,IF(E204=\"ja\",A204,IF(E205=\"ja\",A205,IF(E206=\"ja\",A206,IF(E207=\"ja\",A207,IF(E208=\"ja\",A208,IF(E209=\"ja\",A209,IF(E210=\"ja\",A210,IF(E211=\"ja\",A211,IF(A212=\"ja\",A212,\"Volgepland\")))))))))))))))))))","v":"2021-07-12"},null,null,null,null,0,null,null,0,0,null,null,0]
["2021-07-11",{"$f":"WEEKNUM(Tabel_kalender[[#This Row],[Datum]],21)","v":27},"1900-01-07",null,"nee",{"$f":"IF(Tabel_kalender[[#This Row],[Werkdag]]=\"ja\",Tabel_kalender[[#This Row],[Datum]],IF(E196=\"ja\",A196,IF(E197=\"ja\",A197,IF(E198=\"ja\",A198,IF(E199=\"ja\",A199,IF(E200=\"ja\",A200,IF(E201=\"ja\",A201,IF(E202=\"ja\",A202,IF(E203=\"ja\",A203,IF(E204=\"ja\",A204,IF(E205=\"ja\",A205,IF(E206=\"ja\",A206,IF(E207=\"ja\",A207,IF(E208=\"ja\",A208,IF(E209=\"ja\",A209,IF(E210=\"ja\",A210,IF(E211=\"ja\",A211,IF(E212=\"ja\",A212,IF(A213=\"ja\",A213,\"Volgepland\")))))))))))))))))))","v":"2021-07-12"},null,null,null,null,0,null,null,0,0,null,null,0]
[{"$f":"A195+1","v":"2021-07-12"},{"$f":"WEEKNUM(Tabel_kalender[[#This Row],[Datum]],21)","v":28},"1900-01-01",null,"ja",{"$f":"IF(Tabel_kalender[[#This Row],[Werkdag]]=\"ja\",Tabel_kalender[[#This Row],[Datum]],IF(E197=\"ja\",A197,IF(E198=\"ja\",A198,IF(E199=\"ja\",A199,IF(E200=\"ja\",A200,IF(E201=\"ja\",A201,IF(E202=\"ja\",A202,IF(E203=\"ja\",A203,IF(E204=\"ja\",A204,IF(E205=\"ja\",A205,IF(E206=\"ja\",A206,IF(E207=\"ja\",A207,IF(E208=\"ja\",A208,IF(E209=\"ja\",A209,IF(E210=\"ja\",A210,IF(E211=\"ja\",A211,IF(E212=\"ja\",A212,IF(E213=\"ja\",A213,IF(A214=\"ja\",A214,\"Volgepland\")))))))))))))))))))","v":"2021-07-12"},null,null,null,null,{"$f":"L195","v":0},null,null,{"$f":"IF(L196>0,L196-K196,)-M196","v":0},{"$f":"P195","v":0},null,null,{"$f":"IF(P196>0,P196-O196,)-Q196","v":0}]
["2021-07-13",{"$f":"WEEKNUM(Tabel_kalender[[#This Row],[Datum]],21)","v":28},{"$f":"WEEKDAY(A197,2)","v":"1900-01-02"},null,"ja",{"$f":"IF(Tabel_kalender[[#This Row],[Werkdag]]=\"ja\",Tabel_kalender[[#This Row],[Datum]],IF(E198=\"ja\",A198,IF(E199=\"ja\",A199,IF(E200=\"ja\",A200,IF(E201=\"ja\",A201,IF(E202=\"ja\",A202,IF(E203=\"ja\",A203,IF(E204=\"ja\",A204,IF(E205=\"ja\",A205,IF(E206=\"ja\",A206,IF(E207=\"ja\",A207,IF(E208=\"ja\",A208,IF(E209=\"ja\",A209,IF(E210=\"ja\",A210,IF(E211=\"ja\",A211,IF(E212=\"ja\",A212,IF(E213=\"ja\",A213,IF(E214=\"ja\",A214,IF(A215=\"ja\",A215,\"Volgepland\")))))))))))))))))))","v":"2021-07-13"},null,null,null,null,0,null,null,0,0,null,null,0]
["2021-07-14",{"$f":"WEEKNUM(Tabel_kalender[[#This Row],[Datum]],21)","v":28},"1900-01-03",null,"ja",{"$f":"IF(Tabel_kalender[[#This Row],[Werkdag]]=\"ja\",Tabel_kalender[[#This Row],[Datum]],IF(E199=\"ja\",A199,IF(E200=\"ja\",A200,IF(E201=\"ja\",A201,IF(E202=\"ja\",A202,IF(E203=\"ja\",A203,IF(E204=\"ja\",A204,IF(E205=\"ja\",A205,IF(E206=\"ja\",A206,IF(E207=\"ja\",A207,IF(E208=\"ja\",A208,IF(E209=\"ja\",A209,IF(E210=\"ja\",A210,IF(E211=\"ja\",A211,IF(E212=\"ja\",A212,IF(E213=\"ja\",A213,IF(E214=\"ja\",A214,IF(E215=\"ja\",A215,IF(A216=\"ja\",A216,\"Volgepland\")))))))))))))))))))","v":"2021-07-14"},null,null,null,null,0,null,null,0,0,null,null,0]
["2021-07-15",{"$f":"WEEKNUM(Tabel_kalender[[#This Row],[Datum]],21)","v":28},"1900-01-04",null,"ja",{"$f":"IF(Tabel_kalender[[#This Row],[Werkdag]]=\"ja\",Tabel_kalender[[#This Row],[Datum]],IF(E200=\"ja\",A200,IF(E201=\"ja\",A201,IF(E202=\"ja\",A202,IF(E203=\"ja\",A203,IF(E204=\"ja\",A204,IF(E205=\"ja\",A205,IF(E206=\"ja\",A206,IF(E207=\"ja\",A207,IF(E208=\"ja\",A208,IF(E209=\"ja\",A209,IF(E210=\"ja\",A210,IF(E211=\"ja\",A211,IF(E212=\"ja\",A212,IF(E213=\"ja\",A213,IF(E214=\"ja\",A214,IF(E215=\"ja\",A215,IF(E216=\"ja\",A216,IF(A217=\"ja\",A217,\"Volgepland\")))))))))))))))))))","v":"2021-07-15"},null,null,null,null,0,null,null,0,0,null,null,0]
["2021-07-16",{"$f":"WEEKNUM(Tabel_kalender[[#This Row],[Datum]],21)","v":28},"1900-01-05",null,"ja",{"$f":"IF(Tabel_kalender[[#This Row],[Werkdag]]=\"ja\",Tabel_kalender[[#This Row],[Datum]],IF(E201=\"ja\",A201,IF(E202=\"ja\",A202,IF(E203=\"ja\",A203,IF(E204=\"ja\",A204,IF(E205=\"ja\",A205,IF(E206=\"ja\",A206,IF(E207=\"ja\",A207,IF(E208=\"ja\",A208,IF(E209=\"ja\",A209,IF(E210=\"ja\",A210,IF(E211=\"ja\",A211,IF(E212=\"ja\",A212,IF(E213=\"ja\",A213,IF(E214=\"ja\",A214,IF(E215=\"ja\",A215,IF(E216=\"ja\",A216,IF(E217=\"ja\",A217,IF(A218=\"ja\",A218,\"Volgepland\")))))))))))))))))))","v":"2021-07-16"},null,null,null,null,0,null,null,0,0,null,null,0]
["2021-07-17",{"$f":"WEEKNUM(Tabel_kalender[[#This Row],[Datum]],21)","v":28},"1900-01-06",null,"nee",{"$f":"IF(Tabel_kalender[[#This Row],[Werkdag]]=\"ja\",Tabel_kalender[[#This Row],[Datum]],IF(E202=\"ja\",A202,IF(E203=\"ja\",A203,IF(E204=\"ja\",A204,IF(E205=\"ja\",A205,IF(E206=\"ja\",A206,IF(E207=\"ja\",A207,IF(E208=\"ja\",A208,IF(E209=\"ja\",A209,IF(E210=\"ja\",A210,IF(E211=\"ja\",A211,IF(E212=\"ja\",A212,IF(E213=\"ja\",A213,IF(E214=\"ja\",A214,IF(E215=\"ja\",A215,IF(E216=\"ja\",A216,IF(E217=\"ja\",A217,IF(E218=\"ja\",A218,IF(A219=\"ja\",A219,\"Volgepland\")))))))))))))))))))","v":"2021-07-19"},null,null,null,null,0,null,null,0,0,null,null,0]
["2021-07-18",{"$f":"WEEKNUM(Tabel_kalender[[#This Row],[Datum]],21)","v":28},"1900-01-07",null,"nee",{"$f":"IF(Tabel_kalender[[#This Row],[Werkdag]]=\"ja\",Tabel_kalender[[#This Row],[Datum]],IF(E203=\"ja\",A203,IF(E204=\"ja\",A204,IF(E205=\"ja\",A205,IF(E206=\"ja\",A206,IF(E207=\"ja\",A207,IF(E208=\"ja\",A208,IF(E209=\"ja\",A209,IF(E210=\"ja\",A210,IF(E211=\"ja\",A211,IF(E212=\"ja\",A212,IF(E213=\"ja\",A213,IF(E214=\"ja\",A214,IF(E215=\"ja\",A215,IF(E216=\"ja\",A216,IF(E217=\"ja\",A217,IF(E218=\"ja\",A218,IF(E219=\"ja\",A219,IF(A220=\"ja\",A220,\"Volgepland\")))))))))))))))))))","v":"2021-07-19"},null,null,null,null,0,null,null,0,0,null,null,0]
["2021-07-19",{"$f":"WEEKNUM(Tabel_kalender[[#This Row],[Datum]],21)","v":29},"1900-01-01",null,"ja",{"$f":"IF(Tabel_kalender[[#This Row],[Werkdag]]=\"ja\",Tabel_kalender[[#This Row],[Datum]],IF(E204=\"ja\",A204,IF(E205=\"ja\",A205,IF(E206=\"ja\",A206,IF(E207=\"ja\",A207,IF(E208=\"ja\",A208,IF(E209=\"ja\",A209,IF(E210=\"ja\",A210,IF(E211=\"ja\",A211,IF(E212=\"ja\",A212,IF(E213=\"ja\",A213,IF(E214=\"ja\",A214,IF(E215=\"ja\",A215,IF(E216=\"ja\",A216,IF(E217=\"ja\",A217,IF(E218=\"ja\",A218,IF(E219=\"ja\",A219,IF(E220=\"ja\",A220,IF(A221=\"ja\",A221,\"Volgepland\")))))))))))))))))))","v":"2021-07-19"},null,null,null,null,0,null,null,0,0,null,null,0]
["2021-07-20",{"$f":"WEEKNUM(Tabel_kalender[[#This Row],[Datum]],21)","v":29},"1900-01-02",null,"ja",{"$f":"IF(Tabel_kalender[[#This Row],[Werkdag]]=\"ja\",Tabel_kalender[[#This Row],[Datum]],IF(E205=\"ja\",A205,IF(E206=\"ja\",A206,IF(E207=\"ja\",A207,IF(E208=\"ja\",A208,IF(E209=\"ja\",A209,IF(E210=\"ja\",A210,IF(E211=\"ja\",A211,IF(E212=\"ja\",A212,IF(E213=\"ja\",A213,IF(E214=\"ja\",A214,IF(E215=\"ja\",A215,IF(E216=\"ja\",A216,IF(E217=\"ja\",A217,IF(E218=\"ja\",A218,IF(E219=\"ja\",A219,IF(E220=\"ja\",A220,IF(E221=\"ja\",A221,IF(A222=\"ja\",A222,\"Volgepland\")))))))))))))))))))","v":"2021-07-20"},null,null,null,null,0,null,null,0,0,null,null,0]
["2021-07-21",{"$f":"WEEKNUM(Tabel_kalender[[#This Row],[Datum]],21)","v":29},"1900-01-03",null,"ja",{"$f":"IF(Tabel_kalender[[#This Row],[Werkdag]]=\"ja\",Tabel_kalender[[#This Row],[Datum]],IF(E206=\"ja\",A206,IF(E207=\"ja\",A207,IF(E208=\"ja\",A208,IF(E209=\"ja\",A209,IF(E210=\"ja\",A210,IF(E211=\"ja\",A211,IF(E212=\"ja\",A212,IF(E213=\"ja\",A213,IF(E214=\"ja\",A214,IF(E215=\"ja\",A215,IF(E216=\"ja\",A216,IF(E217=\"ja\",A217,IF(E218=\"ja\",A218,IF(E219=\"ja\",A219,IF(E220=\"ja\",A220,IF(E221=\"ja\",A221,IF(E222=\"ja\",A222,IF(A223=\"ja\",A223,\"Volgepland\")))))))))))))))))))","v":"2021-07-21"},null,null,null,null,0,null,null,0,0,null,null,0]
["2021-07-22",{"$f":"WEEKNUM(Tabel_kalender[[#This Row],[Datum]],21)","v":29},"1900-01-04",null,"ja",{"$f":"IF(Tabel_kalender[[#This Row],[Werkdag]]=\"ja\",Tabel_kalender[[#This Row],[Datum]],IF(E207=\"ja\",A207,IF(E208=\"ja\",A208,IF(E209=\"ja\",A209,IF(E210=\"ja\",A210,IF(E211=\"ja\",A211,IF(E212=\"ja\",A212,IF(E213=\"ja\",A213,IF(E214=\"ja\",A214,IF(E215=\"ja\",A215,IF(E216=\"ja\",A216,IF(E217=\"ja\",A217,IF(E218=\"ja\",A218,IF(E219=\"ja\",A219,IF(E220=\"ja\",A220,IF(E221=\"ja\",A221,IF(E222=\"ja\",A222,IF(E223=\"ja\",A223,IF(A224=\"ja\",A224,\"Volgepland\")))))))))))))))))))","v":"2021-07-22"},null,null,null,null,0,null,null,0,0,null,null,0]
["2021-07-23",{"$f":"WEEKNUM(Tabel_kalender[[#This Row],[Datum]],21)","v":29},"1900-01-05",null,"ja",{"$f":"IF(Tabel_kalender[[#This Row],[Werkdag]]=\"ja\",Tabel_kalender[[#This Row],[Datum]],IF(E208=\"ja\",A208,IF(E209=\"ja\",A209,IF(E210=\"ja\",A210,IF(E211=\"ja\",A211,IF(E212=\"ja\",A212,IF(E213=\"ja\",A213,IF(E214=\"ja\",A214,IF(E215=\"ja\",A215,IF(E216=\"ja\",A216,IF(E217=\"ja\",A217,IF(E218=\"ja\",A218,IF(E219=\"ja\",A219,IF(E220=\"ja\",A220,IF(E221=\"ja\",A221,IF(E222=\"ja\",A222,IF(E223=\"ja\",A223,IF(E224=\"ja\",A224,IF(A225=\"ja\",A225,\"Volgepland\")))))))))))))))))))","v":"2021-07-23"},null,null,null,null,0,null,null,0,0,null,null,0]
["2021-07-24",{"$f":"WEEKNUM(Tabel_kalender[[#This Row],[Datum]],21)","v":29},"1900-01-06",null,"nee",{"$f":"IF(Tabel_kalender[[#This Row],[Werkdag]]=\"ja\",Tabel_kalender[[#This Row],[Datum]],IF(E209=\"ja\",A209,IF(E210=\"ja\",A210,IF(E211=\"ja\",A211,IF(E212=\"ja\",A212,IF(E213=\"ja\",A213,IF(E214=\"ja\",A214,IF(E215=\"ja\",A215,IF(E216=\"ja\",A216,IF(E217=\"ja\",A217,IF(E218=\"ja\",A218,IF(E219=\"ja\",A219,IF(E220=\"ja\",A220,IF(E221=\"ja\",A221,IF(E222=\"ja\",A222,IF(E223=\"ja\",A223,IF(E224=\"ja\",A224,IF(E225=\"ja\",A225,IF(A226=\"ja\",A226,\"Volgepland\")))))))))))))))))))","v":"2021-07-26"},null,null,null,null,0,null,null,0,0,null,null,0]
["2021-07-25",{"$f":"WEEKNUM(Tabel_kalender[[#This Row],[Datum]],21)","v":29},"1900-01-07",null,"nee",{"$f":"IF(Tabel_kalender[[#This Row],[Werkdag]]=\"ja\",Tabel_kalender[[#This Row],[Datum]],IF(E210=\"ja\",A210,IF(E211=\"ja\",A211,IF(E212=\"ja\",A212,IF(E213=\"ja\",A213,IF(E214=\"ja\",A214,IF(E215=\"ja\",A215,IF(E216=\"ja\",A216,IF(E217=\"ja\",A217,IF(E218=\"ja\",A218,IF(E219=\"ja\",A219,IF(E220=\"ja\",A220,IF(E221=\"ja\",A221,IF(E222=\"ja\",A222,IF(E223=\"ja\",A223,IF(E224=\"ja\",A224,IF(E225=\"ja\",A225,IF(E226=\"ja\",A226,IF(A227=\"ja\",A227,\"Volgepland\")))))))))))))))))))","v":"2021-07-26"},null,null,null,null,0,null,null,0,0,null,null,0]
["2021-07-26",{"$f":"WEEKNUM(Tabel_kalender[[#This Row],[Datum]],21)","v":30},"1900-01-01",null,"ja",{"$f":"IF(Tabel_kalender[[#This Row],[Werkdag]]=\"ja\",Tabel_kalender[[#This Row],[Datum]],IF(E211=\"ja\",A211,IF(E212=\"ja\",A212,IF(E213=\"ja\",A213,IF(E214=\"ja\",A214,IF(E215=\"ja\",A215,IF(E216=\"ja\",A216,IF(E217=\"ja\",A217,IF(E218=\"ja\",A218,IF(E219=\"ja\",A219,IF(E220=\"ja\",A220,IF(E221=\"ja\",A221,IF(E222=\"ja\",A222,IF(E223=\"ja\",A223,IF(E224=\"ja\",A224,IF(E225=\"ja\",A225,IF(E226=\"ja\",A226,IF(E227=\"ja\",A227,IF(A228=\"ja\",A228,\"Volgepland\")))))))))))))))))))","v":"2021-07-26"},null,null,null,null,0,null,null,0,0,null,null,0]
["2021-07-27",{"$f":"WEEKNUM(Tabel_kalender[[#This Row],[Datum]],21)","v":30},"1900-01-02",null,"ja",{"$f":"IF(Tabel_kalender[[#This Row],[Werkdag]]=\"ja\",Tabel_kalender[[#This Row],[Datum]],IF(E212=\"ja\",A212,IF(E213=\"ja\",A213,IF(E214=\"ja\",A214,IF(E215=\"ja\",A215,IF(E216=\"ja\",A216,IF(E217=\"ja\",A217,IF(E218=\"ja\",A218,IF(E219=\"ja\",A219,IF(E220=\"ja\",A220,IF(E221=\"ja\",A221,IF(E222=\"ja\",A222,IF(E223=\"ja\",A223,IF(E224=\"ja\",A224,IF(E225=\"ja\",A225,IF(E226=\"ja\",A226,IF(E227=\"ja\",A227,IF(E228=\"ja\",A228,IF(A229=\"ja\",A229,\"Volgepland\")))))))))))))))))))","v":"2021-07-27"},null,null,null,null,0,null,null,0,0,null,null,0]
["2021-07-28",{"$f":"WEEKNUM(Tabel_kalender[[#This Row],[Datum]],21)","v":30},"1900-01-03",null,"ja",{"$f":"IF(Tabel_kalender[[#This Row],[Werkdag]]=\"ja\",Tabel_kalender[[#This Row],[Datum]],IF(E213=\"ja\",A213,IF(E214=\"ja\",A214,IF(E215=\"ja\",A215,IF(E216=\"ja\",A216,IF(E217=\"ja\",A217,IF(E218=\"ja\",A218,IF(E219=\"ja\",A219,IF(E220=\"ja\",A220,IF(E221=\"ja\",A221,IF(E222=\"ja\",A222,IF(E223=\"ja\",A223,IF(E224=\"ja\",A224,IF(E225=\"ja\",A225,IF(E226=\"ja\",A226,IF(E227=\"ja\",A227,IF(E228=\"ja\",A228,IF(E229=\"ja\",A229,IF(A230=\"ja\",A230,\"Volgepland\")))))))))))))))))))","v":"2021-07-28"},null,null,null,null,0,null,null,0,0,null,null,0]
["2021-07-29",{"$f":"WEEKNUM(Tabel_kalender[[#This Row],[Datum]],21)","v":30},"1900-01-04",null,"ja",{"$f":"IF(Tabel_kalender[[#This Row],[Werkdag]]=\"ja\",Tabel_kalender[[#This Row],[Datum]],IF(E214=\"ja\",A214,IF(E215=\"ja\",A215,IF(E216=\"ja\",A216,IF(E217=\"ja\",A217,IF(E218=\"ja\",A218,IF(E219=\"ja\",A219,IF(E220=\"ja\",A220,IF(E221=\"ja\",A221,IF(E222=\"ja\",A222,IF(E223=\"ja\",A223,IF(E224=\"ja\",A224,IF(E225=\"ja\",A225,IF(E226=\"ja\",A226,IF(E227=\"ja\",A227,IF(E228=\"ja\",A228,IF(E229=\"ja\",A229,IF(E230=\"ja\",A230,IF(A231=\"ja\",A231,\"Volgepland\")))))))))))))))))))","v":"2021-07-29"},null,null,null,null,0,null,null,0,0,null,null,0]
["2021-07-30",{"$f":"WEEKNUM(Tabel_kalender[[#This Row],[Datum]],21)","v":30},"1900-01-05",null,"ja",{"$f":"IF(Tabel_kalender[[#This Row],[Werkdag]]=\"ja\",Tabel_kalender[[#This Row],[Datum]],IF(E215=\"ja\",A215,IF(E216=\"ja\",A216,IF(E217=\"ja\",A217,IF(E218=\"ja\",A218,IF(E219=\"ja\",A219,IF(E220=\"ja\",A220,IF(E221=\"ja\",A221,IF(E222=\"ja\",A222,IF(E223=\"ja\",A223,IF(E224=\"ja\",A224,IF(E225=\"ja\",A225,IF(E226=\"ja\",A226,IF(E227=\"ja\",A227,IF(E228=\"ja\",A228,IF(E229=\"ja\",A229,IF(E230=\"ja\",A230,IF(E231=\"ja\",A231,IF(A232=\"ja\",A232,\"Volgepland\")))))))))))))))))))","v":"2021-07-30"},null,null,null,null,0,null,null,0,0,null,null,0]
["2021-07-31",{"$f":"WEEKNUM(Tabel_kalender[[#This Row],[Datum]],21)","v":30},"1900-01-06",null,"nee",{"$f":"IF(Tabel_kalender[[#This Row],[Werkdag]]=\"ja\",Tabel_kalender[[#This Row],[Datum]],IF(E216=\"ja\",A216,IF(E217=\"ja\",A217,IF(E218=\"ja\",A218,IF(E219=\"ja\",A219,IF(E220=\"ja\",A220,IF(E221=\"ja\",A221,IF(E222=\"ja\",A222,IF(E223=\"ja\",A223,IF(E224=\"ja\",A224,IF(E225=\"ja\",A225,IF(E226=\"ja\",A226,IF(E227=\"ja\",A227,IF(E228=\"ja\",A228,IF(E229=\"ja\",A229,IF(E230=\"ja\",A230,IF(E231=\"ja\",A231,IF(E232=\"ja\",A232,IF(A233=\"ja\",A233,\"Volgepland\")))))))))))))))))))","v":"2021-08-02"},null,null,null,null,0,null,null,0,0,null,null,0]
["2021-08-01",{"$f":"WEEKNUM(Tabel_kalender[[#This Row],[Datum]],21)","v":30},"1900-01-07",null,"nee",{"$f":"IF(Tabel_kalender[[#This Row],[Werkdag]]=\"ja\",Tabel_kalender[[#This Row],[Datum]],IF(E217=\"ja\",A217,IF(E218=\"ja\",A218,IF(E219=\"ja\",A219,IF(E220=\"ja\",A220,IF(E221=\"ja\",A221,IF(E222=\"ja\",A222,IF(E223=\"ja\",A223,IF(E224=\"ja\",A224,IF(E225=\"ja\",A225,IF(E226=\"ja\",A226,IF(E227=\"ja\",A227,IF(E228=\"ja\",A228,IF(E229=\"ja\",A229,IF(E230=\"ja\",A230,IF(E231=\"ja\",A231,IF(E232=\"ja\",A232,IF(E233=\"ja\",A233,IF(A234=\"ja\",A234,\"Volgepland\")))))))))))))))))))","v":"2021-08-02"},null,null,null,null,0,null,null,0,0,null,null,0]
["2021-08-02",{"$f":"WEEKNUM(Tabel_kalender[[#This Row],[Datum]],21)","v":31},"1900-01-01",null,"ja",{"$f":"IF(Tabel_kalender[[#This Row],[Werkdag]]=\"ja\",Tabel_kalender[[#This Row],[Datum]],IF(E218=\"ja\",A218,IF(E219=\"ja\",A219,IF(E220=\"ja\",A220,IF(E221=\"ja\",A221,IF(E222=\"ja\",A222,IF(E223=\"ja\",A223,IF(E224=\"ja\",A224,IF(E225=\"ja\",A225,IF(E226=\"ja\",A226,IF(E227=\"ja\",A227,IF(E228=\"ja\",A228,IF(E229=\"ja\",A229,IF(E230=\"ja\",A230,IF(E231=\"ja\",A231,IF(E232=\"ja\",A232,IF(E233=\"ja\",A233,IF(E234=\"ja\",A234,IF(A235=\"ja\",A235,\"Volgepland\")))))))))))))))))))","v":"2021-08-02"},null,null,null,null,0,null,null,0,0,null,null,0]
["2021-08-03",{"$f":"WEEKNUM(Tabel_kalender[[#This Row],[Datum]],21)","v":31},"1900-01-02",null,"ja",{"$f":"IF(Tabel_kalender[[#This Row],[Werkdag]]=\"ja\",Tabel_kalender[[#This Row],[Datum]],IF(E219=\"ja\",A219,IF(E220=\"ja\",A220,IF(E221=\"ja\",A221,IF(E222=\"ja\",A222,IF(E223=\"ja\",A223,IF(E224=\"ja\",A224,IF(E225=\"ja\",A225,IF(E226=\"ja\",A226,IF(E227=\"ja\",A227,IF(E228=\"ja\",A228,IF(E229=\"ja\",A229,IF(E230=\"ja\",A230,IF(E231=\"ja\",A231,IF(E232=\"ja\",A232,IF(E233=\"ja\",A233,IF(E234=\"ja\",A234,IF(E235=\"ja\",A235,IF(A236=\"ja\",A236,\"Volgepland\")))))))))))))))))))","v":"2021-08-03"},null,null,null,null,0,null,null,0,0,null,null,0]
["2021-08-04",{"$f":"WEEKNUM(Tabel_kalender[[#This Row],[Datum]],21)","v":31},"1900-01-03",null,"ja",{"$f":"IF(Tabel_kalender[[#This Row],[Werkdag]]=\"ja\",Tabel_kalender[[#This Row],[Datum]],IF(E220=\"ja\",A220,IF(E221=\"ja\",A221,IF(E222=\"ja\",A222,IF(E223=\"ja\",A223,IF(E224=\"ja\",A224,IF(E225=\"ja\",A225,IF(E226=\"ja\",A226,IF(E227=\"ja\",A227,IF(E228=\"ja\",A228,IF(E229=\"ja\",A229,IF(E230=\"ja\",A230,IF(E231=\"ja\",A231,IF(E232=\"ja\",A232,IF(E233=\"ja\",A233,IF(E234=\"ja\",A234,IF(E235=\"ja\",A235,IF(E236=\"ja\",A236,IF(A237=\"ja\",A237,\"Volgepland\")))))))))))))))))))","v":"2021-08-04"},null,null,null,null,0,null,null,0,0,null,null,0]
["2021-08-05",{"$f":"WEEKNUM(Tabel_kalender[[#This Row],[Datum]],21)","v":31},"1900-01-04",null,"ja",{"$f":"IF(Tabel_kalender[[#This Row],[Werkdag]]=\"ja\",Tabel_kalender[[#This Row],[Datum]],IF(E221=\"ja\",A221,IF(E222=\"ja\",A222,IF(E223=\"ja\",A223,IF(E224=\"ja\",A224,IF(E225=\"ja\",A225,IF(E226=\"ja\",A226,IF(E227=\"ja\",A227,IF(E228=\"ja\",A228,IF(E229=\"ja\",A229,IF(E230=\"ja\",A230,IF(E231=\"ja\",A231,IF(E232=\"ja\",A232,IF(E233=\"ja\",A233,IF(E234=\"ja\",A234,IF(E235=\"ja\",A235,IF(E236=\"ja\",A236,IF(E237=\"ja\",A237,IF(A238=\"ja\",A238,\"Volgepland\")))))))))))))))))))","v":"2021-08-05"},null,null,null,null,0,null,null,0,0,null,null,0]
["2021-08-06",{"$f":"WEEKNUM(Tabel_kalender[[#This Row],[Datum]],21)","v":31},"1900-01-05",null,"ja",{"$f":"IF(Tabel_kalender[[#This Row],[Werkdag]]=\"ja\",Tabel_kalender[[#This Row],[Datum]],IF(E222=\"ja\",A222,IF(E223=\"ja\",A223,IF(E224=\"ja\",A224,IF(E225=\"ja\",A225,IF(E226=\"ja\",A226,IF(E227=\"ja\",A227,IF(E228=\"ja\",A228,IF(E229=\"ja\",A229,IF(E230=\"ja\",A230,IF(E231=\"ja\",A231,IF(E232=\"ja\",A232,IF(E233=\"ja\",A233,IF(E234=\"ja\",A234,IF(E235=\"ja\",A235,IF(E236=\"ja\",A236,IF(E237=\"ja\",A237,IF(E238=\"ja\",A238,IF(A239=\"ja\",A239,\"Volgepland\")))))))))))))))))))","v":"2021-08-06"},null,null,null,null,0,null,null,0,0,null,null,0]
["2021-08-07",{"$f":"WEEKNUM(Tabel_kalender[[#This Row],[Datum]],21)","v":31},"1900-01-06",null,"nee",{"$f":"IF(Tabel_kalender[[#This Row],[Werkdag]]=\"ja\",Tabel_kalender[[#This Row],[Datum]],IF(E223=\"ja\",A223,IF(E224=\"ja\",A224,IF(E225=\"ja\",A225,IF(E226=\"ja\",A226,IF(E227=\"ja\",A227,IF(E228=\"ja\",A228,IF(E229=\"ja\",A229,IF(E230=\"ja\",A230,IF(E231=\"ja\",A231,IF(E232=\"ja\",A232,IF(E233=\"ja\",A233,IF(E234=\"ja\",A234,IF(E235=\"ja\",A235,IF(E236=\"ja\",A236,IF(E237=\"ja\",A237,IF(E238=\"ja\",A238,IF(E239=\"ja\",A239,IF(A240=\"ja\",A240,\"Volgepland\")))))))))))))))))))","v":"2021-08-09"},null,null,null,null,0,null,null,0,0,null,null,0]
["2021-08-08",{"$f":"WEEKNUM(Tabel_kalender[[#This Row],[Datum]],21)","v":31},"1900-01-07",null,"nee",{"$f":"IF(Tabel_kalender[[#This Row],[Werkdag]]=\"ja\",Tabel_kalender[[#This Row],[Datum]],IF(E224=\"ja\",A224,IF(E225=\"ja\",A225,IF(E226=\"ja\",A226,IF(E227=\"ja\",A227,IF(E228=\"ja\",A228,IF(E229=\"ja\",A229,IF(E230=\"ja\",A230,IF(E231=\"ja\",A231,IF(E232=\"ja\",A232,IF(E233=\"ja\",A233,IF(E234=\"ja\",A234,IF(E235=\"ja\",A235,IF(E236=\"ja\",A236,IF(E237=\"ja\",A237,IF(E238=\"ja\",A238,IF(E239=\"ja\",A239,IF(E240=\"ja\",A240,IF(A241=\"ja\",A241,\"Volgepland\")))))))))))))))))))","v":"2021-08-09"},null,null,null,null,0,null,null,0,0,null,null,0]
["2021-08-09",{"$f":"WEEKNUM(Tabel_kalender[[#This Row],[Datum]],21)","v":32},"1900-01-01",null,"ja",{"$f":"IF(Tabel_kalender[[#This Row],[Werkdag]]=\"ja\",Tabel_kalender[[#This Row],[Datum]],IF(E225=\"ja\",A225,IF(E226=\"ja\",A226,IF(E227=\"ja\",A227,IF(E228=\"ja\",A228,IF(E229=\"ja\",A229,IF(E230=\"ja\",A230,IF(E231=\"ja\",A231,IF(E232=\"ja\",A232,IF(E233=\"ja\",A233,IF(E234=\"ja\",A234,IF(E235=\"ja\",A235,IF(E236=\"ja\",A236,IF(E237=\"ja\",A237,IF(E238=\"ja\",A238,IF(E239=\"ja\",A239,IF(E240=\"ja\",A240,IF(E241=\"ja\",A241,IF(A242=\"ja\",A242,\"Volgepland\")))))))))))))))))))","v":"2021-08-09"},null,null,null,null,0,null,null,0,0,null,null,0]
["2021-08-10",{"$f":"WEEKNUM(Tabel_kalender[[#This Row],[Datum]],21)","v":32},"1900-01-02",null,"ja",{"$f":"IF(Tabel_kalender[[#This Row],[Werkdag]]=\"ja\",Tabel_kalender[[#This Row],[Datum]],IF(E226=\"ja\",A226,IF(E227=\"ja\",A227,IF(E228=\"ja\",A228,IF(E229=\"ja\",A229,IF(E230=\"ja\",A230,IF(E231=\"ja\",A231,IF(E232=\"ja\",A232,IF(E233=\"ja\",A233,IF(E234=\"ja\",A234,IF(E235=\"ja\",A235,IF(E236=\"ja\",A236,IF(E237=\"ja\",A237,IF(E238=\"ja\",A238,IF(E239=\"ja\",A239,IF(E240=\"ja\",A240,IF(E241=\"ja\",A241,IF(E242=\"ja\",A242,IF(A243=\"ja\",A243,\"Volgepland\")))))))))))))))))))","v":"2021-08-10"},null,null,null,null,0,null,null,0,0,null,null,0]
["2021-08-11",{"$f":"WEEKNUM(Tabel_kalender[[#This Row],[Datum]],21)","v":32},"1900-01-03",null,"ja",{"$f":"IF(Tabel_kalender[[#This Row],[Werkdag]]=\"ja\",Tabel_kalender[[#This Row],[Datum]],IF(E227=\"ja\",A227,IF(E228=\"ja\",A228,IF(E229=\"ja\",A229,IF(E230=\"ja\",A230,IF(E231=\"ja\",A231,IF(E232=\"ja\",A232,IF(E233=\"ja\",A233,IF(E234=\"ja\",A234,IF(E235=\"ja\",A235,IF(E236=\"ja\",A236,IF(E237=\"ja\",A237,IF(E238=\"ja\",A238,IF(E239=\"ja\",A239,IF(E240=\"ja\",A240,IF(E241=\"ja\",A241,IF(E242=\"ja\",A242,IF(E243=\"ja\",A243,IF(A244=\"ja\",A244,\"Volgepland\")))))))))))))))))))","v":"2021-08-11"},null,null,null,null,0,null,null,0,0,null,null,0]
["2021-08-12",{"$f":"WEEKNUM(Tabel_kalender[[#This Row],[Datum]],21)","v":32},"1900-01-04",null,"ja",{"$f":"IF(Tabel_kalender[[#This Row],[Werkdag]]=\"ja\",Tabel_kalender[[#This Row],[Datum]],IF(E228=\"ja\",A228,IF(E229=\"ja\",A229,IF(E230=\"ja\",A230,IF(E231=\"ja\",A231,IF(E232=\"ja\",A232,IF(E233=\"ja\",A233,IF(E234=\"ja\",A234,IF(E235=\"ja\",A235,IF(E236=\"ja\",A236,IF(E237=\"ja\",A237,IF(E238=\"ja\",A238,IF(E239=\"ja\",A239,IF(E240=\"ja\",A240,IF(E241=\"ja\",A241,IF(E242=\"ja\",A242,IF(E243=\"ja\",A243,IF(E244=\"ja\",A244,IF(A245=\"ja\",A245,\"Volgepland\")))))))))))))))))))","v":"2021-08-12"},null,null,null,null,0,null,null,0,0,null,null,0]
["2021-08-13",{"$f":"WEEKNUM(Tabel_kalender[[#This Row],[Datum]],21)","v":32},"1900-01-05",null,"ja",{"$f":"IF(Tabel_kalender[[#This Row],[Werkdag]]=\"ja\",Tabel_kalender[[#This Row],[Datum]],IF(E229=\"ja\",A229,IF(E230=\"ja\",A230,IF(E231=\"ja\",A231,IF(E232=\"ja\",A232,IF(E233=\"ja\",A233,IF(E234=\"ja\",A234,IF(E235=\"ja\",A235,IF(E236=\"ja\",A236,IF(E237=\"ja\",A237,IF(E238=\"ja\",A238,IF(E239=\"ja\",A239,IF(E240=\"ja\",A240,IF(E241=\"ja\",A241,IF(E242=\"ja\",A242,IF(E243=\"ja\",A243,IF(E244=\"ja\",A244,IF(E245=\"ja\",A245,IF(A246=\"ja\",A246,\"Volgepland\")))))))))))))))))))","v":"2021-08-13"},null,null,null,null,0,null,null,0,0,null,null,0]
["2021-08-14",{"$f":"WEEKNUM(Tabel_kalender[[#This Row],[Datum]],21)","v":32},"1900-01-06",null,"nee",{"$f":"IF(Tabel_kalender[[#This Row],[Werkdag]]=\"ja\",Tabel_kalender[[#This Row],[Datum]],IF(E230=\"ja\",A230,IF(E231=\"ja\",A231,IF(E232=\"ja\",A232,IF(E233=\"ja\",A233,IF(E234=\"ja\",A234,IF(E235=\"ja\",A235,IF(E236=\"ja\",A236,IF(E237=\"ja\",A237,IF(E238=\"ja\",A238,IF(E239=\"ja\",A239,IF(E240=\"ja\",A240,IF(E241=\"ja\",A241,IF(E242=\"ja\",A242,IF(E243=\"ja\",A243,IF(E244=\"ja\",A244,IF(E245=\"ja\",A245,IF(E246=\"ja\",A246,IF(A247=\"ja\",A247,\"Volgepland\")))))))))))))))))))","v":"2021-08-16"},null,null,null,null,0,null,null,0,0,null,null,0]
["2021-08-15",{"$f":"WEEKNUM(Tabel_kalender[[#This Row],[Datum]],21)","v":32},"1900-01-07",null,"nee",{"$f":"IF(Tabel_kalender[[#This Row],[Werkdag]]=\"ja\",Tabel_kalender[[#This Row],[Datum]],IF(E231=\"ja\",A231,IF(E232=\"ja\",A232,IF(E233=\"ja\",A233,IF(E234=\"ja\",A234,IF(E235=\"ja\",A235,IF(E236=\"ja\",A236,IF(E237=\"ja\",A237,IF(E238=\"ja\",A238,IF(E239=\"ja\",A239,IF(E240=\"ja\",A240,IF(E241=\"ja\",A241,IF(E242=\"ja\",A242,IF(E243=\"ja\",A243,IF(E244=\"ja\",A244,IF(E245=\"ja\",A245,IF(E246=\"ja\",A246,IF(E247=\"ja\",A247,IF(A248=\"ja\",A248,\"Volgepland\")))))))))))))))))))","v":"2021-08-16"},null,null,null,null,0,null,null,0,0,null,null,0]
["2021-08-16",{"$f":"WEEKNUM(Tabel_kalender[[#This Row],[Datum]],21)","v":33},"1900-01-01",null,"ja",{"$f":"IF(Tabel_kalender[[#This Row],[Werkdag]]=\"ja\",Tabel_kalender[[#This Row],[Datum]],IF(E232=\"ja\",A232,IF(E233=\"ja\",A233,IF(E234=\"ja\",A234,IF(E235=\"ja\",A235,IF(E236=\"ja\",A236,IF(E237=\"ja\",A237,IF(E238=\"ja\",A238,IF(E239=\"ja\",A239,IF(E240=\"ja\",A240,IF(E241=\"ja\",A241,IF(E242=\"ja\",A242,IF(E243=\"ja\",A243,IF(E244=\"ja\",A244,IF(E245=\"ja\",A245,IF(E246=\"ja\",A246,IF(E247=\"ja\",A247,IF(E248=\"ja\",A248,IF(A249=\"ja\",A249,\"Volgepland\")))))))))))))))))))","v":"2021-08-16"},null,null,null,null,0,null,null,0,0,null,null,0]
["2021-08-17",{"$f":"WEEKNUM(Tabel_kalender[[#This Row],[Datum]],21)","v":33},"1900-01-02",null,"ja",{"$f":"IF(Tabel_kalender[[#This Row],[Werkdag]]=\"ja\",Tabel_kalender[[#This Row],[Datum]],IF(E233=\"ja\",A233,IF(E234=\"ja\",A234,IF(E235=\"ja\",A235,IF(E236=\"ja\",A236,IF(E237=\"ja\",A237,IF(E238=\"ja\",A238,IF(E239=\"ja\",A239,IF(E240=\"ja\",A240,IF(E241=\"ja\",A241,IF(E242=\"ja\",A242,IF(E243=\"ja\",A243,IF(E244=\"ja\",A244,IF(E245=\"ja\",A245,IF(E246=\"ja\",A246,IF(E247=\"ja\",A247,IF(E248=\"ja\",A248,IF(E249=\"ja\",A249,IF(A250=\"ja\",A250,\"Volgepland\")))))))))))))))))))","v":"2021-08-17"},null,null,null,null,0,null,null,0,0,null,null,0]
["2021-08-18",{"$f":"WEEKNUM(Tabel_kalender[[#This Row],[Datum]],21)","v":33},"1900-01-03",null,"ja",{"$f":"IF(Tabel_kalender[[#This Row],[Werkdag]]=\"ja\",Tabel_kalender[[#This Row],[Datum]],IF(E234=\"ja\",A234,IF(E235=\"ja\",A235,IF(E236=\"ja\",A236,IF(E237=\"ja\",A237,IF(E238=\"ja\",A238,IF(E239=\"ja\",A239,IF(E240=\"ja\",A240,IF(E241=\"ja\",A241,IF(E242=\"ja\",A242,IF(E243=\"ja\",A243,IF(E244=\"ja\",A244,IF(E245=\"ja\",A245,IF(E246=\"ja\",A246,IF(E247=\"ja\",A247,IF(E248=\"ja\",A248,IF(E249=\"ja\",A249,IF(E250=\"ja\",A250,IF(A251=\"ja\",A251,\"Volgepland\")))))))))))))))))))","v":"2021-08-18"},null,null,null,null,0,null,null,0,0,null,null,0]
["2021-08-19",{"$f":"WEEKNUM(Tabel_kalender[[#This Row],[Datum]],21)","v":33},"1900-01-04",null,"ja",{"$f":"IF(Tabel_kalender[[#This Row],[Werkdag]]=\"ja\",Tabel_kalender[[#This Row],[Datum]],IF(E235=\"ja\",A235,IF(E236=\"ja\",A236,IF(E237=\"ja\",A237,IF(E238=\"ja\",A238,IF(E239=\"ja\",A239,IF(E240=\"ja\",A240,IF(E241=\"ja\",A241,IF(E242=\"ja\",A242,IF(E243=\"ja\",A243,IF(E244=\"ja\",A244,IF(E245=\"ja\",A245,IF(E246=\"ja\",A246,IF(E247=\"ja\",A247,IF(E248=\"ja\",A248,IF(E249=\"ja\",A249,IF(E250=\"ja\",A250,IF(E251=\"ja\",A251,IF(A252=\"ja\",A252,\"Volgepland\")))))))))))))))))))","v":"2021-08-19"},null,null,null,null,0,null,null,0,0,null,null,0]
["2021-08-20",{"$f":"WEEKNUM(Tabel_kalender[[#This Row],[Datum]],21)","v":33},"1900-01-05",null,"ja",{"$f":"IF(Tabel_kalender[[#This Row],[Werkdag]]=\"ja\",Tabel_kalender[[#This Row],[Datum]],IF(E236=\"ja\",A236,IF(E237=\"ja\",A237,IF(E238=\"ja\",A238,IF(E239=\"ja\",A239,IF(E240=\"ja\",A240,IF(E241=\"ja\",A241,IF(E242=\"ja\",A242,IF(E243=\"ja\",A243,IF(E244=\"ja\",A244,IF(E245=\"ja\",A245,IF(E246=\"ja\",A246,IF(E247=\"ja\",A247,IF(E248=\"ja\",A248,IF(E249=\"ja\",A249,IF(E250=\"ja\",A250,IF(E251=\"ja\",A251,IF(E252=\"ja\",A252,IF(A253=\"ja\",A253,\"Volgepland\")))))))))))))))))))","v":"2021-08-20"},null,null,null,null,0,null,null,0,0,null,null,0]
["2021-08-21",{"$f":"WEEKNUM(Tabel_kalender[[#This Row],[Datum]],21)","v":33},"1900-01-06",null,"nee",{"$f":"IF(Tabel_kalender[[#This Row],[Werkdag]]=\"ja\",Tabel_kalender[[#This Row],[Datum]],IF(E237=\"ja\",A237,IF(E238=\"ja\",A238,IF(E239=\"ja\",A239,IF(E240=\"ja\",A240,IF(E241=\"ja\",A241,IF(E242=\"ja\",A242,IF(E243=\"ja\",A243,IF(E244=\"ja\",A244,IF(E245=\"ja\",A245,IF(E246=\"ja\",A246,IF(E247=\"ja\",A247,IF(E248=\"ja\",A248,IF(E249=\"ja\",A249,IF(E250=\"ja\",A250,IF(E251=\"ja\",A251,IF(E252=\"ja\",A252,IF(E253=\"ja\",A253,IF(A254=\"ja\",A254,\"Volgepland\")))))))))))))))))))","v":"2021-08-23"},null,null,null,null,0,null,null,0,0,null,null,0]
["2021-08-22",{"$f":"WEEKNUM(Tabel_kalender[[#This Row],[Datum]],21)","v":33},"1900-01-07",null,"nee",{"$f":"IF(Tabel_kalender[[#This Row],[Werkdag]]=\"ja\",Tabel_kalender[[#This Row],[Datum]],IF(E238=\"ja\",A238,IF(E239=\"ja\",A239,IF(E240=\"ja\",A240,IF(E241=\"ja\",A241,IF(E242=\"ja\",A242,IF(E243=\"ja\",A243,IF(E244=\"ja\",A244,IF(E245=\"ja\",A245,IF(E246=\"ja\",A246,IF(E247=\"ja\",A247,IF(E248=\"ja\",A248,IF(E249=\"ja\",A249,IF(E250=\"ja\",A250,IF(E251=\"ja\",A251,IF(E252=\"ja\",A252,IF(E253=\"ja\",A253,IF(E254=\"ja\",A254,IF(A255=\"ja\",A255,\"Volgepland\")))))))))))))))))))","v":"2021-08-23"},null,null,null,null,0,null,null,0,0,null,null,0]
["2021-08-23",{"$f":"WEEKNUM(Tabel_kalender[[#This Row],[Datum]],21)","v":34},"1900-01-01",null,"ja",{"$f":"IF(Tabel_kalender[[#This Row],[Werkdag]]=\"ja\",Tabel_kalender[[#This Row],[Datum]],IF(E239=\"ja\",A239,IF(E240=\"ja\",A240,IF(E241=\"ja\",A241,IF(E242=\"ja\",A242,IF(E243=\"ja\",A243,IF(E244=\"ja\",A244,IF(E245=\"ja\",A245,IF(E246=\"ja\",A246,IF(E247=\"ja\",A247,IF(E248=\"ja\",A248,IF(E249=\"ja\",A249,IF(E250=\"ja\",A250,IF(E251=\"ja\",A251,IF(E252=\"ja\",A252,IF(E253=\"ja\",A253,IF(E254=\"ja\",A254,IF(E255=\"ja\",A255,IF(A256=\"ja\",A256,\"Volgepland\")))))))))))))))))))","v":"2021-08-23"},null,null,null,null,0,null,null,0,0,null,null,0]
["2021-08-24",{"$f":"WEEKNUM(Tabel_kalender[[#This Row],[Datum]],21)","v":34},"1900-01-02",null,"ja",{"$f":"IF(Tabel_kalender[[#This Row],[Werkdag]]=\"ja\",Tabel_kalender[[#This Row],[Datum]],IF(E240=\"ja\",A240,IF(E241=\"ja\",A241,IF(E242=\"ja\",A242,IF(E243=\"ja\",A243,IF(E244=\"ja\",A244,IF(E245=\"ja\",A245,IF(E246=\"ja\",A246,IF(E247=\"ja\",A247,IF(E248=\"ja\",A248,IF(E249=\"ja\",A249,IF(E250=\"ja\",A250,IF(E251=\"ja\",A251,IF(E252=\"ja\",A252,IF(E253=\"ja\",A253,IF(E254=\"ja\",A254,IF(E255=\"ja\",A255,IF(E256=\"ja\",A256,IF(A257=\"ja\",A257,\"Volgepland\")))))))))))))))))))","v":"2021-08-24"},null,null,null,null,0,null,null,0,0,null,null,0]
["2021-08-25",{"$f":"WEEKNUM(Tabel_kalender[[#This Row],[Datum]],21)","v":34},"1900-01-03",null,"ja",{"$f":"IF(Tabel_kalender[[#This Row],[Werkdag]]=\"ja\",Tabel_kalender[[#This Row],[Datum]],IF(E241=\"ja\",A241,IF(E242=\"ja\",A242,IF(E243=\"ja\",A243,IF(E244=\"ja\",A244,IF(E245=\"ja\",A245,IF(E246=\"ja\",A246,IF(E247=\"ja\",A247,IF(E248=\"ja\",A248,IF(E249=\"ja\",A249,IF(E250=\"ja\",A250,IF(E251=\"ja\",A251,IF(E252=\"ja\",A252,IF(E253=\"ja\",A253,IF(E254=\"ja\",A254,IF(E255=\"ja\",A255,IF(E256=\"ja\",A256,IF(E257=\"ja\",A257,IF(A258=\"ja\",A258,\"Volgepland\")))))))))))))))))))","v":"2021-08-25"},null,null,null,null,0,null,null,0,0,null,null,0]
["2021-08-26",{"$f":"WEEKNUM(Tabel_kalender[[#This Row],[Datum]],21)","v":34},"1900-01-04",null,"ja",{"$f":"IF(Tabel_kalender[[#This Row],[Werkdag]]=\"ja\",Tabel_kalender[[#This Row],[Datum]],IF(E242=\"ja\",A242,IF(E243=\"ja\",A243,IF(E244=\"ja\",A244,IF(E245=\"ja\",A245,IF(E246=\"ja\",A246,IF(E247=\"ja\",A247,IF(E248=\"ja\",A248,IF(E249=\"ja\",A249,IF(E250=\"ja\",A250,IF(E251=\"ja\",A251,IF(E252=\"ja\",A252,IF(E253=\"ja\",A253,IF(E254=\"ja\",A254,IF(E255=\"ja\",A255,IF(E256=\"ja\",A256,IF(E257=\"ja\",A257,IF(E258=\"ja\",A258,IF(A259=\"ja\",A259,\"Volgepland\")))))))))))))))))))","v":"2021-08-26"},null,null,null,null,0,null,null,0,0,null,null,0]
["2021-08-27",{"$f":"WEEKNUM(Tabel_kalender[[#This Row],[Datum]],21)","v":34},"1900-01-05",null,"ja",{"$f":"IF(Tabel_kalender[[#This Row],[Werkdag]]=\"ja\",Tabel_kalender[[#This Row],[Datum]],IF(E243=\"ja\",A243,IF(E244=\"ja\",A244,IF(E245=\"ja\",A245,IF(E246=\"ja\",A246,IF(E247=\"ja\",A247,IF(E248=\"ja\",A248,IF(E249=\"ja\",A249,IF(E250=\"ja\",A250,IF(E251=\"ja\",A251,IF(E252=\"ja\",A252,IF(E253=\"ja\",A253,IF(E254=\"ja\",A254,IF(E255=\"ja\",A255,IF(E256=\"ja\",A256,IF(E257=\"ja\",A257,IF(E258=\"ja\",A258,IF(E259=\"ja\",A259,IF(A260=\"ja\",A260,\"Volgepland\")))))))))))))))))))","v":"2021-08-27"},null,null,null,null,0,null,null,0,0,null,null,0]
["2021-08-28",{"$f":"WEEKNUM(Tabel_kalender[[#This Row],[Datum]],21)","v":34},"1900-01-06",null,"nee",{"$f":"IF(Tabel_kalender[[#This Row],[Werkdag]]=\"ja\",Tabel_kalender[[#This Row],[Datum]],IF(E244=\"ja\",A244,IF(E245=\"ja\",A245,IF(E246=\"ja\",A246,IF(E247=\"ja\",A247,IF(E248=\"ja\",A248,IF(E249=\"ja\",A249,IF(E250=\"ja\",A250,IF(E251=\"ja\",A251,IF(E252=\"ja\",A252,IF(E253=\"ja\",A253,IF(E254=\"ja\",A254,IF(E255=\"ja\",A255,IF(E256=\"ja\",A256,IF(E257=\"ja\",A257,IF(E258=\"ja\",A258,IF(E259=\"ja\",A259,IF(E260=\"ja\",A260,IF(A261=\"ja\",A261,\"Volgepland\")))))))))))))))))))","v":"2021-08-30"},null,null,null,null,0,null,null,0,0,null,null,0]
["2021-08-29",{"$f":"WEEKNUM(Tabel_kalender[[#This Row],[Datum]],21)","v":34},"1900-01-07",null,"nee",{"$f":"IF(Tabel_kalender[[#This Row],[Werkdag]]=\"ja\",Tabel_kalender[[#This Row],[Datum]],IF(E245=\"ja\",A245,IF(E246=\"ja\",A246,IF(E247=\"ja\",A247,IF(E248=\"ja\",A248,IF(E249=\"ja\",A249,IF(E250=\"ja\",A250,IF(E251=\"ja\",A251,IF(E252=\"ja\",A252,IF(E253=\"ja\",A253,IF(E254=\"ja\",A254,IF(E255=\"ja\",A255,IF(E256=\"ja\",A256,IF(E257=\"ja\",A257,IF(E258=\"ja\",A258,IF(E259=\"ja\",A259,IF(E260=\"ja\",A260,IF(E261=\"ja\",A261,IF(A262=\"ja\",A262,\"Volgepland\")))))))))))))))))))","v":"2021-08-30"},null,null,null,null,0,null,null,0,0,null,null,0]
["2021-08-30",{"$f":"WEEKNUM(Tabel_kalender[[#This Row],[Datum]],21)","v":35},"1900-01-01",null,"ja",{"$f":"IF(Tabel_kalender[[#This Row],[Werkdag]]=\"ja\",Tabel_kalender[[#This Row],[Datum]],IF(E246=\"ja\",A246,IF(E247=\"ja\",A247,IF(E248=\"ja\",A248,IF(E249=\"ja\",A249,IF(E250=\"ja\",A250,IF(E251=\"ja\",A251,IF(E252=\"ja\",A252,IF(E253=\"ja\",A253,IF(E254=\"ja\",A254,IF(E255=\"ja\",A255,IF(E256=\"ja\",A256,IF(E257=\"ja\",A257,IF(E258=\"ja\",A258,IF(E259=\"ja\",A259,IF(E260=\"ja\",A260,IF(E261=\"ja\",A261,IF(E262=\"ja\",A262,IF(A263=\"ja\",A263,\"Volgepland\")))))))))))))))))))","v":"2021-08-30"},null,null,null,null,0,null,null,0,0,null,null,0]
["2021-08-31",{"$f":"WEEKNUM(Tabel_kalender[[#This Row],[Datum]],21)","v":35},"1900-01-02",null,"ja",{"$f":"IF(Tabel_kalender[[#This Row],[Werkdag]]=\"ja\",Tabel_kalender[[#This Row],[Datum]],IF(E247=\"ja\",A247,IF(E248=\"ja\",A248,IF(E249=\"ja\",A249,IF(E250=\"ja\",A250,IF(E251=\"ja\",A251,IF(E252=\"ja\",A252,IF(E253=\"ja\",A253,IF(E254=\"ja\",A254,IF(E255=\"ja\",A255,IF(E256=\"ja\",A256,IF(E257=\"ja\",A257,IF(E258=\"ja\",A258,IF(E259=\"ja\",A259,IF(E260=\"ja\",A260,IF(E261=\"ja\",A261,IF(E262=\"ja\",A262,IF(E263=\"ja\",A263,IF(A264=\"ja\",A264,\"Volgepland\")))))))))))))))))))","v":"2021-08-31"},null,null,null,null,0,null,null,0,0,null,null,0]
["2021-09-01",{"$f":"WEEKNUM(Tabel_kalender[[#This Row],[Datum]],21)","v":35},"1900-01-03",null,"ja",{"$f":"IF(Tabel_kalender[[#This Row],[Werkdag]]=\"ja\",Tabel_kalender[[#This Row],[Datum]],IF(E248=\"ja\",A248,IF(E249=\"ja\",A249,IF(E250=\"ja\",A250,IF(E251=\"ja\",A251,IF(E252=\"ja\",A252,IF(E253=\"ja\",A253,IF(E254=\"ja\",A254,IF(E255=\"ja\",A255,IF(E256=\"ja\",A256,IF(E257=\"ja\",A257,IF(E258=\"ja\",A258,IF(E259=\"ja\",A259,IF(E260=\"ja\",A260,IF(E261=\"ja\",A261,IF(E262=\"ja\",A262,IF(E263=\"ja\",A263,IF(E264=\"ja\",A264,IF(A265=\"ja\",A265,\"Volgepland\")))))))))))))))))))","v":"2021-09-01"},null,null,null,null,0,null,null,0,0,null,null,0]
["2021-09-02",{"$f":"WEEKNUM(Tabel_kalender[[#This Row],[Datum]],21)","v":35},"1900-01-04",null,"ja",{"$f":"IF(Tabel_kalender[[#This Row],[Werkdag]]=\"ja\",Tabel_kalender[[#This Row],[Datum]],IF(E249=\"ja\",A249,IF(E250=\"ja\",A250,IF(E251=\"ja\",A251,IF(E252=\"ja\",A252,IF(E253=\"ja\",A253,IF(E254=\"ja\",A254,IF(E255=\"ja\",A255,IF(E256=\"ja\",A256,IF(E257=\"ja\",A257,IF(E258=\"ja\",A258,IF(E259=\"ja\",A259,IF(E260=\"ja\",A260,IF(E261=\"ja\",A261,IF(E262=\"ja\",A262,IF(E263=\"ja\",A263,IF(E264=\"ja\",A264,IF(E265=\"ja\",A265,IF(A266=\"ja\",A266,\"Volgepland\")))))))))))))))))))","v":"2021-09-02"},null,null,null,null,0,null,null,0,0,null,null,0]
["2021-09-03",{"$f":"WEEKNUM(Tabel_kalender[[#This Row],[Datum]],21)","v":35},"1900-01-05",null,"ja",{"$f":"IF(Tabel_kalender[[#This Row],[Werkdag]]=\"ja\",Tabel_kalender[[#This Row],[Datum]],IF(E250=\"ja\",A250,IF(E251=\"ja\",A251,IF(E252=\"ja\",A252,IF(E253=\"ja\",A253,IF(E254=\"ja\",A254,IF(E255=\"ja\",A255,IF(E256=\"ja\",A256,IF(E257=\"ja\",A257,IF(E258=\"ja\",A258,IF(E259=\"ja\",A259,IF(E260=\"ja\",A260,IF(E261=\"ja\",A261,IF(E262=\"ja\",A262,IF(E263=\"ja\",A263,IF(E264=\"ja\",A264,IF(E265=\"ja\",A265,IF(E266=\"ja\",A266,IF(A267=\"ja\",A267,\"Volgepland\")))))))))))))))))))","v":"2021-09-03"},null,null,null,null,0,null,null,0,0,null,null,0]
["2021-09-04",{"$f":"WEEKNUM(Tabel_kalender[[#This Row],[Datum]],21)","v":35},"1900-01-06",null,"nee",{"$f":"IF(Tabel_kalender[[#This Row],[Werkdag]]=\"ja\",Tabel_kalender[[#This Row],[Datum]],IF(E251=\"ja\",A251,IF(E252=\"ja\",A252,IF(E253=\"ja\",A253,IF(E254=\"ja\",A254,IF(E255=\"ja\",A255,IF(E256=\"ja\",A256,IF(E257=\"ja\",A257,IF(E258=\"ja\",A258,IF(E259=\"ja\",A259,IF(E260=\"ja\",A260,IF(E261=\"ja\",A261,IF(E262=\"ja\",A262,IF(E263=\"ja\",A263,IF(E264=\"ja\",A264,IF(E265=\"ja\",A265,IF(E266=\"ja\",A266,IF(E267=\"ja\",A267,IF(A268=\"ja\",A268,\"Volgepland\")))))))))))))))))))","v":"2021-09-06"},null,null,null,null,0,null,null,0,0,null,null,0]
["2021-09-05",{"$f":"WEEKNUM(Tabel_kalender[[#This Row],[Datum]],21)","v":35},"1900-01-07",null,"nee",{"$f":"IF(Tabel_kalender[[#This Row],[Werkdag]]=\"ja\",Tabel_kalender[[#This Row],[Datum]],IF(E252=\"ja\",A252,IF(E253=\"ja\",A253,IF(E254=\"ja\",A254,IF(E255=\"ja\",A255,IF(E256=\"ja\",A256,IF(E257=\"ja\",A257,IF(E258=\"ja\",A258,IF(E259=\"ja\",A259,IF(E260=\"ja\",A260,IF(E261=\"ja\",A261,IF(E262=\"ja\",A262,IF(E263=\"ja\",A263,IF(E264=\"ja\",A264,IF(E265=\"ja\",A265,IF(E266=\"ja\",A266,IF(E267=\"ja\",A267,IF(E268=\"ja\",A268,IF(A269=\"ja\",A269,\"Volgepland\")))))))))))))))))))","v":"2021-09-06"},null,null,null,null,0,null,null,0,0,null,null,0]
["2021-09-06",{"$f":"WEEKNUM(Tabel_kalender[[#This Row],[Datum]],21)","v":36},"1900-01-01",null,"ja",{"$f":"IF(Tabel_kalender[[#This Row],[Werkdag]]=\"ja\",Tabel_kalender[[#This Row],[Datum]],IF(E253=\"ja\",A253,IF(E254=\"ja\",A254,IF(E255=\"ja\",A255,IF(E256=\"ja\",A256,IF(E257=\"ja\",A257,IF(E258=\"ja\",A258,IF(E259=\"ja\",A259,IF(E260=\"ja\",A260,IF(E261=\"ja\",A261,IF(E262=\"ja\",A262,IF(E263=\"ja\",A263,IF(E264=\"ja\",A264,IF(E265=\"ja\",A265,IF(E266=\"ja\",A266,IF(E267=\"ja\",A267,IF(E268=\"ja\",A268,IF(E269=\"ja\",A269,IF(A270=\"ja\",A270,\"Volgepland\")))))))))))))))))))","v":"2021-09-06"},null,null,null,null,0,null,null,0,0,null,null,0]
["2021-09-07",{"$f":"WEEKNUM(Tabel_kalender[[#This Row],[Datum]],21)","v":36},"1900-01-02",null,"ja",{"$f":"IF(Tabel_kalender[[#This Row],[Werkdag]]=\"ja\",Tabel_kalender[[#This Row],[Datum]],IF(E254=\"ja\",A254,IF(E255=\"ja\",A255,IF(E256=\"ja\",A256,IF(E257=\"ja\",A257,IF(E258=\"ja\",A258,IF(E259=\"ja\",A259,IF(E260=\"ja\",A260,IF(E261=\"ja\",A261,IF(E262=\"ja\",A262,IF(E263=\"ja\",A263,IF(E264=\"ja\",A264,IF(E265=\"ja\",A265,IF(E266=\"ja\",A266,IF(E267=\"ja\",A267,IF(E268=\"ja\",A268,IF(E269=\"ja\",A269,IF(E270=\"ja\",A270,IF(A271=\"ja\",A271,\"Volgepland\")))))))))))))))))))","v":"2021-09-07"},null,null,null,null,0,null,null,0,0,null,null,0]
["2021-09-08",{"$f":"WEEKNUM(Tabel_kalender[[#This Row],[Datum]],21)","v":36},"1900-01-03",null,"ja",{"$f":"IF(Tabel_kalender[[#This Row],[Werkdag]]=\"ja\",Tabel_kalender[[#This Row],[Datum]],IF(E255=\"ja\",A255,IF(E256=\"ja\",A256,IF(E257=\"ja\",A257,IF(E258=\"ja\",A258,IF(E259=\"ja\",A259,IF(E260=\"ja\",A260,IF(E261=\"ja\",A261,IF(E262=\"ja\",A262,IF(E263=\"ja\",A263,IF(E264=\"ja\",A264,IF(E265=\"ja\",A265,IF(E266=\"ja\",A266,IF(E267=\"ja\",A267,IF(E268=\"ja\",A268,IF(E269=\"ja\",A269,IF(E270=\"ja\",A270,IF(E271=\"ja\",A271,IF(A272=\"ja\",A272,\"Volgepland\")))))))))))))))))))","v":"2021-09-08"},null,null,null,null,0,null,null,0,0,null,null,0]
["2021-09-09",{"$f":"WEEKNUM(Tabel_kalender[[#This Row],[Datum]],21)","v":36},"1900-01-04",null,"ja",{"$f":"IF(Tabel_kalender[[#This Row],[Werkdag]]=\"ja\",Tabel_kalender[[#This Row],[Datum]],IF(E256=\"ja\",A256,IF(E257=\"ja\",A257,IF(E258=\"ja\",A258,IF(E259=\"ja\",A259,IF(E260=\"ja\",A260,IF(E261=\"ja\",A261,IF(E262=\"ja\",A262,IF(E263=\"ja\",A263,IF(E264=\"ja\",A264,IF(E265=\"ja\",A265,IF(E266=\"ja\",A266,IF(E267=\"ja\",A267,IF(E268=\"ja\",A268,IF(E269=\"ja\",A269,IF(E270=\"ja\",A270,IF(E271=\"ja\",A271,IF(E272=\"ja\",A272,IF(A273=\"ja\",A273,\"Volgepland\")))))))))))))))))))","v":"2021-09-09"},null,null,null,null,0,null,null,0,0,null,null,0]
["2021-09-10",{"$f":"WEEKNUM(Tabel_kalender[[#This Row],[Datum]],21)","v":36},"1900-01-05",null,"ja",{"$f":"IF(Tabel_kalender[[#This Row],[Werkdag]]=\"ja\",Tabel_kalender[[#This Row],[Datum]],IF(E257=\"ja\",A257,IF(E258=\"ja\",A258,IF(E259=\"ja\",A259,IF(E260=\"ja\",A260,IF(E261=\"ja\",A261,IF(E262=\"ja\",A262,IF(E263=\"ja\",A263,IF(E264=\"ja\",A264,IF(E265=\"ja\",A265,IF(E266=\"ja\",A266,IF(E267=\"ja\",A267,IF(E268=\"ja\",A268,IF(E269=\"ja\",A269,IF(E270=\"ja\",A270,IF(E271=\"ja\",A271,IF(E272=\"ja\",A272,IF(E273=\"ja\",A273,IF(A274=\"ja\",A274,\"Volgepland\")))))))))))))))))))","v":"2021-09-10"},null,null,null,null,0,null,null,0,0,null,null,0]
["2021-09-11",{"$f":"WEEKNUM(Tabel_kalender[[#This Row],[Datum]],21)","v":36},"1900-01-06",null,"nee",{"$f":"IF(Tabel_kalender[[#This Row],[Werkdag]]=\"ja\",Tabel_kalender[[#This Row],[Datum]],IF(E258=\"ja\",A258,IF(E259=\"ja\",A259,IF(E260=\"ja\",A260,IF(E261=\"ja\",A261,IF(E262=\"ja\",A262,IF(E263=\"ja\",A263,IF(E264=\"ja\",A264,IF(E265=\"ja\",A265,IF(E266=\"ja\",A266,IF(E267=\"ja\",A267,IF(E268=\"ja\",A268,IF(E269=\"ja\",A269,IF(E270=\"ja\",A270,IF(E271=\"ja\",A271,IF(E272=\"ja\",A272,IF(E273=\"ja\",A273,IF(E274=\"ja\",A274,IF(A275=\"ja\",A275,\"Volgepland\")))))))))))))))))))","v":"2021-09-13"},null,null,null,null,0,null,null,0,0,null,null,0]
["2021-09-12",{"$f":"WEEKNUM(Tabel_kalender[[#This Row],[Datum]],21)","v":36},"1900-01-07",null,"nee",{"$f":"IF(Tabel_kalender[[#This Row],[Werkdag]]=\"ja\",Tabel_kalender[[#This Row],[Datum]],IF(E259=\"ja\",A259,IF(E260=\"ja\",A260,IF(E261=\"ja\",A261,IF(E262=\"ja\",A262,IF(E263=\"ja\",A263,IF(E264=\"ja\",A264,IF(E265=\"ja\",A265,IF(E266=\"ja\",A266,IF(E267=\"ja\",A267,IF(E268=\"ja\",A268,IF(E269=\"ja\",A269,IF(E270=\"ja\",A270,IF(E271=\"ja\",A271,IF(E272=\"ja\",A272,IF(E273=\"ja\",A273,IF(E274=\"ja\",A274,IF(E275=\"ja\",A275,IF(A276=\"ja\",A276,\"Volgepland\")))))))))))))))))))","v":"2021-09-13"},null,null,null,null,0,null,null,0,0,null,null,0]
["2021-09-13",{"$f":"WEEKNUM(Tabel_kalender[[#This Row],[Datum]],21)","v":37},"1900-01-01",null,"ja",{"$f":"IF(Tabel_kalender[[#This Row],[Werkdag]]=\"ja\",Tabel_kalender[[#This Row],[Datum]],IF(E260=\"ja\",A260,IF(E261=\"ja\",A261,IF(E262=\"ja\",A262,IF(E263=\"ja\",A263,IF(E264=\"ja\",A264,IF(E265=\"ja\",A265,IF(E266=\"ja\",A266,IF(E267=\"ja\",A267,IF(E268=\"ja\",A268,IF(E269=\"ja\",A269,IF(E270=\"ja\",A270,IF(E271=\"ja\",A271,IF(E272=\"ja\",A272,IF(E273=\"ja\",A273,IF(E274=\"ja\",A274,IF(E275=\"ja\",A275,IF(E276=\"ja\",A276,IF(A277=\"ja\",A277,\"Volgepland\")))))))))))))))))))","v":"2021-09-13"},null,null,null,null,0,null,null,0,0,null,null,0]
[{"$f":"A259+1","v":"2021-09-14"},{"$f":"WEEKNUM(Tabel_kalender[[#This Row],[Datum]],21)","v":37},"1900-01-02",null,"ja",{"$f":"IF(Tabel_kalender[[#This Row],[Werkdag]]=\"ja\",Tabel_kalender[[#This Row],[Datum]],IF(E261=\"ja\",A261,IF(E262=\"ja\",A262,IF(E263=\"ja\",A263,IF(E264=\"ja\",A264,IF(E265=\"ja\",A265,IF(E266=\"ja\",A266,IF(E267=\"ja\",A267,IF(E268=\"ja\",A268,IF(E269=\"ja\",A269,IF(E270=\"ja\",A270,IF(E271=\"ja\",A271,IF(E272=\"ja\",A272,IF(E273=\"ja\",A273,IF(E274=\"ja\",A274,IF(E275=\"ja\",A275,IF(E276=\"ja\",A276,IF(E277=\"ja\",A277,IF(A278=\"ja\",A278,\"Volgepland\")))))))))))))))))))","v":"2021-09-14"},null,null,null,null,{"$f":"L259","v":0},null,null,{"$f":"IF(L260>0,L260-K260,)-M260","v":0},{"$f":"P259","v":0},null,null,{"$f":"IF(P260>0,P260-O260,)-Q260","v":0}]
["2021-09-15",{"$f":"WEEKNUM(Tabel_kalender[[#This Row],[Datum]],21)","v":37},{"$f":"WEEKDAY(A261,2)","v":"1900-01-03"},null,"ja",{"$f":"IF(Tabel_kalender[[#This Row],[Werkdag]]=\"ja\",Tabel_kalender[[#This Row],[Datum]],IF(E262=\"ja\",A262,IF(E263=\"ja\",A263,IF(E264=\"ja\",A264,IF(E265=\"ja\",A265,IF(E266=\"ja\",A266,IF(E267=\"ja\",A267,IF(E268=\"ja\",A268,IF(E269=\"ja\",A269,IF(E270=\"ja\",A270,IF(E271=\"ja\",A271,IF(E272=\"ja\",A272,IF(E273=\"ja\",A273,IF(E274=\"ja\",A274,IF(E275=\"ja\",A275,IF(E276=\"ja\",A276,IF(E277=\"ja\",A277,IF(E278=\"ja\",A278,IF(A279=\"ja\",A279,\"Volgepland\")))))))))))))))))))","v":"2021-09-15"},null,null,null,null,0,null,null,0,0,null,null,0]
["2021-09-16",{"$f":"WEEKNUM(Tabel_kalender[[#This Row],[Datum]],21)","v":37},"1900-01-04",null,"ja",{"$f":"IF(Tabel_kalender[[#This Row],[Werkdag]]=\"ja\",Tabel_kalender[[#This Row],[Datum]],IF(E263=\"ja\",A263,IF(E264=\"ja\",A264,IF(E265=\"ja\",A265,IF(E266=\"ja\",A266,IF(E267=\"ja\",A267,IF(E268=\"ja\",A268,IF(E269=\"ja\",A269,IF(E270=\"ja\",A270,IF(E271=\"ja\",A271,IF(E272=\"ja\",A272,IF(E273=\"ja\",A273,IF(E274=\"ja\",A274,IF(E275=\"ja\",A275,IF(E276=\"ja\",A276,IF(E277=\"ja\",A277,IF(E278=\"ja\",A278,IF(E279=\"ja\",A279,IF(A280=\"ja\",A280,\"Volgepland\")))))))))))))))))))","v":"2021-09-16"},null,null,null,null,0,null,null,0,0,null,null,0]
["2021-09-17",{"$f":"WEEKNUM(Tabel_kalender[[#This Row],[Datum]],21)","v":37},"1900-01-05",null,"ja",{"$f":"IF(Tabel_kalender[[#This Row],[Werkdag]]=\"ja\",Tabel_kalender[[#This Row],[Datum]],IF(E264=\"ja\",A264,IF(E265=\"ja\",A265,IF(E266=\"ja\",A266,IF(E267=\"ja\",A267,IF(E268=\"ja\",A268,IF(E269=\"ja\",A269,IF(E270=\"ja\",A270,IF(E271=\"ja\",A271,IF(E272=\"ja\",A272,IF(E273=\"ja\",A273,IF(E274=\"ja\",A274,IF(E275=\"ja\",A275,IF(E276=\"ja\",A276,IF(E277=\"ja\",A277,IF(E278=\"ja\",A278,IF(E279=\"ja\",A279,IF(E280=\"ja\",A280,IF(A281=\"ja\",A281,\"Volgepland\")))))))))))))))))))","v":"2021-09-17"},null,null,null,null,0,null,null,0,0,null,null,0]
["2021-09-18",{"$f":"WEEKNUM(Tabel_kalender[[#This Row],[Datum]],21)","v":37},"1900-01-06",null,"nee",{"$f":"IF(Tabel_kalender[[#This Row],[Werkdag]]=\"ja\",Tabel_kalender[[#This Row],[Datum]],IF(E265=\"ja\",A265,IF(E266=\"ja\",A266,IF(E267=\"ja\",A267,IF(E268=\"ja\",A268,IF(E269=\"ja\",A269,IF(E270=\"ja\",A270,IF(E271=\"ja\",A271,IF(E272=\"ja\",A272,IF(E273=\"ja\",A273,IF(E274=\"ja\",A274,IF(E275=\"ja\",A275,IF(E276=\"ja\",A276,IF(E277=\"ja\",A277,IF(E278=\"ja\",A278,IF(E279=\"ja\",A279,IF(E280=\"ja\",A280,IF(E281=\"ja\",A281,IF(A282=\"ja\",A282,\"Volgepland\")))))))))))))))))))","v":"2021-09-20"},null,null,null,null,0,null,null,0,0,null,null,0]
["2021-09-19",{"$f":"WEEKNUM(Tabel_kalender[[#This Row],[Datum]],21)","v":37},"1900-01-07",null,"nee",{"$f":"IF(Tabel_kalender[[#This Row],[Werkdag]]=\"ja\",Tabel_kalender[[#This Row],[Datum]],IF(E266=\"ja\",A266,IF(E267=\"ja\",A267,IF(E268=\"ja\",A268,IF(E269=\"ja\",A269,IF(E270=\"ja\",A270,IF(E271=\"ja\",A271,IF(E272=\"ja\",A272,IF(E273=\"ja\",A273,IF(E274=\"ja\",A274,IF(E275=\"ja\",A275,IF(E276=\"ja\",A276,IF(E277=\"ja\",A277,IF(E278=\"ja\",A278,IF(E279=\"ja\",A279,IF(E280=\"ja\",A280,IF(E281=\"ja\",A281,IF(E282=\"ja\",A282,IF(A283=\"ja\",A283,\"Volgepland\")))))))))))))))))))","v":"2021-09-20"},null,null,null,null,0,null,null,0,0,null,null,0]
["2021-09-20",{"$f":"WEEKNUM(Tabel_kalender[[#This Row],[Datum]],21)","v":38},"1900-01-01",null,"ja",{"$f":"IF(Tabel_kalender[[#This Row],[Werkdag]]=\"ja\",Tabel_kalender[[#This Row],[Datum]],IF(E267=\"ja\",A267,IF(E268=\"ja\",A268,IF(E269=\"ja\",A269,IF(E270=\"ja\",A270,IF(E271=\"ja\",A271,IF(E272=\"ja\",A272,IF(E273=\"ja\",A273,IF(E274=\"ja\",A274,IF(E275=\"ja\",A275,IF(E276=\"ja\",A276,IF(E277=\"ja\",A277,IF(E278=\"ja\",A278,IF(E279=\"ja\",A279,IF(E280=\"ja\",A280,IF(E281=\"ja\",A281,IF(E282=\"ja\",A282,IF(E283=\"ja\",A283,IF(A284=\"ja\",A284,\"Volgepland\")))))))))))))))))))","v":"2021-09-20"},null,null,null,null,0,null,null,0,0,null,null,0]
["2021-09-21",{"$f":"WEEKNUM(Tabel_kalender[[#This Row],[Datum]],21)","v":38},"1900-01-02",null,"ja",{"$f":"IF(Tabel_kalender[[#This Row],[Werkdag]]=\"ja\",Tabel_kalender[[#This Row],[Datum]],IF(E268=\"ja\",A268,IF(E269=\"ja\",A269,IF(E270=\"ja\",A270,IF(E271=\"ja\",A271,IF(E272=\"ja\",A272,IF(E273=\"ja\",A273,IF(E274=\"ja\",A274,IF(E275=\"ja\",A275,IF(E276=\"ja\",A276,IF(E277=\"ja\",A277,IF(E278=\"ja\",A278,IF(E279=\"ja\",A279,IF(E280=\"ja\",A280,IF(E281=\"ja\",A281,IF(E282=\"ja\",A282,IF(E283=\"ja\",A283,IF(E284=\"ja\",A284,IF(A285=\"ja\",A285,\"Volgepland\")))))))))))))))))))","v":"2021-09-21"},null,null,null,null,0,null,null,0,0,null,null,0]
["2021-09-22",{"$f":"WEEKNUM(Tabel_kalender[[#This Row],[Datum]],21)","v":38},"1900-01-03",null,"ja",{"$f":"IF(Tabel_kalender[[#This Row],[Werkdag]]=\"ja\",Tabel_kalender[[#This Row],[Datum]],IF(E269=\"ja\",A269,IF(E270=\"ja\",A270,IF(E271=\"ja\",A271,IF(E272=\"ja\",A272,IF(E273=\"ja\",A273,IF(E274=\"ja\",A274,IF(E275=\"ja\",A275,IF(E276=\"ja\",A276,IF(E277=\"ja\",A277,IF(E278=\"ja\",A278,IF(E279=\"ja\",A279,IF(E280=\"ja\",A280,IF(E281=\"ja\",A281,IF(E282=\"ja\",A282,IF(E283=\"ja\",A283,IF(E284=\"ja\",A284,IF(E285=\"ja\",A285,IF(A286=\"ja\",A286,\"Volgepland\")))))))))))))))))))","v":"2021-09-22"},null,null,null,null,0,null,null,0,0,null,null,0]
["2021-09-23",{"$f":"WEEKNUM(Tabel_kalender[[#This Row],[Datum]],21)","v":38},"1900-01-04",null,"ja",{"$f":"IF(Tabel_kalender[[#This Row],[Werkdag]]=\"ja\",Tabel_kalender[[#This Row],[Datum]],IF(E270=\"ja\",A270,IF(E271=\"ja\",A271,IF(E272=\"ja\",A272,IF(E273=\"ja\",A273,IF(E274=\"ja\",A274,IF(E275=\"ja\",A275,IF(E276=\"ja\",A276,IF(E277=\"ja\",A277,IF(E278=\"ja\",A278,IF(E279=\"ja\",A279,IF(E280=\"ja\",A280,IF(E281=\"ja\",A281,IF(E282=\"ja\",A282,IF(E283=\"ja\",A283,IF(E284=\"ja\",A284,IF(E285=\"ja\",A285,IF(E286=\"ja\",A286,IF(A287=\"ja\",A287,\"Volgepland\")))))))))))))))))))","v":"2021-09-23"},null,null,null,null,0,null,null,0,0,null,null,0]
["2021-09-24",{"$f":"WEEKNUM(Tabel_kalender[[#This Row],[Datum]],21)","v":38},"1900-01-05",null,"ja",{"$f":"IF(Tabel_kalender[[#This Row],[Werkdag]]=\"ja\",Tabel_kalender[[#This Row],[Datum]],IF(E271=\"ja\",A271,IF(E272=\"ja\",A272,IF(E273=\"ja\",A273,IF(E274=\"ja\",A274,IF(E275=\"ja\",A275,IF(E276=\"ja\",A276,IF(E277=\"ja\",A277,IF(E278=\"ja\",A278,IF(E279=\"ja\",A279,IF(E280=\"ja\",A280,IF(E281=\"ja\",A281,IF(E282=\"ja\",A282,IF(E283=\"ja\",A283,IF(E284=\"ja\",A284,IF(E285=\"ja\",A285,IF(E286=\"ja\",A286,IF(E287=\"ja\",A287,IF(A288=\"ja\",A288,\"Volgepland\")))))))))))))))))))","v":"2021-09-24"},null,null,null,null,0,null,null,0,0,null,null,0]
["2021-09-25",{"$f":"WEEKNUM(Tabel_kalender[[#This Row],[Datum]],21)","v":38},"1900-01-06",null,"nee",{"$f":"IF(Tabel_kalender[[#This Row],[Werkdag]]=\"ja\",Tabel_kalender[[#This Row],[Datum]],IF(E272=\"ja\",A272,IF(E273=\"ja\",A273,IF(E274=\"ja\",A274,IF(E275=\"ja\",A275,IF(E276=\"ja\",A276,IF(E277=\"ja\",A277,IF(E278=\"ja\",A278,IF(E279=\"ja\",A279,IF(E280=\"ja\",A280,IF(E281=\"ja\",A281,IF(E282=\"ja\",A282,IF(E283=\"ja\",A283,IF(E284=\"ja\",A284,IF(E285=\"ja\",A285,IF(E286=\"ja\",A286,IF(E287=\"ja\",A287,IF(E288=\"ja\",A288,IF(A289=\"ja\",A289,\"Volgepland\")))))))))))))))))))","v":"2021-09-27"},null,null,null,null,0,null,null,0,0,null,null,0]
["2021-09-26",{"$f":"WEEKNUM(Tabel_kalender[[#This Row],[Datum]],21)","v":38},"1900-01-07",null,"nee",{"$f":"IF(Tabel_kalender[[#This Row],[Werkdag]]=\"ja\",Tabel_kalender[[#This Row],[Datum]],IF(E273=\"ja\",A273,IF(E274=\"ja\",A274,IF(E275=\"ja\",A275,IF(E276=\"ja\",A276,IF(E277=\"ja\",A277,IF(E278=\"ja\",A278,IF(E279=\"ja\",A279,IF(E280=\"ja\",A280,IF(E281=\"ja\",A281,IF(E282=\"ja\",A282,IF(E283=\"ja\",A283,IF(E284=\"ja\",A284,IF(E285=\"ja\",A285,IF(E286=\"ja\",A286,IF(E287=\"ja\",A287,IF(E288=\"ja\",A288,IF(E289=\"ja\",A289,IF(A290=\"ja\",A290,\"Volgepland\")))))))))))))))))))","v":"2021-09-27"},null,null,null,null,0,null,null,0,0,null,null,0]
["2021-09-27",{"$f":"WEEKNUM(Tabel_kalender[[#This Row],[Datum]],21)","v":39},"1900-01-01",null,"ja",{"$f":"IF(Tabel_kalender[[#This Row],[Werkdag]]=\"ja\",Tabel_kalender[[#This Row],[Datum]],IF(E274=\"ja\",A274,IF(E275=\"ja\",A275,IF(E276=\"ja\",A276,IF(E277=\"ja\",A277,IF(E278=\"ja\",A278,IF(E279=\"ja\",A279,IF(E280=\"ja\",A280,IF(E281=\"ja\",A281,IF(E282=\"ja\",A282,IF(E283=\"ja\",A283,IF(E284=\"ja\",A284,IF(E285=\"ja\",A285,IF(E286=\"ja\",A286,IF(E287=\"ja\",A287,IF(E288=\"ja\",A288,IF(E289=\"ja\",A289,IF(E290=\"ja\",A290,IF(A291=\"ja\",A291,\"Volgepland\")))))))))))))))))))","v":"2021-09-27"},null,null,null,null,0,null,null,0,0,null,null,0]
["2021-09-28",{"$f":"WEEKNUM(Tabel_kalender[[#This Row],[Datum]],21)","v":39},"1900-01-02",null,"ja",{"$f":"IF(Tabel_kalender[[#This Row],[Werkdag]]=\"ja\",Tabel_kalender[[#This Row],[Datum]],IF(E275=\"ja\",A275,IF(E276=\"ja\",A276,IF(E277=\"ja\",A277,IF(E278=\"ja\",A278,IF(E279=\"ja\",A279,IF(E280=\"ja\",A280,IF(E281=\"ja\",A281,IF(E282=\"ja\",A282,IF(E283=\"ja\",A283,IF(E284=\"ja\",A284,IF(E285=\"ja\",A285,IF(E286=\"ja\",A286,IF(E287=\"ja\",A287,IF(E288=\"ja\",A288,IF(E289=\"ja\",A289,IF(E290=\"ja\",A290,IF(E291=\"ja\",A291,IF(A292=\"ja\",A292,\"Volgepland\")))))))))))))))))))","v":"2021-09-28"},null,null,null,null,0,null,null,0,0,null,null,0]
["2021-09-29",{"$f":"WEEKNUM(Tabel_kalender[[#This Row],[Datum]],21)","v":39},"1900-01-03",null,"ja",{"$f":"IF(Tabel_kalender[[#This Row],[Werkdag]]=\"ja\",Tabel_kalender[[#This Row],[Datum]],IF(E276=\"ja\",A276,IF(E277=\"ja\",A277,IF(E278=\"ja\",A278,IF(E279=\"ja\",A279,IF(E280=\"ja\",A280,IF(E281=\"ja\",A281,IF(E282=\"ja\",A282,IF(E283=\"ja\",A283,IF(E284=\"ja\",A284,IF(E285=\"ja\",A285,IF(E286=\"ja\",A286,IF(E287=\"ja\",A287,IF(E288=\"ja\",A288,IF(E289=\"ja\",A289,IF(E290=\"ja\",A290,IF(E291=\"ja\",A291,IF(E292=\"ja\",A292,IF(A293=\"ja\",A293,\"Volgepland\")))))))))))))))))))","v":"2021-09-29"},null,null,null,null,0,null,null,0,0,null,null,0]
["2021-09-30",{"$f":"WEEKNUM(Tabel_kalender[[#This Row],[Datum]],21)","v":39},"1900-01-04",null,"ja",{"$f":"IF(Tabel_kalender[[#This Row],[Werkdag]]=\"ja\",Tabel_kalender[[#This Row],[Datum]],IF(E277=\"ja\",A277,IF(E278=\"ja\",A278,IF(E279=\"ja\",A279,IF(E280=\"ja\",A280,IF(E281=\"ja\",A281,IF(E282=\"ja\",A282,IF(E283=\"ja\",A283,IF(E284=\"ja\",A284,IF(E285=\"ja\",A285,IF(E286=\"ja\",A286,IF(E287=\"ja\",A287,IF(E288=\"ja\",A288,IF(E289=\"ja\",A289,IF(E290=\"ja\",A290,IF(E291=\"ja\",A291,IF(E292=\"ja\",A292,IF(E293=\"ja\",A293,IF(A294=\"ja\",A294,\"Volgepland\")))))))))))))))))))","v":"2021-09-30"},null,null,null,null,0,null,null,0,0,null,null,0]
["2021-10-01",{"$f":"WEEKNUM(Tabel_kalender[[#This Row],[Datum]],21)","v":39},"1900-01-05",null,"ja",{"$f":"IF(Tabel_kalender[[#This Row],[Werkdag]]=\"ja\",Tabel_kalender[[#This Row],[Datum]],IF(E278=\"ja\",A278,IF(E279=\"ja\",A279,IF(E280=\"ja\",A280,IF(E281=\"ja\",A281,IF(E282=\"ja\",A282,IF(E283=\"ja\",A283,IF(E284=\"ja\",A284,IF(E285=\"ja\",A285,IF(E286=\"ja\",A286,IF(E287=\"ja\",A287,IF(E288=\"ja\",A288,IF(E289=\"ja\",A289,IF(E290=\"ja\",A290,IF(E291=\"ja\",A291,IF(E292=\"ja\",A292,IF(E293=\"ja\",A293,IF(E294=\"ja\",A294,IF(A295=\"ja\",A295,\"Volgepland\")))))))))))))))))))","v":"2021-10-01"},null,null,null,null,0,null,null,0,0,null,null,0]
["2021-10-02",{"$f":"WEEKNUM(Tabel_kalender[[#This Row],[Datum]],21)","v":39},"1900-01-06",null,"nee",{"$f":"IF(Tabel_kalender[[#This Row],[Werkdag]]=\"ja\",Tabel_kalender[[#This Row],[Datum]],IF(E279=\"ja\",A279,IF(E280=\"ja\",A280,IF(E281=\"ja\",A281,IF(E282=\"ja\",A282,IF(E283=\"ja\",A283,IF(E284=\"ja\",A284,IF(E285=\"ja\",A285,IF(E286=\"ja\",A286,IF(E287=\"ja\",A287,IF(E288=\"ja\",A288,IF(E289=\"ja\",A289,IF(E290=\"ja\",A290,IF(E291=\"ja\",A291,IF(E292=\"ja\",A292,IF(E293=\"ja\",A293,IF(E294=\"ja\",A294,IF(E295=\"ja\",A295,IF(A296=\"ja\",A296,\"Volgepland\")))))))))))))))))))","v":"2021-10-04"},null,null,null,null,0,null,null,0,0,null,null,0]
["2021-10-03",{"$f":"WEEKNUM(Tabel_kalender[[#This Row],[Datum]],21)","v":39},"1900-01-07",null,"nee",{"$f":"IF(Tabel_kalender[[#This Row],[Werkdag]]=\"ja\",Tabel_kalender[[#This Row],[Datum]],IF(E280=\"ja\",A280,IF(E281=\"ja\",A281,IF(E282=\"ja\",A282,IF(E283=\"ja\",A283,IF(E284=\"ja\",A284,IF(E285=\"ja\",A285,IF(E286=\"ja\",A286,IF(E287=\"ja\",A287,IF(E288=\"ja\",A288,IF(E289=\"ja\",A289,IF(E290=\"ja\",A290,IF(E291=\"ja\",A291,IF(E292=\"ja\",A292,IF(E293=\"ja\",A293,IF(E294=\"ja\",A294,IF(E295=\"ja\",A295,IF(E296=\"ja\",A296,IF(A297=\"ja\",A297,\"Volgepland\")))))))))))))))))))","v":"2021-10-04"},null,null,null,null,0,null,null,0,0,null,null,0]
["2021-10-04",{"$f":"WEEKNUM(Tabel_kalender[[#This Row],[Datum]],21)","v":40},"1900-01-01",null,"ja",{"$f":"IF(Tabel_kalender[[#This Row],[Werkdag]]=\"ja\",Tabel_kalender[[#This Row],[Datum]],IF(E281=\"ja\",A281,IF(E282=\"ja\",A282,IF(E283=\"ja\",A283,IF(E284=\"ja\",A284,IF(E285=\"ja\",A285,IF(E286=\"ja\",A286,IF(E287=\"ja\",A287,IF(E288=\"ja\",A288,IF(E289=\"ja\",A289,IF(E290=\"ja\",A290,IF(E291=\"ja\",A291,IF(E292=\"ja\",A292,IF(E293=\"ja\",A293,IF(E294=\"ja\",A294,IF(E295=\"ja\",A295,IF(E296=\"ja\",A296,IF(E297=\"ja\",A297,IF(A298=\"ja\",A298,\"Volgepland\")))))))))))))))))))","v":"2021-10-04"},null,null,null,null,0,null,null,0,0,null,null,0]
["2021-10-05",{"$f":"WEEKNUM(Tabel_kalender[[#This Row],[Datum]],21)","v":40},"1900-01-02",null,"ja",{"$f":"IF(Tabel_kalender[[#This Row],[Werkdag]]=\"ja\",Tabel_kalender[[#This Row],[Datum]],IF(E282=\"ja\",A282,IF(E283=\"ja\",A283,IF(E284=\"ja\",A284,IF(E285=\"ja\",A285,IF(E286=\"ja\",A286,IF(E287=\"ja\",A287,IF(E288=\"ja\",A288,IF(E289=\"ja\",A289,IF(E290=\"ja\",A290,IF(E291=\"ja\",A291,IF(E292=\"ja\",A292,IF(E293=\"ja\",A293,IF(E294=\"ja\",A294,IF(E295=\"ja\",A295,IF(E296=\"ja\",A296,IF(E297=\"ja\",A297,IF(E298=\"ja\",A298,IF(A299=\"ja\",A299,\"Volgepland\")))))))))))))))))))","v":"2021-10-05"},null,null,null,null,0,null,null,0,0,null,null,0]
["2021-10-06",{"$f":"WEEKNUM(Tabel_kalender[[#This Row],[Datum]],21)","v":40},"1900-01-03",null,"ja",{"$f":"IF(Tabel_kalender[[#This Row],[Werkdag]]=\"ja\",Tabel_kalender[[#This Row],[Datum]],IF(E283=\"ja\",A283,IF(E284=\"ja\",A284,IF(E285=\"ja\",A285,IF(E286=\"ja\",A286,IF(E287=\"ja\",A287,IF(E288=\"ja\",A288,IF(E289=\"ja\",A289,IF(E290=\"ja\",A290,IF(E291=\"ja\",A291,IF(E292=\"ja\",A292,IF(E293=\"ja\",A293,IF(E294=\"ja\",A294,IF(E295=\"ja\",A295,IF(E296=\"ja\",A296,IF(E297=\"ja\",A297,IF(E298=\"ja\",A298,IF(E299=\"ja\",A299,IF(A300=\"ja\",A300,\"Volgepland\")))))))))))))))))))","v":"2021-10-06"},null,null,null,null,0,null,null,0,0,null,null,0]
["2021-10-07",{"$f":"WEEKNUM(Tabel_kalender[[#This Row],[Datum]],21)","v":40},"1900-01-04",null,"ja",{"$f":"IF(Tabel_kalender[[#This Row],[Werkdag]]=\"ja\",Tabel_kalender[[#This Row],[Datum]],IF(E284=\"ja\",A284,IF(E285=\"ja\",A285,IF(E286=\"ja\",A286,IF(E287=\"ja\",A287,IF(E288=\"ja\",A288,IF(E289=\"ja\",A289,IF(E290=\"ja\",A290,IF(E291=\"ja\",A291,IF(E292=\"ja\",A292,IF(E293=\"ja\",A293,IF(E294=\"ja\",A294,IF(E295=\"ja\",A295,IF(E296=\"ja\",A296,IF(E297=\"ja\",A297,IF(E298=\"ja\",A298,IF(E299=\"ja\",A299,IF(E300=\"ja\",A300,IF(A301=\"ja\",A301,\"Volgepland\")))))))))))))))))))","v":"2021-10-07"},null,null,null,null,0,null,null,0,0,null,null,0]
["2021-10-08",{"$f":"WEEKNUM(Tabel_kalender[[#This Row],[Datum]],21)","v":40},"1900-01-05",null,"ja",{"$f":"IF(Tabel_kalender[[#This Row],[Werkdag]]=\"ja\",Tabel_kalender[[#This Row],[Datum]],IF(E285=\"ja\",A285,IF(E286=\"ja\",A286,IF(E287=\"ja\",A287,IF(E288=\"ja\",A288,IF(E289=\"ja\",A289,IF(E290=\"ja\",A290,IF(E291=\"ja\",A291,IF(E292=\"ja\",A292,IF(E293=\"ja\",A293,IF(E294=\"ja\",A294,IF(E295=\"ja\",A295,IF(E296=\"ja\",A296,IF(E297=\"ja\",A297,IF(E298=\"ja\",A298,IF(E299=\"ja\",A299,IF(E300=\"ja\",A300,IF(E301=\"ja\",A301,IF(A302=\"ja\",A302,\"Volgepland\")))))))))))))))))))","v":"2021-10-08"},null,null,null,null,0,null,null,0,0,null,null,0]
["2021-10-09",{"$f":"WEEKNUM(Tabel_kalender[[#This Row],[Datum]],21)","v":40},"1900-01-06",null,"nee",{"$f":"IF(Tabel_kalender[[#This Row],[Werkdag]]=\"ja\",Tabel_kalender[[#This Row],[Datum]],IF(E286=\"ja\",A286,IF(E287=\"ja\",A287,IF(E288=\"ja\",A288,IF(E289=\"ja\",A289,IF(E290=\"ja\",A290,IF(E291=\"ja\",A291,IF(E292=\"ja\",A292,IF(E293=\"ja\",A293,IF(E294=\"ja\",A294,IF(E295=\"ja\",A295,IF(E296=\"ja\",A296,IF(E297=\"ja\",A297,IF(E298=\"ja\",A298,IF(E299=\"ja\",A299,IF(E300=\"ja\",A300,IF(E301=\"ja\",A301,IF(E302=\"ja\",A302,IF(A303=\"ja\",A303,\"Volgepland\")))))))))))))))))))","v":"2021-10-11"},null,null,null,null,0,null,null,0,0,null,null,0]
["2021-10-10",{"$f":"WEEKNUM(Tabel_kalender[[#This Row],[Datum]],21)","v":40},"1900-01-07",null,"nee",{"$f":"IF(Tabel_kalender[[#This Row],[Werkdag]]=\"ja\",Tabel_kalender[[#This Row],[Datum]],IF(E287=\"ja\",A287,IF(E288=\"ja\",A288,IF(E289=\"ja\",A289,IF(E290=\"ja\",A290,IF(E291=\"ja\",A291,IF(E292=\"ja\",A292,IF(E293=\"ja\",A293,IF(E294=\"ja\",A294,IF(E295=\"ja\",A295,IF(E296=\"ja\",A296,IF(E297=\"ja\",A297,IF(E298=\"ja\",A298,IF(E299=\"ja\",A299,IF(E300=\"ja\",A300,IF(E301=\"ja\",A301,IF(E302=\"ja\",A302,IF(E303=\"ja\",A303,IF(A304=\"ja\",A304,\"Volgepland\")))))))))))))))))))","v":"2021-10-11"},null,null,null,null,0,null,null,0,0,null,null,0]
["2021-10-11",{"$f":"WEEKNUM(Tabel_kalender[[#This Row],[Datum]],21)","v":41},"1900-01-01",null,"ja",{"$f":"IF(Tabel_kalender[[#This Row],[Werkdag]]=\"ja\",Tabel_kalender[[#This Row],[Datum]],IF(E288=\"ja\",A288,IF(E289=\"ja\",A289,IF(E290=\"ja\",A290,IF(E291=\"ja\",A291,IF(E292=\"ja\",A292,IF(E293=\"ja\",A293,IF(E294=\"ja\",A294,IF(E295=\"ja\",A295,IF(E296=\"ja\",A296,IF(E297=\"ja\",A297,IF(E298=\"ja\",A298,IF(E299=\"ja\",A299,IF(E300=\"ja\",A300,IF(E301=\"ja\",A301,IF(E302=\"ja\",A302,IF(E303=\"ja\",A303,IF(E304=\"ja\",A304,IF(A305=\"ja\",A305,\"Volgepland\")))))))))))))))))))","v":"2021-10-11"},null,null,null,null,0,null,null,0,0,null,null,0]
["2021-10-12",{"$f":"WEEKNUM(Tabel_kalender[[#This Row],[Datum]],21)","v":41},"1900-01-02",null,"ja",{"$f":"IF(Tabel_kalender[[#This Row],[Werkdag]]=\"ja\",Tabel_kalender[[#This Row],[Datum]],IF(E289=\"ja\",A289,IF(E290=\"ja\",A290,IF(E291=\"ja\",A291,IF(E292=\"ja\",A292,IF(E293=\"ja\",A293,IF(E294=\"ja\",A294,IF(E295=\"ja\",A295,IF(E296=\"ja\",A296,IF(E297=\"ja\",A297,IF(E298=\"ja\",A298,IF(E299=\"ja\",A299,IF(E300=\"ja\",A300,IF(E301=\"ja\",A301,IF(E302=\"ja\",A302,IF(E303=\"ja\",A303,IF(E304=\"ja\",A304,IF(E305=\"ja\",A305,IF(A306=\"ja\",A306,\"Volgepland\")))))))))))))))))))","v":"2021-10-12"},null,null,null,null,0,null,null,0,0,null,null,0]
["2021-10-13",{"$f":"WEEKNUM(Tabel_kalender[[#This Row],[Datum]],21)","v":41},"1900-01-03",null,"ja",{"$f":"IF(Tabel_kalender[[#This Row],[Werkdag]]=\"ja\",Tabel_kalender[[#This Row],[Datum]],IF(E290=\"ja\",A290,IF(E291=\"ja\",A291,IF(E292=\"ja\",A292,IF(E293=\"ja\",A293,IF(E294=\"ja\",A294,IF(E295=\"ja\",A295,IF(E296=\"ja\",A296,IF(E297=\"ja\",A297,IF(E298=\"ja\",A298,IF(E299=\"ja\",A299,IF(E300=\"ja\",A300,IF(E301=\"ja\",A301,IF(E302=\"ja\",A302,IF(E303=\"ja\",A303,IF(E304=\"ja\",A304,IF(E305=\"ja\",A305,IF(E306=\"ja\",A306,IF(A307=\"ja\",A307,\"Volgepland\")))))))))))))))))))","v":"2021-10-13"},null,null,null,null,0,null,null,0,0,null,null,0]
["2021-10-14",{"$f":"WEEKNUM(Tabel_kalender[[#This Row],[Datum]],21)","v":41},"1900-01-04",null,"ja",{"$f":"IF(Tabel_kalender[[#This Row],[Werkdag]]=\"ja\",Tabel_kalender[[#This Row],[Datum]],IF(E291=\"ja\",A291,IF(E292=\"ja\",A292,IF(E293=\"ja\",A293,IF(E294=\"ja\",A294,IF(E295=\"ja\",A295,IF(E296=\"ja\",A296,IF(E297=\"ja\",A297,IF(E298=\"ja\",A298,IF(E299=\"ja\",A299,IF(E300=\"ja\",A300,IF(E301=\"ja\",A301,IF(E302=\"ja\",A302,IF(E303=\"ja\",A303,IF(E304=\"ja\",A304,IF(E305=\"ja\",A305,IF(E306=\"ja\",A306,IF(E307=\"ja\",A307,IF(A308=\"ja\",A308,\"Volgepland\")))))))))))))))))))","v":"2021-10-14"},null,null,null,null,0,null,null,0,0,null,null,0]
["2021-10-15",{"$f":"WEEKNUM(Tabel_kalender[[#This Row],[Datum]],21)","v":41},"1900-01-05",null,"ja",{"$f":"IF(Tabel_kalender[[#This Row],[Werkdag]]=\"ja\",Tabel_kalender[[#This Row],[Datum]],IF(E292=\"ja\",A292,IF(E293=\"ja\",A293,IF(E294=\"ja\",A294,IF(E295=\"ja\",A295,IF(E296=\"ja\",A296,IF(E297=\"ja\",A297,IF(E298=\"ja\",A298,IF(E299=\"ja\",A299,IF(E300=\"ja\",A300,IF(E301=\"ja\",A301,IF(E302=\"ja\",A302,IF(E303=\"ja\",A303,IF(E304=\"ja\",A304,IF(E305=\"ja\",A305,IF(E306=\"ja\",A306,IF(E307=\"ja\",A307,IF(E308=\"ja\",A308,IF(A309=\"ja\",A309,\"Volgepland\")))))))))))))))))))","v":"2021-10-15"},null,null,null,null,0,null,null,0,0,null,null,0]
["2021-10-16",{"$f":"WEEKNUM(Tabel_kalender[[#This Row],[Datum]],21)","v":41},"1900-01-06",null,"nee",{"$f":"IF(Tabel_kalender[[#This Row],[Werkdag]]=\"ja\",Tabel_kalender[[#This Row],[Datum]],IF(E293=\"ja\",A293,IF(E294=\"ja\",A294,IF(E295=\"ja\",A295,IF(E296=\"ja\",A296,IF(E297=\"ja\",A297,IF(E298=\"ja\",A298,IF(E299=\"ja\",A299,IF(E300=\"ja\",A300,IF(E301=\"ja\",A301,IF(E302=\"ja\",A302,IF(E303=\"ja\",A303,IF(E304=\"ja\",A304,IF(E305=\"ja\",A305,IF(E306=\"ja\",A306,IF(E307=\"ja\",A307,IF(E308=\"ja\",A308,IF(E309=\"ja\",A309,IF(A310=\"ja\",A310,\"Volgepland\")))))))))))))))))))","v":"2021-10-18"},null,null,null,null,0,null,null,0,0,null,null,0]
["2021-10-17",{"$f":"WEEKNUM(Tabel_kalender[[#This Row],[Datum]],21)","v":41},"1900-01-07",null,"nee",{"$f":"IF(Tabel_kalender[[#This Row],[Werkdag]]=\"ja\",Tabel_kalender[[#This Row],[Datum]],IF(E294=\"ja\",A294,IF(E295=\"ja\",A295,IF(E296=\"ja\",A296,IF(E297=\"ja\",A297,IF(E298=\"ja\",A298,IF(E299=\"ja\",A299,IF(E300=\"ja\",A300,IF(E301=\"ja\",A301,IF(E302=\"ja\",A302,IF(E303=\"ja\",A303,IF(E304=\"ja\",A304,IF(E305=\"ja\",A305,IF(E306=\"ja\",A306,IF(E307=\"ja\",A307,IF(E308=\"ja\",A308,IF(E309=\"ja\",A309,IF(E310=\"ja\",A310,IF(A311=\"ja\",A311,\"Volgepland\")))))))))))))))))))","v":"2021-10-18"},null,null,null,null,0,null,null,0,0,null,null,0]
["2021-10-18",{"$f":"WEEKNUM(Tabel_kalender[[#This Row],[Datum]],21)","v":42},"1900-01-01",null,"ja",{"$f":"IF(Tabel_kalender[[#This Row],[Werkdag]]=\"ja\",Tabel_kalender[[#This Row],[Datum]],IF(E295=\"ja\",A295,IF(E296=\"ja\",A296,IF(E297=\"ja\",A297,IF(E298=\"ja\",A298,IF(E299=\"ja\",A299,IF(E300=\"ja\",A300,IF(E301=\"ja\",A301,IF(E302=\"ja\",A302,IF(E303=\"ja\",A303,IF(E304=\"ja\",A304,IF(E305=\"ja\",A305,IF(E306=\"ja\",A306,IF(E307=\"ja\",A307,IF(E308=\"ja\",A308,IF(E309=\"ja\",A309,IF(E310=\"ja\",A310,IF(E311=\"ja\",A311,IF(A312=\"ja\",A312,\"Volgepland\")))))))))))))))))))","v":"2021-10-18"},null,null,null,null,0,null,null,0,0,null,null,0]
["2021-10-19",{"$f":"WEEKNUM(Tabel_kalender[[#This Row],[Datum]],21)","v":42},"1900-01-02",null,"ja",{"$f":"IF(Tabel_kalender[[#This Row],[Werkdag]]=\"ja\",Tabel_kalender[[#This Row],[Datum]],IF(E296=\"ja\",A296,IF(E297=\"ja\",A297,IF(E298=\"ja\",A298,IF(E299=\"ja\",A299,IF(E300=\"ja\",A300,IF(E301=\"ja\",A301,IF(E302=\"ja\",A302,IF(E303=\"ja\",A303,IF(E304=\"ja\",A304,IF(E305=\"ja\",A305,IF(E306=\"ja\",A306,IF(E307=\"ja\",A307,IF(E308=\"ja\",A308,IF(E309=\"ja\",A309,IF(E310=\"ja\",A310,IF(E311=\"ja\",A311,IF(E312=\"ja\",A312,IF(A313=\"ja\",A313,\"Volgepland\")))))))))))))))))))","v":"2021-10-19"},null,null,null,null,0,null,null,0,0,null,null,0]
["2021-10-20",{"$f":"WEEKNUM(Tabel_kalender[[#This Row],[Datum]],21)","v":42},"1900-01-03",null,"ja",{"$f":"IF(Tabel_kalender[[#This Row],[Werkdag]]=\"ja\",Tabel_kalender[[#This Row],[Datum]],IF(E297=\"ja\",A297,IF(E298=\"ja\",A298,IF(E299=\"ja\",A299,IF(E300=\"ja\",A300,IF(E301=\"ja\",A301,IF(E302=\"ja\",A302,IF(E303=\"ja\",A303,IF(E304=\"ja\",A304,IF(E305=\"ja\",A305,IF(E306=\"ja\",A306,IF(E307=\"ja\",A307,IF(E308=\"ja\",A308,IF(E309=\"ja\",A309,IF(E310=\"ja\",A310,IF(E311=\"ja\",A311,IF(E312=\"ja\",A312,IF(E313=\"ja\",A313,IF(A314=\"ja\",A314,\"Volgepland\")))))))))))))))))))","v":"2021-10-20"},null,null,null,null,0,null,null,0,0,null,null,0]
["2021-10-21",{"$f":"WEEKNUM(Tabel_kalender[[#This Row],[Datum]],21)","v":42},"1900-01-04",null,"ja",{"$f":"IF(Tabel_kalender[[#This Row],[Werkdag]]=\"ja\",Tabel_kalender[[#This Row],[Datum]],IF(E298=\"ja\",A298,IF(E299=\"ja\",A299,IF(E300=\"ja\",A300,IF(E301=\"ja\",A301,IF(E302=\"ja\",A302,IF(E303=\"ja\",A303,IF(E304=\"ja\",A304,IF(E305=\"ja\",A305,IF(E306=\"ja\",A306,IF(E307=\"ja\",A307,IF(E308=\"ja\",A308,IF(E309=\"ja\",A309,IF(E310=\"ja\",A310,IF(E311=\"ja\",A311,IF(E312=\"ja\",A312,IF(E313=\"ja\",A313,IF(E314=\"ja\",A314,IF(A315=\"ja\",A315,\"Volgepland\")))))))))))))))))))","v":"2021-10-21"},null,null,null,null,0,null,null,0,0,null,null,0]
["2021-10-22",{"$f":"WEEKNUM(Tabel_kalender[[#This Row],[Datum]],21)","v":42},"1900-01-05",null,"ja",{"$f":"IF(Tabel_kalender[[#This Row],[Werkdag]]=\"ja\",Tabel_kalender[[#This Row],[Datum]],IF(E299=\"ja\",A299,IF(E300=\"ja\",A300,IF(E301=\"ja\",A301,IF(E302=\"ja\",A302,IF(E303=\"ja\",A303,IF(E304=\"ja\",A304,IF(E305=\"ja\",A305,IF(E306=\"ja\",A306,IF(E307=\"ja\",A307,IF(E308=\"ja\",A308,IF(E309=\"ja\",A309,IF(E310=\"ja\",A310,IF(E311=\"ja\",A311,IF(E312=\"ja\",A312,IF(E313=\"ja\",A313,IF(E314=\"ja\",A314,IF(E315=\"ja\",A315,IF(A316=\"ja\",A316,\"Volgepland\")))))))))))))))))))","v":"2021-10-22"},null,null,null,null,0,null,null,0,0,null,null,0]
["2021-10-23",{"$f":"WEEKNUM(Tabel_kalender[[#This Row],[Datum]],21)","v":42},"1900-01-06",null,"nee",{"$f":"IF(Tabel_kalender[[#This Row],[Werkdag]]=\"ja\",Tabel_kalender[[#This Row],[Datum]],IF(E300=\"ja\",A300,IF(E301=\"ja\",A301,IF(E302=\"ja\",A302,IF(E303=\"ja\",A303,IF(E304=\"ja\",A304,IF(E305=\"ja\",A305,IF(E306=\"ja\",A306,IF(E307=\"ja\",A307,IF(E308=\"ja\",A308,IF(E309=\"ja\",A309,IF(E310=\"ja\",A310,IF(E311=\"ja\",A311,IF(E312=\"ja\",A312,IF(E313=\"ja\",A313,IF(E314=\"ja\",A314,IF(E315=\"ja\",A315,IF(E316=\"ja\",A316,IF(A317=\"ja\",A317,\"Volgepland\")))))))))))))))))))","v":"2021-10-25"},null,null,null,null,0,null,null,0,0,null,null,0]
["2021-10-24",{"$f":"WEEKNUM(Tabel_kalender[[#This Row],[Datum]],21)","v":42},"1900-01-07",null,"nee",{"$f":"IF(Tabel_kalender[[#This Row],[Werkdag]]=\"ja\",Tabel_kalender[[#This Row],[Datum]],IF(E301=\"ja\",A301,IF(E302=\"ja\",A302,IF(E303=\"ja\",A303,IF(E304=\"ja\",A304,IF(E305=\"ja\",A305,IF(E306=\"ja\",A306,IF(E307=\"ja\",A307,IF(E308=\"ja\",A308,IF(E309=\"ja\",A309,IF(E310=\"ja\",A310,IF(E311=\"ja\",A311,IF(E312=\"ja\",A312,IF(E313=\"ja\",A313,IF(E314=\"ja\",A314,IF(E315=\"ja\",A315,IF(E316=\"ja\",A316,IF(E317=\"ja\",A317,IF(A318=\"ja\",A318,\"Volgepland\")))))))))))))))))))","v":"2021-10-25"},null,null,null,null,0,null,null,0,0,null,null,0]
["2021-10-25",{"$f":"WEEKNUM(Tabel_kalender[[#This Row],[Datum]],21)","v":43},"1900-01-01",null,"ja",{"$f":"IF(Tabel_kalender[[#This Row],[Werkdag]]=\"ja\",Tabel_kalender[[#This Row],[Datum]],IF(E302=\"ja\",A302,IF(E303=\"ja\",A303,IF(E304=\"ja\",A304,IF(E305=\"ja\",A305,IF(E306=\"ja\",A306,IF(E307=\"ja\",A307,IF(E308=\"ja\",A308,IF(E309=\"ja\",A309,IF(E310=\"ja\",A310,IF(E311=\"ja\",A311,IF(E312=\"ja\",A312,IF(E313=\"ja\",A313,IF(E314=\"ja\",A314,IF(E315=\"ja\",A315,IF(E316=\"ja\",A316,IF(E317=\"ja\",A317,IF(E318=\"ja\",A318,IF(A319=\"ja\",A319,\"Volgepland\")))))))))))))))))))","v":"2021-10-25"},null,null,null,null,0,null,null,0,0,null,null,0]
["2021-10-26",{"$f":"WEEKNUM(Tabel_kalender[[#This Row],[Datum]],21)","v":43},"1900-01-02",null,"ja",{"$f":"IF(Tabel_kalender[[#This Row],[Werkdag]]=\"ja\",Tabel_kalender[[#This Row],[Datum]],IF(E303=\"ja\",A303,IF(E304=\"ja\",A304,IF(E305=\"ja\",A305,IF(E306=\"ja\",A306,IF(E307=\"ja\",A307,IF(E308=\"ja\",A308,IF(E309=\"ja\",A309,IF(E310=\"ja\",A310,IF(E311=\"ja\",A311,IF(E312=\"ja\",A312,IF(E313=\"ja\",A313,IF(E314=\"ja\",A314,IF(E315=\"ja\",A315,IF(E316=\"ja\",A316,IF(E317=\"ja\",A317,IF(E318=\"ja\",A318,IF(E319=\"ja\",A319,IF(A320=\"ja\",A320,\"Volgepland\")))))))))))))))))))","v":"2021-10-26"},null,null,null,null,0,null,null,0,0,null,null,0]
["2021-10-27",{"$f":"WEEKNUM(Tabel_kalender[[#This Row],[Datum]],21)","v":43},"1900-01-03",null,"ja",{"$f":"IF(Tabel_kalender[[#This Row],[Werkdag]]=\"ja\",Tabel_kalender[[#This Row],[Datum]],IF(E304=\"ja\",A304,IF(E305=\"ja\",A305,IF(E306=\"ja\",A306,IF(E307=\"ja\",A307,IF(E308=\"ja\",A308,IF(E309=\"ja\",A309,IF(E310=\"ja\",A310,IF(E311=\"ja\",A311,IF(E312=\"ja\",A312,IF(E313=\"ja\",A313,IF(E314=\"ja\",A314,IF(E315=\"ja\",A315,IF(E316=\"ja\",A316,IF(E317=\"ja\",A317,IF(E318=\"ja\",A318,IF(E319=\"ja\",A319,IF(E320=\"ja\",A320,IF(A321=\"ja\",A321,\"Volgepland\")))))))))))))))))))","v":"2021-10-27"},null,null,null,null,0,null,null,0,0,null,null,0]
["2021-10-28",{"$f":"WEEKNUM(Tabel_kalender[[#This Row],[Datum]],21)","v":43},"1900-01-04",null,"ja",{"$f":"IF(Tabel_kalender[[#This Row],[Werkdag]]=\"ja\",Tabel_kalender[[#This Row],[Datum]],IF(E305=\"ja\",A305,IF(E306=\"ja\",A306,IF(E307=\"ja\",A307,IF(E308=\"ja\",A308,IF(E309=\"ja\",A309,IF(E310=\"ja\",A310,IF(E311=\"ja\",A311,IF(E312=\"ja\",A312,IF(E313=\"ja\",A313,IF(E314=\"ja\",A314,IF(E315=\"ja\",A315,IF(E316=\"ja\",A316,IF(E317=\"ja\",A317,IF(E318=\"ja\",A318,IF(E319=\"ja\",A319,IF(E320=\"ja\",A320,IF(E321=\"ja\",A321,IF(A322=\"ja\",A322,\"Volgepland\")))))))))))))))))))","v":"2021-10-28"},null,null,null,null,0,null,null,0,0,null,null,0]
["2021-10-29",{"$f":"WEEKNUM(Tabel_kalender[[#This Row],[Datum]],21)","v":43},"1900-01-05",null,"ja",{"$f":"IF(Tabel_kalender[[#This Row],[Werkdag]]=\"ja\",Tabel_kalender[[#This Row],[Datum]],IF(E306=\"ja\",A306,IF(E307=\"ja\",A307,IF(E308=\"ja\",A308,IF(E309=\"ja\",A309,IF(E310=\"ja\",A310,IF(E311=\"ja\",A311,IF(E312=\"ja\",A312,IF(E313=\"ja\",A313,IF(E314=\"ja\",A314,IF(E315=\"ja\",A315,IF(E316=\"ja\",A316,IF(E317=\"ja\",A317,IF(E318=\"ja\",A318,IF(E319=\"ja\",A319,IF(E320=\"ja\",A320,IF(E321=\"ja\",A321,IF(E322=\"ja\",A322,IF(A323=\"ja\",A323,\"Volgepland\")))))))))))))))))))","v":"2021-10-29"},null,null,null,null,0,null,null,0,0,null,null,0]
["2021-10-30",{"$f":"WEEKNUM(Tabel_kalender[[#This Row],[Datum]],21)","v":43},"1900-01-06",null,"nee",{"$f":"IF(Tabel_kalender[[#This Row],[Werkdag]]=\"ja\",Tabel_kalender[[#This Row],[Datum]],IF(E307=\"ja\",A307,IF(E308=\"ja\",A308,IF(E309=\"ja\",A309,IF(E310=\"ja\",A310,IF(E311=\"ja\",A311,IF(E312=\"ja\",A312,IF(E313=\"ja\",A313,IF(E314=\"ja\",A314,IF(E315=\"ja\",A315,IF(E316=\"ja\",A316,IF(E317=\"ja\",A317,IF(E318=\"ja\",A318,IF(E319=\"ja\",A319,IF(E320=\"ja\",A320,IF(E321=\"ja\",A321,IF(E322=\"ja\",A322,IF(E323=\"ja\",A323,IF(A324=\"ja\",A324,\"Volgepland\")))))))))))))))))))","v":"2021-11-01"},null,null,null,null,0,null,null,0,0,null,null,0]
["2021-10-31",{"$f":"WEEKNUM(Tabel_kalender[[#This Row],[Datum]],21)","v":43},"1900-01-07",null,"nee",{"$f":"IF(Tabel_kalender[[#This Row],[Werkdag]]=\"ja\",Tabel_kalender[[#This Row],[Datum]],IF(E308=\"ja\",A308,IF(E309=\"ja\",A309,IF(E310=\"ja\",A310,IF(E311=\"ja\",A311,IF(E312=\"ja\",A312,IF(E313=\"ja\",A313,IF(E314=\"ja\",A314,IF(E315=\"ja\",A315,IF(E316=\"ja\",A316,IF(E317=\"ja\",A317,IF(E318=\"ja\",A318,IF(E319=\"ja\",A319,IF(E320=\"ja\",A320,IF(E321=\"ja\",A321,IF(E322=\"ja\",A322,IF(E323=\"ja\",A323,IF(E324=\"ja\",A324,IF(A325=\"ja\",A325,\"Volgepland\")))))))))))))))))))","v":"2021-11-01"},null,null,null,null,0,null,null,0,0,null,null,0]
["2021-11-01",{"$f":"WEEKNUM(Tabel_kalender[[#This Row],[Datum]],21)","v":44},"1900-01-01",null,"ja",{"$f":"IF(Tabel_kalender[[#This Row],[Werkdag]]=\"ja\",Tabel_kalender[[#This Row],[Datum]],IF(E309=\"ja\",A309,IF(E310=\"ja\",A310,IF(E311=\"ja\",A311,IF(E312=\"ja\",A312,IF(E313=\"ja\",A313,IF(E314=\"ja\",A314,IF(E315=\"ja\",A315,IF(E316=\"ja\",A316,IF(E317=\"ja\",A317,IF(E318=\"ja\",A318,IF(E319=\"ja\",A319,IF(E320=\"ja\",A320,IF(E321=\"ja\",A321,IF(E322=\"ja\",A322,IF(E323=\"ja\",A323,IF(E324=\"ja\",A324,IF(E325=\"ja\",A325,IF(A326=\"ja\",A326,\"Volgepland\")))))))))))))))))))","v":"2021-11-01"},null,null,null,null,0,null,null,0,0,null,null,0]
["2021-11-02",{"$f":"WEEKNUM(Tabel_kalender[[#This Row],[Datum]],21)","v":44},"1900-01-02",null,"ja",{"$f":"IF(Tabel_kalender[[#This Row],[Werkdag]]=\"ja\",Tabel_kalender[[#This Row],[Datum]],IF(E310=\"ja\",A310,IF(E311=\"ja\",A311,IF(E312=\"ja\",A312,IF(E313=\"ja\",A313,IF(E314=\"ja\",A314,IF(E315=\"ja\",A315,IF(E316=\"ja\",A316,IF(E317=\"ja\",A317,IF(E318=\"ja\",A318,IF(E319=\"ja\",A319,IF(E320=\"ja\",A320,IF(E321=\"ja\",A321,IF(E322=\"ja\",A322,IF(E323=\"ja\",A323,IF(E324=\"ja\",A324,IF(E325=\"ja\",A325,IF(E326=\"ja\",A326,IF(A327=\"ja\",A327,\"Volgepland\")))))))))))))))))))","v":"2021-11-02"},null,null,null,null,0,null,null,0,0,null,null,0]
["2021-11-03",{"$f":"WEEKNUM(Tabel_kalender[[#This Row],[Datum]],21)","v":44},"1900-01-03",null,"ja",{"$f":"IF(Tabel_kalender[[#This Row],[Werkdag]]=\"ja\",Tabel_kalender[[#This Row],[Datum]],IF(E311=\"ja\",A311,IF(E312=\"ja\",A312,IF(E313=\"ja\",A313,IF(E314=\"ja\",A314,IF(E315=\"ja\",A315,IF(E316=\"ja\",A316,IF(E317=\"ja\",A317,IF(E318=\"ja\",A318,IF(E319=\"ja\",A319,IF(E320=\"ja\",A320,IF(E321=\"ja\",A321,IF(E322=\"ja\",A322,IF(E323=\"ja\",A323,IF(E324=\"ja\",A324,IF(E325=\"ja\",A325,IF(E326=\"ja\",A326,IF(E327=\"ja\",A327,IF(A328=\"ja\",A328,\"Volgepland\")))))))))))))))))))","v":"2021-11-03"},null,null,null,null,0,null,null,0,0,null,null,0]
["2021-11-04",{"$f":"WEEKNUM(Tabel_kalender[[#This Row],[Datum]],21)","v":44},"1900-01-04",null,"ja",{"$f":"IF(Tabel_kalender[[#This Row],[Werkdag]]=\"ja\",Tabel_kalender[[#This Row],[Datum]],IF(E312=\"ja\",A312,IF(E313=\"ja\",A313,IF(E314=\"ja\",A314,IF(E315=\"ja\",A315,IF(E316=\"ja\",A316,IF(E317=\"ja\",A317,IF(E318=\"ja\",A318,IF(E319=\"ja\",A319,IF(E320=\"ja\",A320,IF(E321=\"ja\",A321,IF(E322=\"ja\",A322,IF(E323=\"ja\",A323,IF(E324=\"ja\",A324,IF(E325=\"ja\",A325,IF(E326=\"ja\",A326,IF(E327=\"ja\",A327,IF(E328=\"ja\",A328,IF(A329=\"ja\",A329,\"Volgepland\")))))))))))))))))))","v":"2021-11-04"},null,null,null,null,0,null,null,0,0,null,null,0]
["2021-11-05",{"$f":"WEEKNUM(Tabel_kalender[[#This Row],[Datum]],21)","v":44},"1900-01-05",null,"ja",{"$f":"IF(Tabel_kalender[[#This Row],[Werkdag]]=\"ja\",Tabel_kalender[[#This Row],[Datum]],IF(E313=\"ja\",A313,IF(E314=\"ja\",A314,IF(E315=\"ja\",A315,IF(E316=\"ja\",A316,IF(E317=\"ja\",A317,IF(E318=\"ja\",A318,IF(E319=\"ja\",A319,IF(E320=\"ja\",A320,IF(E321=\"ja\",A321,IF(E322=\"ja\",A322,IF(E323=\"ja\",A323,IF(E324=\"ja\",A324,IF(E325=\"ja\",A325,IF(E326=\"ja\",A326,IF(E327=\"ja\",A327,IF(E328=\"ja\",A328,IF(E329=\"ja\",A329,IF(A330=\"ja\",A330,\"Volgepland\")))))))))))))))))))","v":"2021-11-05"},null,null,null,null,0,null,null,0,0,null,null,0]
["2021-11-06",{"$f":"WEEKNUM(Tabel_kalender[[#This Row],[Datum]],21)","v":44},"1900-01-06",null,"nee",{"$f":"IF(Tabel_kalender[[#This Row],[Werkdag]]=\"ja\",Tabel_kalender[[#This Row],[Datum]],IF(E314=\"ja\",A314,IF(E315=\"ja\",A315,IF(E316=\"ja\",A316,IF(E317=\"ja\",A317,IF(E318=\"ja\",A318,IF(E319=\"ja\",A319,IF(E320=\"ja\",A320,IF(E321=\"ja\",A321,IF(E322=\"ja\",A322,IF(E323=\"ja\",A323,IF(E324=\"ja\",A324,IF(E325=\"ja\",A325,IF(E326=\"ja\",A326,IF(E327=\"ja\",A327,IF(E328=\"ja\",A328,IF(E329=\"ja\",A329,IF(E330=\"ja\",A330,IF(A331=\"ja\",A331,\"Volgepland\")))))))))))))))))))","v":"2021-11-08"},null,null,null,null,0,null,null,0,0,null,null,0]
["2021-11-07",{"$f":"WEEKNUM(Tabel_kalender[[#This Row],[Datum]],21)","v":44},"1900-01-07",null,"nee",{"$f":"IF(Tabel_kalender[[#This Row],[Werkdag]]=\"ja\",Tabel_kalender[[#This Row],[Datum]],IF(E315=\"ja\",A315,IF(E316=\"ja\",A316,IF(E317=\"ja\",A317,IF(E318=\"ja\",A318,IF(E319=\"ja\",A319,IF(E320=\"ja\",A320,IF(E321=\"ja\",A321,IF(E322=\"ja\",A322,IF(E323=\"ja\",A323,IF(E324=\"ja\",A324,IF(E325=\"ja\",A325,IF(E326=\"ja\",A326,IF(E327=\"ja\",A327,IF(E328=\"ja\",A328,IF(E329=\"ja\",A329,IF(E330=\"ja\",A330,IF(E331=\"ja\",A331,IF(A332=\"ja\",A332,\"Volgepland\")))))))))))))))))))","v":"2021-11-08"},null,null,null,null,0,null,null,0,0,null,null,0]
["2021-11-08",{"$f":"WEEKNUM(Tabel_kalender[[#This Row],[Datum]],21)","v":45},"1900-01-01",null,"ja",{"$f":"IF(Tabel_kalender[[#This Row],[Werkdag]]=\"ja\",Tabel_kalender[[#This Row],[Datum]],IF(E316=\"ja\",A316,IF(E317=\"ja\",A317,IF(E318=\"ja\",A318,IF(E319=\"ja\",A319,IF(E320=\"ja\",A320,IF(E321=\"ja\",A321,IF(E322=\"ja\",A322,IF(E323=\"ja\",A323,IF(E324=\"ja\",A324,IF(E325=\"ja\",A325,IF(E326=\"ja\",A326,IF(E327=\"ja\",A327,IF(E328=\"ja\",A328,IF(E329=\"ja\",A329,IF(E330=\"ja\",A330,IF(E331=\"ja\",A331,IF(E332=\"ja\",A332,IF(A333=\"ja\",A333,\"Volgepland\")))))))))))))))))))","v":"2021-11-08"},null,null,null,null,0,null,null,0,0,null,null,0]
["2021-11-09",{"$f":"WEEKNUM(Tabel_kalender[[#This Row],[Datum]],21)","v":45},"1900-01-02",null,"ja",{"$f":"IF(Tabel_kalender[[#This Row],[Werkdag]]=\"ja\",Tabel_kalender[[#This Row],[Datum]],IF(E317=\"ja\",A317,IF(E318=\"ja\",A318,IF(E319=\"ja\",A319,IF(E320=\"ja\",A320,IF(E321=\"ja\",A321,IF(E322=\"ja\",A322,IF(E323=\"ja\",A323,IF(E324=\"ja\",A324,IF(E325=\"ja\",A325,IF(E326=\"ja\",A326,IF(E327=\"ja\",A327,IF(E328=\"ja\",A328,IF(E329=\"ja\",A329,IF(E330=\"ja\",A330,IF(E331=\"ja\",A331,IF(E332=\"ja\",A332,IF(E333=\"ja\",A333,IF(A334=\"ja\",A334,\"Volgepland\")))))))))))))))))))","v":"2021-11-09"},null,null,null,null,0,null,null,0,0,null,null,0]
["2021-11-10",{"$f":"WEEKNUM(Tabel_kalender[[#This Row],[Datum]],21)","v":45},"1900-01-03",null,"ja",{"$f":"IF(Tabel_kalender[[#This Row],[Werkdag]]=\"ja\",Tabel_kalender[[#This Row],[Datum]],IF(E318=\"ja\",A318,IF(E319=\"ja\",A319,IF(E320=\"ja\",A320,IF(E321=\"ja\",A321,IF(E322=\"ja\",A322,IF(E323=\"ja\",A323,IF(E324=\"ja\",A324,IF(E325=\"ja\",A325,IF(E326=\"ja\",A326,IF(E327=\"ja\",A327,IF(E328=\"ja\",A328,IF(E329=\"ja\",A329,IF(E330=\"ja\",A330,IF(E331=\"ja\",A331,IF(E332=\"ja\",A332,IF(E333=\"ja\",A333,IF(E334=\"ja\",A334,IF(A335=\"ja\",A335,\"Volgepland\")))))))))))))))))))","v":"2021-11-10"},null,null,null,null,0,null,null,0,0,null,null,0]
["2021-11-11",{"$f":"WEEKNUM(Tabel_kalender[[#This Row],[Datum]],21)","v":45},"1900-01-04",null,"ja",{"$f":"IF(Tabel_kalender[[#This Row],[Werkdag]]=\"ja\",Tabel_kalender[[#This Row],[Datum]],IF(E319=\"ja\",A319,IF(E320=\"ja\",A320,IF(E321=\"ja\",A321,IF(E322=\"ja\",A322,IF(E323=\"ja\",A323,IF(E324=\"ja\",A324,IF(E325=\"ja\",A325,IF(E326=\"ja\",A326,IF(E327=\"ja\",A327,IF(E328=\"ja\",A328,IF(E329=\"ja\",A329,IF(E330=\"ja\",A330,IF(E331=\"ja\",A331,IF(E332=\"ja\",A332,IF(E333=\"ja\",A333,IF(E334=\"ja\",A334,IF(E335=\"ja\",A335,IF(A336=\"ja\",A336,\"Volgepland\")))))))))))))))))))","v":"2021-11-11"},null,null,null,null,0,null,null,0,0,null,null,0]
["2021-11-12",{"$f":"WEEKNUM(Tabel_kalender[[#This Row],[Datum]],21)","v":45},"1900-01-05",null,"ja",{"$f":"IF(Tabel_kalender[[#This Row],[Werkdag]]=\"ja\",Tabel_kalender[[#This Row],[Datum]],IF(E320=\"ja\",A320,IF(E321=\"ja\",A321,IF(E322=\"ja\",A322,IF(E323=\"ja\",A323,IF(E324=\"ja\",A324,IF(E325=\"ja\",A325,IF(E326=\"ja\",A326,IF(E327=\"ja\",A327,IF(E328=\"ja\",A328,IF(E329=\"ja\",A329,IF(E330=\"ja\",A330,IF(E331=\"ja\",A331,IF(E332=\"ja\",A332,IF(E333=\"ja\",A333,IF(E334=\"ja\",A334,IF(E335=\"ja\",A335,IF(E336=\"ja\",A336,IF(A337=\"ja\",A337,\"Volgepland\")))))))))))))))))))","v":"2021-11-12"},null,null,null,null,0,null,null,0,0,null,null,0]
["2021-11-13",{"$f":"WEEKNUM(Tabel_kalender[[#This Row],[Datum]],21)","v":45},"1900-01-06",null,"nee",{"$f":"IF(Tabel_kalender[[#This Row],[Werkdag]]=\"ja\",Tabel_kalender[[#This Row],[Datum]],IF(E321=\"ja\",A321,IF(E322=\"ja\",A322,IF(E323=\"ja\",A323,IF(E324=\"ja\",A324,IF(E325=\"ja\",A325,IF(E326=\"ja\",A326,IF(E327=\"ja\",A327,IF(E328=\"ja\",A328,IF(E329=\"ja\",A329,IF(E330=\"ja\",A330,IF(E331=\"ja\",A331,IF(E332=\"ja\",A332,IF(E333=\"ja\",A333,IF(E334=\"ja\",A334,IF(E335=\"ja\",A335,IF(E336=\"ja\",A336,IF(E337=\"ja\",A337,IF(A338=\"ja\",A338,\"Volgepland\")))))))))))))))))))","v":"2021-11-15"},null,null,null,null,0,null,null,0,0,null,null,0]
["2021-11-14",{"$f":"WEEKNUM(Tabel_kalender[[#This Row],[Datum]],21)","v":45},"1900-01-07",null,"nee",{"$f":"IF(Tabel_kalender[[#This Row],[Werkdag]]=\"ja\",Tabel_kalender[[#This Row],[Datum]],IF(E322=\"ja\",A322,IF(E323=\"ja\",A323,IF(E324=\"ja\",A324,IF(E325=\"ja\",A325,IF(E326=\"ja\",A326,IF(E327=\"ja\",A327,IF(E328=\"ja\",A328,IF(E329=\"ja\",A329,IF(E330=\"ja\",A330,IF(E331=\"ja\",A331,IF(E332=\"ja\",A332,IF(E333=\"ja\",A333,IF(E334=\"ja\",A334,IF(E335=\"ja\",A335,IF(E336=\"ja\",A336,IF(E337=\"ja\",A337,IF(E338=\"ja\",A338,IF(A339=\"ja\",A339,\"Volgepland\")))))))))))))))))))","v":"2021-11-15"},null,null,null,null,0,null,null,0,0,null,null,0]
["2021-11-15",{"$f":"WEEKNUM(Tabel_kalender[[#This Row],[Datum]],21)","v":46},"1900-01-01",null,"ja",{"$f":"IF(Tabel_kalender[[#This Row],[Werkdag]]=\"ja\",Tabel_kalender[[#This Row],[Datum]],IF(E323=\"ja\",A323,IF(E324=\"ja\",A324,IF(E325=\"ja\",A325,IF(E326=\"ja\",A326,IF(E327=\"ja\",A327,IF(E328=\"ja\",A328,IF(E329=\"ja\",A329,IF(E330=\"ja\",A330,IF(E331=\"ja\",A331,IF(E332=\"ja\",A332,IF(E333=\"ja\",A333,IF(E334=\"ja\",A334,IF(E335=\"ja\",A335,IF(E336=\"ja\",A336,IF(E337=\"ja\",A337,IF(E338=\"ja\",A338,IF(E339=\"ja\",A339,IF(A340=\"ja\",A340,\"Volgepland\")))))))))))))))))))","v":"2021-11-15"},null,null,null,null,0,null,null,0,0,null,null,0]
["2021-11-16",{"$f":"WEEKNUM(Tabel_kalender[[#This Row],[Datum]],21)","v":46},"1900-01-02",null,"ja",{"$f":"IF(Tabel_kalender[[#This Row],[Werkdag]]=\"ja\",Tabel_kalender[[#This Row],[Datum]],IF(E324=\"ja\",A324,IF(E325=\"ja\",A325,IF(E326=\"ja\",A326,IF(E327=\"ja\",A327,IF(E328=\"ja\",A328,IF(E329=\"ja\",A329,IF(E330=\"ja\",A330,IF(E331=\"ja\",A331,IF(E332=\"ja\",A332,IF(E333=\"ja\",A333,IF(E334=\"ja\",A334,IF(E335=\"ja\",A335,IF(E336=\"ja\",A336,IF(E337=\"ja\",A337,IF(E338=\"ja\",A338,IF(E339=\"ja\",A339,IF(E340=\"ja\",A340,IF(A341=\"ja\",A341,\"Volgepland\")))))))))))))))))))","v":"2021-11-16"},null,null,null,null,0,null,null,0,0,null,null,0]
[{"$f":"A323+1","v":"2021-11-17"},{"$f":"WEEKNUM(Tabel_kalender[[#This Row],[Datum]],21)","v":46},"1900-01-03",null,"ja",{"$f":"IF(Tabel_kalender[[#This Row],[Werkdag]]=\"ja\",Tabel_kalender[[#This Row],[Datum]],IF(E325=\"ja\",A325,IF(E326=\"ja\",A326,IF(E327=\"ja\",A327,IF(E328=\"ja\",A328,IF(E329=\"ja\",A329,IF(E330=\"ja\",A330,IF(E331=\"ja\",A331,IF(E332=\"ja\",A332,IF(E333=\"ja\",A333,IF(E334=\"ja\",A334,IF(E335=\"ja\",A335,IF(E336=\"ja\",A336,IF(E337=\"ja\",A337,IF(E338=\"ja\",A338,IF(E339=\"ja\",A339,IF(E340=\"ja\",A340,IF(E341=\"ja\",A341,IF(A342=\"ja\",A342,\"Volgepland\")))))))))))))))))))","v":"2021-11-17"},null,null,null,null,{"$f":"L323","v":0},null,null,{"$f":"IF(L324>0,L324-K324,)-M324","v":0},{"$f":"P323","v":0},null,null,{"$f":"IF(P324>0,P324-O324,)-Q324","v":0}]
["2021-11-18",{"$f":"WEEKNUM(Tabel_kalender[[#This Row],[Datum]],21)","v":46},{"$f":"WEEKDAY(A325,2)","v":"1900-01-04"},null,"ja",{"$f":"IF(Tabel_kalender[[#This Row],[Werkdag]]=\"ja\",Tabel_kalender[[#This Row],[Datum]],IF(E326=\"ja\",A326,IF(E327=\"ja\",A327,IF(E328=\"ja\",A328,IF(E329=\"ja\",A329,IF(E330=\"ja\",A330,IF(E331=\"ja\",A331,IF(E332=\"ja\",A332,IF(E333=\"ja\",A333,IF(E334=\"ja\",A334,IF(E335=\"ja\",A335,IF(E336=\"ja\",A336,IF(E337=\"ja\",A337,IF(E338=\"ja\",A338,IF(E339=\"ja\",A339,IF(E340=\"ja\",A340,IF(E341=\"ja\",A341,IF(E342=\"ja\",A342,IF(A343=\"ja\",A343,\"Volgepland\")))))))))))))))))))","v":"2021-11-18"},null,null,null,null,0,null,null,0,0,null,null,0]
["2021-11-19",{"$f":"WEEKNUM(Tabel_kalender[[#This Row],[Datum]],21)","v":46},"1900-01-05",null,"ja",{"$f":"IF(Tabel_kalender[[#This Row],[Werkdag]]=\"ja\",Tabel_kalender[[#This Row],[Datum]],IF(E327=\"ja\",A327,IF(E328=\"ja\",A328,IF(E329=\"ja\",A329,IF(E330=\"ja\",A330,IF(E331=\"ja\",A331,IF(E332=\"ja\",A332,IF(E333=\"ja\",A333,IF(E334=\"ja\",A334,IF(E335=\"ja\",A335,IF(E336=\"ja\",A336,IF(E337=\"ja\",A337,IF(E338=\"ja\",A338,IF(E339=\"ja\",A339,IF(E340=\"ja\",A340,IF(E341=\"ja\",A341,IF(E342=\"ja\",A342,IF(E343=\"ja\",A343,IF(A344=\"ja\",A344,\"Volgepland\")))))))))))))))))))","v":"2021-11-19"},null,null,null,null,0,null,null,0,0,null,null,0]
["2021-11-20",{"$f":"WEEKNUM(Tabel_kalender[[#This Row],[Datum]],21)","v":46},"1900-01-06",null,"nee",{"$f":"IF(Tabel_kalender[[#This Row],[Werkdag]]=\"ja\",Tabel_kalender[[#This Row],[Datum]],IF(E328=\"ja\",A328,IF(E329=\"ja\",A329,IF(E330=\"ja\",A330,IF(E331=\"ja\",A331,IF(E332=\"ja\",A332,IF(E333=\"ja\",A333,IF(E334=\"ja\",A334,IF(E335=\"ja\",A335,IF(E336=\"ja\",A336,IF(E337=\"ja\",A337,IF(E338=\"ja\",A338,IF(E339=\"ja\",A339,IF(E340=\"ja\",A340,IF(E341=\"ja\",A341,IF(E342=\"ja\",A342,IF(E343=\"ja\",A343,IF(E344=\"ja\",A344,IF(A345=\"ja\",A345,\"Volgepland\")))))))))))))))))))","v":"2021-11-22"},null,null,null,null,0,null,null,0,0,null,null,0]
["2021-11-21",{"$f":"WEEKNUM(Tabel_kalender[[#This Row],[Datum]],21)","v":46},"1900-01-07",null,"nee",{"$f":"IF(Tabel_kalender[[#This Row],[Werkdag]]=\"ja\",Tabel_kalender[[#This Row],[Datum]],IF(E329=\"ja\",A329,IF(E330=\"ja\",A330,IF(E331=\"ja\",A331,IF(E332=\"ja\",A332,IF(E333=\"ja\",A333,IF(E334=\"ja\",A334,IF(E335=\"ja\",A335,IF(E336=\"ja\",A336,IF(E337=\"ja\",A337,IF(E338=\"ja\",A338,IF(E339=\"ja\",A339,IF(E340=\"ja\",A340,IF(E341=\"ja\",A341,IF(E342=\"ja\",A342,IF(E343=\"ja\",A343,IF(E344=\"ja\",A344,IF(E345=\"ja\",A345,IF(A346=\"ja\",A346,\"Volgepland\")))))))))))))))))))","v":"2021-11-22"},null,null,null,null,0,null,null,0,0,null,null,0]
["2021-11-22",{"$f":"WEEKNUM(Tabel_kalender[[#This Row],[Datum]],21)","v":47},"1900-01-01",null,"ja",{"$f":"IF(Tabel_kalender[[#This Row],[Werkdag]]=\"ja\",Tabel_kalender[[#This Row],[Datum]],IF(E330=\"ja\",A330,IF(E331=\"ja\",A331,IF(E332=\"ja\",A332,IF(E333=\"ja\",A333,IF(E334=\"ja\",A334,IF(E335=\"ja\",A335,IF(E336=\"ja\",A336,IF(E337=\"ja\",A337,IF(E338=\"ja\",A338,IF(E339=\"ja\",A339,IF(E340=\"ja\",A340,IF(E341=\"ja\",A341,IF(E342=\"ja\",A342,IF(E343=\"ja\",A343,IF(E344=\"ja\",A344,IF(E345=\"ja\",A345,IF(E346=\"ja\",A346,IF(A347=\"ja\",A347,\"Volgepland\")))))))))))))))))))","v":"2021-11-22"},null,null,null,null,0,null,null,0,0,null,null,0]
["2021-11-23",{"$f":"WEEKNUM(Tabel_kalender[[#This Row],[Datum]],21)","v":47},"1900-01-02",null,"ja",{"$f":"IF(Tabel_kalender[[#This Row],[Werkdag]]=\"ja\",Tabel_kalender[[#This Row],[Datum]],IF(E331=\"ja\",A331,IF(E332=\"ja\",A332,IF(E333=\"ja\",A333,IF(E334=\"ja\",A334,IF(E335=\"ja\",A335,IF(E336=\"ja\",A336,IF(E337=\"ja\",A337,IF(E338=\"ja\",A338,IF(E339=\"ja\",A339,IF(E340=\"ja\",A340,IF(E341=\"ja\",A341,IF(E342=\"ja\",A342,IF(E343=\"ja\",A343,IF(E344=\"ja\",A344,IF(E345=\"ja\",A345,IF(E346=\"ja\",A346,IF(E347=\"ja\",A347,IF(A348=\"ja\",A348,\"Volgepland\")))))))))))))))))))","v":"2021-11-23"},null,null,null,null,0,null,null,0,0,null,null,0]
["2021-11-24",{"$f":"WEEKNUM(Tabel_kalender[[#This Row],[Datum]],21)","v":47},"1900-01-03",null,"ja",{"$f":"IF(Tabel_kalender[[#This Row],[Werkdag]]=\"ja\",Tabel_kalender[[#This Row],[Datum]],IF(E332=\"ja\",A332,IF(E333=\"ja\",A333,IF(E334=\"ja\",A334,IF(E335=\"ja\",A335,IF(E336=\"ja\",A336,IF(E337=\"ja\",A337,IF(E338=\"ja\",A338,IF(E339=\"ja\",A339,IF(E340=\"ja\",A340,IF(E341=\"ja\",A341,IF(E342=\"ja\",A342,IF(E343=\"ja\",A343,IF(E344=\"ja\",A344,IF(E345=\"ja\",A345,IF(E346=\"ja\",A346,IF(E347=\"ja\",A347,IF(E348=\"ja\",A348,IF(A349=\"ja\",A349,\"Volgepland\")))))))))))))))))))","v":"2021-11-24"},null,null,null,null,0,null,null,0,0,null,null,0]
["2021-11-25",{"$f":"WEEKNUM(Tabel_kalender[[#This Row],[Datum]],21)","v":47},"1900-01-04",null,"ja",{"$f":"IF(Tabel_kalender[[#This Row],[Werkdag]]=\"ja\",Tabel_kalender[[#This Row],[Datum]],IF(E333=\"ja\",A333,IF(E334=\"ja\",A334,IF(E335=\"ja\",A335,IF(E336=\"ja\",A336,IF(E337=\"ja\",A337,IF(E338=\"ja\",A338,IF(E339=\"ja\",A339,IF(E340=\"ja\",A340,IF(E341=\"ja\",A341,IF(E342=\"ja\",A342,IF(E343=\"ja\",A343,IF(E344=\"ja\",A344,IF(E345=\"ja\",A345,IF(E346=\"ja\",A346,IF(E347=\"ja\",A347,IF(E348=\"ja\",A348,IF(E349=\"ja\",A349,IF(A350=\"ja\",A350,\"Volgepland\")))))))))))))))))))","v":"2021-11-25"},null,null,null,null,0,null,null,0,0,null,null,0]
["2021-11-26",{"$f":"WEEKNUM(Tabel_kalender[[#This Row],[Datum]],21)","v":47},"1900-01-05",null,"ja",{"$f":"IF(Tabel_kalender[[#This Row],[Werkdag]]=\"ja\",Tabel_kalender[[#This Row],[Datum]],IF(E334=\"ja\",A334,IF(E335=\"ja\",A335,IF(E336=\"ja\",A336,IF(E337=\"ja\",A337,IF(E338=\"ja\",A338,IF(E339=\"ja\",A339,IF(E340=\"ja\",A340,IF(E341=\"ja\",A341,IF(E342=\"ja\",A342,IF(E343=\"ja\",A343,IF(E344=\"ja\",A344,IF(E345=\"ja\",A345,IF(E346=\"ja\",A346,IF(E347=\"ja\",A347,IF(E348=\"ja\",A348,IF(E349=\"ja\",A349,IF(E350=\"ja\",A350,IF(A351=\"ja\",A351,\"Volgepland\")))))))))))))))))))","v":"2021-11-26"},null,null,null,null,0,null,null,0,0,null,null,0]
["2021-11-27",{"$f":"WEEKNUM(Tabel_kalender[[#This Row],[Datum]],21)","v":47},"1900-01-06",null,"nee",{"$f":"IF(Tabel_kalender[[#This Row],[Werkdag]]=\"ja\",Tabel_kalender[[#This Row],[Datum]],IF(E335=\"ja\",A335,IF(E336=\"ja\",A336,IF(E337=\"ja\",A337,IF(E338=\"ja\",A338,IF(E339=\"ja\",A339,IF(E340=\"ja\",A340,IF(E341=\"ja\",A341,IF(E342=\"ja\",A342,IF(E343=\"ja\",A343,IF(E344=\"ja\",A344,IF(E345=\"ja\",A345,IF(E346=\"ja\",A346,IF(E347=\"ja\",A347,IF(E348=\"ja\",A348,IF(E349=\"ja\",A349,IF(E350=\"ja\",A350,IF(E351=\"ja\",A351,IF(A352=\"ja\",A352,\"Volgepland\")))))))))))))))))))","v":"2021-11-29"},null,null,null,null,0,null,null,0,0,null,null,0]
["2021-11-28",{"$f":"WEEKNUM(Tabel_kalender[[#This Row],[Datum]],21)","v":47},"1900-01-07",null,"nee",{"$f":"IF(Tabel_kalender[[#This Row],[Werkdag]]=\"ja\",Tabel_kalender[[#This Row],[Datum]],IF(E336=\"ja\",A336,IF(E337=\"ja\",A337,IF(E338=\"ja\",A338,IF(E339=\"ja\",A339,IF(E340=\"ja\",A340,IF(E341=\"ja\",A341,IF(E342=\"ja\",A342,IF(E343=\"ja\",A343,IF(E344=\"ja\",A344,IF(E345=\"ja\",A345,IF(E346=\"ja\",A346,IF(E347=\"ja\",A347,IF(E348=\"ja\",A348,IF(E349=\"ja\",A349,IF(E350=\"ja\",A350,IF(E351=\"ja\",A351,IF(E352=\"ja\",A352,IF(A353=\"ja\",A353,\"Volgepland\")))))))))))))))))))","v":"2021-11-29"},null,null,null,null,0,null,null,0,0,null,null,0]
["2021-11-29",{"$f":"WEEKNUM(Tabel_kalender[[#This Row],[Datum]],21)","v":48},"1900-01-01",null,"ja",{"$f":"IF(Tabel_kalender[[#This Row],[Werkdag]]=\"ja\",Tabel_kalender[[#This Row],[Datum]],IF(E337=\"ja\",A337,IF(E338=\"ja\",A338,IF(E339=\"ja\",A339,IF(E340=\"ja\",A340,IF(E341=\"ja\",A341,IF(E342=\"ja\",A342,IF(E343=\"ja\",A343,IF(E344=\"ja\",A344,IF(E345=\"ja\",A345,IF(E346=\"ja\",A346,IF(E347=\"ja\",A347,IF(E348=\"ja\",A348,IF(E349=\"ja\",A349,IF(E350=\"ja\",A350,IF(E351=\"ja\",A351,IF(E352=\"ja\",A352,IF(E353=\"ja\",A353,IF(A354=\"ja\",A354,\"Volgepland\")))))))))))))))))))","v":"2021-11-29"},null,null,null,null,0,null,null,0,0,null,null,0]
["2021-11-30",{"$f":"WEEKNUM(Tabel_kalender[[#This Row],[Datum]],21)","v":48},"1900-01-02",null,"ja",{"$f":"IF(Tabel_kalender[[#This Row],[Werkdag]]=\"ja\",Tabel_kalender[[#This Row],[Datum]],IF(E338=\"ja\",A338,IF(E339=\"ja\",A339,IF(E340=\"ja\",A340,IF(E341=\"ja\",A341,IF(E342=\"ja\",A342,IF(E343=\"ja\",A343,IF(E344=\"ja\",A344,IF(E345=\"ja\",A345,IF(E346=\"ja\",A346,IF(E347=\"ja\",A347,IF(E348=\"ja\",A348,IF(E349=\"ja\",A349,IF(E350=\"ja\",A350,IF(E351=\"ja\",A351,IF(E352=\"ja\",A352,IF(E353=\"ja\",A353,IF(E354=\"ja\",A354,IF(A355=\"ja\",A355,\"Volgepland\")))))))))))))))))))","v":"2021-11-30"},null,null,null,null,0,null,null,0,0,null,null,0]
["2021-12-01",{"$f":"WEEKNUM(Tabel_kalender[[#This Row],[Datum]],21)","v":48},"1900-01-03",null,"ja",{"$f":"IF(Tabel_kalender[[#This Row],[Werkdag]]=\"ja\",Tabel_kalender[[#This Row],[Datum]],IF(E339=\"ja\",A339,IF(E340=\"ja\",A340,IF(E341=\"ja\",A341,IF(E342=\"ja\",A342,IF(E343=\"ja\",A343,IF(E344=\"ja\",A344,IF(E345=\"ja\",A345,IF(E346=\"ja\",A346,IF(E347=\"ja\",A347,IF(E348=\"ja\",A348,IF(E349=\"ja\",A349,IF(E350=\"ja\",A350,IF(E351=\"ja\",A351,IF(E352=\"ja\",A352,IF(E353=\"ja\",A353,IF(E354=\"ja\",A354,IF(E355=\"ja\",A355,IF(A356=\"ja\",A356,\"Volgepland\")))))))))))))))))))","v":"2021-12-01"},null,null,null,null,0,null,null,0,0,null,null,0]
["2021-12-02",{"$f":"WEEKNUM(Tabel_kalender[[#This Row],[Datum]],21)","v":48},"1900-01-04",null,"ja",{"$f":"IF(Tabel_kalender[[#This Row],[Werkdag]]=\"ja\",Tabel_kalender[[#This Row],[Datum]],IF(E340=\"ja\",A340,IF(E341=\"ja\",A341,IF(E342=\"ja\",A342,IF(E343=\"ja\",A343,IF(E344=\"ja\",A344,IF(E345=\"ja\",A345,IF(E346=\"ja\",A346,IF(E347=\"ja\",A347,IF(E348=\"ja\",A348,IF(E349=\"ja\",A349,IF(E350=\"ja\",A350,IF(E351=\"ja\",A351,IF(E352=\"ja\",A352,IF(E353=\"ja\",A353,IF(E354=\"ja\",A354,IF(E355=\"ja\",A355,IF(E356=\"ja\",A356,IF(A357=\"ja\",A357,\"Volgepland\")))))))))))))))))))","v":"2021-12-02"},null,null,null,null,0,null,null,0,0,null,null,0]
["2021-12-03",{"$f":"WEEKNUM(Tabel_kalender[[#This Row],[Datum]],21)","v":48},"1900-01-05",null,"ja",{"$f":"IF(Tabel_kalender[[#This Row],[Werkdag]]=\"ja\",Tabel_kalender[[#This Row],[Datum]],IF(E341=\"ja\",A341,IF(E342=\"ja\",A342,IF(E343=\"ja\",A343,IF(E344=\"ja\",A344,IF(E345=\"ja\",A345,IF(E346=\"ja\",A346,IF(E347=\"ja\",A347,IF(E348=\"ja\",A348,IF(E349=\"ja\",A349,IF(E350=\"ja\",A350,IF(E351=\"ja\",A351,IF(E352=\"ja\",A352,IF(E353=\"ja\",A353,IF(E354=\"ja\",A354,IF(E355=\"ja\",A355,IF(E356=\"ja\",A356,IF(E357=\"ja\",A357,IF(A358=\"ja\",A358,\"Volgepland\")))))))))))))))))))","v":"2021-12-03"},null,null,null,null,0,null,null,0,0,null,null,0]
["2021-12-04",{"$f":"WEEKNUM(Tabel_kalender[[#This Row],[Datum]],21)","v":48},"1900-01-06",null,"nee",{"$f":"IF(Tabel_kalender[[#This Row],[Werkdag]]=\"ja\",Tabel_kalender[[#This Row],[Datum]],IF(E342=\"ja\",A342,IF(E343=\"ja\",A343,IF(E344=\"ja\",A344,IF(E345=\"ja\",A345,IF(E346=\"ja\",A346,IF(E347=\"ja\",A347,IF(E348=\"ja\",A348,IF(E349=\"ja\",A349,IF(E350=\"ja\",A350,IF(E351=\"ja\",A351,IF(E352=\"ja\",A352,IF(E353=\"ja\",A353,IF(E354=\"ja\",A354,IF(E355=\"ja\",A355,IF(E356=\"ja\",A356,IF(E357=\"ja\",A357,IF(E358=\"ja\",A358,IF(A359=\"ja\",A359,\"Volgepland\")))))))))))))))))))","v":"2021-12-06"},null,null,null,null,0,null,null,0,0,null,null,0]
["2021-12-05",{"$f":"WEEKNUM(Tabel_kalender[[#This Row],[Datum]],21)","v":48},"1900-01-07",null,"nee",{"$f":"IF(Tabel_kalender[[#This Row],[Werkdag]]=\"ja\",Tabel_kalender[[#This Row],[Datum]],IF(E343=\"ja\",A343,IF(E344=\"ja\",A344,IF(E345=\"ja\",A345,IF(E346=\"ja\",A346,IF(E347=\"ja\",A347,IF(E348=\"ja\",A348,IF(E349=\"ja\",A349,IF(E350=\"ja\",A350,IF(E351=\"ja\",A351,IF(E352=\"ja\",A352,IF(E353=\"ja\",A353,IF(E354=\"ja\",A354,IF(E355=\"ja\",A355,IF(E356=\"ja\",A356,IF(E357=\"ja\",A357,IF(E358=\"ja\",A358,IF(E359=\"ja\",A359,IF(A360=\"ja\",A360,\"Volgepland\")))))))))))))))))))","v":"2021-12-06"},null,null,null,null,0,null,null,0,0,null,null,0]
["2021-12-06",{"$f":"WEEKNUM(Tabel_kalender[[#This Row],[Datum]],21)","v":49},"1900-01-01",null,"ja",{"$f":"IF(Tabel_kalender[[#This Row],[Werkdag]]=\"ja\",Tabel_kalender[[#This Row],[Datum]],IF(E344=\"ja\",A344,IF(E345=\"ja\",A345,IF(E346=\"ja\",A346,IF(E347=\"ja\",A347,IF(E348=\"ja\",A348,IF(E349=\"ja\",A349,IF(E350=\"ja\",A350,IF(E351=\"ja\",A351,IF(E352=\"ja\",A352,IF(E353=\"ja\",A353,IF(E354=\"ja\",A354,IF(E355=\"ja\",A355,IF(E356=\"ja\",A356,IF(E357=\"ja\",A357,IF(E358=\"ja\",A358,IF(E359=\"ja\",A359,IF(E360=\"ja\",A360,IF(A361=\"ja\",A361,\"Volgepland\")))))))))))))))))))","v":"2021-12-06"},null,null,null,null,0,null,null,0,0,null,null,0]
["2021-12-07",{"$f":"WEEKNUM(Tabel_kalender[[#This Row],[Datum]],21)","v":49},"1900-01-02",null,"ja",{"$f":"IF(Tabel_kalender[[#This Row],[Werkdag]]=\"ja\",Tabel_kalender[[#This Row],[Datum]],IF(E345=\"ja\",A345,IF(E346=\"ja\",A346,IF(E347=\"ja\",A347,IF(E348=\"ja\",A348,IF(E349=\"ja\",A349,IF(E350=\"ja\",A350,IF(E351=\"ja\",A351,IF(E352=\"ja\",A352,IF(E353=\"ja\",A353,IF(E354=\"ja\",A354,IF(E355=\"ja\",A355,IF(E356=\"ja\",A356,IF(E357=\"ja\",A357,IF(E358=\"ja\",A358,IF(E359=\"ja\",A359,IF(E360=\"ja\",A360,IF(E361=\"ja\",A361,IF(A362=\"ja\",A362,\"Volgepland\")))))))))))))))))))","v":"2021-12-07"},null,null,null,null,0,null,null,0,0,null,null,0]
["2021-12-08",{"$f":"WEEKNUM(Tabel_kalender[[#This Row],[Datum]],21)","v":49},"1900-01-03",null,"ja",{"$f":"IF(Tabel_kalender[[#This Row],[Werkdag]]=\"ja\",Tabel_kalender[[#This Row],[Datum]],IF(E346=\"ja\",A346,IF(E347=\"ja\",A347,IF(E348=\"ja\",A348,IF(E349=\"ja\",A349,IF(E350=\"ja\",A350,IF(E351=\"ja\",A351,IF(E352=\"ja\",A352,IF(E353=\"ja\",A353,IF(E354=\"ja\",A354,IF(E355=\"ja\",A355,IF(E356=\"ja\",A356,IF(E357=\"ja\",A357,IF(E358=\"ja\",A358,IF(E359=\"ja\",A359,IF(E360=\"ja\",A360,IF(E361=\"ja\",A361,IF(E362=\"ja\",A362,IF(A363=\"ja\",A363,\"Volgepland\")))))))))))))))))))","v":"2021-12-08"},null,null,null,null,0,null,null,0,0,null,null,0]
["2021-12-09",{"$f":"WEEKNUM(Tabel_kalender[[#This Row],[Datum]],21)","v":49},"1900-01-04",null,"ja",{"$f":"IF(Tabel_kalender[[#This Row],[Werkdag]]=\"ja\",Tabel_kalender[[#This Row],[Datum]],IF(E347=\"ja\",A347,IF(E348=\"ja\",A348,IF(E349=\"ja\",A349,IF(E350=\"ja\",A350,IF(E351=\"ja\",A351,IF(E352=\"ja\",A352,IF(E353=\"ja\",A353,IF(E354=\"ja\",A354,IF(E355=\"ja\",A355,IF(E356=\"ja\",A356,IF(E357=\"ja\",A357,IF(E358=\"ja\",A358,IF(E359=\"ja\",A359,IF(E360=\"ja\",A360,IF(E361=\"ja\",A361,IF(E362=\"ja\",A362,IF(E363=\"ja\",A363,IF(A364=\"ja\",A364,\"Volgepland\")))))))))))))))))))","v":"2021-12-09"},null,null,null,null,0,null,null,0,0,null,null,0]
["2021-12-10",{"$f":"WEEKNUM(Tabel_kalender[[#This Row],[Datum]],21)","v":49},"1900-01-05",null,"ja",{"$f":"IF(Tabel_kalender[[#This Row],[Werkdag]]=\"ja\",Tabel_kalender[[#This Row],[Datum]],IF(E348=\"ja\",A348,IF(E349=\"ja\",A349,IF(E350=\"ja\",A350,IF(E351=\"ja\",A351,IF(E352=\"ja\",A352,IF(E353=\"ja\",A353,IF(E354=\"ja\",A354,IF(E355=\"ja\",A355,IF(E356=\"ja\",A356,IF(E357=\"ja\",A357,IF(E358=\"ja\",A358,IF(E359=\"ja\",A359,IF(E360=\"ja\",A360,IF(E361=\"ja\",A361,IF(E362=\"ja\",A362,IF(E363=\"ja\",A363,IF(E364=\"ja\",A364,IF(A365=\"ja\",A365,\"Volgepland\")))))))))))))))))))","v":"2021-12-10"},null,null,null,null,0,null,null,0,0,null,null,0]
["2021-12-11",{"$f":"WEEKNUM(Tabel_kalender[[#This Row],[Datum]],21)","v":49},"1900-01-06",null,"nee",{"$f":"IF(Tabel_kalender[[#This Row],[Werkdag]]=\"ja\",Tabel_kalender[[#This Row],[Datum]],IF(E349=\"ja\",A349,IF(E350=\"ja\",A350,IF(E351=\"ja\",A351,IF(E352=\"ja\",A352,IF(E353=\"ja\",A353,IF(E354=\"ja\",A354,IF(E355=\"ja\",A355,IF(E356=\"ja\",A356,IF(E357=\"ja\",A357,IF(E358=\"ja\",A358,IF(E359=\"ja\",A359,IF(E360=\"ja\",A360,IF(E361=\"ja\",A361,IF(E362=\"ja\",A362,IF(E363=\"ja\",A363,IF(E364=\"ja\",A364,IF(E365=\"ja\",A365,IF(A366=\"ja\",A366,\"Volgepland\")))))))))))))))))))","v":"2021-12-13"},null,null,null,null,0,null,null,0,0,null,null,0]
["2021-12-12",{"$f":"WEEKNUM(Tabel_kalender[[#This Row],[Datum]],21)","v":49},"1900-01-07",null,"nee",{"$f":"IF(Tabel_kalender[[#This Row],[Werkdag]]=\"ja\",Tabel_kalender[[#This Row],[Datum]],IF(E350=\"ja\",A350,IF(E351=\"ja\",A351,IF(E352=\"ja\",A352,IF(E353=\"ja\",A353,IF(E354=\"ja\",A354,IF(E355=\"ja\",A355,IF(E356=\"ja\",A356,IF(E357=\"ja\",A357,IF(E358=\"ja\",A358,IF(E359=\"ja\",A359,IF(E360=\"ja\",A360,IF(E361=\"ja\",A361,IF(E362=\"ja\",A362,IF(E363=\"ja\",A363,IF(E364=\"ja\",A364,IF(E365=\"ja\",A365,IF(E366=\"ja\",A366,IF(A367=\"ja\",A367,\"Volgepland\")))))))))))))))))))","v":"2021-12-13"},null,null,null,null,0,null,null,0,0,null,null,0]
["2021-12-13",{"$f":"WEEKNUM(Tabel_kalender[[#This Row],[Datum]],21)","v":50},"1900-01-01",null,"ja",{"$f":"IF(Tabel_kalender[[#This Row],[Werkdag]]=\"ja\",Tabel_kalender[[#This Row],[Datum]],IF(E351=\"ja\",A351,IF(E352=\"ja\",A352,IF(E353=\"ja\",A353,IF(E354=\"ja\",A354,IF(E355=\"ja\",A355,IF(E356=\"ja\",A356,IF(E357=\"ja\",A357,IF(E358=\"ja\",A358,IF(E359=\"ja\",A359,IF(E360=\"ja\",A360,IF(E361=\"ja\",A361,IF(E362=\"ja\",A362,IF(E363=\"ja\",A363,IF(E364=\"ja\",A364,IF(E365=\"ja\",A365,IF(E366=\"ja\",A366,IF(E367=\"ja\",A367,IF(A368=\"ja\",A368,\"Volgepland\")))))))))))))))))))","v":"2021-12-13"},null,null,null,null,0,null,null,0,0,null,null,0]
["2021-12-14",{"$f":"WEEKNUM(Tabel_kalender[[#This Row],[Datum]],21)","v":50},"1900-01-02",null,"ja",{"$f":"IF(Tabel_kalender[[#This Row],[Werkdag]]=\"ja\",Tabel_kalender[[#This Row],[Datum]],IF(E352=\"ja\",A352,IF(E353=\"ja\",A353,IF(E354=\"ja\",A354,IF(E355=\"ja\",A355,IF(E356=\"ja\",A356,IF(E357=\"ja\",A357,IF(E358=\"ja\",A358,IF(E359=\"ja\",A359,IF(E360=\"ja\",A360,IF(E361=\"ja\",A361,IF(E362=\"ja\",A362,IF(E363=\"ja\",A363,IF(E364=\"ja\",A364,IF(E365=\"ja\",A365,IF(E366=\"ja\",A366,IF(E367=\"ja\",A367,IF(E368=\"ja\",A368,IF(A369=\"ja\",A369,\"Volgepland\")))))))))))))))))))","v":"2021-12-14"},null,null,null,null,0,null,null,0,0,null,null,0]
["2021-12-15",{"$f":"WEEKNUM(Tabel_kalender[[#This Row],[Datum]],21)","v":50},"1900-01-03",null,"ja",{"$f":"IF(Tabel_kalender[[#This Row],[Werkdag]]=\"ja\",Tabel_kalender[[#This Row],[Datum]],IF(E353=\"ja\",A353,IF(E354=\"ja\",A354,IF(E355=\"ja\",A355,IF(E356=\"ja\",A356,IF(E357=\"ja\",A357,IF(E358=\"ja\",A358,IF(E359=\"ja\",A359,IF(E360=\"ja\",A360,IF(E361=\"ja\",A361,IF(E362=\"ja\",A362,IF(E363=\"ja\",A363,IF(E364=\"ja\",A364,IF(E365=\"ja\",A365,IF(E366=\"ja\",A366,IF(E367=\"ja\",A367,IF(E368=\"ja\",A368,IF(E369=\"ja\",A369,IF(A370=\"ja\",A370,\"Volgepland\")))))))))))))))))))","v":"2021-12-15"},null,null,null,null,0,null,null,0,0,null,null,0]
["2021-12-16",{"$f":"WEEKNUM(Tabel_kalender[[#This Row],[Datum]],21)","v":50},"1900-01-04",null,"ja",{"$f":"IF(Tabel_kalender[[#This Row],[Werkdag]]=\"ja\",Tabel_kalender[[#This Row],[Datum]],IF(E354=\"ja\",A354,IF(E355=\"ja\",A355,IF(E356=\"ja\",A356,IF(E357=\"ja\",A357,IF(E358=\"ja\",A358,IF(E359=\"ja\",A359,IF(E360=\"ja\",A360,IF(E361=\"ja\",A361,IF(E362=\"ja\",A362,IF(E363=\"ja\",A363,IF(E364=\"ja\",A364,IF(E365=\"ja\",A365,IF(E366=\"ja\",A366,IF(E367=\"ja\",A367,IF(E368=\"ja\",A368,IF(E369=\"ja\",A369,IF(E370=\"ja\",A370,IF(A371=\"ja\",A371,\"Volgepland\")))))))))))))))))))","v":"2021-12-16"},null,null,null,null,0,null,null,0,0,null,null,0]
["2021-12-17",{"$f":"WEEKNUM(Tabel_kalender[[#This Row],[Datum]],21)","v":50},"1900-01-05",null,"ja",{"$f":"IF(Tabel_kalender[[#This Row],[Werkdag]]=\"ja\",Tabel_kalender[[#This Row],[Datum]],IF(E355=\"ja\",A355,IF(E356=\"ja\",A356,IF(E357=\"ja\",A357,IF(E358=\"ja\",A358,IF(E359=\"ja\",A359,IF(E360=\"ja\",A360,IF(E361=\"ja\",A361,IF(E362=\"ja\",A362,IF(E363=\"ja\",A363,IF(E364=\"ja\",A364,IF(E365=\"ja\",A365,IF(E366=\"ja\",A366,IF(E367=\"ja\",A367,IF(E368=\"ja\",A368,IF(E369=\"ja\",A369,IF(E370=\"ja\",A370,IF(E371=\"ja\",A371,IF(A372=\"ja\",A372,\"Volgepland\")))))))))))))))))))","v":"2021-12-17"},null,null,null,null,0,null,null,0,0,null,null,0]
["2021-12-18",{"$f":"WEEKNUM(Tabel_kalender[[#This Row],[Datum]],21)","v":50},"1900-01-06",null,"nee",{"$f":"IF(Tabel_kalender[[#This Row],[Werkdag]]=\"ja\",Tabel_kalender[[#This Row],[Datum]],IF(E356=\"ja\",A356,IF(E357=\"ja\",A357,IF(E358=\"ja\",A358,IF(E359=\"ja\",A359,IF(E360=\"ja\",A360,IF(E361=\"ja\",A361,IF(E362=\"ja\",A362,IF(E363=\"ja\",A363,IF(E364=\"ja\",A364,IF(E365=\"ja\",A365,IF(E366=\"ja\",A366,IF(E367=\"ja\",A367,IF(E368=\"ja\",A368,IF(E369=\"ja\",A369,IF(E370=\"ja\",A370,IF(E371=\"ja\",A371,IF(E372=\"ja\",A372,IF(A373=\"ja\",A373,\"Volgepland\")))))))))))))))))))","v":"2021-12-20"},null,null,null,null,0,null,null,0,0,null,null,0]
["2021-12-19",{"$f":"WEEKNUM(Tabel_kalender[[#This Row],[Datum]],21)","v":50},"1900-01-07",null,"nee",{"$f":"IF(Tabel_kalender[[#This Row],[Werkdag]]=\"ja\",Tabel_kalender[[#This Row],[Datum]],IF(E357=\"ja\",A357,IF(E358=\"ja\",A358,IF(E359=\"ja\",A359,IF(E360=\"ja\",A360,IF(E361=\"ja\",A361,IF(E362=\"ja\",A362,IF(E363=\"ja\",A363,IF(E364=\"ja\",A364,IF(E365=\"ja\",A365,IF(E366=\"ja\",A366,IF(E367=\"ja\",A367,IF(E368=\"ja\",A368,IF(E369=\"ja\",A369,IF(E370=\"ja\",A370,IF(E371=\"ja\",A371,IF(E372=\"ja\",A372,IF(E373=\"ja\",A373,IF(A374=\"ja\",A374,\"Volgepland\")))))))))))))))))))","v":"2021-12-20"},null,null,null,null,0,null,null,0,0,null,null,0]
["2021-12-20",{"$f":"WEEKNUM(Tabel_kalender[[#This Row],[Datum]],21)","v":51},"1900-01-01",null,"ja",{"$f":"IF(Tabel_kalender[[#This Row],[Werkdag]]=\"ja\",Tabel_kalender[[#This Row],[Datum]],IF(E358=\"ja\",A358,IF(E359=\"ja\",A359,IF(E360=\"ja\",A360,IF(E361=\"ja\",A361,IF(E362=\"ja\",A362,IF(E363=\"ja\",A363,IF(E364=\"ja\",A364,IF(E365=\"ja\",A365,IF(E366=\"ja\",A366,IF(E367=\"ja\",A367,IF(E368=\"ja\",A368,IF(E369=\"ja\",A369,IF(E370=\"ja\",A370,IF(E371=\"ja\",A371,IF(E372=\"ja\",A372,IF(E373=\"ja\",A373,IF(E374=\"ja\",A374,IF(A375=\"ja\",A375,\"Volgepland\")))))))))))))))))))","v":"2021-12-20"},null,null,null,null,0,null,null,0,0,null,null,0]
["2021-12-21",{"$f":"WEEKNUM(Tabel_kalender[[#This Row],[Datum]],21)","v":51},"1900-01-02",null,"ja",{"$f":"IF(Tabel_kalender[[#This Row],[Werkdag]]=\"ja\",Tabel_kalender[[#This Row],[Datum]],IF(E359=\"ja\",A359,IF(E360=\"ja\",A360,IF(E361=\"ja\",A361,IF(E362=\"ja\",A362,IF(E363=\"ja\",A363,IF(E364=\"ja\",A364,IF(E365=\"ja\",A365,IF(E366=\"ja\",A366,IF(E367=\"ja\",A367,IF(E368=\"ja\",A368,IF(E369=\"ja\",A369,IF(E370=\"ja\",A370,IF(E371=\"ja\",A371,IF(E372=\"ja\",A372,IF(E373=\"ja\",A373,IF(E374=\"ja\",A374,IF(E375=\"ja\",A375,IF(A376=\"ja\",A376,\"Volgepland\")))))))))))))))))))","v":"2021-12-21"},null,null,null,null,0,null,null,0,0,null,null,0]
["2021-12-22",{"$f":"WEEKNUM(Tabel_kalender[[#This Row],[Datum]],21)","v":51},"1900-01-03",null,"ja",{"$f":"IF(Tabel_kalender[[#This Row],[Werkdag]]=\"ja\",Tabel_kalender[[#This Row],[Datum]],IF(E360=\"ja\",A360,IF(E361=\"ja\",A361,IF(E362=\"ja\",A362,IF(E363=\"ja\",A363,IF(E364=\"ja\",A364,IF(E365=\"ja\",A365,IF(E366=\"ja\",A366,IF(E367=\"ja\",A367,IF(E368=\"ja\",A368,IF(E369=\"ja\",A369,IF(E370=\"ja\",A370,IF(E371=\"ja\",A371,IF(E372=\"ja\",A372,IF(E373=\"ja\",A373,IF(E374=\"ja\",A374,IF(E375=\"ja\",A375,IF(E376=\"ja\",A376,IF(A377=\"ja\",A377,\"Volgepland\")))))))))))))))))))","v":"2021-12-22"},null,null,null,null,0,null,null,0,0,null,null,0]
["2021-12-23",{"$f":"WEEKNUM(Tabel_kalender[[#This Row],[Datum]],21)","v":51},"1900-01-04",null,"ja",{"$f":"IF(Tabel_kalender[[#This Row],[Werkdag]]=\"ja\",Tabel_kalender[[#This Row],[Datum]],IF(E361=\"ja\",A361,IF(E362=\"ja\",A362,IF(E363=\"ja\",A363,IF(E364=\"ja\",A364,IF(E365=\"ja\",A365,IF(E366=\"ja\",A366,IF(E367=\"ja\",A367,IF(E368=\"ja\",A368,IF(E369=\"ja\",A369,IF(E370=\"ja\",A370,IF(E371=\"ja\",A371,IF(E372=\"ja\",A372,IF(E373=\"ja\",A373,IF(E374=\"ja\",A374,IF(E375=\"ja\",A375,IF(E376=\"ja\",A376,IF(E377=\"ja\",A377,IF(A378=\"ja\",A378,\"Volgepland\")))))))))))))))))))","v":"2021-12-23"},null,null,null,null,0,null,null,0,0,null,null,0]
["2021-12-24",{"$f":"WEEKNUM(Tabel_kalender[[#This Row],[Datum]],21)","v":51},"1900-01-05",null,"ja",{"$f":"IF(Tabel_kalender[[#This Row],[Werkdag]]=\"ja\",Tabel_kalender[[#This Row],[Datum]],IF(E362=\"ja\",A362,IF(E363=\"ja\",A363,IF(E364=\"ja\",A364,IF(E365=\"ja\",A365,IF(E366=\"ja\",A366,IF(E367=\"ja\",A367,IF(E368=\"ja\",A368,IF(E369=\"ja\",A369,IF(E370=\"ja\",A370,IF(E371=\"ja\",A371,IF(E372=\"ja\",A372,IF(E373=\"ja\",A373,IF(E374=\"ja\",A374,IF(E375=\"ja\",A375,IF(E376=\"ja\",A376,IF(E377=\"ja\",A377,IF(E378=\"ja\",A378,IF(A379=\"ja\",A379,\"Volgepland\")))))))))))))))))))","v":"2021-12-24"},null,null,null,null,0,null,null,0,0,null,null,0]
["2021-12-25",{"$f":"WEEKNUM(Tabel_kalender[[#This Row],[Datum]],21)","v":51},"1900-01-06","Kerst","nee",{"$f":"IF(Tabel_kalender[[#This Row],[Werkdag]]=\"ja\",Tabel_kalender[[#This Row],[Datum]],IF(E363=\"ja\",A363,IF(E364=\"ja\",A364,IF(E365=\"ja\",A365,IF(E366=\"ja\",A366,IF(E367=\"ja\",A367,IF(E368=\"ja\",A368,IF(E369=\"ja\",A369,IF(E370=\"ja\",A370,IF(E371=\"ja\",A371,IF(E372=\"ja\",A372,IF(E373=\"ja\",A373,IF(E374=\"ja\",A374,IF(E375=\"ja\",A375,IF(E376=\"ja\",A376,IF(E377=\"ja\",A377,IF(E378=\"ja\",A378,IF(E379=\"ja\",A379,IF(A380=\"ja\",A380,\"Volgepland\")))))))))))))))))))","v":"2022-01-03"},null,null,null,null,0,null,null,0,0,null,null,0]
["2021-12-26",{"$f":"WEEKNUM(Tabel_kalender[[#This Row],[Datum]],21)","v":51},"1900-01-07","Kerst","nee",{"$f":"IF(Tabel_kalender[[#This Row],[Werkdag]]=\"ja\",Tabel_kalender[[#This Row],[Datum]],IF(E364=\"ja\",A364,IF(E365=\"ja\",A365,IF(E366=\"ja\",A366,IF(E367=\"ja\",A367,IF(E368=\"ja\",A368,IF(E369=\"ja\",A369,IF(E370=\"ja\",A370,IF(E371=\"ja\",A371,IF(E372=\"ja\",A372,IF(E373=\"ja\",A373,IF(E374=\"ja\",A374,IF(E375=\"ja\",A375,IF(E376=\"ja\",A376,IF(E377=\"ja\",A377,IF(E378=\"ja\",A378,IF(E379=\"ja\",A379,IF(E380=\"ja\",A380,IF(A381=\"ja\",A381,\"Volgepland\")))))))))))))))))))","v":"2022-01-03"},null,null,null,null,0,null,null,0,0,null,null,0]
["2021-12-27",{"$f":"WEEKNUM(Tabel_kalender[[#This Row],[Datum]],21)","v":52},"1900-01-01",null,"nee",{"$f":"IF(Tabel_kalender[[#This Row],[Werkdag]]=\"ja\",Tabel_kalender[[#This Row],[Datum]],IF(E365=\"ja\",A365,IF(E366=\"ja\",A366,IF(E367=\"ja\",A367,IF(E368=\"ja\",A368,IF(E369=\"ja\",A369,IF(E370=\"ja\",A370,IF(E371=\"ja\",A371,IF(E372=\"ja\",A372,IF(E373=\"ja\",A373,IF(E374=\"ja\",A374,IF(E375=\"ja\",A375,IF(E376=\"ja\",A376,IF(E377=\"ja\",A377,IF(E378=\"ja\",A378,IF(E379=\"ja\",A379,IF(E380=\"ja\",A380,IF(E381=\"ja\",A381,IF(A382=\"ja\",A382,\"Volgepland\")))))))))))))))))))","v":"2022-01-03"},null,null,null,null,0,null,null,0,0,null,null,0]
["2021-12-28",{"$f":"WEEKNUM(Tabel_kalender[[#This Row],[Datum]],21)","v":52},"1900-01-02",null,"nee",{"$f":"IF(Tabel_kalender[[#This Row],[Werkdag]]=\"ja\",Tabel_kalender[[#This Row],[Datum]],IF(E366=\"ja\",A366,IF(E367=\"ja\",A367,IF(E368=\"ja\",A368,IF(E369=\"ja\",A369,IF(E370=\"ja\",A370,IF(E371=\"ja\",A371,IF(E372=\"ja\",A372,IF(E373=\"ja\",A373,IF(E374=\"ja\",A374,IF(E375=\"ja\",A375,IF(E376=\"ja\",A376,IF(E377=\"ja\",A377,IF(E378=\"ja\",A378,IF(E379=\"ja\",A379,IF(E380=\"ja\",A380,IF(E381=\"ja\",A381,IF(E382=\"ja\",A382,IF(A383=\"ja\",A383,\"Volgepland\")))))))))))))))))))","v":"2022-01-03"},null,null,null,null,0,null,null,0,0,null,null,0]
["2021-12-29",{"$f":"WEEKNUM(Tabel_kalender[[#This Row],[Datum]],21)","v":52},"1900-01-03",null,"nee",{"$f":"IF(Tabel_kalender[[#This Row],[Werkdag]]=\"ja\",Tabel_kalender[[#This Row],[Datum]],IF(E367=\"ja\",A367,IF(E368=\"ja\",A368,IF(E369=\"ja\",A369,IF(E370=\"ja\",A370,IF(E371=\"ja\",A371,IF(E372=\"ja\",A372,IF(E373=\"ja\",A373,IF(E374=\"ja\",A374,IF(E375=\"ja\",A375,IF(E376=\"ja\",A376,IF(E377=\"ja\",A377,IF(E378=\"ja\",A378,IF(E379=\"ja\",A379,IF(E380=\"ja\",A380,IF(E381=\"ja\",A381,IF(E382=\"ja\",A382,IF(E383=\"ja\",A383,IF(A384=\"ja\",A384,\"Volgepland\")))))))))))))))))))","v":"2022-01-03"},null,null,null,null,0,null,null,0,0,null,null,0]
["2021-12-30",{"$f":"WEEKNUM(Tabel_kalender[[#This Row],[Datum]],21)","v":52},"1900-01-04",null,"nee",{"$f":"IF(Tabel_kalender[[#This Row],[Werkdag]]=\"ja\",Tabel_kalender[[#This Row],[Datum]],IF(E368=\"ja\",A368,IF(E369=\"ja\",A369,IF(E370=\"ja\",A370,IF(E371=\"ja\",A371,IF(E372=\"ja\",A372,IF(E373=\"ja\",A373,IF(E374=\"ja\",A374,IF(E375=\"ja\",A375,IF(E376=\"ja\",A376,IF(E377=\"ja\",A377,IF(E378=\"ja\",A378,IF(E379=\"ja\",A379,IF(E380=\"ja\",A380,IF(E381=\"ja\",A381,IF(E382=\"ja\",A382,IF(E383=\"ja\",A383,IF(E384=\"ja\",A384,IF(A385=\"ja\",A385,\"Volgepland\")))))))))))))))))))","v":"2022-01-03"},null,null,null,null,0,null,null,0,0,null,null,0]
["2021-12-31",{"$f":"WEEKNUM(Tabel_kalender[[#This Row],[Datum]],21)","v":52},"1900-01-05",null,"nee",{"$f":"IF(Tabel_kalender[[#This Row],[Werkdag]]=\"ja\",Tabel_kalender[[#This Row],[Datum]],IF(E369=\"ja\",A369,IF(E370=\"ja\",A370,IF(E371=\"ja\",A371,IF(E372=\"ja\",A372,IF(E373=\"ja\",A373,IF(E374=\"ja\",A374,IF(E375=\"ja\",A375,IF(E376=\"ja\",A376,IF(E377=\"ja\",A377,IF(E378=\"ja\",A378,IF(E379=\"ja\",A379,IF(E380=\"ja\",A380,IF(E381=\"ja\",A381,IF(E382=\"ja\",A382,IF(E383=\"ja\",A383,IF(E384=\"ja\",A384,IF(E385=\"ja\",A385,IF(A386=\"ja\",A386,\"Volgepland\")))))))))))))))))))","v":"2022-01-03"},null,null,null,null,0,null,null,{"$f":"IF(L368>0,L368-K368,)-M368","v":0},0,null,null,0]
[{"$f":"A368+1","v":"2022-01-01"},{"$f":"WEEKNUM(Tabel_kalender[[#This Row],[Datum]],21)","v":52},"1900-01-06",null,"nee",{"$f":"IF(Tabel_kalender[[#This Row],[Werkdag]]=\"ja\",Tabel_kalender[[#This Row],[Datum]],IF(E370=\"ja\",A370,IF(E371=\"ja\",A371,IF(E372=\"ja\",A372,IF(E373=\"ja\",A373,IF(E374=\"ja\",A374,IF(E375=\"ja\",A375,IF(E376=\"ja\",A376,IF(E377=\"ja\",A377,IF(E378=\"ja\",A378,IF(E379=\"ja\",A379,IF(E380=\"ja\",A380,IF(E381=\"ja\",A381,IF(E382=\"ja\",A382,IF(E383=\"ja\",A383,IF(E384=\"ja\",A384,IF(E385=\"ja\",A385,IF(E386=\"ja\",A386,IF(A387=\"ja\",A387,\"Volgepland\")))))))))))))))))))","v":"2022-01-03"},null,null,null,null,{"$f":"L368","v":0},null,null,{"$f":"IF(L369>0,L369-K369,)-M369","v":0},0,null,null,0]
["2022-01-02",{"$f":"WEEKNUM(Tabel_kalender[[#This Row],[Datum]],21)","v":52},"1900-01-07",null,"nee",{"$f":"IF(Tabel_kalender[[#This Row],[Werkdag]]=\"ja\",Tabel_kalender[[#This Row],[Datum]],IF(E371=\"ja\",A371,IF(E372=\"ja\",A372,IF(E373=\"ja\",A373,IF(E374=\"ja\",A374,IF(E375=\"ja\",A375,IF(E376=\"ja\",A376,IF(E377=\"ja\",A377,IF(E378=\"ja\",A378,IF(E379=\"ja\",A379,IF(E380=\"ja\",A380,IF(E381=\"ja\",A381,IF(E382=\"ja\",A382,IF(E383=\"ja\",A383,IF(E384=\"ja\",A384,IF(E385=\"ja\",A385,IF(E386=\"ja\",A386,IF(E387=\"ja\",A387,IF(A388=\"ja\",A388,\"Volgepland\")))))))))))))))))))","v":"2022-01-03"},null,null,null,null,0,null,null,0,0,null,null,0]
["2022-01-03",{"$f":"WEEKNUM(Tabel_kalender[[#This Row],[Datum]],21)","v":1},"1900-01-01",null,"ja",{"$f":"IF(Tabel_kalender[[#This Row],[Werkdag]]=\"ja\",Tabel_kalender[[#This Row],[Datum]],IF(E372=\"ja\",A372,IF(E373=\"ja\",A373,IF(E374=\"ja\",A374,IF(E375=\"ja\",A375,IF(E376=\"ja\",A376,IF(E377=\"ja\",A377,IF(E378=\"ja\",A378,IF(E379=\"ja\",A379,IF(E380=\"ja\",A380,IF(E381=\"ja\",A381,IF(E382=\"ja\",A382,IF(E383=\"ja\",A383,IF(E384=\"ja\",A384,IF(E385=\"ja\",A385,IF(E386=\"ja\",A386,IF(E387=\"ja\",A387,IF(E388=\"ja\",A388,IF(A389=\"ja\",A389,\"Volgepland\")))))))))))))))))))","v":"2022-01-03"},null,null,null,null,0,null,null,0,0,null,null,0,null,"   "]
["2022-01-04",{"$f":"WEEKNUM(Tabel_kalender[[#This Row],[Datum]],21)","v":1},"1900-01-02",null,"ja",{"$f":"IF(Tabel_kalender[[#This Row],[Werkdag]]=\"ja\",Tabel_kalender[[#This Row],[Datum]],IF(E373=\"ja\",A373,IF(E374=\"ja\",A374,IF(E375=\"ja\",A375,IF(E376=\"ja\",A376,IF(E377=\"ja\",A377,IF(E378=\"ja\",A378,IF(E379=\"ja\",A379,IF(E380=\"ja\",A380,IF(E381=\"ja\",A381,IF(E382=\"ja\",A382,IF(E383=\"ja\",A383,IF(E384=\"ja\",A384,IF(E385=\"ja\",A385,IF(E386=\"ja\",A386,IF(E387=\"ja\",A387,IF(E388=\"ja\",A388,IF(E389=\"ja\",A389,IF(A390=\"ja\",A390,\"Volgepland\")))))))))))))))))))","v":"2022-01-04"},null,null,null,null,0,null,null,0,0,null,null,0]
["2022-01-05",{"$f":"WEEKNUM(Tabel_kalender[[#This Row],[Datum]],21)","v":1},"1900-01-03",null,"ja",{"$f":"IF(Tabel_kalender[[#This Row],[Werkdag]]=\"ja\",Tabel_kalender[[#This Row],[Datum]],IF(E374=\"ja\",A374,IF(E375=\"ja\",A375,IF(E376=\"ja\",A376,IF(E377=\"ja\",A377,IF(E378=\"ja\",A378,IF(E379=\"ja\",A379,IF(E380=\"ja\",A380,IF(E381=\"ja\",A381,IF(E382=\"ja\",A382,IF(E383=\"ja\",A383,IF(E384=\"ja\",A384,IF(E385=\"ja\",A385,IF(E386=\"ja\",A386,IF(E387=\"ja\",A387,IF(E388=\"ja\",A388,IF(E389=\"ja\",A389,IF(E390=\"ja\",A390,IF(A391=\"ja\",A391,\"Volgepland\")))))))))))))))))))","v":"2022-01-05"},null,null,null,null,0,null,null,0,0,null,null,0]
["2022-01-06",{"$f":"WEEKNUM(Tabel_kalender[[#This Row],[Datum]],21)","v":1},"1900-01-04",null,"ja",{"$f":"IF(Tabel_kalender[[#This Row],[Werkdag]]=\"ja\",Tabel_kalender[[#This Row],[Datum]],IF(E375=\"ja\",A375,IF(E376=\"ja\",A376,IF(E377=\"ja\",A377,IF(E378=\"ja\",A378,IF(E379=\"ja\",A379,IF(E380=\"ja\",A380,IF(E381=\"ja\",A381,IF(E382=\"ja\",A382,IF(E383=\"ja\",A383,IF(E384=\"ja\",A384,IF(E385=\"ja\",A385,IF(E386=\"ja\",A386,IF(E387=\"ja\",A387,IF(E388=\"ja\",A388,IF(E389=\"ja\",A389,IF(E390=\"ja\",A390,IF(E391=\"ja\",A391,IF(A392=\"ja\",A392,\"Volgepland\")))))))))))))))))))","v":"2022-01-06"},null,null,null,null,0,null,null,0,0,null,null,0]
["2022-01-07",{"$f":"WEEKNUM(Tabel_kalender[[#This Row],[Datum]],21)","v":1},"1900-01-05",null,"ja",{"$f":"IF(Tabel_kalender[[#This Row],[Werkdag]]=\"ja\",Tabel_kalender[[#This Row],[Datum]],IF(E376=\"ja\",A376,IF(E377=\"ja\",A377,IF(E378=\"ja\",A378,IF(E379=\"ja\",A379,IF(E380=\"ja\",A380,IF(E381=\"ja\",A381,IF(E382=\"ja\",A382,IF(E383=\"ja\",A383,IF(E384=\"ja\",A384,IF(E385=\"ja\",A385,IF(E386=\"ja\",A386,IF(E387=\"ja\",A387,IF(E388=\"ja\",A388,IF(E389=\"ja\",A389,IF(E390=\"ja\",A390,IF(E391=\"ja\",A391,IF(E392=\"ja\",A392,IF(A393=\"ja\",A393,\"Volgepland\")))))))))))))))))))","v":"2022-01-07"},null,null,null,null,0,null,null,0,0,null,null,0]
["2022-01-08",{"$f":"WEEKNUM(Tabel_kalender[[#This Row],[Datum]],21)","v":1},"1900-01-06",null,"nee",{"$f":"IF(Tabel_kalender[[#This Row],[Werkdag]]=\"ja\",Tabel_kalender[[#This Row],[Datum]],IF(E377=\"ja\",A377,IF(E378=\"ja\",A378,IF(E379=\"ja\",A379,IF(E380=\"ja\",A380,IF(E381=\"ja\",A381,IF(E382=\"ja\",A382,IF(E383=\"ja\",A383,IF(E384=\"ja\",A384,IF(E385=\"ja\",A385,IF(E386=\"ja\",A386,IF(E387=\"ja\",A387,IF(E388=\"ja\",A388,IF(E389=\"ja\",A389,IF(E390=\"ja\",A390,IF(E391=\"ja\",A391,IF(E392=\"ja\",A392,IF(E393=\"ja\",A393,IF(A394=\"ja\",A394,\"Volgepland\")))))))))))))))))))","v":"2022-01-10"},null,null,null,null,0,null,null,0,0,null,null,0]
["2022-01-09",{"$f":"WEEKNUM(Tabel_kalender[[#This Row],[Datum]],21)","v":1},"1900-01-07",null,"nee",{"$f":"IF(Tabel_kalender[[#This Row],[Werkdag]]=\"ja\",Tabel_kalender[[#This Row],[Datum]],IF(E378=\"ja\",A378,IF(E379=\"ja\",A379,IF(E380=\"ja\",A380,IF(E381=\"ja\",A381,IF(E382=\"ja\",A382,IF(E383=\"ja\",A383,IF(E384=\"ja\",A384,IF(E385=\"ja\",A385,IF(E386=\"ja\",A386,IF(E387=\"ja\",A387,IF(E388=\"ja\",A388,IF(E389=\"ja\",A389,IF(E390=\"ja\",A390,IF(E391=\"ja\",A391,IF(E392=\"ja\",A392,IF(E393=\"ja\",A393,IF(E394=\"ja\",A394,IF(A395=\"ja\",A395,\"Volgepland\")))))))))))))))))))","v":"2022-01-10"},null,null,null,null,0,null,null,0,0,null,null,0]
["2022-01-10",{"$f":"WEEKNUM(Tabel_kalender[[#This Row],[Datum]],21)","v":2},"1900-01-01",null,"ja",{"$f":"IF(Tabel_kalender[[#This Row],[Werkdag]]=\"ja\",Tabel_kalender[[#This Row],[Datum]],IF(E379=\"ja\",A379,IF(E380=\"ja\",A380,IF(E381=\"ja\",A381,IF(E382=\"ja\",A382,IF(E383=\"ja\",A383,IF(E384=\"ja\",A384,IF(E385=\"ja\",A385,IF(E386=\"ja\",A386,IF(E387=\"ja\",A387,IF(E388=\"ja\",A388,IF(E389=\"ja\",A389,IF(E390=\"ja\",A390,IF(E391=\"ja\",A391,IF(E392=\"ja\",A392,IF(E393=\"ja\",A393,IF(E394=\"ja\",A394,IF(E395=\"ja\",A395,IF(A396=\"ja\",A396,\"Volgepland\")))))))))))))))))))","v":"2022-01-10"},null,null,null,null,0,null,null,0,0,null,null,0]
["2022-01-11",{"$f":"WEEKNUM(Tabel_kalender[[#This Row],[Datum]],21)","v":2},"1900-01-02",null,"nee",{"$f":"IF(Tabel_kalender[[#This Row],[Werkdag]]=\"ja\",Tabel_kalender[[#This Row],[Datum]],IF(E380=\"ja\",A380,IF(E381=\"ja\",A381,IF(E382=\"ja\",A382,IF(E383=\"ja\",A383,IF(E384=\"ja\",A384,IF(E385=\"ja\",A385,IF(E386=\"ja\",A386,IF(E387=\"ja\",A387,IF(E388=\"ja\",A388,IF(E389=\"ja\",A389,IF(E390=\"ja\",A390,IF(E391=\"ja\",A391,IF(E392=\"ja\",A392,IF(E393=\"ja\",A393,IF(E394=\"ja\",A394,IF(E395=\"ja\",A395,IF(E396=\"ja\",A396,IF(A397=\"ja\",A397,\"Volgepland\")))))))))))))))))))","v":"2022-01-13"},null,null,null,null,0,null,null,0,0,null,null,0]
["2022-01-12",{"$f":"WEEKNUM(Tabel_kalender[[#This Row],[Datum]],21)","v":2},"1900-01-03",null,"nee",{"$f":"IF(Tabel_kalender[[#This Row],[Werkdag]]=\"ja\",Tabel_kalender[[#This Row],[Datum]],IF(E381=\"ja\",A381,IF(E382=\"ja\",A382,IF(E383=\"ja\",A383,IF(E384=\"ja\",A384,IF(E385=\"ja\",A385,IF(E386=\"ja\",A386,IF(E387=\"ja\",A387,IF(E388=\"ja\",A388,IF(E389=\"ja\",A389,IF(E390=\"ja\",A390,IF(E391=\"ja\",A391,IF(E392=\"ja\",A392,IF(E393=\"ja\",A393,IF(E394=\"ja\",A394,IF(E395=\"ja\",A395,IF(E396=\"ja\",A396,IF(E397=\"ja\",A397,IF(A398=\"ja\",A398,\"Volgepland\")))))))))))))))))))","v":"2022-01-13"},null,null,null,null,0,null,null,0,0,null,null,0]
["2022-01-13",{"$f":"WEEKNUM(Tabel_kalender[[#This Row],[Datum]],21)","v":2},"1900-01-04",null,"ja",{"$f":"IF(Tabel_kalender[[#This Row],[Werkdag]]=\"ja\",Tabel_kalender[[#This Row],[Datum]],IF(E382=\"ja\",A382,IF(E383=\"ja\",A383,IF(E384=\"ja\",A384,IF(E385=\"ja\",A385,IF(E386=\"ja\",A386,IF(E387=\"ja\",A387,IF(E388=\"ja\",A388,IF(E389=\"ja\",A389,IF(E390=\"ja\",A390,IF(E391=\"ja\",A391,IF(E392=\"ja\",A392,IF(E393=\"ja\",A393,IF(E394=\"ja\",A394,IF(E395=\"ja\",A395,IF(E396=\"ja\",A396,IF(E397=\"ja\",A397,IF(E398=\"ja\",A398,IF(A399=\"ja\",A399,\"Volgepland\")))))))))))))))))))","v":"2022-01-13"},null,null,null,null,0,null,null,0,0,null,null,0]
["2022-01-14",{"$f":"WEEKNUM(Tabel_kalender[[#This Row],[Datum]],21)","v":2},"1900-01-05",null,"nee",{"$f":"IF(Tabel_kalender[[#This Row],[Werkdag]]=\"ja\",Tabel_kalender[[#This Row],[Datum]],IF(E383=\"ja\",A383,IF(E384=\"ja\",A384,IF(E385=\"ja\",A385,IF(E386=\"ja\",A386,IF(E387=\"ja\",A387,IF(E388=\"ja\",A388,IF(E389=\"ja\",A389,IF(E390=\"ja\",A390,IF(E391=\"ja\",A391,IF(E392=\"ja\",A392,IF(E393=\"ja\",A393,IF(E394=\"ja\",A394,IF(E395=\"ja\",A395,IF(E396=\"ja\",A396,IF(E397=\"ja\",A397,IF(E398=\"ja\",A398,IF(E399=\"ja\",A399,IF(A400=\"ja\",A400,\"Volgepland\")))))))))))))))))))","v":"2022-01-16"},null,null,null,null,0,null,null,0,0,null,null,0]
["2022-01-15",{"$f":"WEEKNUM(Tabel_kalender[[#This Row],[Datum]],21)","v":2},"1900-01-06",null,"nee",{"$f":"IF(Tabel_kalender[[#This Row],[Werkdag]]=\"ja\",Tabel_kalender[[#This Row],[Datum]],IF(E384=\"ja\",A384,IF(E385=\"ja\",A385,IF(E386=\"ja\",A386,IF(E387=\"ja\",A387,IF(E388=\"ja\",A388,IF(E389=\"ja\",A389,IF(E390=\"ja\",A390,IF(E391=\"ja\",A391,IF(E392=\"ja\",A392,IF(E393=\"ja\",A393,IF(E394=\"ja\",A394,IF(E395=\"ja\",A395,IF(E396=\"ja\",A396,IF(E397=\"ja\",A397,IF(E398=\"ja\",A398,IF(E399=\"ja\",A399,IF(E400=\"ja\",A400,IF(A401=\"ja\",A401,\"Volgepland\")))))))))))))))))))","v":"2022-01-16"},null,null,null,null,0,null,null,0,0,null,null,0]
["2022-01-16",{"$f":"WEEKNUM(Tabel_kalender[[#This Row],[Datum]],21)","v":2},"1900-01-07",null,"ja",{"$f":"IF(Tabel_kalender[[#This Row],[Werkdag]]=\"ja\",Tabel_kalender[[#This Row],[Datum]],IF(E385=\"ja\",A385,IF(E386=\"ja\",A386,IF(E387=\"ja\",A387,IF(E388=\"ja\",A388,IF(E389=\"ja\",A389,IF(E390=\"ja\",A390,IF(E391=\"ja\",A391,IF(E392=\"ja\",A392,IF(E393=\"ja\",A393,IF(E394=\"ja\",A394,IF(E395=\"ja\",A395,IF(E396=\"ja\",A396,IF(E397=\"ja\",A397,IF(E398=\"ja\",A398,IF(E399=\"ja\",A399,IF(E400=\"ja\",A400,IF(E401=\"ja\",A401,IF(A402=\"ja\",A402,\"Volgepland\")))))))))))))))))))","v":"2022-01-16"},null,null,null,null,0,null,null,0,0,null,null,0]
["2022-01-17",{"$f":"WEEKNUM(Tabel_kalender[[#This Row],[Datum]],21)","v":3},"1900-01-01",null,"ja",{"$f":"IF(Tabel_kalender[[#This Row],[Werkdag]]=\"ja\",Tabel_kalender[[#This Row],[Datum]],IF(E386=\"ja\",A386,IF(E387=\"ja\",A387,IF(E388=\"ja\",A388,IF(E389=\"ja\",A389,IF(E390=\"ja\",A390,IF(E391=\"ja\",A391,IF(E392=\"ja\",A392,IF(E393=\"ja\",A393,IF(E394=\"ja\",A394,IF(E395=\"ja\",A395,IF(E396=\"ja\",A396,IF(E397=\"ja\",A397,IF(E398=\"ja\",A398,IF(E399=\"ja\",A399,IF(E400=\"ja\",A400,IF(E401=\"ja\",A401,IF(E402=\"ja\",A402,IF(A403=\"ja\",A403,\"Volgepland\")))))))))))))))))))","v":"2022-01-17"},null,null,null,null,0,null,null,0,0,null,null,0]
["2022-01-18",{"$f":"WEEKNUM(Tabel_kalender[[#This Row],[Datum]],21)","v":3},"1900-01-02",null,"nee",{"$f":"IF(Tabel_kalender[[#This Row],[Werkdag]]=\"ja\",Tabel_kalender[[#This Row],[Datum]],IF(E387=\"ja\",A387,IF(E388=\"ja\",A388,IF(E389=\"ja\",A389,IF(E390=\"ja\",A390,IF(E391=\"ja\",A391,IF(E392=\"ja\",A392,IF(E393=\"ja\",A393,IF(E394=\"ja\",A394,IF(E395=\"ja\",A395,IF(E396=\"ja\",A396,IF(E397=\"ja\",A397,IF(E398=\"ja\",A398,IF(E399=\"ja\",A399,IF(E400=\"ja\",A400,IF(E401=\"ja\",A401,IF(E402=\"ja\",A402,IF(E403=\"ja\",A403,IF(A404=\"ja\",A404,\"Volgepland\")))))))))))))))))))","v":"2022-01-20"},null,null,null,null,0,null,null,0,0,null,null,0]
["2022-01-19",{"$f":"WEEKNUM(Tabel_kalender[[#This Row],[Datum]],21)","v":3},"1900-01-03",null,"nee",{"$f":"IF(Tabel_kalender[[#This Row],[Werkdag]]=\"ja\",Tabel_kalender[[#This Row],[Datum]],IF(E388=\"ja\",A388,IF(E389=\"ja\",A389,IF(E390=\"ja\",A390,IF(E391=\"ja\",A391,IF(E392=\"ja\",A392,IF(E393=\"ja\",A393,IF(E394=\"ja\",A394,IF(E395=\"ja\",A395,IF(E396=\"ja\",A396,IF(E397=\"ja\",A397,IF(E398=\"ja\",A398,IF(E399=\"ja\",A399,IF(E400=\"ja\",A400,IF(E401=\"ja\",A401,IF(E402=\"ja\",A402,IF(E403=\"ja\",A403,IF(E404=\"ja\",A404,IF(A405=\"ja\",A405,\"Volgepland\")))))))))))))))))))","v":"2022-01-20"},null,null,null,null,0,null,null,0,0,null,null,0]
["2022-01-20",{"$f":"WEEKNUM(Tabel_kalender[[#This Row],[Datum]],21)","v":3},"1900-01-04",null,"ja",{"$f":"IF(Tabel_kalender[[#This Row],[Werkdag]]=\"ja\",Tabel_kalender[[#This Row],[Datum]],IF(E389=\"ja\",A389,IF(E390=\"ja\",A390,IF(E391=\"ja\",A391,IF(E392=\"ja\",A392,IF(E393=\"ja\",A393,IF(E394=\"ja\",A394,IF(E395=\"ja\",A395,IF(E396=\"ja\",A396,IF(E397=\"ja\",A397,IF(E398=\"ja\",A398,IF(E399=\"ja\",A399,IF(E400=\"ja\",A400,IF(E401=\"ja\",A401,IF(E402=\"ja\",A402,IF(E403=\"ja\",A403,IF(E404=\"ja\",A404,IF(E405=\"ja\",A405,IF(A406=\"ja\",A406,\"Volgepland\")))))))))))))))))))","v":"2022-01-20"},null,null,null,null,0,null,null,{"$f":"IF(L388>0,L388-K388,)-M388","v":0},{"$f":"P387","v":0},null,null,{"$f":"IF(P388>0,P388-O388,)-Q388","v":0}]
["2022-01-21",{"$f":"WEEKNUM(Tabel_kalender[[#This Row],[Datum]],21)","v":3},{"$f":"WEEKDAY(A389,2)","v":"1900-01-05"},null,"ja",{"$f":"IF(Tabel_kalender[[#This Row],[Werkdag]]=\"ja\",Tabel_kalender[[#This Row],[Datum]],IF(E390=\"ja\",A390,IF(E391=\"ja\",A391,IF(E392=\"ja\",A392,IF(E393=\"ja\",A393,IF(E394=\"ja\",A394,IF(E395=\"ja\",A395,IF(E396=\"ja\",A396,IF(E397=\"ja\",A397,IF(E398=\"ja\",A398,IF(E399=\"ja\",A399,IF(E400=\"ja\",A400,IF(E401=\"ja\",A401,IF(E402=\"ja\",A402,IF(E403=\"ja\",A403,IF(E404=\"ja\",A404,IF(E405=\"ja\",A405,IF(E406=\"ja\",A406,IF(A407=\"ja\",A407,\"Volgepland\")))))))))))))))))))","v":"2022-01-21"},null,null,null,null,{"$f":"L388","v":0},null,null,0,0,null,null,0]
[{"$f":"A389+1","v":"2022-01-22"},{"$f":"WEEKNUM(Tabel_kalender[[#This Row],[Datum]],21)","v":3},"1900-01-06",null,"nee",{"$f":"IF(Tabel_kalender[[#This Row],[Werkdag]]=\"ja\",Tabel_kalender[[#This Row],[Datum]],IF(E391=\"ja\",A391,IF(E392=\"ja\",A392,IF(E393=\"ja\",A393,IF(E394=\"ja\",A394,IF(E395=\"ja\",A395,IF(E396=\"ja\",A396,IF(E397=\"ja\",A397,IF(E398=\"ja\",A398,IF(E399=\"ja\",A399,IF(E400=\"ja\",A400,IF(E401=\"ja\",A401,IF(E402=\"ja\",A402,IF(E403=\"ja\",A403,IF(E404=\"ja\",A404,IF(E405=\"ja\",A405,IF(E406=\"ja\",A406,IF(E407=\"ja\",A407,IF(A408=\"ja\",A408,\"Volgepland\")))))))))))))))))))","v":"2022-01-28"},null,null,null,null,0,null,null,0,0,null,null,0]
["2022-01-23",{"$f":"WEEKNUM(Tabel_kalender[[#This Row],[Datum]],21)","v":3},"1900-01-07",null,"nee",{"$f":"IF(Tabel_kalender[[#This Row],[Werkdag]]=\"ja\",Tabel_kalender[[#This Row],[Datum]],IF(E392=\"ja\",A392,IF(E393=\"ja\",A393,IF(E394=\"ja\",A394,IF(E395=\"ja\",A395,IF(E396=\"ja\",A396,IF(E397=\"ja\",A397,IF(E398=\"ja\",A398,IF(E399=\"ja\",A399,IF(E400=\"ja\",A400,IF(E401=\"ja\",A401,IF(E402=\"ja\",A402,IF(E403=\"ja\",A403,IF(E404=\"ja\",A404,IF(E405=\"ja\",A405,IF(E406=\"ja\",A406,IF(E407=\"ja\",A407,IF(E408=\"ja\",A408,IF(A409=\"ja\",A409,\"Volgepland\")))))))))))))))))))","v":"2022-01-28"},null,null,null,null,0,null,null,0,0,null,null,0]
["2022-01-24",{"$f":"WEEKNUM(Tabel_kalender[[#This Row],[Datum]],21)","v":4},"1900-01-01",null,"nee",{"$f":"IF(Tabel_kalender[[#This Row],[Werkdag]]=\"ja\",Tabel_kalender[[#This Row],[Datum]],IF(E393=\"ja\",A393,IF(E394=\"ja\",A394,IF(E395=\"ja\",A395,IF(E396=\"ja\",A396,IF(E397=\"ja\",A397,IF(E398=\"ja\",A398,IF(E399=\"ja\",A399,IF(E400=\"ja\",A400,IF(E401=\"ja\",A401,IF(E402=\"ja\",A402,IF(E403=\"ja\",A403,IF(E404=\"ja\",A404,IF(E405=\"ja\",A405,IF(E406=\"ja\",A406,IF(E407=\"ja\",A407,IF(E408=\"ja\",A408,IF(E409=\"ja\",A409,IF(A410=\"ja\",A410,\"Volgepland\")))))))))))))))))))","v":"2022-01-28"},null,null,null,null,0,null,null,0,0,null,null,0]
["2022-01-25",{"$f":"WEEKNUM(Tabel_kalender[[#This Row],[Datum]],21)","v":4},"1900-01-02",null,"nee",{"$f":"IF(Tabel_kalender[[#This Row],[Werkdag]]=\"ja\",Tabel_kalender[[#This Row],[Datum]],IF(E394=\"ja\",A394,IF(E395=\"ja\",A395,IF(E396=\"ja\",A396,IF(E397=\"ja\",A397,IF(E398=\"ja\",A398,IF(E399=\"ja\",A399,IF(E400=\"ja\",A400,IF(E401=\"ja\",A401,IF(E402=\"ja\",A402,IF(E403=\"ja\",A403,IF(E404=\"ja\",A404,IF(E405=\"ja\",A405,IF(E406=\"ja\",A406,IF(E407=\"ja\",A407,IF(E408=\"ja\",A408,IF(E409=\"ja\",A409,IF(E410=\"ja\",A410,IF(A411=\"ja\",A411,\"Volgepland\")))))))))))))))))))","v":"2022-01-28"},null,null,null,null,0,null,null,0,0,null,null,0]
["2022-01-26",{"$f":"WEEKNUM(Tabel_kalender[[#This Row],[Datum]],21)","v":4},"1900-01-03",null,"nee",{"$f":"IF(Tabel_kalender[[#This Row],[Werkdag]]=\"ja\",Tabel_kalender[[#This Row],[Datum]],IF(E395=\"ja\",A395,IF(E396=\"ja\",A396,IF(E397=\"ja\",A397,IF(E398=\"ja\",A398,IF(E399=\"ja\",A399,IF(E400=\"ja\",A400,IF(E401=\"ja\",A401,IF(E402=\"ja\",A402,IF(E403=\"ja\",A403,IF(E404=\"ja\",A404,IF(E405=\"ja\",A405,IF(E406=\"ja\",A406,IF(E407=\"ja\",A407,IF(E408=\"ja\",A408,IF(E409=\"ja\",A409,IF(E410=\"ja\",A410,IF(E411=\"ja\",A411,IF(A412=\"ja\",A412,\"Volgepland\")))))))))))))))))))","v":"2022-01-28"},null,null,null,null,0,null,null,0,0,null,null,0]
["2022-01-27",{"$f":"WEEKNUM(Tabel_kalender[[#This Row],[Datum]],21)","v":4},"1900-01-04",null,"nee",{"$f":"IF(Tabel_kalender[[#This Row],[Werkdag]]=\"ja\",Tabel_kalender[[#This Row],[Datum]],IF(E396=\"ja\",A396,IF(E397=\"ja\",A397,IF(E398=\"ja\",A398,IF(E399=\"ja\",A399,IF(E400=\"ja\",A400,IF(E401=\"ja\",A401,IF(E402=\"ja\",A402,IF(E403=\"ja\",A403,IF(E404=\"ja\",A404,IF(E405=\"ja\",A405,IF(E406=\"ja\",A406,IF(E407=\"ja\",A407,IF(E408=\"ja\",A408,IF(E409=\"ja\",A409,IF(E410=\"ja\",A410,IF(E411=\"ja\",A411,IF(E412=\"ja\",A412,IF(A413=\"ja\",A413,\"Volgepland\")))))))))))))))))))","v":"2022-01-28"},null,null,null,null,0,null,null,0,0,null,null,0]
["2022-01-28",{"$f":"WEEKNUM(Tabel_kalender[[#This Row],[Datum]],21)","v":4},"1900-01-05",null,"ja",{"$f":"IF(Tabel_kalender[[#This Row],[Werkdag]]=\"ja\",Tabel_kalender[[#This Row],[Datum]],IF(E397=\"ja\",A397,IF(E398=\"ja\",A398,IF(E399=\"ja\",A399,IF(E400=\"ja\",A400,IF(E401=\"ja\",A401,IF(E402=\"ja\",A402,IF(E403=\"ja\",A403,IF(E404=\"ja\",A404,IF(E405=\"ja\",A405,IF(E406=\"ja\",A406,IF(E407=\"ja\",A407,IF(E408=\"ja\",A408,IF(E409=\"ja\",A409,IF(E410=\"ja\",A410,IF(E411=\"ja\",A411,IF(E412=\"ja\",A412,IF(E413=\"ja\",A413,IF(A414=\"ja\",A414,\"Volgepland\")))))))))))))))))))","v":"2022-01-28"},null,null,null,null,0,null,null,0,0,null,null,0]
["2022-01-29",{"$f":"WEEKNUM(Tabel_kalender[[#This Row],[Datum]],21)","v":4},"1900-01-06",null,"ja",{"$f":"IF(Tabel_kalender[[#This Row],[Werkdag]]=\"ja\",Tabel_kalender[[#This Row],[Datum]],IF(E398=\"ja\",A398,IF(E399=\"ja\",A399,IF(E400=\"ja\",A400,IF(E401=\"ja\",A401,IF(E402=\"ja\",A402,IF(E403=\"ja\",A403,IF(E404=\"ja\",A404,IF(E405=\"ja\",A405,IF(E406=\"ja\",A406,IF(E407=\"ja\",A407,IF(E408=\"ja\",A408,IF(E409=\"ja\",A409,IF(E410=\"ja\",A410,IF(E411=\"ja\",A411,IF(E412=\"ja\",A412,IF(E413=\"ja\",A413,IF(E414=\"ja\",A414,IF(A415=\"ja\",A415,\"Volgepland\")))))))))))))))))))","v":"2022-01-29"},null,null,null,null,0,null,null,0,0,null,null,0]
["2022-01-30",{"$f":"WEEKNUM(Tabel_kalender[[#This Row],[Datum]],21)","v":4},"1900-01-07",null,"ja",{"$f":"IF(Tabel_kalender[[#This Row],[Werkdag]]=\"ja\",Tabel_kalender[[#This Row],[Datum]],IF(E399=\"ja\",A399,IF(E400=\"ja\",A400,IF(E401=\"ja\",A401,IF(E402=\"ja\",A402,IF(E403=\"ja\",A403,IF(E404=\"ja\",A404,IF(E405=\"ja\",A405,IF(E406=\"ja\",A406,IF(E407=\"ja\",A407,IF(E408=\"ja\",A408,IF(E409=\"ja\",A409,IF(E410=\"ja\",A410,IF(E411=\"ja\",A411,IF(E412=\"ja\",A412,IF(E413=\"ja\",A413,IF(E414=\"ja\",A414,IF(E415=\"ja\",A415,IF(A416=\"ja\",A416,\"Volgepland\")))))))))))))))))))","v":"2022-01-30"},null,null,null,null,0,null,null,0,0,null,null,0]
["2022-01-31",{"$f":"WEEKNUM(Tabel_kalender[[#This Row],[Datum]],21)","v":5},"1900-01-01",null,"ja",{"$f":"IF(Tabel_kalender[[#This Row],[Werkdag]]=\"ja\",Tabel_kalender[[#This Row],[Datum]],IF(E400=\"ja\",A400,IF(E401=\"ja\",A401,IF(E402=\"ja\",A402,IF(E403=\"ja\",A403,IF(E404=\"ja\",A404,IF(E405=\"ja\",A405,IF(E406=\"ja\",A406,IF(E407=\"ja\",A407,IF(E408=\"ja\",A408,IF(E409=\"ja\",A409,IF(E410=\"ja\",A410,IF(E411=\"ja\",A411,IF(E412=\"ja\",A412,IF(E413=\"ja\",A413,IF(E414=\"ja\",A414,IF(E415=\"ja\",A415,IF(E416=\"ja\",A416,IF(A417=\"ja\",A417,\"Volgepland\")))))))))))))))))))","v":"2022-01-31"},null,null,null,null,0,null,null,0,0,null,null,0]
["2022-02-01",{"$f":"WEEKNUM(Tabel_kalender[[#This Row],[Datum]],21)","v":5},"1900-01-02",null,"nee",{"$f":"IF(Tabel_kalender[[#This Row],[Werkdag]]=\"ja\",Tabel_kalender[[#This Row],[Datum]],IF(E401=\"ja\",A401,IF(E402=\"ja\",A402,IF(E403=\"ja\",A403,IF(E404=\"ja\",A404,IF(E405=\"ja\",A405,IF(E406=\"ja\",A406,IF(E407=\"ja\",A407,IF(E408=\"ja\",A408,IF(E409=\"ja\",A409,IF(E410=\"ja\",A410,IF(E411=\"ja\",A411,IF(E412=\"ja\",A412,IF(E413=\"ja\",A413,IF(E414=\"ja\",A414,IF(E415=\"ja\",A415,IF(E416=\"ja\",A416,IF(E417=\"ja\",A417,IF(A418=\"ja\",A418,\"Volgepland\")))))))))))))))))))","v":"2022-02-03"},null,null,null,null,0,null,null,0,0,null,null,0]
["2022-02-02",{"$f":"WEEKNUM(Tabel_kalender[[#This Row],[Datum]],21)","v":5},"1900-01-03",null,"nee",{"$f":"IF(Tabel_kalender[[#This Row],[Werkdag]]=\"ja\",Tabel_kalender[[#This Row],[Datum]],IF(E402=\"ja\",A402,IF(E403=\"ja\",A403,IF(E404=\"ja\",A404,IF(E405=\"ja\",A405,IF(E406=\"ja\",A406,IF(E407=\"ja\",A407,IF(E408=\"ja\",A408,IF(E409=\"ja\",A409,IF(E410=\"ja\",A410,IF(E411=\"ja\",A411,IF(E412=\"ja\",A412,IF(E413=\"ja\",A413,IF(E414=\"ja\",A414,IF(E415=\"ja\",A415,IF(E416=\"ja\",A416,IF(E417=\"ja\",A417,IF(E418=\"ja\",A418,IF(A419=\"ja\",A419,\"Volgepland\")))))))))))))))))))","v":"2022-02-03"},null,null,null,null,0,null,null,0,0,null,null,0]
["2022-02-03",{"$f":"WEEKNUM(Tabel_kalender[[#This Row],[Datum]],21)","v":5},"1900-01-04",null,"ja",{"$f":"IF(Tabel_kalender[[#This Row],[Werkdag]]=\"ja\",Tabel_kalender[[#This Row],[Datum]],IF(E403=\"ja\",A403,IF(E404=\"ja\",A404,IF(E405=\"ja\",A405,IF(E406=\"ja\",A406,IF(E407=\"ja\",A407,IF(E408=\"ja\",A408,IF(E409=\"ja\",A409,IF(E410=\"ja\",A410,IF(E411=\"ja\",A411,IF(E412=\"ja\",A412,IF(E413=\"ja\",A413,IF(E414=\"ja\",A414,IF(E415=\"ja\",A415,IF(E416=\"ja\",A416,IF(E417=\"ja\",A417,IF(E418=\"ja\",A418,IF(E419=\"ja\",A419,IF(A420=\"ja\",A420,\"Volgepland\")))))))))))))))))))","v":"2022-02-03"},null,null,null,null,0,null,null,0,0,null,null,0]
["2022-02-04",{"$f":"WEEKNUM(Tabel_kalender[[#This Row],[Datum]],21)","v":5},"1900-01-05",null,"ja",{"$f":"IF(Tabel_kalender[[#This Row],[Werkdag]]=\"ja\",Tabel_kalender[[#This Row],[Datum]],IF(E404=\"ja\",A404,IF(E405=\"ja\",A405,IF(E406=\"ja\",A406,IF(E407=\"ja\",A407,IF(E408=\"ja\",A408,IF(E409=\"ja\",A409,IF(E410=\"ja\",A410,IF(E411=\"ja\",A411,IF(E412=\"ja\",A412,IF(E413=\"ja\",A413,IF(E414=\"ja\",A414,IF(E415=\"ja\",A415,IF(E416=\"ja\",A416,IF(E417=\"ja\",A417,IF(E418=\"ja\",A418,IF(E419=\"ja\",A419,IF(E420=\"ja\",A420,IF(A421=\"ja\",A421,\"Volgepland\")))))))))))))))))))","v":"2022-02-04"},null,null,null,null,0,null,null,0,0,null,null,0]
["2022-02-05",{"$f":"WEEKNUM(Tabel_kalender[[#This Row],[Datum]],21)","v":5},"1900-01-06",null,"ja",{"$f":"IF(Tabel_kalender[[#This Row],[Werkdag]]=\"ja\",Tabel_kalender[[#This Row],[Datum]],IF(E405=\"ja\",A405,IF(E406=\"ja\",A406,IF(E407=\"ja\",A407,IF(E408=\"ja\",A408,IF(E409=\"ja\",A409,IF(E410=\"ja\",A410,IF(E411=\"ja\",A411,IF(E412=\"ja\",A412,IF(E413=\"ja\",A413,IF(E414=\"ja\",A414,IF(E415=\"ja\",A415,IF(E416=\"ja\",A416,IF(E417=\"ja\",A417,IF(E418=\"ja\",A418,IF(E419=\"ja\",A419,IF(E420=\"ja\",A420,IF(E421=\"ja\",A421,IF(A422=\"ja\",A422,\"Volgepland\")))))))))))))))))))","v":"2022-02-05"},null,null,null,null,0,null,null,0,0,null,null,0]
["2022-02-06",{"$f":"WEEKNUM(Tabel_kalender[[#This Row],[Datum]],21)","v":5},"1900-01-07",null,"ja",{"$f":"IF(Tabel_kalender[[#This Row],[Werkdag]]=\"ja\",Tabel_kalender[[#This Row],[Datum]],IF(E406=\"ja\",A406,IF(E407=\"ja\",A407,IF(E408=\"ja\",A408,IF(E409=\"ja\",A409,IF(E410=\"ja\",A410,IF(E411=\"ja\",A411,IF(E412=\"ja\",A412,IF(E413=\"ja\",A413,IF(E414=\"ja\",A414,IF(E415=\"ja\",A415,IF(E416=\"ja\",A416,IF(E417=\"ja\",A417,IF(E418=\"ja\",A418,IF(E419=\"ja\",A419,IF(E420=\"ja\",A420,IF(E421=\"ja\",A421,IF(E422=\"ja\",A422,IF(A423=\"ja\",A423,\"Volgepland\")))))))))))))))))))","v":"2022-02-06"},null,null,null,null,0,null,null,0,0,null,null,0]
["2022-02-07",{"$f":"WEEKNUM(Tabel_kalender[[#This Row],[Datum]],21)","v":6},"1900-01-01",null,"ja",{"$f":"IF(Tabel_kalender[[#This Row],[Werkdag]]=\"ja\",Tabel_kalender[[#This Row],[Datum]],IF(E407=\"ja\",A407,IF(E408=\"ja\",A408,IF(E409=\"ja\",A409,IF(E410=\"ja\",A410,IF(E411=\"ja\",A411,IF(E412=\"ja\",A412,IF(E413=\"ja\",A413,IF(E414=\"ja\",A414,IF(E415=\"ja\",A415,IF(E416=\"ja\",A416,IF(E417=\"ja\",A417,IF(E418=\"ja\",A418,IF(E419=\"ja\",A419,IF(E420=\"ja\",A420,IF(E421=\"ja\",A421,IF(E422=\"ja\",A422,IF(E423=\"ja\",A423,IF(A424=\"ja\",A424,\"Volgepland\")))))))))))))))))))","v":"2022-02-07"},null,null,null,null,0,null,null,0,0,null,null,0]
["2022-02-08",{"$f":"WEEKNUM(Tabel_kalender[[#This Row],[Datum]],21)","v":6},"1900-01-02",null,"nee",{"$f":"IF(Tabel_kalender[[#This Row],[Werkdag]]=\"ja\",Tabel_kalender[[#This Row],[Datum]],IF(E408=\"ja\",A408,IF(E409=\"ja\",A409,IF(E410=\"ja\",A410,IF(E411=\"ja\",A411,IF(E412=\"ja\",A412,IF(E413=\"ja\",A413,IF(E414=\"ja\",A414,IF(E415=\"ja\",A415,IF(E416=\"ja\",A416,IF(E417=\"ja\",A417,IF(E418=\"ja\",A418,IF(E419=\"ja\",A419,IF(E420=\"ja\",A420,IF(E421=\"ja\",A421,IF(E422=\"ja\",A422,IF(E423=\"ja\",A423,IF(E424=\"ja\",A424,IF(A425=\"ja\",A425,\"Volgepland\")))))))))))))))))))","v":"2022-02-10"},null,null,null,null,0,null,null,0,0,null,null,0]
["2022-02-09",{"$f":"WEEKNUM(Tabel_kalender[[#This Row],[Datum]],21)","v":6},"1900-01-03",null,"nee",{"$f":"IF(Tabel_kalender[[#This Row],[Werkdag]]=\"ja\",Tabel_kalender[[#This Row],[Datum]],IF(E409=\"ja\",A409,IF(E410=\"ja\",A410,IF(E411=\"ja\",A411,IF(E412=\"ja\",A412,IF(E413=\"ja\",A413,IF(E414=\"ja\",A414,IF(E415=\"ja\",A415,IF(E416=\"ja\",A416,IF(E417=\"ja\",A417,IF(E418=\"ja\",A418,IF(E419=\"ja\",A419,IF(E420=\"ja\",A420,IF(E421=\"ja\",A421,IF(E422=\"ja\",A422,IF(E423=\"ja\",A423,IF(E424=\"ja\",A424,IF(E425=\"ja\",A425,IF(A426=\"ja\",A426,\"Volgepland\")))))))))))))))))))","v":"2022-02-10"},null,null,null,null,0,null,null,0,0,null,null,0]
["2022-02-10",{"$f":"WEEKNUM(Tabel_kalender[[#This Row],[Datum]],21)","v":6},"1900-01-04",null,"ja",{"$f":"IF(Tabel_kalender[[#This Row],[Werkdag]]=\"ja\",Tabel_kalender[[#This Row],[Datum]],IF(E410=\"ja\",A410,IF(E411=\"ja\",A411,IF(E412=\"ja\",A412,IF(E413=\"ja\",A413,IF(E414=\"ja\",A414,IF(E415=\"ja\",A415,IF(E416=\"ja\",A416,IF(E417=\"ja\",A417,IF(E418=\"ja\",A418,IF(E419=\"ja\",A419,IF(E420=\"ja\",A420,IF(E421=\"ja\",A421,IF(E422=\"ja\",A422,IF(E423=\"ja\",A423,IF(E424=\"ja\",A424,IF(E425=\"ja\",A425,IF(E426=\"ja\",A426,IF(A427=\"ja\",A427,\"Volgepland\")))))))))))))))))))","v":"2022-02-10"},null,null,null,null,0,null,null,0,0,null,null,0]
["2022-02-11",{"$f":"WEEKNUM(Tabel_kalender[[#This Row],[Datum]],21)","v":6},"1900-01-05",null,"ja",{"$f":"IF(Tabel_kalender[[#This Row],[Werkdag]]=\"ja\",Tabel_kalender[[#This Row],[Datum]],IF(E411=\"ja\",A411,IF(E412=\"ja\",A412,IF(E413=\"ja\",A413,IF(E414=\"ja\",A414,IF(E415=\"ja\",A415,IF(E416=\"ja\",A416,IF(E417=\"ja\",A417,IF(E418=\"ja\",A418,IF(E419=\"ja\",A419,IF(E420=\"ja\",A420,IF(E421=\"ja\",A421,IF(E422=\"ja\",A422,IF(E423=\"ja\",A423,IF(E424=\"ja\",A424,IF(E425=\"ja\",A425,IF(E426=\"ja\",A426,IF(E427=\"ja\",A427,IF(A428=\"ja\",A428,\"Volgepland\")))))))))))))))))))","v":"2022-02-11"},null,null,null,null,0,null,null,0,0,null,null,0]
["2022-02-12",{"$f":"WEEKNUM(Tabel_kalender[[#This Row],[Datum]],21)","v":6},"1900-01-06",null,"ja",{"$f":"IF(Tabel_kalender[[#This Row],[Werkdag]]=\"ja\",Tabel_kalender[[#This Row],[Datum]],IF(E412=\"ja\",A412,IF(E413=\"ja\",A413,IF(E414=\"ja\",A414,IF(E415=\"ja\",A415,IF(E416=\"ja\",A416,IF(E417=\"ja\",A417,IF(E418=\"ja\",A418,IF(E419=\"ja\",A419,IF(E420=\"ja\",A420,IF(E421=\"ja\",A421,IF(E422=\"ja\",A422,IF(E423=\"ja\",A423,IF(E424=\"ja\",A424,IF(E425=\"ja\",A425,IF(E426=\"ja\",A426,IF(E427=\"ja\",A427,IF(E428=\"ja\",A428,IF(A429=\"ja\",A429,\"Volgepland\")))))))))))))))))))","v":"2022-02-12"},null,null,null,null,0,null,null,0,0,null,null,0]
["2022-02-13",{"$f":"WEEKNUM(Tabel_kalender[[#This Row],[Datum]],21)","v":6},"1900-01-07",null,"ja",{"$f":"IF(Tabel_kalender[[#This Row],[Werkdag]]=\"ja\",Tabel_kalender[[#This Row],[Datum]],IF(E413=\"ja\",A413,IF(E414=\"ja\",A414,IF(E415=\"ja\",A415,IF(E416=\"ja\",A416,IF(E417=\"ja\",A417,IF(E418=\"ja\",A418,IF(E419=\"ja\",A419,IF(E420=\"ja\",A420,IF(E421=\"ja\",A421,IF(E422=\"ja\",A422,IF(E423=\"ja\",A423,IF(E424=\"ja\",A424,IF(E425=\"ja\",A425,IF(E426=\"ja\",A426,IF(E427=\"ja\",A427,IF(E428=\"ja\",A428,IF(E429=\"ja\",A429,IF(A430=\"ja\",A430,\"Volgepland\")))))))))))))))))))","v":"2022-02-13"},null,null,null,null,0,null,null,0,0,null,null,0]
["2022-02-14",{"$f":"WEEKNUM(Tabel_kalender[[#This Row],[Datum]],21)","v":7},"1900-01-01",null,"ja",{"$f":"IF(Tabel_kalender[[#This Row],[Werkdag]]=\"ja\",Tabel_kalender[[#This Row],[Datum]],IF(E414=\"ja\",A414,IF(E415=\"ja\",A415,IF(E416=\"ja\",A416,IF(E417=\"ja\",A417,IF(E418=\"ja\",A418,IF(E419=\"ja\",A419,IF(E420=\"ja\",A420,IF(E421=\"ja\",A421,IF(E422=\"ja\",A422,IF(E423=\"ja\",A423,IF(E424=\"ja\",A424,IF(E425=\"ja\",A425,IF(E426=\"ja\",A426,IF(E427=\"ja\",A427,IF(E428=\"ja\",A428,IF(E429=\"ja\",A429,IF(E430=\"ja\",A430,IF(A431=\"ja\",A431,\"Volgepland\")))))))))))))))))))","v":"2022-02-14"},null,null,null,null,0,null,null,0,0,null,null,0]
["2022-02-15",{"$f":"WEEKNUM(Tabel_kalender[[#This Row],[Datum]],21)","v":7},"1900-01-02",null,"nee",{"$f":"IF(Tabel_kalender[[#This Row],[Werkdag]]=\"ja\",Tabel_kalender[[#This Row],[Datum]],IF(E415=\"ja\",A415,IF(E416=\"ja\",A416,IF(E417=\"ja\",A417,IF(E418=\"ja\",A418,IF(E419=\"ja\",A419,IF(E420=\"ja\",A420,IF(E421=\"ja\",A421,IF(E422=\"ja\",A422,IF(E423=\"ja\",A423,IF(E424=\"ja\",A424,IF(E425=\"ja\",A425,IF(E426=\"ja\",A426,IF(E427=\"ja\",A427,IF(E428=\"ja\",A428,IF(E429=\"ja\",A429,IF(E430=\"ja\",A430,IF(E431=\"ja\",A431,IF(A432=\"ja\",A432,\"Volgepland\")))))))))))))))))))","v":"2022-02-17"},null,null,null,null,0,null,null,0,0,null,null,0]
["2022-02-16",{"$f":"WEEKNUM(Tabel_kalender[[#This Row],[Datum]],21)","v":7},"1900-01-03",null,"nee",{"$f":"IF(Tabel_kalender[[#This Row],[Werkdag]]=\"ja\",Tabel_kalender[[#This Row],[Datum]],IF(E416=\"ja\",A416,IF(E417=\"ja\",A417,IF(E418=\"ja\",A418,IF(E419=\"ja\",A419,IF(E420=\"ja\",A420,IF(E421=\"ja\",A421,IF(E422=\"ja\",A422,IF(E423=\"ja\",A423,IF(E424=\"ja\",A424,IF(E425=\"ja\",A425,IF(E426=\"ja\",A426,IF(E427=\"ja\",A427,IF(E428=\"ja\",A428,IF(E429=\"ja\",A429,IF(E430=\"ja\",A430,IF(E431=\"ja\",A431,IF(E432=\"ja\",A432,IF(A433=\"ja\",A433,\"Volgepland\")))))))))))))))))))","v":"2022-02-17"},null,null,null,null,0,null,null,0,0,null,null,0]
["2022-02-17",{"$f":"WEEKNUM(Tabel_kalender[[#This Row],[Datum]],21)","v":7},"1900-01-04",null,"ja",{"$f":"IF(Tabel_kalender[[#This Row],[Werkdag]]=\"ja\",Tabel_kalender[[#This Row],[Datum]],IF(E417=\"ja\",A417,IF(E418=\"ja\",A418,IF(E419=\"ja\",A419,IF(E420=\"ja\",A420,IF(E421=\"ja\",A421,IF(E422=\"ja\",A422,IF(E423=\"ja\",A423,IF(E424=\"ja\",A424,IF(E425=\"ja\",A425,IF(E426=\"ja\",A426,IF(E427=\"ja\",A427,IF(E428=\"ja\",A428,IF(E429=\"ja\",A429,IF(E430=\"ja\",A430,IF(E431=\"ja\",A431,IF(E432=\"ja\",A432,IF(E433=\"ja\",A433,IF(A434=\"ja\",A434,\"Volgepland\")))))))))))))))))))","v":"2022-02-17"},null,null,null,null,0,null,null,0,0,null,null,0]
["2022-02-18",{"$f":"WEEKNUM(Tabel_kalender[[#This Row],[Datum]],21)","v":7},"1900-01-05",null,"ja",{"$f":"IF(Tabel_kalender[[#This Row],[Werkdag]]=\"ja\",Tabel_kalender[[#This Row],[Datum]],IF(E418=\"ja\",A418,IF(E419=\"ja\",A419,IF(E420=\"ja\",A420,IF(E421=\"ja\",A421,IF(E422=\"ja\",A422,IF(E423=\"ja\",A423,IF(E424=\"ja\",A424,IF(E425=\"ja\",A425,IF(E426=\"ja\",A426,IF(E427=\"ja\",A427,IF(E428=\"ja\",A428,IF(E429=\"ja\",A429,IF(E430=\"ja\",A430,IF(E431=\"ja\",A431,IF(E432=\"ja\",A432,IF(E433=\"ja\",A433,IF(E434=\"ja\",A434,IF(A435=\"ja\",A435,\"Volgepland\")))))))))))))))))))","v":"2022-02-18"},null,null,null,null,0,null,null,0,0,null,null,0]
["2022-02-19",{"$f":"WEEKNUM(Tabel_kalender[[#This Row],[Datum]],21)","v":7},"1900-01-06",null,"ja",{"$f":"IF(Tabel_kalender[[#This Row],[Werkdag]]=\"ja\",Tabel_kalender[[#This Row],[Datum]],IF(E419=\"ja\",A419,IF(E420=\"ja\",A420,IF(E421=\"ja\",A421,IF(E422=\"ja\",A422,IF(E423=\"ja\",A423,IF(E424=\"ja\",A424,IF(E425=\"ja\",A425,IF(E426=\"ja\",A426,IF(E427=\"ja\",A427,IF(E428=\"ja\",A428,IF(E429=\"ja\",A429,IF(E430=\"ja\",A430,IF(E431=\"ja\",A431,IF(E432=\"ja\",A432,IF(E433=\"ja\",A433,IF(E434=\"ja\",A434,IF(E435=\"ja\",A435,IF(A436=\"ja\",A436,\"Volgepland\")))))))))))))))))))","v":"2022-02-19"},null,null,null,null,0,null,null,0,0,null,null,0]
["2022-02-20",{"$f":"WEEKNUM(Tabel_kalender[[#This Row],[Datum]],21)","v":7},"1900-01-07",null,"ja",{"$f":"IF(Tabel_kalender[[#This Row],[Werkdag]]=\"ja\",Tabel_kalender[[#This Row],[Datum]],IF(E420=\"ja\",A420,IF(E421=\"ja\",A421,IF(E422=\"ja\",A422,IF(E423=\"ja\",A423,IF(E424=\"ja\",A424,IF(E425=\"ja\",A425,IF(E426=\"ja\",A426,IF(E427=\"ja\",A427,IF(E428=\"ja\",A428,IF(E429=\"ja\",A429,IF(E430=\"ja\",A430,IF(E431=\"ja\",A431,IF(E432=\"ja\",A432,IF(E433=\"ja\",A433,IF(E434=\"ja\",A434,IF(E435=\"ja\",A435,IF(E436=\"ja\",A436,IF(A437=\"ja\",A437,\"Volgepland\")))))))))))))))))))","v":"2022-02-20"},null,null,null,null,0,null,null,0,0,null,null,0]
["2022-02-21",{"$f":"WEEKNUM(Tabel_kalender[[#This Row],[Datum]],21)","v":8},"1900-01-01",null,"ja",{"$f":"IF(Tabel_kalender[[#This Row],[Werkdag]]=\"ja\",Tabel_kalender[[#This Row],[Datum]],IF(E421=\"ja\",A421,IF(E422=\"ja\",A422,IF(E423=\"ja\",A423,IF(E424=\"ja\",A424,IF(E425=\"ja\",A425,IF(E426=\"ja\",A426,IF(E427=\"ja\",A427,IF(E428=\"ja\",A428,IF(E429=\"ja\",A429,IF(E430=\"ja\",A430,IF(E431=\"ja\",A431,IF(E432=\"ja\",A432,IF(E433=\"ja\",A433,IF(E434=\"ja\",A434,IF(E435=\"ja\",A435,IF(E436=\"ja\",A436,IF(E437=\"ja\",A437,IF(A438=\"ja\",A438,\"Volgepland\")))))))))))))))))))","v":"2022-02-21"},null,null,null,null,0,null,null,0,0,null,null,0]
["2022-02-22",{"$f":"WEEKNUM(Tabel_kalender[[#This Row],[Datum]],21)","v":8},"1900-01-02",null,"nee",{"$f":"IF(Tabel_kalender[[#This Row],[Werkdag]]=\"ja\",Tabel_kalender[[#This Row],[Datum]],IF(E422=\"ja\",A422,IF(E423=\"ja\",A423,IF(E424=\"ja\",A424,IF(E425=\"ja\",A425,IF(E426=\"ja\",A426,IF(E427=\"ja\",A427,IF(E428=\"ja\",A428,IF(E429=\"ja\",A429,IF(E430=\"ja\",A430,IF(E431=\"ja\",A431,IF(E432=\"ja\",A432,IF(E433=\"ja\",A433,IF(E434=\"ja\",A434,IF(E435=\"ja\",A435,IF(E436=\"ja\",A436,IF(E437=\"ja\",A437,IF(E438=\"ja\",A438,IF(A439=\"ja\",A439,\"Volgepland\")))))))))))))))))))","v":"2022-02-24"},null,null,null,null,0,null,null,0,0,null,null,0]
["2022-02-23",{"$f":"WEEKNUM(Tabel_kalender[[#This Row],[Datum]],21)","v":8},"1900-01-03",null,"nee",{"$f":"IF(Tabel_kalender[[#This Row],[Werkdag]]=\"ja\",Tabel_kalender[[#This Row],[Datum]],IF(E423=\"ja\",A423,IF(E424=\"ja\",A424,IF(E425=\"ja\",A425,IF(E426=\"ja\",A426,IF(E427=\"ja\",A427,IF(E428=\"ja\",A428,IF(E429=\"ja\",A429,IF(E430=\"ja\",A430,IF(E431=\"ja\",A431,IF(E432=\"ja\",A432,IF(E433=\"ja\",A433,IF(E434=\"ja\",A434,IF(E435=\"ja\",A435,IF(E436=\"ja\",A436,IF(E437=\"ja\",A437,IF(E438=\"ja\",A438,IF(E439=\"ja\",A439,IF(A440=\"ja\",A440,\"Volgepland\")))))))))))))))))))","v":"2022-02-24"},null,null,null,null,0,null,null,0,0,null,null,0]
["2022-02-24",{"$f":"WEEKNUM(Tabel_kalender[[#This Row],[Datum]],21)","v":8},"1900-01-04",null,"ja",{"$f":"IF(Tabel_kalender[[#This Row],[Werkdag]]=\"ja\",Tabel_kalender[[#This Row],[Datum]],IF(E424=\"ja\",A424,IF(E425=\"ja\",A425,IF(E426=\"ja\",A426,IF(E427=\"ja\",A427,IF(E428=\"ja\",A428,IF(E429=\"ja\",A429,IF(E430=\"ja\",A430,IF(E431=\"ja\",A431,IF(E432=\"ja\",A432,IF(E433=\"ja\",A433,IF(E434=\"ja\",A434,IF(E435=\"ja\",A435,IF(E436=\"ja\",A436,IF(E437=\"ja\",A437,IF(E438=\"ja\",A438,IF(E439=\"ja\",A439,IF(E440=\"ja\",A440,IF(A441=\"ja\",A441,\"Volgepland\")))))))))))))))))))","v":"2022-02-24"},null,null,null,null,0,null,null,0,0,null,null,0]
["2022-02-25",{"$f":"WEEKNUM(Tabel_kalender[[#This Row],[Datum]],21)","v":8},"1900-01-05",null,"ja",{"$f":"IF(Tabel_kalender[[#This Row],[Werkdag]]=\"ja\",Tabel_kalender[[#This Row],[Datum]],IF(E425=\"ja\",A425,IF(E426=\"ja\",A426,IF(E427=\"ja\",A427,IF(E428=\"ja\",A428,IF(E429=\"ja\",A429,IF(E430=\"ja\",A430,IF(E431=\"ja\",A431,IF(E432=\"ja\",A432,IF(E433=\"ja\",A433,IF(E434=\"ja\",A434,IF(E435=\"ja\",A435,IF(E436=\"ja\",A436,IF(E437=\"ja\",A437,IF(E438=\"ja\",A438,IF(E439=\"ja\",A439,IF(E440=\"ja\",A440,IF(E441=\"ja\",A441,IF(A442=\"ja\",A442,\"Volgepland\")))))))))))))))))))","v":"2022-02-25"},null,null,null,null,0,null,null,0,0,null,null,0]
["2022-02-26",{"$f":"WEEKNUM(Tabel_kalender[[#This Row],[Datum]],21)","v":8},"1900-01-06",null,"ja",{"$f":"IF(Tabel_kalender[[#This Row],[Werkdag]]=\"ja\",Tabel_kalender[[#This Row],[Datum]],IF(E426=\"ja\",A426,IF(E427=\"ja\",A427,IF(E428=\"ja\",A428,IF(E429=\"ja\",A429,IF(E430=\"ja\",A430,IF(E431=\"ja\",A431,IF(E432=\"ja\",A432,IF(E433=\"ja\",A433,IF(E434=\"ja\",A434,IF(E435=\"ja\",A435,IF(E436=\"ja\",A436,IF(E437=\"ja\",A437,IF(E438=\"ja\",A438,IF(E439=\"ja\",A439,IF(E440=\"ja\",A440,IF(E441=\"ja\",A441,IF(E442=\"ja\",A442,IF(A443=\"ja\",A443,\"Volgepland\")))))))))))))))))))","v":"2022-02-26"},null,null,null,null,0,null,null,0,0,null,null,0]
["2022-02-27",{"$f":"WEEKNUM(Tabel_kalender[[#This Row],[Datum]],21)","v":8},"1900-01-07",null,"ja",{"$f":"IF(Tabel_kalender[[#This Row],[Werkdag]]=\"ja\",Tabel_kalender[[#This Row],[Datum]],IF(E427=\"ja\",A427,IF(E428=\"ja\",A428,IF(E429=\"ja\",A429,IF(E430=\"ja\",A430,IF(E431=\"ja\",A431,IF(E432=\"ja\",A432,IF(E433=\"ja\",A433,IF(E434=\"ja\",A434,IF(E435=\"ja\",A435,IF(E436=\"ja\",A436,IF(E437=\"ja\",A437,IF(E438=\"ja\",A438,IF(E439=\"ja\",A439,IF(E440=\"ja\",A440,IF(E441=\"ja\",A441,IF(E442=\"ja\",A442,IF(E443=\"ja\",A443,IF(A444=\"ja\",A444,\"Volgepland\")))))))))))))))))))","v":"2022-02-27"},null,null,null,null,0,null,null,0,0,null,null,0]
["2022-02-28",{"$f":"WEEKNUM(Tabel_kalender[[#This Row],[Datum]],21)","v":9},"1900-01-01",null,"ja",{"$f":"IF(Tabel_kalender[[#This Row],[Werkdag]]=\"ja\",Tabel_kalender[[#This Row],[Datum]],IF(E428=\"ja\",A428,IF(E429=\"ja\",A429,IF(E430=\"ja\",A430,IF(E431=\"ja\",A431,IF(E432=\"ja\",A432,IF(E433=\"ja\",A433,IF(E434=\"ja\",A434,IF(E435=\"ja\",A435,IF(E436=\"ja\",A436,IF(E437=\"ja\",A437,IF(E438=\"ja\",A438,IF(E439=\"ja\",A439,IF(E440=\"ja\",A440,IF(E441=\"ja\",A441,IF(E442=\"ja\",A442,IF(E443=\"ja\",A443,IF(E444=\"ja\",A444,IF(A445=\"ja\",A445,\"Volgepland\")))))))))))))))))))","v":"2022-02-28"},null,null,null,null,0,null,null,0,0,null,null,0]
["2022-03-01",{"$f":"WEEKNUM(Tabel_kalender[[#This Row],[Datum]],21)","v":9},"1900-01-02",null,"nee",{"$f":"IF(Tabel_kalender[[#This Row],[Werkdag]]=\"ja\",Tabel_kalender[[#This Row],[Datum]],IF(E429=\"ja\",A429,IF(E430=\"ja\",A430,IF(E431=\"ja\",A431,IF(E432=\"ja\",A432,IF(E433=\"ja\",A433,IF(E434=\"ja\",A434,IF(E435=\"ja\",A435,IF(E436=\"ja\",A436,IF(E437=\"ja\",A437,IF(E438=\"ja\",A438,IF(E439=\"ja\",A439,IF(E440=\"ja\",A440,IF(E441=\"ja\",A441,IF(E442=\"ja\",A442,IF(E443=\"ja\",A443,IF(E444=\"ja\",A444,IF(E445=\"ja\",A445,IF(A446=\"ja\",A446,\"Volgepland\")))))))))))))))))))","v":"2022-03-03"},null,null,null,null,0,null,null,0,0,null,null,0]
["2022-03-02",{"$f":"WEEKNUM(Tabel_kalender[[#This Row],[Datum]],21)","v":9},"1900-01-03",null,"nee",{"$f":"IF(Tabel_kalender[[#This Row],[Werkdag]]=\"ja\",Tabel_kalender[[#This Row],[Datum]],IF(E430=\"ja\",A430,IF(E431=\"ja\",A431,IF(E432=\"ja\",A432,IF(E433=\"ja\",A433,IF(E434=\"ja\",A434,IF(E435=\"ja\",A435,IF(E436=\"ja\",A436,IF(E437=\"ja\",A437,IF(E438=\"ja\",A438,IF(E439=\"ja\",A439,IF(E440=\"ja\",A440,IF(E441=\"ja\",A441,IF(E442=\"ja\",A442,IF(E443=\"ja\",A443,IF(E444=\"ja\",A444,IF(E445=\"ja\",A445,IF(E446=\"ja\",A446,IF(A447=\"ja\",A447,\"Volgepland\")))))))))))))))))))","v":"2022-03-03"},null,null,null,null,0,null,null,0,0,null,null,0]
["2022-03-03",{"$f":"WEEKNUM(Tabel_kalender[[#This Row],[Datum]],21)","v":9},"1900-01-04",null,"ja",{"$f":"IF(Tabel_kalender[[#This Row],[Werkdag]]=\"ja\",Tabel_kalender[[#This Row],[Datum]],IF(E431=\"ja\",A431,IF(E432=\"ja\",A432,IF(E433=\"ja\",A433,IF(E434=\"ja\",A434,IF(E435=\"ja\",A435,IF(E436=\"ja\",A436,IF(E437=\"ja\",A437,IF(E438=\"ja\",A438,IF(E439=\"ja\",A439,IF(E440=\"ja\",A440,IF(E441=\"ja\",A441,IF(E442=\"ja\",A442,IF(E443=\"ja\",A443,IF(E444=\"ja\",A444,IF(E445=\"ja\",A445,IF(E446=\"ja\",A446,IF(E447=\"ja\",A447,IF(A448=\"ja\",A448,\"Volgepland\")))))))))))))))))))","v":"2022-03-03"},null,null,null,null,0,null,null,0,0,null,null,0]
["2022-03-04",{"$f":"WEEKNUM(Tabel_kalender[[#This Row],[Datum]],21)","v":9},"1900-01-05",null,"ja",{"$f":"IF(Tabel_kalender[[#This Row],[Werkdag]]=\"ja\",Tabel_kalender[[#This Row],[Datum]],IF(E432=\"ja\",A432,IF(E433=\"ja\",A433,IF(E434=\"ja\",A434,IF(E435=\"ja\",A435,IF(E436=\"ja\",A436,IF(E437=\"ja\",A437,IF(E438=\"ja\",A438,IF(E439=\"ja\",A439,IF(E440=\"ja\",A440,IF(E441=\"ja\",A441,IF(E442=\"ja\",A442,IF(E443=\"ja\",A443,IF(E444=\"ja\",A444,IF(E445=\"ja\",A445,IF(E446=\"ja\",A446,IF(E447=\"ja\",A447,IF(E448=\"ja\",A448,IF(A449=\"ja\",A449,\"Volgepland\")))))))))))))))))))","v":"2022-03-04"},null,null,null,null,0,null,null,0,0,null,null,0]
["2022-03-05",{"$f":"WEEKNUM(Tabel_kalender[[#This Row],[Datum]],21)","v":9},"1900-01-06",null,"ja",{"$f":"IF(Tabel_kalender[[#This Row],[Werkdag]]=\"ja\",Tabel_kalender[[#This Row],[Datum]],IF(E433=\"ja\",A433,IF(E434=\"ja\",A434,IF(E435=\"ja\",A435,IF(E436=\"ja\",A436,IF(E437=\"ja\",A437,IF(E438=\"ja\",A438,IF(E439=\"ja\",A439,IF(E440=\"ja\",A440,IF(E441=\"ja\",A441,IF(E442=\"ja\",A442,IF(E443=\"ja\",A443,IF(E444=\"ja\",A444,IF(E445=\"ja\",A445,IF(E446=\"ja\",A446,IF(E447=\"ja\",A447,IF(E448=\"ja\",A448,IF(E449=\"ja\",A449,IF(A450=\"ja\",A450,\"Volgepland\")))))))))))))))))))","v":"2022-03-05"},null,null,null,null,0,null,null,0,0,null,null,0]
["2022-03-06",{"$f":"WEEKNUM(Tabel_kalender[[#This Row],[Datum]],21)","v":9},"1900-01-07",null,"ja",{"$f":"IF(Tabel_kalender[[#This Row],[Werkdag]]=\"ja\",Tabel_kalender[[#This Row],[Datum]],IF(E434=\"ja\",A434,IF(E435=\"ja\",A435,IF(E436=\"ja\",A436,IF(E437=\"ja\",A437,IF(E438=\"ja\",A438,IF(E439=\"ja\",A439,IF(E440=\"ja\",A440,IF(E441=\"ja\",A441,IF(E442=\"ja\",A442,IF(E443=\"ja\",A443,IF(E444=\"ja\",A444,IF(E445=\"ja\",A445,IF(E446=\"ja\",A446,IF(E447=\"ja\",A447,IF(E448=\"ja\",A448,IF(E449=\"ja\",A449,IF(E450=\"ja\",A450,IF(A451=\"ja\",A451,\"Volgepland\")))))))))))))))))))","v":"2022-03-06"},null,null,null,null,0,null,null,0,0,null,null,0]
["2022-03-07",{"$f":"WEEKNUM(Tabel_kalender[[#This Row],[Datum]],21)","v":10},"1900-01-01",null,"ja",{"$f":"IF(Tabel_kalender[[#This Row],[Werkdag]]=\"ja\",Tabel_kalender[[#This Row],[Datum]],IF(E435=\"ja\",A435,IF(E436=\"ja\",A436,IF(E437=\"ja\",A437,IF(E438=\"ja\",A438,IF(E439=\"ja\",A439,IF(E440=\"ja\",A440,IF(E441=\"ja\",A441,IF(E442=\"ja\",A442,IF(E443=\"ja\",A443,IF(E444=\"ja\",A444,IF(E445=\"ja\",A445,IF(E446=\"ja\",A446,IF(E447=\"ja\",A447,IF(E448=\"ja\",A448,IF(E449=\"ja\",A449,IF(E450=\"ja\",A450,IF(E451=\"ja\",A451,IF(A452=\"ja\",A452,\"Volgepland\")))))))))))))))))))","v":"2022-03-07"},null,null,null,null,0,null,null,0,0,null,null,0]
["2022-03-08",{"$f":"WEEKNUM(Tabel_kalender[[#This Row],[Datum]],21)","v":10},"1900-01-02",null,"nee",{"$f":"IF(Tabel_kalender[[#This Row],[Werkdag]]=\"ja\",Tabel_kalender[[#This Row],[Datum]],IF(E436=\"ja\",A436,IF(E437=\"ja\",A437,IF(E438=\"ja\",A438,IF(E439=\"ja\",A439,IF(E440=\"ja\",A440,IF(E441=\"ja\",A441,IF(E442=\"ja\",A442,IF(E443=\"ja\",A443,IF(E444=\"ja\",A444,IF(E445=\"ja\",A445,IF(E446=\"ja\",A446,IF(E447=\"ja\",A447,IF(E448=\"ja\",A448,IF(E449=\"ja\",A449,IF(E450=\"ja\",A450,IF(E451=\"ja\",A451,IF(E452=\"ja\",A452,IF(A453=\"ja\",A453,\"Volgepland\")))))))))))))))))))","v":"2022-03-10"},null,null,null,null,0,null,null,0,0,null,null,0]
["2022-03-09",{"$f":"WEEKNUM(Tabel_kalender[[#This Row],[Datum]],21)","v":10},"1900-01-03",null,"nee",{"$f":"IF(Tabel_kalender[[#This Row],[Werkdag]]=\"ja\",Tabel_kalender[[#This Row],[Datum]],IF(E437=\"ja\",A437,IF(E438=\"ja\",A438,IF(E439=\"ja\",A439,IF(E440=\"ja\",A440,IF(E441=\"ja\",A441,IF(E442=\"ja\",A442,IF(E443=\"ja\",A443,IF(E444=\"ja\",A444,IF(E445=\"ja\",A445,IF(E446=\"ja\",A446,IF(E447=\"ja\",A447,IF(E448=\"ja\",A448,IF(E449=\"ja\",A449,IF(E450=\"ja\",A450,IF(E451=\"ja\",A451,IF(E452=\"ja\",A452,IF(E453=\"ja\",A453,IF(A454=\"ja\",A454,\"Volgepland\")))))))))))))))))))","v":"2022-03-10"},null,null,null,null,0,null,null,0,0,null,null,0]
["2022-03-10",{"$f":"WEEKNUM(Tabel_kalender[[#This Row],[Datum]],21)","v":10},"1900-01-04",null,"ja",{"$f":"IF(Tabel_kalender[[#This Row],[Werkdag]]=\"ja\",Tabel_kalender[[#This Row],[Datum]],IF(E438=\"ja\",A438,IF(E439=\"ja\",A439,IF(E440=\"ja\",A440,IF(E441=\"ja\",A441,IF(E442=\"ja\",A442,IF(E443=\"ja\",A443,IF(E444=\"ja\",A444,IF(E445=\"ja\",A445,IF(E446=\"ja\",A446,IF(E447=\"ja\",A447,IF(E448=\"ja\",A448,IF(E449=\"ja\",A449,IF(E450=\"ja\",A450,IF(E451=\"ja\",A451,IF(E452=\"ja\",A452,IF(E453=\"ja\",A453,IF(E454=\"ja\",A454,IF(A455=\"ja\",A455,\"Volgepland\")))))))))))))))))))","v":"2022-03-10"},null,null,null,null,0,null,null,0,0,null,null,0]
["2022-03-11",{"$f":"WEEKNUM(Tabel_kalender[[#This Row],[Datum]],21)","v":10},"1900-01-05",null,"ja",{"$f":"IF(Tabel_kalender[[#This Row],[Werkdag]]=\"ja\",Tabel_kalender[[#This Row],[Datum]],IF(E439=\"ja\",A439,IF(E440=\"ja\",A440,IF(E441=\"ja\",A441,IF(E442=\"ja\",A442,IF(E443=\"ja\",A443,IF(E444=\"ja\",A444,IF(E445=\"ja\",A445,IF(E446=\"ja\",A446,IF(E447=\"ja\",A447,IF(E448=\"ja\",A448,IF(E449=\"ja\",A449,IF(E450=\"ja\",A450,IF(E451=\"ja\",A451,IF(E452=\"ja\",A452,IF(E453=\"ja\",A453,IF(E454=\"ja\",A454,IF(E455=\"ja\",A455,IF(A456=\"ja\",A456,\"Volgepland\")))))))))))))))))))","v":"2022-03-11"},null,null,null,null,0,null,null,0,0,null,null,0]
["2022-03-12",{"$f":"WEEKNUM(Tabel_kalender[[#This Row],[Datum]],21)","v":10},"1900-01-06",null,"ja",{"$f":"IF(Tabel_kalender[[#This Row],[Werkdag]]=\"ja\",Tabel_kalender[[#This Row],[Datum]],IF(E440=\"ja\",A440,IF(E441=\"ja\",A441,IF(E442=\"ja\",A442,IF(E443=\"ja\",A443,IF(E444=\"ja\",A444,IF(E445=\"ja\",A445,IF(E446=\"ja\",A446,IF(E447=\"ja\",A447,IF(E448=\"ja\",A448,IF(E449=\"ja\",A449,IF(E450=\"ja\",A450,IF(E451=\"ja\",A451,IF(E452=\"ja\",A452,IF(E453=\"ja\",A453,IF(E454=\"ja\",A454,IF(E455=\"ja\",A455,IF(E456=\"ja\",A456,IF(A457=\"ja\",A457,\"Volgepland\")))))))))))))))))))","v":"2022-03-12"},null,null,null,null,0,null,null,0,0,null,null,0]
["2022-03-13",{"$f":"WEEKNUM(Tabel_kalender[[#This Row],[Datum]],21)","v":10},"1900-01-07",null,"ja",{"$f":"IF(Tabel_kalender[[#This Row],[Werkdag]]=\"ja\",Tabel_kalender[[#This Row],[Datum]],IF(E441=\"ja\",A441,IF(E442=\"ja\",A442,IF(E443=\"ja\",A443,IF(E444=\"ja\",A444,IF(E445=\"ja\",A445,IF(E446=\"ja\",A446,IF(E447=\"ja\",A447,IF(E448=\"ja\",A448,IF(E449=\"ja\",A449,IF(E450=\"ja\",A450,IF(E451=\"ja\",A451,IF(E452=\"ja\",A452,IF(E453=\"ja\",A453,IF(E454=\"ja\",A454,IF(E455=\"ja\",A455,IF(E456=\"ja\",A456,IF(E457=\"ja\",A457,IF(A458=\"ja\",A458,\"Volgepland\")))))))))))))))))))","v":"2022-03-13"},null,null,null,null,0,null,null,0,0,null,null,0]
["2022-03-14",{"$f":"WEEKNUM(Tabel_kalender[[#This Row],[Datum]],21)","v":11},"1900-01-01",null,"ja",{"$f":"IF(Tabel_kalender[[#This Row],[Werkdag]]=\"ja\",Tabel_kalender[[#This Row],[Datum]],IF(E442=\"ja\",A442,IF(E443=\"ja\",A443,IF(E444=\"ja\",A444,IF(E445=\"ja\",A445,IF(E446=\"ja\",A446,IF(E447=\"ja\",A447,IF(E448=\"ja\",A448,IF(E449=\"ja\",A449,IF(E450=\"ja\",A450,IF(E451=\"ja\",A451,IF(E452=\"ja\",A452,IF(E453=\"ja\",A453,IF(E454=\"ja\",A454,IF(E455=\"ja\",A455,IF(E456=\"ja\",A456,IF(E457=\"ja\",A457,IF(E458=\"ja\",A458,IF(A459=\"ja\",A459,\"Volgepland\")))))))))))))))))))","v":"2022-03-14"},null,null,null,null,0,null,null,0,0,null,null,0]
["2022-03-15",{"$f":"WEEKNUM(Tabel_kalender[[#This Row],[Datum]],21)","v":11},"1900-01-02",null,"ja",{"$f":"IF(Tabel_kalender[[#This Row],[Werkdag]]=\"ja\",Tabel_kalender[[#This Row],[Datum]],IF(E443=\"ja\",A443,IF(E444=\"ja\",A444,IF(E445=\"ja\",A445,IF(E446=\"ja\",A446,IF(E447=\"ja\",A447,IF(E448=\"ja\",A448,IF(E449=\"ja\",A449,IF(E450=\"ja\",A450,IF(E451=\"ja\",A451,IF(E452=\"ja\",A452,IF(E453=\"ja\",A453,IF(E454=\"ja\",A454,IF(E455=\"ja\",A455,IF(E456=\"ja\",A456,IF(E457=\"ja\",A457,IF(E458=\"ja\",A458,IF(E459=\"ja\",A459,IF(A460=\"ja\",A460,\"Volgepland\")))))))))))))))))))","v":"2022-03-15"},null,null,null,null,0,null,null,0,0,null,null,0]
["2022-03-16",{"$f":"WEEKNUM(Tabel_kalender[[#This Row],[Datum]],21)","v":11},"1900-01-03",null,"ja",{"$f":"IF(Tabel_kalender[[#This Row],[Werkdag]]=\"ja\",Tabel_kalender[[#This Row],[Datum]],IF(E444=\"ja\",A444,IF(E445=\"ja\",A445,IF(E446=\"ja\",A446,IF(E447=\"ja\",A447,IF(E448=\"ja\",A448,IF(E449=\"ja\",A449,IF(E450=\"ja\",A450,IF(E451=\"ja\",A451,IF(E452=\"ja\",A452,IF(E453=\"ja\",A453,IF(E454=\"ja\",A454,IF(E455=\"ja\",A455,IF(E456=\"ja\",A456,IF(E457=\"ja\",A457,IF(E458=\"ja\",A458,IF(E459=\"ja\",A459,IF(E460=\"ja\",A460,IF(A461=\"ja\",A461,\"Volgepland\")))))))))))))))))))","v":"2022-03-16"},null,null,null,null,0,null,null,0,0,null,null,0]
["2022-03-17",{"$f":"WEEKNUM(Tabel_kalender[[#This Row],[Datum]],21)","v":11},"1900-01-04",null,"ja",{"$f":"IF(Tabel_kalender[[#This Row],[Werkdag]]=\"ja\",Tabel_kalender[[#This Row],[Datum]],IF(E445=\"ja\",A445,IF(E446=\"ja\",A446,IF(E447=\"ja\",A447,IF(E448=\"ja\",A448,IF(E449=\"ja\",A449,IF(E450=\"ja\",A450,IF(E451=\"ja\",A451,IF(E452=\"ja\",A452,IF(E453=\"ja\",A453,IF(E454=\"ja\",A454,IF(E455=\"ja\",A455,IF(E456=\"ja\",A456,IF(E457=\"ja\",A457,IF(E458=\"ja\",A458,IF(E459=\"ja\",A459,IF(E460=\"ja\",A460,IF(E461=\"ja\",A461,IF(A462=\"ja\",A462,\"Volgepland\")))))))))))))))))))","v":"2022-03-17"},null,null,null,null,0,null,null,0,0,null,null,0]
["2022-03-18",{"$f":"WEEKNUM(Tabel_kalender[[#This Row],[Datum]],21)","v":11},"1900-01-05",null,"ja",{"$f":"IF(Tabel_kalender[[#This Row],[Werkdag]]=\"ja\",Tabel_kalender[[#This Row],[Datum]],IF(E446=\"ja\",A446,IF(E447=\"ja\",A447,IF(E448=\"ja\",A448,IF(E449=\"ja\",A449,IF(E450=\"ja\",A450,IF(E451=\"ja\",A451,IF(E452=\"ja\",A452,IF(E453=\"ja\",A453,IF(E454=\"ja\",A454,IF(E455=\"ja\",A455,IF(E456=\"ja\",A456,IF(E457=\"ja\",A457,IF(E458=\"ja\",A458,IF(E459=\"ja\",A459,IF(E460=\"ja\",A460,IF(E461=\"ja\",A461,IF(E462=\"ja\",A462,IF(A463=\"ja\",A463,\"Volgepland\")))))))))))))))))))","v":"2022-03-18"},null,null,null,null,0,null,null,0,0,null,null,0]
["2022-03-19",{"$f":"WEEKNUM(Tabel_kalender[[#This Row],[Datum]],21)","v":11},"1900-01-06",null,"ja",{"$f":"IF(Tabel_kalender[[#This Row],[Werkdag]]=\"ja\",Tabel_kalender[[#This Row],[Datum]],IF(E447=\"ja\",A447,IF(E448=\"ja\",A448,IF(E449=\"ja\",A449,IF(E450=\"ja\",A450,IF(E451=\"ja\",A451,IF(E452=\"ja\",A452,IF(E453=\"ja\",A453,IF(E454=\"ja\",A454,IF(E455=\"ja\",A455,IF(E456=\"ja\",A456,IF(E457=\"ja\",A457,IF(E458=\"ja\",A458,IF(E459=\"ja\",A459,IF(E460=\"ja\",A460,IF(E461=\"ja\",A461,IF(E462=\"ja\",A462,IF(E463=\"ja\",A463,IF(A464=\"ja\",A464,\"Volgepland\")))))))))))))))))))","v":"2022-03-19"},null,null,null,null,0,null,null,0,0,null,null,0]
["2022-03-20",{"$f":"WEEKNUM(Tabel_kalender[[#This Row],[Datum]],21)","v":11},"1900-01-07",null,"ja",{"$f":"IF(Tabel_kalender[[#This Row],[Werkdag]]=\"ja\",Tabel_kalender[[#This Row],[Datum]],IF(E448=\"ja\",A448,IF(E449=\"ja\",A449,IF(E450=\"ja\",A450,IF(E451=\"ja\",A451,IF(E452=\"ja\",A452,IF(E453=\"ja\",A453,IF(E454=\"ja\",A454,IF(E455=\"ja\",A455,IF(E456=\"ja\",A456,IF(E457=\"ja\",A457,IF(E458=\"ja\",A458,IF(E459=\"ja\",A459,IF(E460=\"ja\",A460,IF(E461=\"ja\",A461,IF(E462=\"ja\",A462,IF(E463=\"ja\",A463,IF(E464=\"ja\",A464,IF(A465=\"ja\",A465,\"Volgepland\")))))))))))))))))))","v":"2022-03-20"},null,null,null,null,0,null,null,0,0,null,null,0]
["2022-03-21",{"$f":"WEEKNUM(Tabel_kalender[[#This Row],[Datum]],21)","v":12},"1900-01-01",null,"ja",{"$f":"IF(Tabel_kalender[[#This Row],[Werkdag]]=\"ja\",Tabel_kalender[[#This Row],[Datum]],IF(E449=\"ja\",A449,IF(E450=\"ja\",A450,IF(E451=\"ja\",A451,IF(E452=\"ja\",A452,IF(E453=\"ja\",A453,IF(E454=\"ja\",A454,IF(E455=\"ja\",A455,IF(E456=\"ja\",A456,IF(E457=\"ja\",A457,IF(E458=\"ja\",A458,IF(E459=\"ja\",A459,IF(E460=\"ja\",A460,IF(E461=\"ja\",A461,IF(E462=\"ja\",A462,IF(E463=\"ja\",A463,IF(E464=\"ja\",A464,IF(E465=\"ja\",A465,IF(A466=\"ja\",A466,\"Volgepland\")))))))))))))))))))","v":"2022-03-21"},null,null,null,null,0,null,null,0,0,null,null,0]
["2022-03-22",{"$f":"WEEKNUM(Tabel_kalender[[#This Row],[Datum]],21)","v":12},"1900-01-02",null,"ja",{"$f":"IF(Tabel_kalender[[#This Row],[Werkdag]]=\"ja\",Tabel_kalender[[#This Row],[Datum]],IF(E450=\"ja\",A450,IF(E451=\"ja\",A451,IF(E452=\"ja\",A452,IF(E453=\"ja\",A453,IF(E454=\"ja\",A454,IF(E455=\"ja\",A455,IF(E456=\"ja\",A456,IF(E457=\"ja\",A457,IF(E458=\"ja\",A458,IF(E459=\"ja\",A459,IF(E460=\"ja\",A460,IF(E461=\"ja\",A461,IF(E462=\"ja\",A462,IF(E463=\"ja\",A463,IF(E464=\"ja\",A464,IF(E465=\"ja\",A465,IF(E466=\"ja\",A466,IF(A467=\"ja\",A467,\"Volgepland\")))))))))))))))))))","v":"2022-03-22"},null,null,null,null,0,null,null,0,0,null,null,0]
["2022-03-23",{"$f":"WEEKNUM(Tabel_kalender[[#This Row],[Datum]],21)","v":12},"1900-01-03",null,"ja",{"$f":"IF(Tabel_kalender[[#This Row],[Werkdag]]=\"ja\",Tabel_kalender[[#This Row],[Datum]],IF(E451=\"ja\",A451,IF(E452=\"ja\",A452,IF(E453=\"ja\",A453,IF(E454=\"ja\",A454,IF(E455=\"ja\",A455,IF(E456=\"ja\",A456,IF(E457=\"ja\",A457,IF(E458=\"ja\",A458,IF(E459=\"ja\",A459,IF(E460=\"ja\",A460,IF(E461=\"ja\",A461,IF(E462=\"ja\",A462,IF(E463=\"ja\",A463,IF(E464=\"ja\",A464,IF(E465=\"ja\",A465,IF(E466=\"ja\",A466,IF(E467=\"ja\",A467,IF(A468=\"ja\",A468,\"Volgepland\")))))))))))))))))))","v":"2022-03-23"},null,null,null,null,0,null,null,0,0,null,null,0]
["2022-03-24",{"$f":"WEEKNUM(Tabel_kalender[[#This Row],[Datum]],21)","v":12},"1900-01-04",null,"ja",{"$f":"IF(Tabel_kalender[[#This Row],[Werkdag]]=\"ja\",Tabel_kalender[[#This Row],[Datum]],IF(E452=\"ja\",A452,IF(E453=\"ja\",A453,IF(E454=\"ja\",A454,IF(E455=\"ja\",A455,IF(E456=\"ja\",A456,IF(E457=\"ja\",A457,IF(E458=\"ja\",A458,IF(E459=\"ja\",A459,IF(E460=\"ja\",A460,IF(E461=\"ja\",A461,IF(E462=\"ja\",A462,IF(E463=\"ja\",A463,IF(E464=\"ja\",A464,IF(E465=\"ja\",A465,IF(E466=\"ja\",A466,IF(E467=\"ja\",A467,IF(E468=\"ja\",A468,IF(A469=\"ja\",A469,\"Volgepland\")))))))))))))))))))","v":"2022-03-24"},null,null,null,null,0,null,null,0,0,null,null,0]
["2022-03-25",{"$f":"WEEKNUM(Tabel_kalender[[#This Row],[Datum]],21)","v":12},"1900-01-05",null,"ja",{"$f":"IF(Tabel_kalender[[#This Row],[Werkdag]]=\"ja\",Tabel_kalender[[#This Row],[Datum]],IF(E453=\"ja\",A453,IF(E454=\"ja\",A454,IF(E455=\"ja\",A455,IF(E456=\"ja\",A456,IF(E457=\"ja\",A457,IF(E458=\"ja\",A458,IF(E459=\"ja\",A459,IF(E460=\"ja\",A460,IF(E461=\"ja\",A461,IF(E462=\"ja\",A462,IF(E463=\"ja\",A463,IF(E464=\"ja\",A464,IF(E465=\"ja\",A465,IF(E466=\"ja\",A466,IF(E467=\"ja\",A467,IF(E468=\"ja\",A468,IF(E469=\"ja\",A469,IF(A470=\"ja\",A470,\"Volgepland\")))))))))))))))))))","v":"2022-03-25"},null,null,null,null,0,null,null,{"$f":"IF(L452>0,L452-K452,)-M452","v":0},{"$f":"P451","v":0},null,null,{"$f":"IF(P452>0,P452-O452,)-Q452","v":0}]
["2022-03-26",{"$f":"WEEKNUM(Tabel_kalender[[#This Row],[Datum]],21)","v":12},{"$f":"WEEKDAY(A453,2)","v":"1900-01-06"},null,"ja",{"$f":"IF(Tabel_kalender[[#This Row],[Werkdag]]=\"ja\",Tabel_kalender[[#This Row],[Datum]],IF(E454=\"ja\",A454,IF(E455=\"ja\",A455,IF(E456=\"ja\",A456,IF(E457=\"ja\",A457,IF(E458=\"ja\",A458,IF(E459=\"ja\",A459,IF(E460=\"ja\",A460,IF(E461=\"ja\",A461,IF(E462=\"ja\",A462,IF(E463=\"ja\",A463,IF(E464=\"ja\",A464,IF(E465=\"ja\",A465,IF(E466=\"ja\",A466,IF(E467=\"ja\",A467,IF(E468=\"ja\",A468,IF(E469=\"ja\",A469,IF(E470=\"ja\",A470,IF(A471=\"ja\",A471,\"Volgepland\")))))))))))))))))))","v":"2022-03-26"},null,null,null,null,{"$f":"L452","v":0},null,null,0,0,null,null,0]
[{"$f":"A453+1","v":"2022-03-27"},{"$f":"WEEKNUM(Tabel_kalender[[#This Row],[Datum]],21)","v":12},"1900-01-07",null,"ja",{"$f":"IF(Tabel_kalender[[#This Row],[Werkdag]]=\"ja\",Tabel_kalender[[#This Row],[Datum]],IF(E455=\"ja\",A455,IF(E456=\"ja\",A456,IF(E457=\"ja\",A457,IF(E458=\"ja\",A458,IF(E459=\"ja\",A459,IF(E460=\"ja\",A460,IF(E461=\"ja\",A461,IF(E462=\"ja\",A462,IF(E463=\"ja\",A463,IF(E464=\"ja\",A464,IF(E465=\"ja\",A465,IF(E466=\"ja\",A466,IF(E467=\"ja\",A467,IF(E468=\"ja\",A468,IF(E469=\"ja\",A469,IF(E470=\"ja\",A470,IF(E471=\"ja\",A471,IF(A472=\"ja\",A472,\"Volgepland\")))))))))))))))))))","v":"2022-03-27"},null,null,null,null,0,null,null,0,0,null,null,0]
["2022-03-28",{"$f":"WEEKNUM(Tabel_kalender[[#This Row],[Datum]],21)","v":13},"1900-01-01",null,"ja",{"$f":"IF(Tabel_kalender[[#This Row],[Werkdag]]=\"ja\",Tabel_kalender[[#This Row],[Datum]],IF(E456=\"ja\",A456,IF(E457=\"ja\",A457,IF(E458=\"ja\",A458,IF(E459=\"ja\",A459,IF(E460=\"ja\",A460,IF(E461=\"ja\",A461,IF(E462=\"ja\",A462,IF(E463=\"ja\",A463,IF(E464=\"ja\",A464,IF(E465=\"ja\",A465,IF(E466=\"ja\",A466,IF(E467=\"ja\",A467,IF(E468=\"ja\",A468,IF(E469=\"ja\",A469,IF(E470=\"ja\",A470,IF(E471=\"ja\",A471,IF(E472=\"ja\",A472,IF(A473=\"ja\",A473,\"Volgepland\")))))))))))))))))))","v":"2022-03-28"},null,null,null,null,0,null,null,0,0,null,null,0]
["2022-03-29",{"$f":"WEEKNUM(Tabel_kalender[[#This Row],[Datum]],21)","v":13},"1900-01-02",null,"ja",{"$f":"IF(Tabel_kalender[[#This Row],[Werkdag]]=\"ja\",Tabel_kalender[[#This Row],[Datum]],IF(E457=\"ja\",A457,IF(E458=\"ja\",A458,IF(E459=\"ja\",A459,IF(E460=\"ja\",A460,IF(E461=\"ja\",A461,IF(E462=\"ja\",A462,IF(E463=\"ja\",A463,IF(E464=\"ja\",A464,IF(E465=\"ja\",A465,IF(E466=\"ja\",A466,IF(E467=\"ja\",A467,IF(E468=\"ja\",A468,IF(E469=\"ja\",A469,IF(E470=\"ja\",A470,IF(E471=\"ja\",A471,IF(E472=\"ja\",A472,IF(E473=\"ja\",A473,IF(A474=\"ja\",A474,\"Volgepland\")))))))))))))))))))","v":"2022-03-29"},null,null,null,null,0,null,null,0,0,null,null,0]
["2022-03-30",{"$f":"WEEKNUM(Tabel_kalender[[#This Row],[Datum]],21)","v":13},"1900-01-03",null,"nee",{"$f":"IF(Tabel_kalender[[#This Row],[Werkdag]]=\"ja\",Tabel_kalender[[#This Row],[Datum]],IF(E458=\"ja\",A458,IF(E459=\"ja\",A459,IF(E460=\"ja\",A460,IF(E461=\"ja\",A461,IF(E462=\"ja\",A462,IF(E463=\"ja\",A463,IF(E464=\"ja\",A464,IF(E465=\"ja\",A465,IF(E466=\"ja\",A466,IF(E467=\"ja\",A467,IF(E468=\"ja\",A468,IF(E469=\"ja\",A469,IF(E470=\"ja\",A470,IF(E471=\"ja\",A471,IF(E472=\"ja\",A472,IF(E473=\"ja\",A473,IF(E474=\"ja\",A474,IF(A475=\"ja\",A475,\"Volgepland\")))))))))))))))))))","v":"2022-03-31"},null,null,null,null,0,null,null,0,0,null,null,0]
["2022-03-31",{"$f":"WEEKNUM(Tabel_kalender[[#This Row],[Datum]],21)","v":13},"1900-01-04",null,"ja",{"$f":"IF(Tabel_kalender[[#This Row],[Werkdag]]=\"ja\",Tabel_kalender[[#This Row],[Datum]],IF(E459=\"ja\",A459,IF(E460=\"ja\",A460,IF(E461=\"ja\",A461,IF(E462=\"ja\",A462,IF(E463=\"ja\",A463,IF(E464=\"ja\",A464,IF(E465=\"ja\",A465,IF(E466=\"ja\",A466,IF(E467=\"ja\",A467,IF(E468=\"ja\",A468,IF(E469=\"ja\",A469,IF(E470=\"ja\",A470,IF(E471=\"ja\",A471,IF(E472=\"ja\",A472,IF(E473=\"ja\",A473,IF(E474=\"ja\",A474,IF(E475=\"ja\",A475,IF(A476=\"ja\",A476,\"Volgepland\")))))))))))))))))))","v":"2022-03-31"},null,null,null,null,0,null,null,0,0,null,null,0]
["2022-04-01",{"$f":"WEEKNUM(Tabel_kalender[[#This Row],[Datum]],21)","v":13},"1900-01-05",null,"ja",{"$f":"IF(Tabel_kalender[[#This Row],[Werkdag]]=\"ja\",Tabel_kalender[[#This Row],[Datum]],IF(E460=\"ja\",A460,IF(E461=\"ja\",A461,IF(E462=\"ja\",A462,IF(E463=\"ja\",A463,IF(E464=\"ja\",A464,IF(E465=\"ja\",A465,IF(E466=\"ja\",A466,IF(E467=\"ja\",A467,IF(E468=\"ja\",A468,IF(E469=\"ja\",A469,IF(E470=\"ja\",A470,IF(E471=\"ja\",A471,IF(E472=\"ja\",A472,IF(E473=\"ja\",A473,IF(E474=\"ja\",A474,IF(E475=\"ja\",A475,IF(E476=\"ja\",A476,IF(A477=\"ja\",A477,\"Volgepland\")))))))))))))))))))","v":"2022-04-01"},null,null,null,null,0,null,null,0,0,null,null,0]
["2022-04-02",{"$f":"WEEKNUM(Tabel_kalender[[#This Row],[Datum]],21)","v":13},"1900-01-06",null,"ja",{"$f":"IF(Tabel_kalender[[#This Row],[Werkdag]]=\"ja\",Tabel_kalender[[#This Row],[Datum]],IF(E461=\"ja\",A461,IF(E462=\"ja\",A462,IF(E463=\"ja\",A463,IF(E464=\"ja\",A464,IF(E465=\"ja\",A465,IF(E466=\"ja\",A466,IF(E467=\"ja\",A467,IF(E468=\"ja\",A468,IF(E469=\"ja\",A469,IF(E470=\"ja\",A470,IF(E471=\"ja\",A471,IF(E472=\"ja\",A472,IF(E473=\"ja\",A473,IF(E474=\"ja\",A474,IF(E475=\"ja\",A475,IF(E476=\"ja\",A476,IF(E477=\"ja\",A477,IF(A478=\"ja\",A478,\"Volgepland\")))))))))))))))))))","v":"2022-04-02"},null,null,null,null,0,null,null,0,0,null,null,0]
["2022-04-03",{"$f":"WEEKNUM(Tabel_kalender[[#This Row],[Datum]],21)","v":13},"1900-01-07",null,"ja",{"$f":"IF(Tabel_kalender[[#This Row],[Werkdag]]=\"ja\",Tabel_kalender[[#This Row],[Datum]],IF(E462=\"ja\",A462,IF(E463=\"ja\",A463,IF(E464=\"ja\",A464,IF(E465=\"ja\",A465,IF(E466=\"ja\",A466,IF(E467=\"ja\",A467,IF(E468=\"ja\",A468,IF(E469=\"ja\",A469,IF(E470=\"ja\",A470,IF(E471=\"ja\",A471,IF(E472=\"ja\",A472,IF(E473=\"ja\",A473,IF(E474=\"ja\",A474,IF(E475=\"ja\",A475,IF(E476=\"ja\",A476,IF(E477=\"ja\",A477,IF(E478=\"ja\",A478,IF(A479=\"ja\",A479,\"Volgepland\")))))))))))))))))))","v":"2022-04-03"},null,null,null,null,0,null,null,0,0,null,null,0]
["2022-04-04",{"$f":"WEEKNUM(Tabel_kalender[[#This Row],[Datum]],21)","v":14},"1900-01-01",null,"ja",{"$f":"IF(Tabel_kalender[[#This Row],[Werkdag]]=\"ja\",Tabel_kalender[[#This Row],[Datum]],IF(E463=\"ja\",A463,IF(E464=\"ja\",A464,IF(E465=\"ja\",A465,IF(E466=\"ja\",A466,IF(E467=\"ja\",A467,IF(E468=\"ja\",A468,IF(E469=\"ja\",A469,IF(E470=\"ja\",A470,IF(E471=\"ja\",A471,IF(E472=\"ja\",A472,IF(E473=\"ja\",A473,IF(E474=\"ja\",A474,IF(E475=\"ja\",A475,IF(E476=\"ja\",A476,IF(E477=\"ja\",A477,IF(E478=\"ja\",A478,IF(E479=\"ja\",A479,IF(A480=\"ja\",A480,\"Volgepland\")))))))))))))))))))","v":"2022-04-04"},null,null,null,null,0,null,null,0,0,null,null,0]
["2022-04-05",{"$f":"WEEKNUM(Tabel_kalender[[#This Row],[Datum]],21)","v":14},"1900-01-02",null,"nee",{"$f":"IF(Tabel_kalender[[#This Row],[Werkdag]]=\"ja\",Tabel_kalender[[#This Row],[Datum]],IF(E464=\"ja\",A464,IF(E465=\"ja\",A465,IF(E466=\"ja\",A466,IF(E467=\"ja\",A467,IF(E468=\"ja\",A468,IF(E469=\"ja\",A469,IF(E470=\"ja\",A470,IF(E471=\"ja\",A471,IF(E472=\"ja\",A472,IF(E473=\"ja\",A473,IF(E474=\"ja\",A474,IF(E475=\"ja\",A475,IF(E476=\"ja\",A476,IF(E477=\"ja\",A477,IF(E478=\"ja\",A478,IF(E479=\"ja\",A479,IF(E480=\"ja\",A480,IF(A481=\"ja\",A481,\"Volgepland\")))))))))))))))))))","v":"2022-04-07"},null,null,null,null,0,null,null,0,0,null,null,0]
["2022-04-06",{"$f":"WEEKNUM(Tabel_kalender[[#This Row],[Datum]],21)","v":14},"1900-01-03",null,"nee",{"$f":"IF(Tabel_kalender[[#This Row],[Werkdag]]=\"ja\",Tabel_kalender[[#This Row],[Datum]],IF(E465=\"ja\",A465,IF(E466=\"ja\",A466,IF(E467=\"ja\",A467,IF(E468=\"ja\",A468,IF(E469=\"ja\",A469,IF(E470=\"ja\",A470,IF(E471=\"ja\",A471,IF(E472=\"ja\",A472,IF(E473=\"ja\",A473,IF(E474=\"ja\",A474,IF(E475=\"ja\",A475,IF(E476=\"ja\",A476,IF(E477=\"ja\",A477,IF(E478=\"ja\",A478,IF(E479=\"ja\",A479,IF(E480=\"ja\",A480,IF(E481=\"ja\",A481,IF(A482=\"ja\",A482,\"Volgepland\")))))))))))))))))))","v":"2022-04-07"},null,null,null,null,0,null,null,0,0,null,null,0]
["2022-04-07",{"$f":"WEEKNUM(Tabel_kalender[[#This Row],[Datum]],21)","v":14},"1900-01-04",null,"ja",{"$f":"IF(Tabel_kalender[[#This Row],[Werkdag]]=\"ja\",Tabel_kalender[[#This Row],[Datum]],IF(E466=\"ja\",A466,IF(E467=\"ja\",A467,IF(E468=\"ja\",A468,IF(E469=\"ja\",A469,IF(E470=\"ja\",A470,IF(E471=\"ja\",A471,IF(E472=\"ja\",A472,IF(E473=\"ja\",A473,IF(E474=\"ja\",A474,IF(E475=\"ja\",A475,IF(E476=\"ja\",A476,IF(E477=\"ja\",A477,IF(E478=\"ja\",A478,IF(E479=\"ja\",A479,IF(E480=\"ja\",A480,IF(E481=\"ja\",A481,IF(E482=\"ja\",A482,IF(A483=\"ja\",A483,\"Volgepland\")))))))))))))))))))","v":"2022-04-07"},null,null,null,null,0,null,null,0,0,null,null,0]
["2022-04-08",{"$f":"WEEKNUM(Tabel_kalender[[#This Row],[Datum]],21)","v":14},"1900-01-05",null,"ja",{"$f":"IF(Tabel_kalender[[#This Row],[Werkdag]]=\"ja\",Tabel_kalender[[#This Row],[Datum]],IF(E467=\"ja\",A467,IF(E468=\"ja\",A468,IF(E469=\"ja\",A469,IF(E470=\"ja\",A470,IF(E471=\"ja\",A471,IF(E472=\"ja\",A472,IF(E473=\"ja\",A473,IF(E474=\"ja\",A474,IF(E475=\"ja\",A475,IF(E476=\"ja\",A476,IF(E477=\"ja\",A477,IF(E478=\"ja\",A478,IF(E479=\"ja\",A479,IF(E480=\"ja\",A480,IF(E481=\"ja\",A481,IF(E482=\"ja\",A482,IF(E483=\"ja\",A483,IF(A484=\"ja\",A484,\"Volgepland\")))))))))))))))))))","v":"2022-04-08"},null,null,null,null,0,null,null,0,0,null,null,0]
["2022-04-09",{"$f":"WEEKNUM(Tabel_kalender[[#This Row],[Datum]],21)","v":14},"1900-01-06",null,"ja",{"$f":"IF(Tabel_kalender[[#This Row],[Werkdag]]=\"ja\",Tabel_kalender[[#This Row],[Datum]],IF(E468=\"ja\",A468,IF(E469=\"ja\",A469,IF(E470=\"ja\",A470,IF(E471=\"ja\",A471,IF(E472=\"ja\",A472,IF(E473=\"ja\",A473,IF(E474=\"ja\",A474,IF(E475=\"ja\",A475,IF(E476=\"ja\",A476,IF(E477=\"ja\",A477,IF(E478=\"ja\",A478,IF(E479=\"ja\",A479,IF(E480=\"ja\",A480,IF(E481=\"ja\",A481,IF(E482=\"ja\",A482,IF(E483=\"ja\",A483,IF(E484=\"ja\",A484,IF(A485=\"ja\",A485,\"Volgepland\")))))))))))))))))))","v":"2022-04-09"},null,null,null,null,0,null,null,0,0,null,null,0]
["2022-04-10",{"$f":"WEEKNUM(Tabel_kalender[[#This Row],[Datum]],21)","v":14},"1900-01-07",null,"ja",{"$f":"IF(Tabel_kalender[[#This Row],[Werkdag]]=\"ja\",Tabel_kalender[[#This Row],[Datum]],IF(E469=\"ja\",A469,IF(E470=\"ja\",A470,IF(E471=\"ja\",A471,IF(E472=\"ja\",A472,IF(E473=\"ja\",A473,IF(E474=\"ja\",A474,IF(E475=\"ja\",A475,IF(E476=\"ja\",A476,IF(E477=\"ja\",A477,IF(E478=\"ja\",A478,IF(E479=\"ja\",A479,IF(E480=\"ja\",A480,IF(E481=\"ja\",A481,IF(E482=\"ja\",A482,IF(E483=\"ja\",A483,IF(E484=\"ja\",A484,IF(E485=\"ja\",A485,IF(A486=\"ja\",A486,\"Volgepland\")))))))))))))))))))","v":"2022-04-10"},null,null,null,null,0,null,null,0,0,null,null,0]
["2022-04-11",{"$f":"WEEKNUM(Tabel_kalender[[#This Row],[Datum]],21)","v":15},"1900-01-01",null,"ja",{"$f":"IF(Tabel_kalender[[#This Row],[Werkdag]]=\"ja\",Tabel_kalender[[#This Row],[Datum]],IF(E470=\"ja\",A470,IF(E471=\"ja\",A471,IF(E472=\"ja\",A472,IF(E473=\"ja\",A473,IF(E474=\"ja\",A474,IF(E475=\"ja\",A475,IF(E476=\"ja\",A476,IF(E477=\"ja\",A477,IF(E478=\"ja\",A478,IF(E479=\"ja\",A479,IF(E480=\"ja\",A480,IF(E481=\"ja\",A481,IF(E482=\"ja\",A482,IF(E483=\"ja\",A483,IF(E484=\"ja\",A484,IF(E485=\"ja\",A485,IF(E486=\"ja\",A486,IF(A487=\"ja\",A487,\"Volgepland\")))))))))))))))))))","v":"2022-04-11"},null,null,null,null,0,null,null,0,0,null,null,0]
["2022-04-12",{"$f":"WEEKNUM(Tabel_kalender[[#This Row],[Datum]],21)","v":15},"1900-01-02",null,"nee",{"$f":"IF(Tabel_kalender[[#This Row],[Werkdag]]=\"ja\",Tabel_kalender[[#This Row],[Datum]],IF(E471=\"ja\",A471,IF(E472=\"ja\",A472,IF(E473=\"ja\",A473,IF(E474=\"ja\",A474,IF(E475=\"ja\",A475,IF(E476=\"ja\",A476,IF(E477=\"ja\",A477,IF(E478=\"ja\",A478,IF(E479=\"ja\",A479,IF(E480=\"ja\",A480,IF(E481=\"ja\",A481,IF(E482=\"ja\",A482,IF(E483=\"ja\",A483,IF(E484=\"ja\",A484,IF(E485=\"ja\",A485,IF(E486=\"ja\",A486,IF(E487=\"ja\",A487,IF(A488=\"ja\",A488,\"Volgepland\")))))))))))))))))))","v":"2022-04-15"},null,null,null,null,0,null,null,0,0,null,null,0]
["2022-04-13",{"$f":"WEEKNUM(Tabel_kalender[[#This Row],[Datum]],21)","v":15},"1900-01-03","Pasen","nee",{"$f":"IF(Tabel_kalender[[#This Row],[Werkdag]]=\"ja\",Tabel_kalender[[#This Row],[Datum]],IF(E472=\"ja\",A472,IF(E473=\"ja\",A473,IF(E474=\"ja\",A474,IF(E475=\"ja\",A475,IF(E476=\"ja\",A476,IF(E477=\"ja\",A477,IF(E478=\"ja\",A478,IF(E479=\"ja\",A479,IF(E480=\"ja\",A480,IF(E481=\"ja\",A481,IF(E482=\"ja\",A482,IF(E483=\"ja\",A483,IF(E484=\"ja\",A484,IF(E485=\"ja\",A485,IF(E486=\"ja\",A486,IF(E487=\"ja\",A487,IF(E488=\"ja\",A488,IF(A489=\"ja\",A489,\"Volgepland\")))))))))))))))))))","v":"2022-04-15"},null,null,null,null,0,null,null,0,0,null,null,0]
["2022-04-14",{"$f":"WEEKNUM(Tabel_kalender[[#This Row],[Datum]],21)","v":15},"1900-01-04","Pasen","nee",{"$f":"IF(Tabel_kalender[[#This Row],[Werkdag]]=\"ja\",Tabel_kalender[[#This Row],[Datum]],IF(E473=\"ja\",A473,IF(E474=\"ja\",A474,IF(E475=\"ja\",A475,IF(E476=\"ja\",A476,IF(E477=\"ja\",A477,IF(E478=\"ja\",A478,IF(E479=\"ja\",A479,IF(E480=\"ja\",A480,IF(E481=\"ja\",A481,IF(E482=\"ja\",A482,IF(E483=\"ja\",A483,IF(E484=\"ja\",A484,IF(E485=\"ja\",A485,IF(E486=\"ja\",A486,IF(E487=\"ja\",A487,IF(E488=\"ja\",A488,IF(E489=\"ja\",A489,IF(A490=\"ja\",A490,\"Volgepland\")))))))))))))))))))","v":"2022-04-15"},null,null,null,null,0,null,null,0,0,null,null,0]
["2022-04-15",{"$f":"WEEKNUM(Tabel_kalender[[#This Row],[Datum]],21)","v":15},"1900-01-05",null,"ja",{"$f":"IF(Tabel_kalender[[#This Row],[Werkdag]]=\"ja\",Tabel_kalender[[#This Row],[Datum]],IF(E474=\"ja\",A474,IF(E475=\"ja\",A475,IF(E476=\"ja\",A476,IF(E477=\"ja\",A477,IF(E478=\"ja\",A478,IF(E479=\"ja\",A479,IF(E480=\"ja\",A480,IF(E481=\"ja\",A481,IF(E482=\"ja\",A482,IF(E483=\"ja\",A483,IF(E484=\"ja\",A484,IF(E485=\"ja\",A485,IF(E486=\"ja\",A486,IF(E487=\"ja\",A487,IF(E488=\"ja\",A488,IF(E489=\"ja\",A489,IF(E490=\"ja\",A490,IF(A491=\"ja\",A491,\"Volgepland\")))))))))))))))))))","v":"2022-04-15"},null,null,null,null,0,null,null,0,0,null,null,0]
["2022-04-16",{"$f":"WEEKNUM(Tabel_kalender[[#This Row],[Datum]],21)","v":15},"1900-01-06",null,"ja",{"$f":"IF(Tabel_kalender[[#This Row],[Werkdag]]=\"ja\",Tabel_kalender[[#This Row],[Datum]],IF(E475=\"ja\",A475,IF(E476=\"ja\",A476,IF(E477=\"ja\",A477,IF(E478=\"ja\",A478,IF(E479=\"ja\",A479,IF(E480=\"ja\",A480,IF(E481=\"ja\",A481,IF(E482=\"ja\",A482,IF(E483=\"ja\",A483,IF(E484=\"ja\",A484,IF(E485=\"ja\",A485,IF(E486=\"ja\",A486,IF(E487=\"ja\",A487,IF(E488=\"ja\",A488,IF(E489=\"ja\",A489,IF(E490=\"ja\",A490,IF(E491=\"ja\",A491,IF(A492=\"ja\",A492,\"Volgepland\")))))))))))))))))))","v":"2022-04-16"},null,null,null,null,0,null,null,0,0,null,null,0]
["2022-04-17",{"$f":"WEEKNUM(Tabel_kalender[[#This Row],[Datum]],21)","v":15},"1900-01-07",null,"ja",{"$f":"IF(Tabel_kalender[[#This Row],[Werkdag]]=\"ja\",Tabel_kalender[[#This Row],[Datum]],IF(E476=\"ja\",A476,IF(E477=\"ja\",A477,IF(E478=\"ja\",A478,IF(E479=\"ja\",A479,IF(E480=\"ja\",A480,IF(E481=\"ja\",A481,IF(E482=\"ja\",A482,IF(E483=\"ja\",A483,IF(E484=\"ja\",A484,IF(E485=\"ja\",A485,IF(E486=\"ja\",A486,IF(E487=\"ja\",A487,IF(E488=\"ja\",A488,IF(E489=\"ja\",A489,IF(E490=\"ja\",A490,IF(E491=\"ja\",A491,IF(E492=\"ja\",A492,IF(A493=\"ja\",A493,\"Volgepland\")))))))))))))))))))","v":"2022-04-17"},null,null,null,null,0,null,null,0,0,null,null,0]
["2022-04-18",{"$f":"WEEKNUM(Tabel_kalender[[#This Row],[Datum]],21)","v":16},"1900-01-01",null,"ja",{"$f":"IF(Tabel_kalender[[#This Row],[Werkdag]]=\"ja\",Tabel_kalender[[#This Row],[Datum]],IF(E477=\"ja\",A477,IF(E478=\"ja\",A478,IF(E479=\"ja\",A479,IF(E480=\"ja\",A480,IF(E481=\"ja\",A481,IF(E482=\"ja\",A482,IF(E483=\"ja\",A483,IF(E484=\"ja\",A484,IF(E485=\"ja\",A485,IF(E486=\"ja\",A486,IF(E487=\"ja\",A487,IF(E488=\"ja\",A488,IF(E489=\"ja\",A489,IF(E490=\"ja\",A490,IF(E491=\"ja\",A491,IF(E492=\"ja\",A492,IF(E493=\"ja\",A493,IF(A494=\"ja\",A494,\"Volgepland\")))))))))))))))))))","v":"2022-04-18"},null,null,null,null,0,null,null,0,0,null,null,0]
["2022-04-19",{"$f":"WEEKNUM(Tabel_kalender[[#This Row],[Datum]],21)","v":16},"1900-01-02",null,"nee",{"$f":"IF(Tabel_kalender[[#This Row],[Werkdag]]=\"ja\",Tabel_kalender[[#This Row],[Datum]],IF(E478=\"ja\",A478,IF(E479=\"ja\",A479,IF(E480=\"ja\",A480,IF(E481=\"ja\",A481,IF(E482=\"ja\",A482,IF(E483=\"ja\",A483,IF(E484=\"ja\",A484,IF(E485=\"ja\",A485,IF(E486=\"ja\",A486,IF(E487=\"ja\",A487,IF(E488=\"ja\",A488,IF(E489=\"ja\",A489,IF(E490=\"ja\",A490,IF(E491=\"ja\",A491,IF(E492=\"ja\",A492,IF(E493=\"ja\",A493,IF(E494=\"ja\",A494,IF(A495=\"ja\",A495,\"Volgepland\")))))))))))))))))))","v":"2022-04-21"},null,null,null,null,0,null,null,0,0,null,null,0]
["2022-04-20",{"$f":"WEEKNUM(Tabel_kalender[[#This Row],[Datum]],21)","v":16},"1900-01-03",null,"nee",{"$f":"IF(Tabel_kalender[[#This Row],[Werkdag]]=\"ja\",Tabel_kalender[[#This Row],[Datum]],IF(E479=\"ja\",A479,IF(E480=\"ja\",A480,IF(E481=\"ja\",A481,IF(E482=\"ja\",A482,IF(E483=\"ja\",A483,IF(E484=\"ja\",A484,IF(E485=\"ja\",A485,IF(E486=\"ja\",A486,IF(E487=\"ja\",A487,IF(E488=\"ja\",A488,IF(E489=\"ja\",A489,IF(E490=\"ja\",A490,IF(E491=\"ja\",A491,IF(E492=\"ja\",A492,IF(E493=\"ja\",A493,IF(E494=\"ja\",A494,IF(E495=\"ja\",A495,IF(A496=\"ja\",A496,\"Volgepland\")))))))))))))))))))","v":"2022-04-21"},null,null,null,null,0,null,null,0,0,null,null,0]
["2022-04-21",{"$f":"WEEKNUM(Tabel_kalender[[#This Row],[Datum]],21)","v":16},"1900-01-04",null,"ja",{"$f":"IF(Tabel_kalender[[#This Row],[Werkdag]]=\"ja\",Tabel_kalender[[#This Row],[Datum]],IF(E480=\"ja\",A480,IF(E481=\"ja\",A481,IF(E482=\"ja\",A482,IF(E483=\"ja\",A483,IF(E484=\"ja\",A484,IF(E485=\"ja\",A485,IF(E486=\"ja\",A486,IF(E487=\"ja\",A487,IF(E488=\"ja\",A488,IF(E489=\"ja\",A489,IF(E490=\"ja\",A490,IF(E491=\"ja\",A491,IF(E492=\"ja\",A492,IF(E493=\"ja\",A493,IF(E494=\"ja\",A494,IF(E495=\"ja\",A495,IF(E496=\"ja\",A496,IF(A497=\"ja\",A497,\"Volgepland\")))))))))))))))))))","v":"2022-04-21"},null,null,null,null,0,null,null,0,0,null,null,0]
["2022-04-22",{"$f":"WEEKNUM(Tabel_kalender[[#This Row],[Datum]],21)","v":16},"1900-01-05",null,"ja",{"$f":"IF(Tabel_kalender[[#This Row],[Werkdag]]=\"ja\",Tabel_kalender[[#This Row],[Datum]],IF(E481=\"ja\",A481,IF(E482=\"ja\",A482,IF(E483=\"ja\",A483,IF(E484=\"ja\",A484,IF(E485=\"ja\",A485,IF(E486=\"ja\",A486,IF(E487=\"ja\",A487,IF(E488=\"ja\",A488,IF(E489=\"ja\",A489,IF(E490=\"ja\",A490,IF(E491=\"ja\",A491,IF(E492=\"ja\",A492,IF(E493=\"ja\",A493,IF(E494=\"ja\",A494,IF(E495=\"ja\",A495,IF(E496=\"ja\",A496,IF(E497=\"ja\",A497,IF(A498=\"ja\",A498,\"Volgepland\")))))))))))))))))))","v":"2022-04-22"},null,null,null,null,0,null,null,0,0,null,null,0]
["2022-04-23",{"$f":"WEEKNUM(Tabel_kalender[[#This Row],[Datum]],21)","v":16},"1900-01-06",null,"ja",{"$f":"IF(Tabel_kalender[[#This Row],[Werkdag]]=\"ja\",Tabel_kalender[[#This Row],[Datum]],IF(E482=\"ja\",A482,IF(E483=\"ja\",A483,IF(E484=\"ja\",A484,IF(E485=\"ja\",A485,IF(E486=\"ja\",A486,IF(E487=\"ja\",A487,IF(E488=\"ja\",A488,IF(E489=\"ja\",A489,IF(E490=\"ja\",A490,IF(E491=\"ja\",A491,IF(E492=\"ja\",A492,IF(E493=\"ja\",A493,IF(E494=\"ja\",A494,IF(E495=\"ja\",A495,IF(E496=\"ja\",A496,IF(E497=\"ja\",A497,IF(E498=\"ja\",A498,IF(A499=\"ja\",A499,\"Volgepland\")))))))))))))))))))","v":"2022-04-23"},null,null,null,null,0,null,null,0,0,null,null,0]
["2022-04-24",{"$f":"WEEKNUM(Tabel_kalender[[#This Row],[Datum]],21)","v":16},"1900-01-07",null,"ja",{"$f":"IF(Tabel_kalender[[#This Row],[Werkdag]]=\"ja\",Tabel_kalender[[#This Row],[Datum]],IF(E483=\"ja\",A483,IF(E484=\"ja\",A484,IF(E485=\"ja\",A485,IF(E486=\"ja\",A486,IF(E487=\"ja\",A487,IF(E488=\"ja\",A488,IF(E489=\"ja\",A489,IF(E490=\"ja\",A490,IF(E491=\"ja\",A491,IF(E492=\"ja\",A492,IF(E493=\"ja\",A493,IF(E494=\"ja\",A494,IF(E495=\"ja\",A495,IF(E496=\"ja\",A496,IF(E497=\"ja\",A497,IF(E498=\"ja\",A498,IF(E499=\"ja\",A499,IF(A500=\"ja\",A500,\"Volgepland\")))))))))))))))))))","v":"2022-04-24"},null,null,null,null,0,null,null,0,0,null,null,0]
["2022-04-25",{"$f":"WEEKNUM(Tabel_kalender[[#This Row],[Datum]],21)","v":17},"1900-01-01",null,"ja",{"$f":"IF(Tabel_kalender[[#This Row],[Werkdag]]=\"ja\",Tabel_kalender[[#This Row],[Datum]],IF(E484=\"ja\",A484,IF(E485=\"ja\",A485,IF(E486=\"ja\",A486,IF(E487=\"ja\",A487,IF(E488=\"ja\",A488,IF(E489=\"ja\",A489,IF(E490=\"ja\",A490,IF(E491=\"ja\",A491,IF(E492=\"ja\",A492,IF(E493=\"ja\",A493,IF(E494=\"ja\",A494,IF(E495=\"ja\",A495,IF(E496=\"ja\",A496,IF(E497=\"ja\",A497,IF(E498=\"ja\",A498,IF(E499=\"ja\",A499,IF(E500=\"ja\",A500,IF(A501=\"ja\",A501,\"Volgepland\")))))))))))))))))))","v":"2022-04-25"},null,null,null,null,0,null,null,0,0,null,null,0]
["2022-04-26",{"$f":"WEEKNUM(Tabel_kalender[[#This Row],[Datum]],21)","v":17},"1900-01-02",null,"nee",{"$f":"IF(Tabel_kalender[[#This Row],[Werkdag]]=\"ja\",Tabel_kalender[[#This Row],[Datum]],IF(E485=\"ja\",A485,IF(E486=\"ja\",A486,IF(E487=\"ja\",A487,IF(E488=\"ja\",A488,IF(E489=\"ja\",A489,IF(E490=\"ja\",A490,IF(E491=\"ja\",A491,IF(E492=\"ja\",A492,IF(E493=\"ja\",A493,IF(E494=\"ja\",A494,IF(E495=\"ja\",A495,IF(E496=\"ja\",A496,IF(E497=\"ja\",A497,IF(E498=\"ja\",A498,IF(E499=\"ja\",A499,IF(E500=\"ja\",A500,IF(E501=\"ja\",A501,IF(A502=\"ja\",A502,\"Volgepland\")))))))))))))))))))","v":"2022-04-29"},null,null,null,null,0,null,null,0,0,null,null,0]
["2022-04-27",{"$f":"WEEKNUM(Tabel_kalender[[#This Row],[Datum]],21)","v":17},"1900-01-03",null,"nee",{"$f":"IF(Tabel_kalender[[#This Row],[Werkdag]]=\"ja\",Tabel_kalender[[#This Row],[Datum]],IF(E486=\"ja\",A486,IF(E487=\"ja\",A487,IF(E488=\"ja\",A488,IF(E489=\"ja\",A489,IF(E490=\"ja\",A490,IF(E491=\"ja\",A491,IF(E492=\"ja\",A492,IF(E493=\"ja\",A493,IF(E494=\"ja\",A494,IF(E495=\"ja\",A495,IF(E496=\"ja\",A496,IF(E497=\"ja\",A497,IF(E498=\"ja\",A498,IF(E499=\"ja\",A499,IF(E500=\"ja\",A500,IF(E501=\"ja\",A501,IF(E502=\"ja\",A502,IF(A503=\"ja\",A503,\"Volgepland\")))))))))))))))))))","v":"2022-04-29"},null,null,null,null,0,null,null,0,0,null,null,0]
["2022-04-28",{"$f":"WEEKNUM(Tabel_kalender[[#This Row],[Datum]],21)","v":17},"1900-01-04","Koningsdag","nee",{"$f":"IF(Tabel_kalender[[#This Row],[Werkdag]]=\"ja\",Tabel_kalender[[#This Row],[Datum]],IF(E487=\"ja\",A487,IF(E488=\"ja\",A488,IF(E489=\"ja\",A489,IF(E490=\"ja\",A490,IF(E491=\"ja\",A491,IF(E492=\"ja\",A492,IF(E493=\"ja\",A493,IF(E494=\"ja\",A494,IF(E495=\"ja\",A495,IF(E496=\"ja\",A496,IF(E497=\"ja\",A497,IF(E498=\"ja\",A498,IF(E499=\"ja\",A499,IF(E500=\"ja\",A500,IF(E501=\"ja\",A501,IF(E502=\"ja\",A502,IF(E503=\"ja\",A503,IF(A504=\"ja\",A504,\"Volgepland\")))))))))))))))))))","v":"2022-04-29"},null,null,null,null,0,null,null,0,0,null,null,0]
["2022-04-29",{"$f":"WEEKNUM(Tabel_kalender[[#This Row],[Datum]],21)","v":17},"1900-01-05",null,"ja",{"$f":"IF(Tabel_kalender[[#This Row],[Werkdag]]=\"ja\",Tabel_kalender[[#This Row],[Datum]],IF(E488=\"ja\",A488,IF(E489=\"ja\",A489,IF(E490=\"ja\",A490,IF(E491=\"ja\",A491,IF(E492=\"ja\",A492,IF(E493=\"ja\",A493,IF(E494=\"ja\",A494,IF(E495=\"ja\",A495,IF(E496=\"ja\",A496,IF(E497=\"ja\",A497,IF(E498=\"ja\",A498,IF(E499=\"ja\",A499,IF(E500=\"ja\",A500,IF(E501=\"ja\",A501,IF(E502=\"ja\",A502,IF(E503=\"ja\",A503,IF(E504=\"ja\",A504,IF(A505=\"ja\",A505,\"Volgepland\")))))))))))))))))))","v":"2022-04-29"},null,null,null,null,0,null,null,0,0,null,null,0]
["2022-04-30",{"$f":"WEEKNUM(Tabel_kalender[[#This Row],[Datum]],21)","v":17},"1900-01-06",null,"ja",{"$f":"IF(Tabel_kalender[[#This Row],[Werkdag]]=\"ja\",Tabel_kalender[[#This Row],[Datum]],IF(E489=\"ja\",A489,IF(E490=\"ja\",A490,IF(E491=\"ja\",A491,IF(E492=\"ja\",A492,IF(E493=\"ja\",A493,IF(E494=\"ja\",A494,IF(E495=\"ja\",A495,IF(E496=\"ja\",A496,IF(E497=\"ja\",A497,IF(E498=\"ja\",A498,IF(E499=\"ja\",A499,IF(E500=\"ja\",A500,IF(E501=\"ja\",A501,IF(E502=\"ja\",A502,IF(E503=\"ja\",A503,IF(E504=\"ja\",A504,IF(E505=\"ja\",A505,IF(A506=\"ja\",A506,\"Volgepland\")))))))))))))))))))","v":"2022-04-30"},null,null,null,null,0,null,null,0,0,null,null,0]
["2022-05-01",{"$f":"WEEKNUM(Tabel_kalender[[#This Row],[Datum]],21)","v":17},"1900-01-07",null,"ja",{"$f":"IF(Tabel_kalender[[#This Row],[Werkdag]]=\"ja\",Tabel_kalender[[#This Row],[Datum]],IF(E490=\"ja\",A490,IF(E491=\"ja\",A491,IF(E492=\"ja\",A492,IF(E493=\"ja\",A493,IF(E494=\"ja\",A494,IF(E495=\"ja\",A495,IF(E496=\"ja\",A496,IF(E497=\"ja\",A497,IF(E498=\"ja\",A498,IF(E499=\"ja\",A499,IF(E500=\"ja\",A500,IF(E501=\"ja\",A501,IF(E502=\"ja\",A502,IF(E503=\"ja\",A503,IF(E504=\"ja\",A504,IF(E505=\"ja\",A505,IF(E506=\"ja\",A506,IF(A507=\"ja\",A507,\"Volgepland\")))))))))))))))))))","v":"2022-05-01"},null,null,null,null,0,null,null,0,0,null,null,0]
["2022-05-02",{"$f":"WEEKNUM(Tabel_kalender[[#This Row],[Datum]],21)","v":18},"1900-01-01",null,"ja",{"$f":"IF(Tabel_kalender[[#This Row],[Werkdag]]=\"ja\",Tabel_kalender[[#This Row],[Datum]],IF(E491=\"ja\",A491,IF(E492=\"ja\",A492,IF(E493=\"ja\",A493,IF(E494=\"ja\",A494,IF(E495=\"ja\",A495,IF(E496=\"ja\",A496,IF(E497=\"ja\",A497,IF(E498=\"ja\",A498,IF(E499=\"ja\",A499,IF(E500=\"ja\",A500,IF(E501=\"ja\",A501,IF(E502=\"ja\",A502,IF(E503=\"ja\",A503,IF(E504=\"ja\",A504,IF(E505=\"ja\",A505,IF(E506=\"ja\",A506,IF(E507=\"ja\",A507,IF(A508=\"ja\",A508,\"Volgepland\")))))))))))))))))))","v":"2022-05-02"},null,null,null,null,0,null,null,0,0,null,null,0]
["2022-05-03",{"$f":"WEEKNUM(Tabel_kalender[[#This Row],[Datum]],21)","v":18},"1900-01-02",null,"nee",{"$f":"IF(Tabel_kalender[[#This Row],[Werkdag]]=\"ja\",Tabel_kalender[[#This Row],[Datum]],IF(E492=\"ja\",A492,IF(E493=\"ja\",A493,IF(E494=\"ja\",A494,IF(E495=\"ja\",A495,IF(E496=\"ja\",A496,IF(E497=\"ja\",A497,IF(E498=\"ja\",A498,IF(E499=\"ja\",A499,IF(E500=\"ja\",A500,IF(E501=\"ja\",A501,IF(E502=\"ja\",A502,IF(E503=\"ja\",A503,IF(E504=\"ja\",A504,IF(E505=\"ja\",A505,IF(E506=\"ja\",A506,IF(E507=\"ja\",A507,IF(E508=\"ja\",A508,IF(A509=\"ja\",A509,\"Volgepland\")))))))))))))))))))","v":"2022-05-05"},null,null,null,null,0,null,null,0,0,null,null,0]
["2022-05-04",{"$f":"WEEKNUM(Tabel_kalender[[#This Row],[Datum]],21)","v":18},"1900-01-03",null,"nee",{"$f":"IF(Tabel_kalender[[#This Row],[Werkdag]]=\"ja\",Tabel_kalender[[#This Row],[Datum]],IF(E493=\"ja\",A493,IF(E494=\"ja\",A494,IF(E495=\"ja\",A495,IF(E496=\"ja\",A496,IF(E497=\"ja\",A497,IF(E498=\"ja\",A498,IF(E499=\"ja\",A499,IF(E500=\"ja\",A500,IF(E501=\"ja\",A501,IF(E502=\"ja\",A502,IF(E503=\"ja\",A503,IF(E504=\"ja\",A504,IF(E505=\"ja\",A505,IF(E506=\"ja\",A506,IF(E507=\"ja\",A507,IF(E508=\"ja\",A508,IF(E509=\"ja\",A509,IF(A510=\"ja\",A510,\"Volgepland\")))))))))))))))))))","v":"2022-05-05"},null,null,null,null,0,null,null,0,0,null,null,0]
["2022-05-05",{"$f":"WEEKNUM(Tabel_kalender[[#This Row],[Datum]],21)","v":18},"1900-01-04",null,"ja",{"$f":"IF(Tabel_kalender[[#This Row],[Werkdag]]=\"ja\",Tabel_kalender[[#This Row],[Datum]],IF(E494=\"ja\",A494,IF(E495=\"ja\",A495,IF(E496=\"ja\",A496,IF(E497=\"ja\",A497,IF(E498=\"ja\",A498,IF(E499=\"ja\",A499,IF(E500=\"ja\",A500,IF(E501=\"ja\",A501,IF(E502=\"ja\",A502,IF(E503=\"ja\",A503,IF(E504=\"ja\",A504,IF(E505=\"ja\",A505,IF(E506=\"ja\",A506,IF(E507=\"ja\",A507,IF(E508=\"ja\",A508,IF(E509=\"ja\",A509,IF(E510=\"ja\",A510,IF(A511=\"ja\",A511,\"Volgepland\")))))))))))))))))))","v":"2022-05-05"},null,null,null,null,0,null,null,0,0,null,null,0]
["2022-05-06",{"$f":"WEEKNUM(Tabel_kalender[[#This Row],[Datum]],21)","v":18},"1900-01-05","Bevrijdingsdag","nee",{"$f":"IF(Tabel_kalender[[#This Row],[Werkdag]]=\"ja\",Tabel_kalender[[#This Row],[Datum]],IF(E495=\"ja\",A495,IF(E496=\"ja\",A496,IF(E497=\"ja\",A497,IF(E498=\"ja\",A498,IF(E499=\"ja\",A499,IF(E500=\"ja\",A500,IF(E501=\"ja\",A501,IF(E502=\"ja\",A502,IF(E503=\"ja\",A503,IF(E504=\"ja\",A504,IF(E505=\"ja\",A505,IF(E506=\"ja\",A506,IF(E507=\"ja\",A507,IF(E508=\"ja\",A508,IF(E509=\"ja\",A509,IF(E510=\"ja\",A510,IF(E511=\"ja\",A511,IF(A512=\"ja\",A512,\"Volgepland\")))))))))))))))))))","v":"2022-05-07"},null,null,null,null,0,null,null,0,0,null,null,0]
["2022-05-07",{"$f":"WEEKNUM(Tabel_kalender[[#This Row],[Datum]],21)","v":18},"1900-01-06",null,"ja",{"$f":"IF(Tabel_kalender[[#This Row],[Werkdag]]=\"ja\",Tabel_kalender[[#This Row],[Datum]],IF(E496=\"ja\",A496,IF(E497=\"ja\",A497,IF(E498=\"ja\",A498,IF(E499=\"ja\",A499,IF(E500=\"ja\",A500,IF(E501=\"ja\",A501,IF(E502=\"ja\",A502,IF(E503=\"ja\",A503,IF(E504=\"ja\",A504,IF(E505=\"ja\",A505,IF(E506=\"ja\",A506,IF(E507=\"ja\",A507,IF(E508=\"ja\",A508,IF(E509=\"ja\",A509,IF(E510=\"ja\",A510,IF(E511=\"ja\",A511,IF(E512=\"ja\",A512,IF(A513=\"ja\",A513,\"Volgepland\")))))))))))))))))))","v":"2022-05-07"},null,null,null,null,0,null,null,0,0,null,null,0]
["2022-05-08",{"$f":"WEEKNUM(Tabel_kalender[[#This Row],[Datum]],21)","v":18},"1900-01-07",null,"ja",{"$f":"IF(Tabel_kalender[[#This Row],[Werkdag]]=\"ja\",Tabel_kalender[[#This Row],[Datum]],IF(E497=\"ja\",A497,IF(E498=\"ja\",A498,IF(E499=\"ja\",A499,IF(E500=\"ja\",A500,IF(E501=\"ja\",A501,IF(E502=\"ja\",A502,IF(E503=\"ja\",A503,IF(E504=\"ja\",A504,IF(E505=\"ja\",A505,IF(E506=\"ja\",A506,IF(E507=\"ja\",A507,IF(E508=\"ja\",A508,IF(E509=\"ja\",A509,IF(E510=\"ja\",A510,IF(E511=\"ja\",A511,IF(E512=\"ja\",A512,IF(E513=\"ja\",A513,IF(A514=\"ja\",A514,\"Volgepland\")))))))))))))))))))","v":"2022-05-08"},null,null,null,null,0,null,null,0,0,null,null,0]
["2022-05-09",{"$f":"WEEKNUM(Tabel_kalender[[#This Row],[Datum]],21)","v":19},"1900-01-01",null,"ja",{"$f":"IF(Tabel_kalender[[#This Row],[Werkdag]]=\"ja\",Tabel_kalender[[#This Row],[Datum]],IF(E498=\"ja\",A498,IF(E499=\"ja\",A499,IF(E500=\"ja\",A500,IF(E501=\"ja\",A501,IF(E502=\"ja\",A502,IF(E503=\"ja\",A503,IF(E504=\"ja\",A504,IF(E505=\"ja\",A505,IF(E506=\"ja\",A506,IF(E507=\"ja\",A507,IF(E508=\"ja\",A508,IF(E509=\"ja\",A509,IF(E510=\"ja\",A510,IF(E511=\"ja\",A511,IF(E512=\"ja\",A512,IF(E513=\"ja\",A513,IF(E514=\"ja\",A514,IF(A515=\"ja\",A515,\"Volgepland\")))))))))))))))))))","v":"2022-05-09"},null,null,null,null,0,null,null,0,0,null,null,0]
["2022-05-10",{"$f":"WEEKNUM(Tabel_kalender[[#This Row],[Datum]],21)","v":19},"1900-01-02",null,"nee",{"$f":"IF(Tabel_kalender[[#This Row],[Werkdag]]=\"ja\",Tabel_kalender[[#This Row],[Datum]],IF(E499=\"ja\",A499,IF(E500=\"ja\",A500,IF(E501=\"ja\",A501,IF(E502=\"ja\",A502,IF(E503=\"ja\",A503,IF(E504=\"ja\",A504,IF(E505=\"ja\",A505,IF(E506=\"ja\",A506,IF(E507=\"ja\",A507,IF(E508=\"ja\",A508,IF(E509=\"ja\",A509,IF(E510=\"ja\",A510,IF(E511=\"ja\",A511,IF(E512=\"ja\",A512,IF(E513=\"ja\",A513,IF(E514=\"ja\",A514,IF(E515=\"ja\",A515,IF(A516=\"ja\",A516,\"Volgepland\")))))))))))))))))))","v":"2022-05-12"},null,null,null,null,0,null,null,0,0,null,null,0]
["2022-05-11",{"$f":"WEEKNUM(Tabel_kalender[[#This Row],[Datum]],21)","v":19},"1900-01-03",null,"nee",{"$f":"IF(Tabel_kalender[[#This Row],[Werkdag]]=\"ja\",Tabel_kalender[[#This Row],[Datum]],IF(E500=\"ja\",A500,IF(E501=\"ja\",A501,IF(E502=\"ja\",A502,IF(E503=\"ja\",A503,IF(E504=\"ja\",A504,IF(E505=\"ja\",A505,IF(E506=\"ja\",A506,IF(E507=\"ja\",A507,IF(E508=\"ja\",A508,IF(E509=\"ja\",A509,IF(E510=\"ja\",A510,IF(E511=\"ja\",A511,IF(E512=\"ja\",A512,IF(E513=\"ja\",A513,IF(E514=\"ja\",A514,IF(E515=\"ja\",A515,IF(E516=\"ja\",A516,IF(A517=\"ja\",A517,\"Volgepland\")))))))))))))))))))","v":"2022-05-12"},null,null,null,null,0,null,null,0,0,null,null,0]
["2022-05-12",{"$f":"WEEKNUM(Tabel_kalender[[#This Row],[Datum]],21)","v":19},"1900-01-04",null,"ja",{"$f":"IF(Tabel_kalender[[#This Row],[Werkdag]]=\"ja\",Tabel_kalender[[#This Row],[Datum]],IF(E501=\"ja\",A501,IF(E502=\"ja\",A502,IF(E503=\"ja\",A503,IF(E504=\"ja\",A504,IF(E505=\"ja\",A505,IF(E506=\"ja\",A506,IF(E507=\"ja\",A507,IF(E508=\"ja\",A508,IF(E509=\"ja\",A509,IF(E510=\"ja\",A510,IF(E511=\"ja\",A511,IF(E512=\"ja\",A512,IF(E513=\"ja\",A513,IF(E514=\"ja\",A514,IF(E515=\"ja\",A515,IF(E516=\"ja\",A516,IF(E517=\"ja\",A517,IF(A518=\"ja\",A518,\"Volgepland\")))))))))))))))))))","v":"2022-05-12"},null,null,null,null,0,null,null,0,0,null,null,0]
["2022-05-13",{"$f":"WEEKNUM(Tabel_kalender[[#This Row],[Datum]],21)","v":19},"1900-01-05",null,"ja",{"$f":"IF(Tabel_kalender[[#This Row],[Werkdag]]=\"ja\",Tabel_kalender[[#This Row],[Datum]],IF(E502=\"ja\",A502,IF(E503=\"ja\",A503,IF(E504=\"ja\",A504,IF(E505=\"ja\",A505,IF(E506=\"ja\",A506,IF(E507=\"ja\",A507,IF(E508=\"ja\",A508,IF(E509=\"ja\",A509,IF(E510=\"ja\",A510,IF(E511=\"ja\",A511,IF(E512=\"ja\",A512,IF(E513=\"ja\",A513,IF(E514=\"ja\",A514,IF(E515=\"ja\",A515,IF(E516=\"ja\",A516,IF(E517=\"ja\",A517,IF(E518=\"ja\",A518,IF(A519=\"ja\",A519,\"Volgepland\")))))))))))))))))))","v":"2022-05-13"},null,null,null,null,0,null,null,0,0,null,null,0]
["2022-05-14",{"$f":"WEEKNUM(Tabel_kalender[[#This Row],[Datum]],21)","v":19},"1900-01-06",null,"nee",{"$f":"IF(Tabel_kalender[[#This Row],[Werkdag]]=\"ja\",Tabel_kalender[[#This Row],[Datum]],IF(E503=\"ja\",A503,IF(E504=\"ja\",A504,IF(E505=\"ja\",A505,IF(E506=\"ja\",A506,IF(E507=\"ja\",A507,IF(E508=\"ja\",A508,IF(E509=\"ja\",A509,IF(E510=\"ja\",A510,IF(E511=\"ja\",A511,IF(E512=\"ja\",A512,IF(E513=\"ja\",A513,IF(E514=\"ja\",A514,IF(E515=\"ja\",A515,IF(E516=\"ja\",A516,IF(E517=\"ja\",A517,IF(E518=\"ja\",A518,IF(E519=\"ja\",A519,IF(A520=\"ja\",A520,\"Volgepland\")))))))))))))))))))","v":"2022-05-15"},null,null,null,null,0,null,null,0,0,null,null,0]
["2022-05-15",{"$f":"WEEKNUM(Tabel_kalender[[#This Row],[Datum]],21)","v":19},"1900-01-07",null,"ja",{"$f":"IF(Tabel_kalender[[#This Row],[Werkdag]]=\"ja\",Tabel_kalender[[#This Row],[Datum]],IF(E504=\"ja\",A504,IF(E505=\"ja\",A505,IF(E506=\"ja\",A506,IF(E507=\"ja\",A507,IF(E508=\"ja\",A508,IF(E509=\"ja\",A509,IF(E510=\"ja\",A510,IF(E511=\"ja\",A511,IF(E512=\"ja\",A512,IF(E513=\"ja\",A513,IF(E514=\"ja\",A514,IF(E515=\"ja\",A515,IF(E516=\"ja\",A516,IF(E517=\"ja\",A517,IF(E518=\"ja\",A518,IF(E519=\"ja\",A519,IF(E520=\"ja\",A520,IF(A521=\"ja\",A521,\"Volgepland\")))))))))))))))))))","v":"2022-05-15"},null,null,null,null,0,null,null,0,0,null,null,0]
["2022-05-16",{"$f":"WEEKNUM(Tabel_kalender[[#This Row],[Datum]],21)","v":20},"1900-01-01",null,"ja",{"$f":"IF(Tabel_kalender[[#This Row],[Werkdag]]=\"ja\",Tabel_kalender[[#This Row],[Datum]],IF(E505=\"ja\",A505,IF(E506=\"ja\",A506,IF(E507=\"ja\",A507,IF(E508=\"ja\",A508,IF(E509=\"ja\",A509,IF(E510=\"ja\",A510,IF(E511=\"ja\",A511,IF(E512=\"ja\",A512,IF(E513=\"ja\",A513,IF(E514=\"ja\",A514,IF(E515=\"ja\",A515,IF(E516=\"ja\",A516,IF(E517=\"ja\",A517,IF(E518=\"ja\",A518,IF(E519=\"ja\",A519,IF(E520=\"ja\",A520,IF(E521=\"ja\",A521,IF(A522=\"ja\",A522,\"Volgepland\")))))))))))))))))))","v":"2022-05-16"},null,null,null,null,0,null,null,0,0,null,null,0]
["2022-05-17",{"$f":"WEEKNUM(Tabel_kalender[[#This Row],[Datum]],21)","v":20},"1900-01-02",null,"nee",{"$f":"IF(Tabel_kalender[[#This Row],[Werkdag]]=\"ja\",Tabel_kalender[[#This Row],[Datum]],IF(E506=\"ja\",A506,IF(E507=\"ja\",A507,IF(E508=\"ja\",A508,IF(E509=\"ja\",A509,IF(E510=\"ja\",A510,IF(E511=\"ja\",A511,IF(E512=\"ja\",A512,IF(E513=\"ja\",A513,IF(E514=\"ja\",A514,IF(E515=\"ja\",A515,IF(E516=\"ja\",A516,IF(E517=\"ja\",A517,IF(E518=\"ja\",A518,IF(E519=\"ja\",A519,IF(E520=\"ja\",A520,IF(E521=\"ja\",A521,IF(E522=\"ja\",A522,IF(A523=\"ja\",A523,\"Volgepland\")))))))))))))))))))","v":"2022-05-19"},null,null,null,null,0,null,null,0,0,null,null,0]
["2022-05-18",{"$f":"WEEKNUM(Tabel_kalender[[#This Row],[Datum]],21)","v":20},"1900-01-03",null,"nee",{"$f":"IF(Tabel_kalender[[#This Row],[Werkdag]]=\"ja\",Tabel_kalender[[#This Row],[Datum]],IF(E507=\"ja\",A507,IF(E508=\"ja\",A508,IF(E509=\"ja\",A509,IF(E510=\"ja\",A510,IF(E511=\"ja\",A511,IF(E512=\"ja\",A512,IF(E513=\"ja\",A513,IF(E514=\"ja\",A514,IF(E515=\"ja\",A515,IF(E516=\"ja\",A516,IF(E517=\"ja\",A517,IF(E518=\"ja\",A518,IF(E519=\"ja\",A519,IF(E520=\"ja\",A520,IF(E521=\"ja\",A521,IF(E522=\"ja\",A522,IF(E523=\"ja\",A523,IF(A524=\"ja\",A524,\"Volgepland\")))))))))))))))))))","v":"2022-05-19"},null,null,null,null,0,null,null,0,0,null,null,0]
["2022-05-19",{"$f":"WEEKNUM(Tabel_kalender[[#This Row],[Datum]],21)","v":20},"1900-01-04",null,"ja",{"$f":"IF(Tabel_kalender[[#This Row],[Werkdag]]=\"ja\",Tabel_kalender[[#This Row],[Datum]],IF(E508=\"ja\",A508,IF(E509=\"ja\",A509,IF(E510=\"ja\",A510,IF(E511=\"ja\",A511,IF(E512=\"ja\",A512,IF(E513=\"ja\",A513,IF(E514=\"ja\",A514,IF(E515=\"ja\",A515,IF(E516=\"ja\",A516,IF(E517=\"ja\",A517,IF(E518=\"ja\",A518,IF(E519=\"ja\",A519,IF(E520=\"ja\",A520,IF(E521=\"ja\",A521,IF(E522=\"ja\",A522,IF(E523=\"ja\",A523,IF(E524=\"ja\",A524,IF(A525=\"ja\",A525,\"Volgepland\")))))))))))))))))))","v":"2022-05-19"},null,null,null,null,0,null,null,0,0,null,null,0]
["2022-05-20",{"$f":"WEEKNUM(Tabel_kalender[[#This Row],[Datum]],21)","v":20},"1900-01-05",null,"ja",{"$f":"IF(Tabel_kalender[[#This Row],[Werkdag]]=\"ja\",Tabel_kalender[[#This Row],[Datum]],IF(E509=\"ja\",A509,IF(E510=\"ja\",A510,IF(E511=\"ja\",A511,IF(E512=\"ja\",A512,IF(E513=\"ja\",A513,IF(E514=\"ja\",A514,IF(E515=\"ja\",A515,IF(E516=\"ja\",A516,IF(E517=\"ja\",A517,IF(E518=\"ja\",A518,IF(E519=\"ja\",A519,IF(E520=\"ja\",A520,IF(E521=\"ja\",A521,IF(E522=\"ja\",A522,IF(E523=\"ja\",A523,IF(E524=\"ja\",A524,IF(E525=\"ja\",A525,IF(A526=\"ja\",A526,\"Volgepland\")))))))))))))))))))","v":"2022-05-20"},null,null,null,null,0,null,null,0,0,null,null,0]
["2022-05-21",{"$f":"WEEKNUM(Tabel_kalender[[#This Row],[Datum]],21)","v":20},"1900-01-06",null,"ja",{"$f":"IF(Tabel_kalender[[#This Row],[Werkdag]]=\"ja\",Tabel_kalender[[#This Row],[Datum]],IF(E510=\"ja\",A510,IF(E511=\"ja\",A511,IF(E512=\"ja\",A512,IF(E513=\"ja\",A513,IF(E514=\"ja\",A514,IF(E515=\"ja\",A515,IF(E516=\"ja\",A516,IF(E517=\"ja\",A517,IF(E518=\"ja\",A518,IF(E519=\"ja\",A519,IF(E520=\"ja\",A520,IF(E521=\"ja\",A521,IF(E522=\"ja\",A522,IF(E523=\"ja\",A523,IF(E524=\"ja\",A524,IF(E525=\"ja\",A525,IF(E526=\"ja\",A526,IF(A527=\"ja\",A527,\"Volgepland\")))))))))))))))))))","v":"2022-05-21"},null,null,null,null,0,null,null,0,0,null,null,0]
["2022-05-22",{"$f":"WEEKNUM(Tabel_kalender[[#This Row],[Datum]],21)","v":20},"1900-01-07","Hemelvaartsdag","b",{"$f":"IF(Tabel_kalender[[#This Row],[Werkdag]]=\"ja\",Tabel_kalender[[#This Row],[Datum]],IF(E511=\"ja\",A511,IF(E512=\"ja\",A512,IF(E513=\"ja\",A513,IF(E514=\"ja\",A514,IF(E515=\"ja\",A515,IF(E516=\"ja\",A516,IF(E517=\"ja\",A517,IF(E518=\"ja\",A518,IF(E519=\"ja\",A519,IF(E520=\"ja\",A520,IF(E521=\"ja\",A521,IF(E522=\"ja\",A522,IF(E523=\"ja\",A523,IF(E524=\"ja\",A524,IF(E525=\"ja\",A525,IF(E526=\"ja\",A526,IF(E527=\"ja\",A527,IF(A528=\"ja\",A528,\"Volgepland\")))))))))))))))))))","v":"2022-05-23"},null,null,null,null,0,null,null,0,0,null,null,0]
["2022-05-23",{"$f":"WEEKNUM(Tabel_kalender[[#This Row],[Datum]],21)","v":21},"1900-01-01",null,"ja",{"$f":"IF(Tabel_kalender[[#This Row],[Werkdag]]=\"ja\",Tabel_kalender[[#This Row],[Datum]],IF(E512=\"ja\",A512,IF(E513=\"ja\",A513,IF(E514=\"ja\",A514,IF(E515=\"ja\",A515,IF(E516=\"ja\",A516,IF(E517=\"ja\",A517,IF(E518=\"ja\",A518,IF(E519=\"ja\",A519,IF(E520=\"ja\",A520,IF(E521=\"ja\",A521,IF(E522=\"ja\",A522,IF(E523=\"ja\",A523,IF(E524=\"ja\",A524,IF(E525=\"ja\",A525,IF(E526=\"ja\",A526,IF(E527=\"ja\",A527,IF(E528=\"ja\",A528,IF(A529=\"ja\",A529,\"Volgepland\")))))))))))))))))))","v":"2022-05-23"},null,null,null,null,0,null,null,0,0,null,null,0]
["2022-05-24",{"$f":"WEEKNUM(Tabel_kalender[[#This Row],[Datum]],21)","v":21},"1900-01-02",null,"nee",{"$f":"IF(Tabel_kalender[[#This Row],[Werkdag]]=\"ja\",Tabel_kalender[[#This Row],[Datum]],IF(E513=\"ja\",A513,IF(E514=\"ja\",A514,IF(E515=\"ja\",A515,IF(E516=\"ja\",A516,IF(E517=\"ja\",A517,IF(E518=\"ja\",A518,IF(E519=\"ja\",A519,IF(E520=\"ja\",A520,IF(E521=\"ja\",A521,IF(E522=\"ja\",A522,IF(E523=\"ja\",A523,IF(E524=\"ja\",A524,IF(E525=\"ja\",A525,IF(E526=\"ja\",A526,IF(E527=\"ja\",A527,IF(E528=\"ja\",A528,IF(E529=\"ja\",A529,IF(A530=\"ja\",A530,\"Volgepland\")))))))))))))))))))","v":"2022-05-26"},null,null,null,null,0,null,null,0,0,null,null,0]
["2022-05-25",{"$f":"WEEKNUM(Tabel_kalender[[#This Row],[Datum]],21)","v":21},"1900-01-03",null,"nee",{"$f":"IF(Tabel_kalender[[#This Row],[Werkdag]]=\"ja\",Tabel_kalender[[#This Row],[Datum]],IF(E514=\"ja\",A514,IF(E515=\"ja\",A515,IF(E516=\"ja\",A516,IF(E517=\"ja\",A517,IF(E518=\"ja\",A518,IF(E519=\"ja\",A519,IF(E520=\"ja\",A520,IF(E521=\"ja\",A521,IF(E522=\"ja\",A522,IF(E523=\"ja\",A523,IF(E524=\"ja\",A524,IF(E525=\"ja\",A525,IF(E526=\"ja\",A526,IF(E527=\"ja\",A527,IF(E528=\"ja\",A528,IF(E529=\"ja\",A529,IF(E530=\"ja\",A530,IF(A531=\"ja\",A531,\"Volgepland\")))))))))))))))))))","v":"2022-05-26"},null,null,null,null,0,null,null,0,0,null,null,0]
["2022-05-26",{"$f":"WEEKNUM(Tabel_kalender[[#This Row],[Datum]],21)","v":21},"1900-01-04",null,"ja",{"$f":"IF(Tabel_kalender[[#This Row],[Werkdag]]=\"ja\",Tabel_kalender[[#This Row],[Datum]],IF(E515=\"ja\",A515,IF(E516=\"ja\",A516,IF(E517=\"ja\",A517,IF(E518=\"ja\",A518,IF(E519=\"ja\",A519,IF(E520=\"ja\",A520,IF(E521=\"ja\",A521,IF(E522=\"ja\",A522,IF(E523=\"ja\",A523,IF(E524=\"ja\",A524,IF(E525=\"ja\",A525,IF(E526=\"ja\",A526,IF(E527=\"ja\",A527,IF(E528=\"ja\",A528,IF(E529=\"ja\",A529,IF(E530=\"ja\",A530,IF(E531=\"ja\",A531,IF(A532=\"ja\",A532,\"Volgepland\")))))))))))))))))))","v":"2022-05-26"},null,null,null,null,0,null,null,0,0,null,null,0]
["2022-05-27",{"$f":"WEEKNUM(Tabel_kalender[[#This Row],[Datum]],21)","v":21},"1900-01-05",null,"ja",{"$f":"IF(Tabel_kalender[[#This Row],[Werkdag]]=\"ja\",Tabel_kalender[[#This Row],[Datum]],IF(E516=\"ja\",A516,IF(E517=\"ja\",A517,IF(E518=\"ja\",A518,IF(E519=\"ja\",A519,IF(E520=\"ja\",A520,IF(E521=\"ja\",A521,IF(E522=\"ja\",A522,IF(E523=\"ja\",A523,IF(E524=\"ja\",A524,IF(E525=\"ja\",A525,IF(E526=\"ja\",A526,IF(E527=\"ja\",A527,IF(E528=\"ja\",A528,IF(E529=\"ja\",A529,IF(E530=\"ja\",A530,IF(E531=\"ja\",A531,IF(E532=\"ja\",A532,IF(A533=\"ja\",A533,\"Volgepland\")))))))))))))))))))","v":"2022-05-27"},null,null,null,null,0,null,null,0,0,null,null,0]
["2022-05-28",{"$f":"WEEKNUM(Tabel_kalender[[#This Row],[Datum]],21)","v":21},"1900-01-06",null,"ja",{"$f":"IF(Tabel_kalender[[#This Row],[Werkdag]]=\"ja\",Tabel_kalender[[#This Row],[Datum]],IF(E517=\"ja\",A517,IF(E518=\"ja\",A518,IF(E519=\"ja\",A519,IF(E520=\"ja\",A520,IF(E521=\"ja\",A521,IF(E522=\"ja\",A522,IF(E523=\"ja\",A523,IF(E524=\"ja\",A524,IF(E525=\"ja\",A525,IF(E526=\"ja\",A526,IF(E527=\"ja\",A527,IF(E528=\"ja\",A528,IF(E529=\"ja\",A529,IF(E530=\"ja\",A530,IF(E531=\"ja\",A531,IF(E532=\"ja\",A532,IF(E533=\"ja\",A533,IF(A534=\"ja\",A534,\"Volgepland\")))))))))))))))))))","v":"2022-05-28"},null,null,null,null,0,null,null,{"$f":"IF(L516>0,L516-K516,)-M516","v":0},{"$f":"P515","v":0},null,null,{"$f":"IF(P516>0,P516-O516,)-Q516","v":0}]
["2022-05-29",{"$f":"WEEKNUM(Tabel_kalender[[#This Row],[Datum]],21)","v":21},{"$f":"WEEKDAY(A517,2)","v":"1900-01-07"},null,"ja",{"$f":"IF(Tabel_kalender[[#This Row],[Werkdag]]=\"ja\",Tabel_kalender[[#This Row],[Datum]],IF(E518=\"ja\",A518,IF(E519=\"ja\",A519,IF(E520=\"ja\",A520,IF(E521=\"ja\",A521,IF(E522=\"ja\",A522,IF(E523=\"ja\",A523,IF(E524=\"ja\",A524,IF(E525=\"ja\",A525,IF(E526=\"ja\",A526,IF(E527=\"ja\",A527,IF(E528=\"ja\",A528,IF(E529=\"ja\",A529,IF(E530=\"ja\",A530,IF(E531=\"ja\",A531,IF(E532=\"ja\",A532,IF(E533=\"ja\",A533,IF(E534=\"ja\",A534,IF(A535=\"ja\",A535,\"Volgepland\")))))))))))))))))))","v":"2022-05-29"},null,null,null,null,{"$f":"L516","v":0},null,null,0,0,null,null,0]
[{"$f":"A517+1","v":"2022-05-30"},{"$f":"WEEKNUM(Tabel_kalender[[#This Row],[Datum]],21)","v":22},"1900-01-01",null,"ja",{"$f":"IF(Tabel_kalender[[#This Row],[Werkdag]]=\"ja\",Tabel_kalender[[#This Row],[Datum]],IF(E519=\"ja\",A519,IF(E520=\"ja\",A520,IF(E521=\"ja\",A521,IF(E522=\"ja\",A522,IF(E523=\"ja\",A523,IF(E524=\"ja\",A524,IF(E525=\"ja\",A525,IF(E526=\"ja\",A526,IF(E527=\"ja\",A527,IF(E528=\"ja\",A528,IF(E529=\"ja\",A529,IF(E530=\"ja\",A530,IF(E531=\"ja\",A531,IF(E532=\"ja\",A532,IF(E533=\"ja\",A533,IF(E534=\"ja\",A534,IF(E535=\"ja\",A535,IF(A536=\"ja\",A536,\"Volgepland\")))))))))))))))))))","v":"2022-05-30"},null,null,null,null,0,null,null,0,0,null,null,0]
["2022-05-31",{"$f":"WEEKNUM(Tabel_kalender[[#This Row],[Datum]],21)","v":22},"1900-01-02",null,"nee",{"$f":"IF(Tabel_kalender[[#This Row],[Werkdag]]=\"ja\",Tabel_kalender[[#This Row],[Datum]],IF(E520=\"ja\",A520,IF(E521=\"ja\",A521,IF(E522=\"ja\",A522,IF(E523=\"ja\",A523,IF(E524=\"ja\",A524,IF(E525=\"ja\",A525,IF(E526=\"ja\",A526,IF(E527=\"ja\",A527,IF(E528=\"ja\",A528,IF(E529=\"ja\",A529,IF(E530=\"ja\",A530,IF(E531=\"ja\",A531,IF(E532=\"ja\",A532,IF(E533=\"ja\",A533,IF(E534=\"ja\",A534,IF(E535=\"ja\",A535,IF(E536=\"ja\",A536,IF(A537=\"ja\",A537,\"Volgepland\")))))))))))))))))))","v":"2022-06-03"},null,null,null,null,0,null,null,0,0,null,null,0]
["2022-06-01",{"$f":"WEEKNUM(Tabel_kalender[[#This Row],[Datum]],21)","v":22},"1900-01-03","Pinksteren","nee",{"$f":"IF(Tabel_kalender[[#This Row],[Werkdag]]=\"ja\",Tabel_kalender[[#This Row],[Datum]],IF(E521=\"ja\",A521,IF(E522=\"ja\",A522,IF(E523=\"ja\",A523,IF(E524=\"ja\",A524,IF(E525=\"ja\",A525,IF(E526=\"ja\",A526,IF(E527=\"ja\",A527,IF(E528=\"ja\",A528,IF(E529=\"ja\",A529,IF(E530=\"ja\",A530,IF(E531=\"ja\",A531,IF(E532=\"ja\",A532,IF(E533=\"ja\",A533,IF(E534=\"ja\",A534,IF(E535=\"ja\",A535,IF(E536=\"ja\",A536,IF(E537=\"ja\",A537,IF(A538=\"ja\",A538,\"Volgepland\")))))))))))))))))))","v":"2022-06-03"},null,null,null,null,0,null,null,0,0,null,null,0]
["2022-06-02",{"$f":"WEEKNUM(Tabel_kalender[[#This Row],[Datum]],21)","v":22},"1900-01-04","Pinksteren","nee",{"$f":"IF(Tabel_kalender[[#This Row],[Werkdag]]=\"ja\",Tabel_kalender[[#This Row],[Datum]],IF(E522=\"ja\",A522,IF(E523=\"ja\",A523,IF(E524=\"ja\",A524,IF(E525=\"ja\",A525,IF(E526=\"ja\",A526,IF(E527=\"ja\",A527,IF(E528=\"ja\",A528,IF(E529=\"ja\",A529,IF(E530=\"ja\",A530,IF(E531=\"ja\",A531,IF(E532=\"ja\",A532,IF(E533=\"ja\",A533,IF(E534=\"ja\",A534,IF(E535=\"ja\",A535,IF(E536=\"ja\",A536,IF(E537=\"ja\",A537,IF(E538=\"ja\",A538,IF(A539=\"ja\",A539,\"Volgepland\")))))))))))))))))))","v":"2022-06-03"},null,null,null,null,0,null,null,0,0,null,null,0]
["2022-06-03",{"$f":"WEEKNUM(Tabel_kalender[[#This Row],[Datum]],21)","v":22},"1900-01-05",null,"ja",{"$f":"IF(Tabel_kalender[[#This Row],[Werkdag]]=\"ja\",Tabel_kalender[[#This Row],[Datum]],IF(E523=\"ja\",A523,IF(E524=\"ja\",A524,IF(E525=\"ja\",A525,IF(E526=\"ja\",A526,IF(E527=\"ja\",A527,IF(E528=\"ja\",A528,IF(E529=\"ja\",A529,IF(E530=\"ja\",A530,IF(E531=\"ja\",A531,IF(E532=\"ja\",A532,IF(E533=\"ja\",A533,IF(E534=\"ja\",A534,IF(E535=\"ja\",A535,IF(E536=\"ja\",A536,IF(E537=\"ja\",A537,IF(E538=\"ja\",A538,IF(E539=\"ja\",A539,IF(A540=\"ja\",A540,\"Volgepland\")))))))))))))))))))","v":"2022-06-03"},null,null,null,null,0,null,null,0,0,null,null,0]
["2022-06-04",{"$f":"WEEKNUM(Tabel_kalender[[#This Row],[Datum]],21)","v":22},"1900-01-06",null,"ja",{"$f":"IF(Tabel_kalender[[#This Row],[Werkdag]]=\"ja\",Tabel_kalender[[#This Row],[Datum]],IF(E524=\"ja\",A524,IF(E525=\"ja\",A525,IF(E526=\"ja\",A526,IF(E527=\"ja\",A527,IF(E528=\"ja\",A528,IF(E529=\"ja\",A529,IF(E530=\"ja\",A530,IF(E531=\"ja\",A531,IF(E532=\"ja\",A532,IF(E533=\"ja\",A533,IF(E534=\"ja\",A534,IF(E535=\"ja\",A535,IF(E536=\"ja\",A536,IF(E537=\"ja\",A537,IF(E538=\"ja\",A538,IF(E539=\"ja\",A539,IF(E540=\"ja\",A540,IF(A541=\"ja\",A541,\"Volgepland\")))))))))))))))))))","v":"2022-06-04"},null,null,null,null,0,null,null,0,0,null,null,0]
["2022-06-05",{"$f":"WEEKNUM(Tabel_kalender[[#This Row],[Datum]],21)","v":22},"1900-01-07",null,"ja",{"$f":"IF(Tabel_kalender[[#This Row],[Werkdag]]=\"ja\",Tabel_kalender[[#This Row],[Datum]],IF(E525=\"ja\",A525,IF(E526=\"ja\",A526,IF(E527=\"ja\",A527,IF(E528=\"ja\",A528,IF(E529=\"ja\",A529,IF(E530=\"ja\",A530,IF(E531=\"ja\",A531,IF(E532=\"ja\",A532,IF(E533=\"ja\",A533,IF(E534=\"ja\",A534,IF(E535=\"ja\",A535,IF(E536=\"ja\",A536,IF(E537=\"ja\",A537,IF(E538=\"ja\",A538,IF(E539=\"ja\",A539,IF(E540=\"ja\",A540,IF(E541=\"ja\",A541,IF(A542=\"ja\",A542,\"Volgepland\")))))))))))))))))))","v":"2022-06-05"},null,null,null,null,0,null,null,0,0,null,null,0]
["2022-06-06",{"$f":"WEEKNUM(Tabel_kalender[[#This Row],[Datum]],21)","v":23},"1900-01-01",null,"ja",{"$f":"IF(Tabel_kalender[[#This Row],[Werkdag]]=\"ja\",Tabel_kalender[[#This Row],[Datum]],IF(E526=\"ja\",A526,IF(E527=\"ja\",A527,IF(E528=\"ja\",A528,IF(E529=\"ja\",A529,IF(E530=\"ja\",A530,IF(E531=\"ja\",A531,IF(E532=\"ja\",A532,IF(E533=\"ja\",A533,IF(E534=\"ja\",A534,IF(E535=\"ja\",A535,IF(E536=\"ja\",A536,IF(E537=\"ja\",A537,IF(E538=\"ja\",A538,IF(E539=\"ja\",A539,IF(E540=\"ja\",A540,IF(E541=\"ja\",A541,IF(E542=\"ja\",A542,IF(A543=\"ja\",A543,\"Volgepland\")))))))))))))))))))","v":"2022-06-06"},null,null,null,null,0,null,null,0,0,null,null,0]
["2022-06-07",{"$f":"WEEKNUM(Tabel_kalender[[#This Row],[Datum]],21)","v":23},"1900-01-02",null,"nee",{"$f":"IF(Tabel_kalender[[#This Row],[Werkdag]]=\"ja\",Tabel_kalender[[#This Row],[Datum]],IF(E527=\"ja\",A527,IF(E528=\"ja\",A528,IF(E529=\"ja\",A529,IF(E530=\"ja\",A530,IF(E531=\"ja\",A531,IF(E532=\"ja\",A532,IF(E533=\"ja\",A533,IF(E534=\"ja\",A534,IF(E535=\"ja\",A535,IF(E536=\"ja\",A536,IF(E537=\"ja\",A537,IF(E538=\"ja\",A538,IF(E539=\"ja\",A539,IF(E540=\"ja\",A540,IF(E541=\"ja\",A541,IF(E542=\"ja\",A542,IF(E543=\"ja\",A543,IF(A544=\"ja\",A544,\"Volgepland\")))))))))))))))))))","v":"2022-06-09"},null,null,null,null,0,null,null,0,0,null,null,0]
["2022-06-08",{"$f":"WEEKNUM(Tabel_kalender[[#This Row],[Datum]],21)","v":23},"1900-01-03",null,"nee",{"$f":"IF(Tabel_kalender[[#This Row],[Werkdag]]=\"ja\",Tabel_kalender[[#This Row],[Datum]],IF(E528=\"ja\",A528,IF(E529=\"ja\",A529,IF(E530=\"ja\",A530,IF(E531=\"ja\",A531,IF(E532=\"ja\",A532,IF(E533=\"ja\",A533,IF(E534=\"ja\",A534,IF(E535=\"ja\",A535,IF(E536=\"ja\",A536,IF(E537=\"ja\",A537,IF(E538=\"ja\",A538,IF(E539=\"ja\",A539,IF(E540=\"ja\",A540,IF(E541=\"ja\",A541,IF(E542=\"ja\",A542,IF(E543=\"ja\",A543,IF(E544=\"ja\",A544,IF(A545=\"ja\",A545,\"Volgepland\")))))))))))))))))))","v":"2022-06-09"},null,null,null,null,0,null,null,0,0,null,null,0]
["2022-06-09",{"$f":"WEEKNUM(Tabel_kalender[[#This Row],[Datum]],21)","v":23},"1900-01-04",null,"ja",{"$f":"IF(Tabel_kalender[[#This Row],[Werkdag]]=\"ja\",Tabel_kalender[[#This Row],[Datum]],IF(E529=\"ja\",A529,IF(E530=\"ja\",A530,IF(E531=\"ja\",A531,IF(E532=\"ja\",A532,IF(E533=\"ja\",A533,IF(E534=\"ja\",A534,IF(E535=\"ja\",A535,IF(E536=\"ja\",A536,IF(E537=\"ja\",A537,IF(E538=\"ja\",A538,IF(E539=\"ja\",A539,IF(E540=\"ja\",A540,IF(E541=\"ja\",A541,IF(E542=\"ja\",A542,IF(E543=\"ja\",A543,IF(E544=\"ja\",A544,IF(E545=\"ja\",A545,IF(A546=\"ja\",A546,\"Volgepland\")))))))))))))))))))","v":"2022-06-09"},null,null,null,null,0,null,null,0,0,null,null,0]
["2022-06-10",{"$f":"WEEKNUM(Tabel_kalender[[#This Row],[Datum]],21)","v":23},"1900-01-05",null,"ja",{"$f":"IF(Tabel_kalender[[#This Row],[Werkdag]]=\"ja\",Tabel_kalender[[#This Row],[Datum]],IF(E530=\"ja\",A530,IF(E531=\"ja\",A531,IF(E532=\"ja\",A532,IF(E533=\"ja\",A533,IF(E534=\"ja\",A534,IF(E535=\"ja\",A535,IF(E536=\"ja\",A536,IF(E537=\"ja\",A537,IF(E538=\"ja\",A538,IF(E539=\"ja\",A539,IF(E540=\"ja\",A540,IF(E541=\"ja\",A541,IF(E542=\"ja\",A542,IF(E543=\"ja\",A543,IF(E544=\"ja\",A544,IF(E545=\"ja\",A545,IF(E546=\"ja\",A546,IF(A547=\"ja\",A547,\"Volgepland\")))))))))))))))))))","v":"2022-06-10"},null,null,null,null,0,null,null,0,0,null,null,0]
["2022-06-11",{"$f":"WEEKNUM(Tabel_kalender[[#This Row],[Datum]],21)","v":23},"1900-01-06",null,"ja",{"$f":"IF(Tabel_kalender[[#This Row],[Werkdag]]=\"ja\",Tabel_kalender[[#This Row],[Datum]],IF(E531=\"ja\",A531,IF(E532=\"ja\",A532,IF(E533=\"ja\",A533,IF(E534=\"ja\",A534,IF(E535=\"ja\",A535,IF(E536=\"ja\",A536,IF(E537=\"ja\",A537,IF(E538=\"ja\",A538,IF(E539=\"ja\",A539,IF(E540=\"ja\",A540,IF(E541=\"ja\",A541,IF(E542=\"ja\",A542,IF(E543=\"ja\",A543,IF(E544=\"ja\",A544,IF(E545=\"ja\",A545,IF(E546=\"ja\",A546,IF(E547=\"ja\",A547,IF(A548=\"ja\",A548,\"Volgepland\")))))))))))))))))))","v":"2022-06-11"},null,null,null,null,0,null,null,0,0,null,null,0]
["2022-06-12",{"$f":"WEEKNUM(Tabel_kalender[[#This Row],[Datum]],21)","v":23},"1900-01-07",null,"ja",{"$f":"IF(Tabel_kalender[[#This Row],[Werkdag]]=\"ja\",Tabel_kalender[[#This Row],[Datum]],IF(E532=\"ja\",A532,IF(E533=\"ja\",A533,IF(E534=\"ja\",A534,IF(E535=\"ja\",A535,IF(E536=\"ja\",A536,IF(E537=\"ja\",A537,IF(E538=\"ja\",A538,IF(E539=\"ja\",A539,IF(E540=\"ja\",A540,IF(E541=\"ja\",A541,IF(E542=\"ja\",A542,IF(E543=\"ja\",A543,IF(E544=\"ja\",A544,IF(E545=\"ja\",A545,IF(E546=\"ja\",A546,IF(E547=\"ja\",A547,IF(E548=\"ja\",A548,IF(A549=\"ja\",A549,\"Volgepland\")))))))))))))))))))","v":"2022-06-12"},null,null,null,null,0,null,null,0,0,null,null,0]
["2022-06-13",{"$f":"WEEKNUM(Tabel_kalender[[#This Row],[Datum]],21)","v":24},"1900-01-01",null,"ja",{"$f":"IF(Tabel_kalender[[#This Row],[Werkdag]]=\"ja\",Tabel_kalender[[#This Row],[Datum]],IF(E533=\"ja\",A533,IF(E534=\"ja\",A534,IF(E535=\"ja\",A535,IF(E536=\"ja\",A536,IF(E537=\"ja\",A537,IF(E538=\"ja\",A538,IF(E539=\"ja\",A539,IF(E540=\"ja\",A540,IF(E541=\"ja\",A541,IF(E542=\"ja\",A542,IF(E543=\"ja\",A543,IF(E544=\"ja\",A544,IF(E545=\"ja\",A545,IF(E546=\"ja\",A546,IF(E547=\"ja\",A547,IF(E548=\"ja\",A548,IF(E549=\"ja\",A549,IF(A550=\"ja\",A550,\"Volgepland\")))))))))))))))))))","v":"2022-06-13"},null,null,null,null,0,null,null,0,0,null,null,0]
["2022-06-14",{"$f":"WEEKNUM(Tabel_kalender[[#This Row],[Datum]],21)","v":24},"1900-01-02",null,"nee",{"$f":"IF(Tabel_kalender[[#This Row],[Werkdag]]=\"ja\",Tabel_kalender[[#This Row],[Datum]],IF(E534=\"ja\",A534,IF(E535=\"ja\",A535,IF(E536=\"ja\",A536,IF(E537=\"ja\",A537,IF(E538=\"ja\",A538,IF(E539=\"ja\",A539,IF(E540=\"ja\",A540,IF(E541=\"ja\",A541,IF(E542=\"ja\",A542,IF(E543=\"ja\",A543,IF(E544=\"ja\",A544,IF(E545=\"ja\",A545,IF(E546=\"ja\",A546,IF(E547=\"ja\",A547,IF(E548=\"ja\",A548,IF(E549=\"ja\",A549,IF(E550=\"ja\",A550,IF(A551=\"ja\",A551,\"Volgepland\")))))))))))))))))))","v":"2022-06-16"},null,null,null,null,0,null,null,0,0,null,null,0]
["2022-06-15",{"$f":"WEEKNUM(Tabel_kalender[[#This Row],[Datum]],21)","v":24},"1900-01-03",null,"nee",{"$f":"IF(Tabel_kalender[[#This Row],[Werkdag]]=\"ja\",Tabel_kalender[[#This Row],[Datum]],IF(E535=\"ja\",A535,IF(E536=\"ja\",A536,IF(E537=\"ja\",A537,IF(E538=\"ja\",A538,IF(E539=\"ja\",A539,IF(E540=\"ja\",A540,IF(E541=\"ja\",A541,IF(E542=\"ja\",A542,IF(E543=\"ja\",A543,IF(E544=\"ja\",A544,IF(E545=\"ja\",A545,IF(E546=\"ja\",A546,IF(E547=\"ja\",A547,IF(E548=\"ja\",A548,IF(E549=\"ja\",A549,IF(E550=\"ja\",A550,IF(E551=\"ja\",A551,IF(A552=\"ja\",A552,\"Volgepland\")))))))))))))))))))","v":"2022-06-16"},null,null,null,null,0,null,null,0,0,null,null,0]
["2022-06-16",{"$f":"WEEKNUM(Tabel_kalender[[#This Row],[Datum]],21)","v":24},"1900-01-04",null,"ja",{"$f":"IF(Tabel_kalender[[#This Row],[Werkdag]]=\"ja\",Tabel_kalender[[#This Row],[Datum]],IF(E536=\"ja\",A536,IF(E537=\"ja\",A537,IF(E538=\"ja\",A538,IF(E539=\"ja\",A539,IF(E540=\"ja\",A540,IF(E541=\"ja\",A541,IF(E542=\"ja\",A542,IF(E543=\"ja\",A543,IF(E544=\"ja\",A544,IF(E545=\"ja\",A545,IF(E546=\"ja\",A546,IF(E547=\"ja\",A547,IF(E548=\"ja\",A548,IF(E549=\"ja\",A549,IF(E550=\"ja\",A550,IF(E551=\"ja\",A551,IF(E552=\"ja\",A552,IF(A553=\"ja\",A553,\"Volgepland\")))))))))))))))))))","v":"2022-06-16"},null,null,null,null,0,null,null,0,0,null,null,0]
["2022-06-17",{"$f":"WEEKNUM(Tabel_kalender[[#This Row],[Datum]],21)","v":24},"1900-01-05",null,"ja",{"$f":"IF(Tabel_kalender[[#This Row],[Werkdag]]=\"ja\",Tabel_kalender[[#This Row],[Datum]],IF(E537=\"ja\",A537,IF(E538=\"ja\",A538,IF(E539=\"ja\",A539,IF(E540=\"ja\",A540,IF(E541=\"ja\",A541,IF(E542=\"ja\",A542,IF(E543=\"ja\",A543,IF(E544=\"ja\",A544,IF(E545=\"ja\",A545,IF(E546=\"ja\",A546,IF(E547=\"ja\",A547,IF(E548=\"ja\",A548,IF(E549=\"ja\",A549,IF(E550=\"ja\",A550,IF(E551=\"ja\",A551,IF(E552=\"ja\",A552,IF(E553=\"ja\",A553,IF(A554=\"ja\",A554,\"Volgepland\")))))))))))))))))))","v":"2022-06-17"},null,null,null,null,0,null,null,0,0,null,null,0]
["2022-06-18",{"$f":"WEEKNUM(Tabel_kalender[[#This Row],[Datum]],21)","v":24},"1900-01-06",null,"ja",{"$f":"IF(Tabel_kalender[[#This Row],[Werkdag]]=\"ja\",Tabel_kalender[[#This Row],[Datum]],IF(E538=\"ja\",A538,IF(E539=\"ja\",A539,IF(E540=\"ja\",A540,IF(E541=\"ja\",A541,IF(E542=\"ja\",A542,IF(E543=\"ja\",A543,IF(E544=\"ja\",A544,IF(E545=\"ja\",A545,IF(E546=\"ja\",A546,IF(E547=\"ja\",A547,IF(E548=\"ja\",A548,IF(E549=\"ja\",A549,IF(E550=\"ja\",A550,IF(E551=\"ja\",A551,IF(E552=\"ja\",A552,IF(E553=\"ja\",A553,IF(E554=\"ja\",A554,IF(A555=\"ja\",A555,\"Volgepland\")))))))))))))))))))","v":"2022-06-18"},null,null,null,null,0,null,null,0,0,null,null,0]
["2022-06-19",{"$f":"WEEKNUM(Tabel_kalender[[#This Row],[Datum]],21)","v":24},"1900-01-07",null,"ja",{"$f":"IF(Tabel_kalender[[#This Row],[Werkdag]]=\"ja\",Tabel_kalender[[#This Row],[Datum]],IF(E539=\"ja\",A539,IF(E540=\"ja\",A540,IF(E541=\"ja\",A541,IF(E542=\"ja\",A542,IF(E543=\"ja\",A543,IF(E544=\"ja\",A544,IF(E545=\"ja\",A545,IF(E546=\"ja\",A546,IF(E547=\"ja\",A547,IF(E548=\"ja\",A548,IF(E549=\"ja\",A549,IF(E550=\"ja\",A550,IF(E551=\"ja\",A551,IF(E552=\"ja\",A552,IF(E553=\"ja\",A553,IF(E554=\"ja\",A554,IF(E555=\"ja\",A555,IF(A556=\"ja\",A556,\"Volgepland\")))))))))))))))))))","v":"2022-06-19"},null,null,null,null,0,null,null,0,0,null,null,0]
["2022-06-20",{"$f":"WEEKNUM(Tabel_kalender[[#This Row],[Datum]],21)","v":25},"1900-01-01",null,"ja",{"$f":"IF(Tabel_kalender[[#This Row],[Werkdag]]=\"ja\",Tabel_kalender[[#This Row],[Datum]],IF(E540=\"ja\",A540,IF(E541=\"ja\",A541,IF(E542=\"ja\",A542,IF(E543=\"ja\",A543,IF(E544=\"ja\",A544,IF(E545=\"ja\",A545,IF(E546=\"ja\",A546,IF(E547=\"ja\",A547,IF(E548=\"ja\",A548,IF(E549=\"ja\",A549,IF(E550=\"ja\",A550,IF(E551=\"ja\",A551,IF(E552=\"ja\",A552,IF(E553=\"ja\",A553,IF(E554=\"ja\",A554,IF(E555=\"ja\",A555,IF(E556=\"ja\",A556,IF(A557=\"ja\",A557,\"Volgepland\")))))))))))))))))))","v":"2022-06-20"},null,null,null,null,0,null,null,0,0,null,null,0]
["2022-06-21",{"$f":"WEEKNUM(Tabel_kalender[[#This Row],[Datum]],21)","v":25},"1900-01-02",null,"nee",{"$f":"IF(Tabel_kalender[[#This Row],[Werkdag]]=\"ja\",Tabel_kalender[[#This Row],[Datum]],IF(E541=\"ja\",A541,IF(E542=\"ja\",A542,IF(E543=\"ja\",A543,IF(E544=\"ja\",A544,IF(E545=\"ja\",A545,IF(E546=\"ja\",A546,IF(E547=\"ja\",A547,IF(E548=\"ja\",A548,IF(E549=\"ja\",A549,IF(E550=\"ja\",A550,IF(E551=\"ja\",A551,IF(E552=\"ja\",A552,IF(E553=\"ja\",A553,IF(E554=\"ja\",A554,IF(E555=\"ja\",A555,IF(E556=\"ja\",A556,IF(E557=\"ja\",A557,IF(A558=\"ja\",A558,\"Volgepland\")))))))))))))))))))","v":"2022-06-23"},null,null,null,null,0,null,null,0,0,null,null,0]
["2022-06-22",{"$f":"WEEKNUM(Tabel_kalender[[#This Row],[Datum]],21)","v":25},"1900-01-03",null,"nee",{"$f":"IF(Tabel_kalender[[#This Row],[Werkdag]]=\"ja\",Tabel_kalender[[#This Row],[Datum]],IF(E542=\"ja\",A542,IF(E543=\"ja\",A543,IF(E544=\"ja\",A544,IF(E545=\"ja\",A545,IF(E546=\"ja\",A546,IF(E547=\"ja\",A547,IF(E548=\"ja\",A548,IF(E549=\"ja\",A549,IF(E550=\"ja\",A550,IF(E551=\"ja\",A551,IF(E552=\"ja\",A552,IF(E553=\"ja\",A553,IF(E554=\"ja\",A554,IF(E555=\"ja\",A555,IF(E556=\"ja\",A556,IF(E557=\"ja\",A557,IF(E558=\"ja\",A558,IF(A559=\"ja\",A559,\"Volgepland\")))))))))))))))))))","v":"2022-06-23"},null,null,null,null,0,null,null,0,0,null,null,0]
["2022-06-23",{"$f":"WEEKNUM(Tabel_kalender[[#This Row],[Datum]],21)","v":25},"1900-01-04",null,"ja",{"$f":"IF(Tabel_kalender[[#This Row],[Werkdag]]=\"ja\",Tabel_kalender[[#This Row],[Datum]],IF(E543=\"ja\",A543,IF(E544=\"ja\",A544,IF(E545=\"ja\",A545,IF(E546=\"ja\",A546,IF(E547=\"ja\",A547,IF(E548=\"ja\",A548,IF(E549=\"ja\",A549,IF(E550=\"ja\",A550,IF(E551=\"ja\",A551,IF(E552=\"ja\",A552,IF(E553=\"ja\",A553,IF(E554=\"ja\",A554,IF(E555=\"ja\",A555,IF(E556=\"ja\",A556,IF(E557=\"ja\",A557,IF(E558=\"ja\",A558,IF(E559=\"ja\",A559,IF(A560=\"ja\",A560,\"Volgepland\")))))))))))))))))))","v":"2022-06-23"},null,null,null,null,0,null,null,0,0,null,null,0]
["2022-06-24",{"$f":"WEEKNUM(Tabel_kalender[[#This Row],[Datum]],21)","v":25},"1900-01-05",null,"ja",{"$f":"IF(Tabel_kalender[[#This Row],[Werkdag]]=\"ja\",Tabel_kalender[[#This Row],[Datum]],IF(E544=\"ja\",A544,IF(E545=\"ja\",A545,IF(E546=\"ja\",A546,IF(E547=\"ja\",A547,IF(E548=\"ja\",A548,IF(E549=\"ja\",A549,IF(E550=\"ja\",A550,IF(E551=\"ja\",A551,IF(E552=\"ja\",A552,IF(E553=\"ja\",A553,IF(E554=\"ja\",A554,IF(E555=\"ja\",A555,IF(E556=\"ja\",A556,IF(E557=\"ja\",A557,IF(E558=\"ja\",A558,IF(E559=\"ja\",A559,IF(E560=\"ja\",A560,IF(A561=\"ja\",A561,\"Volgepland\")))))))))))))))))))","v":"2022-06-24"},null,null,null,null,0,null,null,0,0,null,null,0]
["2022-06-25",{"$f":"WEEKNUM(Tabel_kalender[[#This Row],[Datum]],21)","v":25},"1900-01-06",null,"ja",{"$f":"IF(Tabel_kalender[[#This Row],[Werkdag]]=\"ja\",Tabel_kalender[[#This Row],[Datum]],IF(E545=\"ja\",A545,IF(E546=\"ja\",A546,IF(E547=\"ja\",A547,IF(E548=\"ja\",A548,IF(E549=\"ja\",A549,IF(E550=\"ja\",A550,IF(E551=\"ja\",A551,IF(E552=\"ja\",A552,IF(E553=\"ja\",A553,IF(E554=\"ja\",A554,IF(E555=\"ja\",A555,IF(E556=\"ja\",A556,IF(E557=\"ja\",A557,IF(E558=\"ja\",A558,IF(E559=\"ja\",A559,IF(E560=\"ja\",A560,IF(E561=\"ja\",A561,IF(A562=\"ja\",A562,\"Volgepland\")))))))))))))))))))","v":"2022-06-25"},null,null,null,null,0,null,null,0,0,null,null,0]
["2022-06-26",{"$f":"WEEKNUM(Tabel_kalender[[#This Row],[Datum]],21)","v":25},"1900-01-07",null,"ja",{"$f":"IF(Tabel_kalender[[#This Row],[Werkdag]]=\"ja\",Tabel_kalender[[#This Row],[Datum]],IF(E546=\"ja\",A546,IF(E547=\"ja\",A547,IF(E548=\"ja\",A548,IF(E549=\"ja\",A549,IF(E550=\"ja\",A550,IF(E551=\"ja\",A551,IF(E552=\"ja\",A552,IF(E553=\"ja\",A553,IF(E554=\"ja\",A554,IF(E555=\"ja\",A555,IF(E556=\"ja\",A556,IF(E557=\"ja\",A557,IF(E558=\"ja\",A558,IF(E559=\"ja\",A559,IF(E560=\"ja\",A560,IF(E561=\"ja\",A561,IF(E562=\"ja\",A562,IF(A563=\"ja\",A563,\"Volgepland\")))))))))))))))))))","v":"2022-06-26"},null,null,null,null,0,null,null,0,0,null,null,0]
["2022-06-27",{"$f":"WEEKNUM(Tabel_kalender[[#This Row],[Datum]],21)","v":26},"1900-01-01",null,"ja",{"$f":"IF(Tabel_kalender[[#This Row],[Werkdag]]=\"ja\",Tabel_kalender[[#This Row],[Datum]],IF(E547=\"ja\",A547,IF(E548=\"ja\",A548,IF(E549=\"ja\",A549,IF(E550=\"ja\",A550,IF(E551=\"ja\",A551,IF(E552=\"ja\",A552,IF(E553=\"ja\",A553,IF(E554=\"ja\",A554,IF(E555=\"ja\",A555,IF(E556=\"ja\",A556,IF(E557=\"ja\",A557,IF(E558=\"ja\",A558,IF(E559=\"ja\",A559,IF(E560=\"ja\",A560,IF(E561=\"ja\",A561,IF(E562=\"ja\",A562,IF(E563=\"ja\",A563,IF(A564=\"ja\",A564,\"Volgepland\")))))))))))))))))))","v":"2022-06-27"},null,null,null,null,0,null,null,0,0,null,null,0]
["2022-06-28",{"$f":"WEEKNUM(Tabel_kalender[[#This Row],[Datum]],21)","v":26},"1900-01-02",null,"nee",{"$f":"IF(Tabel_kalender[[#This Row],[Werkdag]]=\"ja\",Tabel_kalender[[#This Row],[Datum]],IF(E548=\"ja\",A548,IF(E549=\"ja\",A549,IF(E550=\"ja\",A550,IF(E551=\"ja\",A551,IF(E552=\"ja\",A552,IF(E553=\"ja\",A553,IF(E554=\"ja\",A554,IF(E555=\"ja\",A555,IF(E556=\"ja\",A556,IF(E557=\"ja\",A557,IF(E558=\"ja\",A558,IF(E559=\"ja\",A559,IF(E560=\"ja\",A560,IF(E561=\"ja\",A561,IF(E562=\"ja\",A562,IF(E563=\"ja\",A563,IF(E564=\"ja\",A564,IF(A565=\"ja\",A565,\"Volgepland\")))))))))))))))))))","v":"2022-06-30"},null,null,null,null,0,null,null,0,0,null,null,0]
["2022-06-29",{"$f":"WEEKNUM(Tabel_kalender[[#This Row],[Datum]],21)","v":26},"1900-01-03",null,"nee",{"$f":"IF(Tabel_kalender[[#This Row],[Werkdag]]=\"ja\",Tabel_kalender[[#This Row],[Datum]],IF(E549=\"ja\",A549,IF(E550=\"ja\",A550,IF(E551=\"ja\",A551,IF(E552=\"ja\",A552,IF(E553=\"ja\",A553,IF(E554=\"ja\",A554,IF(E555=\"ja\",A555,IF(E556=\"ja\",A556,IF(E557=\"ja\",A557,IF(E558=\"ja\",A558,IF(E559=\"ja\",A559,IF(E560=\"ja\",A560,IF(E561=\"ja\",A561,IF(E562=\"ja\",A562,IF(E563=\"ja\",A563,IF(E564=\"ja\",A564,IF(E565=\"ja\",A565,IF(A566=\"ja\",A566,\"Volgepland\")))))))))))))))))))","v":"2022-06-30"},null,null,null,null,0,null,null,0,0,null,null,0]
["2022-06-30",{"$f":"WEEKNUM(Tabel_kalender[[#This Row],[Datum]],21)","v":26},"1900-01-04",null,"ja",{"$f":"IF(Tabel_kalender[[#This Row],[Werkdag]]=\"ja\",Tabel_kalender[[#This Row],[Datum]],IF(E550=\"ja\",A550,IF(E551=\"ja\",A551,IF(E552=\"ja\",A552,IF(E553=\"ja\",A553,IF(E554=\"ja\",A554,IF(E555=\"ja\",A555,IF(E556=\"ja\",A556,IF(E557=\"ja\",A557,IF(E558=\"ja\",A558,IF(E559=\"ja\",A559,IF(E560=\"ja\",A560,IF(E561=\"ja\",A561,IF(E562=\"ja\",A562,IF(E563=\"ja\",A563,IF(E564=\"ja\",A564,IF(E565=\"ja\",A565,IF(E566=\"ja\",A566,IF(A567=\"ja\",A567,\"Volgepland\")))))))))))))))))))","v":"2022-06-30"},null,null,null,null,0,null,null,0,0,null,null,0]
["2022-07-01",{"$f":"WEEKNUM(Tabel_kalender[[#This Row],[Datum]],21)","v":26},"1900-01-05",null,"ja",{"$f":"IF(Tabel_kalender[[#This Row],[Werkdag]]=\"ja\",Tabel_kalender[[#This Row],[Datum]],IF(E551=\"ja\",A551,IF(E552=\"ja\",A552,IF(E553=\"ja\",A553,IF(E554=\"ja\",A554,IF(E555=\"ja\",A555,IF(E556=\"ja\",A556,IF(E557=\"ja\",A557,IF(E558=\"ja\",A558,IF(E559=\"ja\",A559,IF(E560=\"ja\",A560,IF(E561=\"ja\",A561,IF(E562=\"ja\",A562,IF(E563=\"ja\",A563,IF(E564=\"ja\",A564,IF(E565=\"ja\",A565,IF(E566=\"ja\",A566,IF(E567=\"ja\",A567,IF(A568=\"ja\",A568,\"Volgepland\")))))))))))))))))))","v":"2022-07-01"},null,null,null,null,0,null,null,0,0,null,null,0]
["2022-07-02",{"$f":"WEEKNUM(Tabel_kalender[[#This Row],[Datum]],21)","v":26},"1900-01-06",null,"ja",{"$f":"IF(Tabel_kalender[[#This Row],[Werkdag]]=\"ja\",Tabel_kalender[[#This Row],[Datum]],IF(E552=\"ja\",A552,IF(E553=\"ja\",A553,IF(E554=\"ja\",A554,IF(E555=\"ja\",A555,IF(E556=\"ja\",A556,IF(E557=\"ja\",A557,IF(E558=\"ja\",A558,IF(E559=\"ja\",A559,IF(E560=\"ja\",A560,IF(E561=\"ja\",A561,IF(E562=\"ja\",A562,IF(E563=\"ja\",A563,IF(E564=\"ja\",A564,IF(E565=\"ja\",A565,IF(E566=\"ja\",A566,IF(E567=\"ja\",A567,IF(E568=\"ja\",A568,IF(A569=\"ja\",A569,\"Volgepland\")))))))))))))))))))","v":"2022-07-02"},null,null,null,null,0,null,null,0,0,null,null,0]
["2022-07-03",{"$f":"WEEKNUM(Tabel_kalender[[#This Row],[Datum]],21)","v":26},"1900-01-07",null,"ja",{"$f":"IF(Tabel_kalender[[#This Row],[Werkdag]]=\"ja\",Tabel_kalender[[#This Row],[Datum]],IF(E553=\"ja\",A553,IF(E554=\"ja\",A554,IF(E555=\"ja\",A555,IF(E556=\"ja\",A556,IF(E557=\"ja\",A557,IF(E558=\"ja\",A558,IF(E559=\"ja\",A559,IF(E560=\"ja\",A560,IF(E561=\"ja\",A561,IF(E562=\"ja\",A562,IF(E563=\"ja\",A563,IF(E564=\"ja\",A564,IF(E565=\"ja\",A565,IF(E566=\"ja\",A566,IF(E567=\"ja\",A567,IF(E568=\"ja\",A568,IF(E569=\"ja\",A569,IF(A570=\"ja\",A570,\"Volgepland\")))))))))))))))))))","v":"2022-07-03"},null,null,null,null,0,null,null,0,0,null,null,0]
["2022-07-04",{"$f":"WEEKNUM(Tabel_kalender[[#This Row],[Datum]],21)","v":27},"1900-01-01",null,"ja",{"$f":"IF(Tabel_kalender[[#This Row],[Werkdag]]=\"ja\",Tabel_kalender[[#This Row],[Datum]],IF(E554=\"ja\",A554,IF(E555=\"ja\",A555,IF(E556=\"ja\",A556,IF(E557=\"ja\",A557,IF(E558=\"ja\",A558,IF(E559=\"ja\",A559,IF(E560=\"ja\",A560,IF(E561=\"ja\",A561,IF(E562=\"ja\",A562,IF(E563=\"ja\",A563,IF(E564=\"ja\",A564,IF(E565=\"ja\",A565,IF(E566=\"ja\",A566,IF(E567=\"ja\",A567,IF(E568=\"ja\",A568,IF(E569=\"ja\",A569,IF(E570=\"ja\",A570,IF(A571=\"ja\",A571,\"Volgepland\")))))))))))))))))))","v":"2022-07-04"},null,null,null,null,0,null,null,0,0,null,null,0]
["2022-07-05",{"$f":"WEEKNUM(Tabel_kalender[[#This Row],[Datum]],21)","v":27},"1900-01-02",null,"nee",{"$f":"IF(Tabel_kalender[[#This Row],[Werkdag]]=\"ja\",Tabel_kalender[[#This Row],[Datum]],IF(E555=\"ja\",A555,IF(E556=\"ja\",A556,IF(E557=\"ja\",A557,IF(E558=\"ja\",A558,IF(E559=\"ja\",A559,IF(E560=\"ja\",A560,IF(E561=\"ja\",A561,IF(E562=\"ja\",A562,IF(E563=\"ja\",A563,IF(E564=\"ja\",A564,IF(E565=\"ja\",A565,IF(E566=\"ja\",A566,IF(E567=\"ja\",A567,IF(E568=\"ja\",A568,IF(E569=\"ja\",A569,IF(E570=\"ja\",A570,IF(E571=\"ja\",A571,IF(A572=\"ja\",A572,\"Volgepland\")))))))))))))))))))","v":"2022-07-07"},null,null,null,null,0,null,null,0,0,null,null,0]
["2022-07-06",{"$f":"WEEKNUM(Tabel_kalender[[#This Row],[Datum]],21)","v":27},"1900-01-03",null,"nee",{"$f":"IF(Tabel_kalender[[#This Row],[Werkdag]]=\"ja\",Tabel_kalender[[#This Row],[Datum]],IF(E556=\"ja\",A556,IF(E557=\"ja\",A557,IF(E558=\"ja\",A558,IF(E559=\"ja\",A559,IF(E560=\"ja\",A560,IF(E561=\"ja\",A561,IF(E562=\"ja\",A562,IF(E563=\"ja\",A563,IF(E564=\"ja\",A564,IF(E565=\"ja\",A565,IF(E566=\"ja\",A566,IF(E567=\"ja\",A567,IF(E568=\"ja\",A568,IF(E569=\"ja\",A569,IF(E570=\"ja\",A570,IF(E571=\"ja\",A571,IF(E572=\"ja\",A572,IF(A573=\"ja\",A573,\"Volgepland\")))))))))))))))))))","v":"2022-07-07"},null,null,null,null,0,null,null,0,0,null,null,0]
["2022-07-07",{"$f":"WEEKNUM(Tabel_kalender[[#This Row],[Datum]],21)","v":27},"1900-01-04",null,"ja",{"$f":"IF(Tabel_kalender[[#This Row],[Werkdag]]=\"ja\",Tabel_kalender[[#This Row],[Datum]],IF(E557=\"ja\",A557,IF(E558=\"ja\",A558,IF(E559=\"ja\",A559,IF(E560=\"ja\",A560,IF(E561=\"ja\",A561,IF(E562=\"ja\",A562,IF(E563=\"ja\",A563,IF(E564=\"ja\",A564,IF(E565=\"ja\",A565,IF(E566=\"ja\",A566,IF(E567=\"ja\",A567,IF(E568=\"ja\",A568,IF(E569=\"ja\",A569,IF(E570=\"ja\",A570,IF(E571=\"ja\",A571,IF(E572=\"ja\",A572,IF(E573=\"ja\",A573,IF(A574=\"ja\",A574,\"Volgepland\")))))))))))))))))))","v":"2022-07-07"},null,null,null,null,0,null,null,0,0,null,null,0]
["2022-07-08",{"$f":"WEEKNUM(Tabel_kalender[[#This Row],[Datum]],21)","v":27},"1900-01-05",null,"ja",{"$f":"IF(Tabel_kalender[[#This Row],[Werkdag]]=\"ja\",Tabel_kalender[[#This Row],[Datum]],IF(E558=\"ja\",A558,IF(E559=\"ja\",A559,IF(E560=\"ja\",A560,IF(E561=\"ja\",A561,IF(E562=\"ja\",A562,IF(E563=\"ja\",A563,IF(E564=\"ja\",A564,IF(E565=\"ja\",A565,IF(E566=\"ja\",A566,IF(E567=\"ja\",A567,IF(E568=\"ja\",A568,IF(E569=\"ja\",A569,IF(E570=\"ja\",A570,IF(E571=\"ja\",A571,IF(E572=\"ja\",A572,IF(E573=\"ja\",A573,IF(E574=\"ja\",A574,IF(A575=\"ja\",A575,\"Volgepland\")))))))))))))))))))","v":"2022-07-08"},null,null,null,null,0,null,null,0,0,null,null,0]
["2022-07-09",{"$f":"WEEKNUM(Tabel_kalender[[#This Row],[Datum]],21)","v":27},"1900-01-06",null,"ja",{"$f":"IF(Tabel_kalender[[#This Row],[Werkdag]]=\"ja\",Tabel_kalender[[#This Row],[Datum]],IF(E559=\"ja\",A559,IF(E560=\"ja\",A560,IF(E561=\"ja\",A561,IF(E562=\"ja\",A562,IF(E563=\"ja\",A563,IF(E564=\"ja\",A564,IF(E565=\"ja\",A565,IF(E566=\"ja\",A566,IF(E567=\"ja\",A567,IF(E568=\"ja\",A568,IF(E569=\"ja\",A569,IF(E570=\"ja\",A570,IF(E571=\"ja\",A571,IF(E572=\"ja\",A572,IF(E573=\"ja\",A573,IF(E574=\"ja\",A574,IF(E575=\"ja\",A575,IF(A576=\"ja\",A576,\"Volgepland\")))))))))))))))))))","v":"2022-07-09"},null,null,null,null,0,null,null,0,0,null,null,0]
["2022-07-10",{"$f":"WEEKNUM(Tabel_kalender[[#This Row],[Datum]],21)","v":27},"1900-01-07",null,"ja",{"$f":"IF(Tabel_kalender[[#This Row],[Werkdag]]=\"ja\",Tabel_kalender[[#This Row],[Datum]],IF(E560=\"ja\",A560,IF(E561=\"ja\",A561,IF(E562=\"ja\",A562,IF(E563=\"ja\",A563,IF(E564=\"ja\",A564,IF(E565=\"ja\",A565,IF(E566=\"ja\",A566,IF(E567=\"ja\",A567,IF(E568=\"ja\",A568,IF(E569=\"ja\",A569,IF(E570=\"ja\",A570,IF(E571=\"ja\",A571,IF(E572=\"ja\",A572,IF(E573=\"ja\",A573,IF(E574=\"ja\",A574,IF(E575=\"ja\",A575,IF(E576=\"ja\",A576,IF(A577=\"ja\",A577,\"Volgepland\")))))))))))))))))))","v":"2022-07-10"},null,null,null,null,0,null,null,0,0,null,null,0]
["2022-07-11",{"$f":"WEEKNUM(Tabel_kalender[[#This Row],[Datum]],21)","v":28},"1900-01-01",null,"ja",{"$f":"IF(Tabel_kalender[[#This Row],[Werkdag]]=\"ja\",Tabel_kalender[[#This Row],[Datum]],IF(E561=\"ja\",A561,IF(E562=\"ja\",A562,IF(E563=\"ja\",A563,IF(E564=\"ja\",A564,IF(E565=\"ja\",A565,IF(E566=\"ja\",A566,IF(E567=\"ja\",A567,IF(E568=\"ja\",A568,IF(E569=\"ja\",A569,IF(E570=\"ja\",A570,IF(E571=\"ja\",A571,IF(E572=\"ja\",A572,IF(E573=\"ja\",A573,IF(E574=\"ja\",A574,IF(E575=\"ja\",A575,IF(E576=\"ja\",A576,IF(E577=\"ja\",A577,IF(A578=\"ja\",A578,\"Volgepland\")))))))))))))))))))","v":"2022-07-11"},null,null,null,null,0,null,null,0,0,null,null,0]
["2022-07-12",{"$f":"WEEKNUM(Tabel_kalender[[#This Row],[Datum]],21)","v":28},"1900-01-02",null,"nee",{"$f":"IF(Tabel_kalender[[#This Row],[Werkdag]]=\"ja\",Tabel_kalender[[#This Row],[Datum]],IF(E562=\"ja\",A562,IF(E563=\"ja\",A563,IF(E564=\"ja\",A564,IF(E565=\"ja\",A565,IF(E566=\"ja\",A566,IF(E567=\"ja\",A567,IF(E568=\"ja\",A568,IF(E569=\"ja\",A569,IF(E570=\"ja\",A570,IF(E571=\"ja\",A571,IF(E572=\"ja\",A572,IF(E573=\"ja\",A573,IF(E574=\"ja\",A574,IF(E575=\"ja\",A575,IF(E576=\"ja\",A576,IF(E577=\"ja\",A577,IF(E578=\"ja\",A578,IF(A579=\"ja\",A579,\"Volgepland\")))))))))))))))))))","v":"2022-07-14"},null,null,null,null,0,null,null,0,0,null,null,0]
["2022-07-13",{"$f":"WEEKNUM(Tabel_kalender[[#This Row],[Datum]],21)","v":28},"1900-01-03",null,"nee",{"$f":"IF(Tabel_kalender[[#This Row],[Werkdag]]=\"ja\",Tabel_kalender[[#This Row],[Datum]],IF(E563=\"ja\",A563,IF(E564=\"ja\",A564,IF(E565=\"ja\",A565,IF(E566=\"ja\",A566,IF(E567=\"ja\",A567,IF(E568=\"ja\",A568,IF(E569=\"ja\",A569,IF(E570=\"ja\",A570,IF(E571=\"ja\",A571,IF(E572=\"ja\",A572,IF(E573=\"ja\",A573,IF(E574=\"ja\",A574,IF(E575=\"ja\",A575,IF(E576=\"ja\",A576,IF(E577=\"ja\",A577,IF(E578=\"ja\",A578,IF(E579=\"ja\",A579,IF(A580=\"ja\",A580,\"Volgepland\")))))))))))))))))))","v":"2022-07-14"},null,null,null,null,0,null,null,0,0,null,null,0]
["2022-07-14",{"$f":"WEEKNUM(Tabel_kalender[[#This Row],[Datum]],21)","v":28},"1900-01-04",null,"ja",{"$f":"IF(Tabel_kalender[[#This Row],[Werkdag]]=\"ja\",Tabel_kalender[[#This Row],[Datum]],IF(E564=\"ja\",A564,IF(E565=\"ja\",A565,IF(E566=\"ja\",A566,IF(E567=\"ja\",A567,IF(E568=\"ja\",A568,IF(E569=\"ja\",A569,IF(E570=\"ja\",A570,IF(E571=\"ja\",A571,IF(E572=\"ja\",A572,IF(E573=\"ja\",A573,IF(E574=\"ja\",A574,IF(E575=\"ja\",A575,IF(E576=\"ja\",A576,IF(E577=\"ja\",A577,IF(E578=\"ja\",A578,IF(E579=\"ja\",A579,IF(E580=\"ja\",A580,IF(A581=\"ja\",A581,\"Volgepland\")))))))))))))))))))","v":"2022-07-14"},null,null,null,null,0,null,null,{"$f":"IF(L563>0,L563-K563,)-M563","v":0},0,null,null,0]
["2022-07-15",{"$f":"WEEKNUM(Tabel_kalender[[#This Row],[Datum]],21)","v":28},"1900-01-05",null,"ja",{"$f":"IF(Tabel_kalender[[#This Row],[Werkdag]]=\"ja\",Tabel_kalender[[#This Row],[Datum]],IF(E565=\"ja\",A565,IF(E566=\"ja\",A566,IF(E567=\"ja\",A567,IF(E568=\"ja\",A568,IF(E569=\"ja\",A569,IF(E570=\"ja\",A570,IF(E571=\"ja\",A571,IF(E572=\"ja\",A572,IF(E573=\"ja\",A573,IF(E574=\"ja\",A574,IF(E575=\"ja\",A575,IF(E576=\"ja\",A576,IF(E577=\"ja\",A577,IF(E578=\"ja\",A578,IF(E579=\"ja\",A579,IF(E580=\"ja\",A580,IF(E581=\"ja\",A581,IF(A582=\"ja\",A582,\"Volgepland\")))))))))))))))))))","v":"2022-07-15"},null,null,null,null,0,null,null,0,0,null,null,0]
["2022-07-16",{"$f":"WEEKNUM(Tabel_kalender[[#This Row],[Datum]],21)","v":28},"1900-01-06",null,"ja",{"$f":"IF(Tabel_kalender[[#This Row],[Werkdag]]=\"ja\",Tabel_kalender[[#This Row],[Datum]],IF(E566=\"ja\",A566,IF(E567=\"ja\",A567,IF(E568=\"ja\",A568,IF(E569=\"ja\",A569,IF(E570=\"ja\",A570,IF(E571=\"ja\",A571,IF(E572=\"ja\",A572,IF(E573=\"ja\",A573,IF(E574=\"ja\",A574,IF(E575=\"ja\",A575,IF(E576=\"ja\",A576,IF(E577=\"ja\",A577,IF(E578=\"ja\",A578,IF(E579=\"ja\",A579,IF(E580=\"ja\",A580,IF(E581=\"ja\",A581,IF(E582=\"ja\",A582,IF(A583=\"ja\",A583,\"Volgepland\")))))))))))))))))))","v":"2022-07-16"},null,null,null,null,0,null,null,0,0,null,null,0]
["2022-07-17",{"$f":"WEEKNUM(Tabel_kalender[[#This Row],[Datum]],21)","v":28},"1900-01-07",null,"ja",{"$f":"IF(Tabel_kalender[[#This Row],[Werkdag]]=\"ja\",Tabel_kalender[[#This Row],[Datum]],IF(E567=\"ja\",A567,IF(E568=\"ja\",A568,IF(E569=\"ja\",A569,IF(E570=\"ja\",A570,IF(E571=\"ja\",A571,IF(E572=\"ja\",A572,IF(E573=\"ja\",A573,IF(E574=\"ja\",A574,IF(E575=\"ja\",A575,IF(E576=\"ja\",A576,IF(E577=\"ja\",A577,IF(E578=\"ja\",A578,IF(E579=\"ja\",A579,IF(E580=\"ja\",A580,IF(E581=\"ja\",A581,IF(E582=\"ja\",A582,IF(E583=\"ja\",A583,IF(A584=\"ja\",A584,\"Volgepland\")))))))))))))))))))","v":"2022-07-17"},null,null,null,null,0,null,null,0,0,null,null,0]
["2022-07-18",{"$f":"WEEKNUM(Tabel_kalender[[#This Row],[Datum]],21)","v":29},"1900-01-01",null,"ja",{"$f":"IF(Tabel_kalender[[#This Row],[Werkdag]]=\"ja\",Tabel_kalender[[#This Row],[Datum]],IF(E568=\"ja\",A568,IF(E569=\"ja\",A569,IF(E570=\"ja\",A570,IF(E571=\"ja\",A571,IF(E572=\"ja\",A572,IF(E573=\"ja\",A573,IF(E574=\"ja\",A574,IF(E575=\"ja\",A575,IF(E576=\"ja\",A576,IF(E577=\"ja\",A577,IF(E578=\"ja\",A578,IF(E579=\"ja\",A579,IF(E580=\"ja\",A580,IF(E581=\"ja\",A581,IF(E582=\"ja\",A582,IF(E583=\"ja\",A583,IF(E584=\"ja\",A584,IF(A585=\"ja\",A585,\"Volgepland\")))))))))))))))))))","v":"2022-07-18"},null,null,null,null,0,null,null,0,0,null,null,0]
["2022-07-19",{"$f":"WEEKNUM(Tabel_kalender[[#This Row],[Datum]],21)","v":29},"1900-01-02",null,"nee",{"$f":"IF(Tabel_kalender[[#This Row],[Werkdag]]=\"ja\",Tabel_kalender[[#This Row],[Datum]],IF(E569=\"ja\",A569,IF(E570=\"ja\",A570,IF(E571=\"ja\",A571,IF(E572=\"ja\",A572,IF(E573=\"ja\",A573,IF(E574=\"ja\",A574,IF(E575=\"ja\",A575,IF(E576=\"ja\",A576,IF(E577=\"ja\",A577,IF(E578=\"ja\",A578,IF(E579=\"ja\",A579,IF(E580=\"ja\",A580,IF(E581=\"ja\",A581,IF(E582=\"ja\",A582,IF(E583=\"ja\",A583,IF(E584=\"ja\",A584,IF(E585=\"ja\",A585,IF(A586=\"ja\",A586,\"Volgepland\")))))))))))))))))))","v":"2022-07-21"},null,null,null,null,0,null,null,0,0,null,null,0]
["2022-07-20",{"$f":"WEEKNUM(Tabel_kalender[[#This Row],[Datum]],21)","v":29},"1900-01-03",null,"nee",{"$f":"IF(Tabel_kalender[[#This Row],[Werkdag]]=\"ja\",Tabel_kalender[[#This Row],[Datum]],IF(E570=\"ja\",A570,IF(E571=\"ja\",A571,IF(E572=\"ja\",A572,IF(E573=\"ja\",A573,IF(E574=\"ja\",A574,IF(E575=\"ja\",A575,IF(E576=\"ja\",A576,IF(E577=\"ja\",A577,IF(E578=\"ja\",A578,IF(E579=\"ja\",A579,IF(E580=\"ja\",A580,IF(E581=\"ja\",A581,IF(E582=\"ja\",A582,IF(E583=\"ja\",A583,IF(E584=\"ja\",A584,IF(E585=\"ja\",A585,IF(E586=\"ja\",A586,IF(A587=\"ja\",A587,\"Volgepland\")))))))))))))))))))","v":"2022-07-21"},null,null,null,null,0,null,null,0,0,null,null,0]
["2022-07-21",{"$f":"WEEKNUM(Tabel_kalender[[#This Row],[Datum]],21)","v":29},"1900-01-04",null,"ja",{"$f":"IF(Tabel_kalender[[#This Row],[Werkdag]]=\"ja\",Tabel_kalender[[#This Row],[Datum]],IF(E571=\"ja\",A571,IF(E572=\"ja\",A572,IF(E573=\"ja\",A573,IF(E574=\"ja\",A574,IF(E575=\"ja\",A575,IF(E576=\"ja\",A576,IF(E577=\"ja\",A577,IF(E578=\"ja\",A578,IF(E579=\"ja\",A579,IF(E580=\"ja\",A580,IF(E581=\"ja\",A581,IF(E582=\"ja\",A582,IF(E583=\"ja\",A583,IF(E584=\"ja\",A584,IF(E585=\"ja\",A585,IF(E586=\"ja\",A586,IF(E587=\"ja\",A587,IF(A588=\"ja\",A588,\"Volgepland\")))))))))))))))))))","v":"2022-07-21"},null,null,null,null,0,null,null,0,0,null,null,0]
["2022-07-22",{"$f":"WEEKNUM(Tabel_kalender[[#This Row],[Datum]],21)","v":29},"1900-01-05",null,"ja",{"$f":"IF(Tabel_kalender[[#This Row],[Werkdag]]=\"ja\",Tabel_kalender[[#This Row],[Datum]],IF(E572=\"ja\",A572,IF(E573=\"ja\",A573,IF(E574=\"ja\",A574,IF(E575=\"ja\",A575,IF(E576=\"ja\",A576,IF(E577=\"ja\",A577,IF(E578=\"ja\",A578,IF(E579=\"ja\",A579,IF(E580=\"ja\",A580,IF(E581=\"ja\",A581,IF(E582=\"ja\",A582,IF(E583=\"ja\",A583,IF(E584=\"ja\",A584,IF(E585=\"ja\",A585,IF(E586=\"ja\",A586,IF(E587=\"ja\",A587,IF(E588=\"ja\",A588,IF(A589=\"ja\",A589,\"Volgepland\")))))))))))))))))))","v":"2022-07-22"},null,null,null,null,0,null,null,0,0,null,null,0]
["2022-07-23",{"$f":"WEEKNUM(Tabel_kalender[[#This Row],[Datum]],21)","v":29},"1900-01-06",null,"ja",{"$f":"IF(Tabel_kalender[[#This Row],[Werkdag]]=\"ja\",Tabel_kalender[[#This Row],[Datum]],IF(E573=\"ja\",A573,IF(E574=\"ja\",A574,IF(E575=\"ja\",A575,IF(E576=\"ja\",A576,IF(E577=\"ja\",A577,IF(E578=\"ja\",A578,IF(E579=\"ja\",A579,IF(E580=\"ja\",A580,IF(E581=\"ja\",A581,IF(E582=\"ja\",A582,IF(E583=\"ja\",A583,IF(E584=\"ja\",A584,IF(E585=\"ja\",A585,IF(E586=\"ja\",A586,IF(E587=\"ja\",A587,IF(E588=\"ja\",A588,IF(E589=\"ja\",A589,IF(A590=\"ja\",A590,\"Volgepland\")))))))))))))))))))","v":"2022-07-23"},null,null,null,null,0,null,null,0,0,null,null,0]
["2022-07-24",{"$f":"WEEKNUM(Tabel_kalender[[#This Row],[Datum]],21)","v":29},"1900-01-07",null,"ja",{"$f":"IF(Tabel_kalender[[#This Row],[Werkdag]]=\"ja\",Tabel_kalender[[#This Row],[Datum]],IF(E574=\"ja\",A574,IF(E575=\"ja\",A575,IF(E576=\"ja\",A576,IF(E577=\"ja\",A577,IF(E578=\"ja\",A578,IF(E579=\"ja\",A579,IF(E580=\"ja\",A580,IF(E581=\"ja\",A581,IF(E582=\"ja\",A582,IF(E583=\"ja\",A583,IF(E584=\"ja\",A584,IF(E585=\"ja\",A585,IF(E586=\"ja\",A586,IF(E587=\"ja\",A587,IF(E588=\"ja\",A588,IF(E589=\"ja\",A589,IF(E590=\"ja\",A590,IF(A591=\"ja\",A591,\"Volgepland\")))))))))))))))))))","v":"2022-07-24"},null,null,null,null,0,null,null,0,0,null,null,0]
["2022-07-25",{"$f":"WEEKNUM(Tabel_kalender[[#This Row],[Datum]],21)","v":30},"1900-01-01",null,"ja",{"$f":"IF(Tabel_kalender[[#This Row],[Werkdag]]=\"ja\",Tabel_kalender[[#This Row],[Datum]],IF(E575=\"ja\",A575,IF(E576=\"ja\",A576,IF(E577=\"ja\",A577,IF(E578=\"ja\",A578,IF(E579=\"ja\",A579,IF(E580=\"ja\",A580,IF(E581=\"ja\",A581,IF(E582=\"ja\",A582,IF(E583=\"ja\",A583,IF(E584=\"ja\",A584,IF(E585=\"ja\",A585,IF(E586=\"ja\",A586,IF(E587=\"ja\",A587,IF(E588=\"ja\",A588,IF(E589=\"ja\",A589,IF(E590=\"ja\",A590,IF(E591=\"ja\",A591,IF(A592=\"ja\",A592,\"Volgepland\")))))))))))))))))))","v":"2022-07-25"},null,null,null,null,0,null,null,0,0,null,null,0]
["2022-07-26",{"$f":"WEEKNUM(Tabel_kalender[[#This Row],[Datum]],21)","v":30},"1900-01-02",null,"nee",{"$f":"IF(Tabel_kalender[[#This Row],[Werkdag]]=\"ja\",Tabel_kalender[[#This Row],[Datum]],IF(E576=\"ja\",A576,IF(E577=\"ja\",A577,IF(E578=\"ja\",A578,IF(E579=\"ja\",A579,IF(E580=\"ja\",A580,IF(E581=\"ja\",A581,IF(E582=\"ja\",A582,IF(E583=\"ja\",A583,IF(E584=\"ja\",A584,IF(E585=\"ja\",A585,IF(E586=\"ja\",A586,IF(E587=\"ja\",A587,IF(E588=\"ja\",A588,IF(E589=\"ja\",A589,IF(E590=\"ja\",A590,IF(E591=\"ja\",A591,IF(E592=\"ja\",A592,IF(A593=\"ja\",A593,\"Volgepland\")))))))))))))))))))","v":"2022-07-28"},null,null,null,null,0,null,null,0,0,null,null,0]
["2022-07-27",{"$f":"WEEKNUM(Tabel_kalender[[#This Row],[Datum]],21)","v":30},"1900-01-03",null,"nee",{"$f":"IF(Tabel_kalender[[#This Row],[Werkdag]]=\"ja\",Tabel_kalender[[#This Row],[Datum]],IF(E577=\"ja\",A577,IF(E578=\"ja\",A578,IF(E579=\"ja\",A579,IF(E580=\"ja\",A580,IF(E581=\"ja\",A581,IF(E582=\"ja\",A582,IF(E583=\"ja\",A583,IF(E584=\"ja\",A584,IF(E585=\"ja\",A585,IF(E586=\"ja\",A586,IF(E587=\"ja\",A587,IF(E588=\"ja\",A588,IF(E589=\"ja\",A589,IF(E590=\"ja\",A590,IF(E591=\"ja\",A591,IF(E592=\"ja\",A592,IF(E593=\"ja\",A593,IF(A594=\"ja\",A594,\"Volgepland\")))))))))))))))))))","v":"2022-07-28"},null,null,null,null,0,null,null,0,0,null,null,0]
["2022-07-28",{"$f":"WEEKNUM(Tabel_kalender[[#This Row],[Datum]],21)","v":30},"1900-01-04",null,"ja",{"$f":"IF(Tabel_kalender[[#This Row],[Werkdag]]=\"ja\",Tabel_kalender[[#This Row],[Datum]],IF(E578=\"ja\",A578,IF(E579=\"ja\",A579,IF(E580=\"ja\",A580,IF(E581=\"ja\",A581,IF(E582=\"ja\",A582,IF(E583=\"ja\",A583,IF(E584=\"ja\",A584,IF(E585=\"ja\",A585,IF(E586=\"ja\",A586,IF(E587=\"ja\",A587,IF(E588=\"ja\",A588,IF(E589=\"ja\",A589,IF(E590=\"ja\",A590,IF(E591=\"ja\",A591,IF(E592=\"ja\",A592,IF(E593=\"ja\",A593,IF(E594=\"ja\",A594,IF(A595=\"ja\",A595,\"Volgepland\")))))))))))))))))))","v":"2022-07-28"},null,null,null,null,0,null,null,0,0,null,null,0]
["2022-07-29",{"$f":"WEEKNUM(Tabel_kalender[[#This Row],[Datum]],21)","v":30},"1900-01-05",null,"ja",{"$f":"IF(Tabel_kalender[[#This Row],[Werkdag]]=\"ja\",Tabel_kalender[[#This Row],[Datum]],IF(E579=\"ja\",A579,IF(E580=\"ja\",A580,IF(E581=\"ja\",A581,IF(E582=\"ja\",A582,IF(E583=\"ja\",A583,IF(E584=\"ja\",A584,IF(E585=\"ja\",A585,IF(E586=\"ja\",A586,IF(E587=\"ja\",A587,IF(E588=\"ja\",A588,IF(E589=\"ja\",A589,IF(E590=\"ja\",A590,IF(E591=\"ja\",A591,IF(E592=\"ja\",A592,IF(E593=\"ja\",A593,IF(E594=\"ja\",A594,IF(E595=\"ja\",A595,IF(A596=\"ja\",A596,\"Volgepland\")))))))))))))))))))","v":"2022-07-29"},null,null,null,null,0,null,null,0,0,null,null,0]
["2022-07-30",{"$f":"WEEKNUM(Tabel_kalender[[#This Row],[Datum]],21)","v":30},"1900-01-06",null,"ja",{"$f":"IF(Tabel_kalender[[#This Row],[Werkdag]]=\"ja\",Tabel_kalender[[#This Row],[Datum]],IF(E580=\"ja\",A580,IF(E581=\"ja\",A581,IF(E582=\"ja\",A582,IF(E583=\"ja\",A583,IF(E584=\"ja\",A584,IF(E585=\"ja\",A585,IF(E586=\"ja\",A586,IF(E587=\"ja\",A587,IF(E588=\"ja\",A588,IF(E589=\"ja\",A589,IF(E590=\"ja\",A590,IF(E591=\"ja\",A591,IF(E592=\"ja\",A592,IF(E593=\"ja\",A593,IF(E594=\"ja\",A594,IF(E595=\"ja\",A595,IF(E596=\"ja\",A596,IF(A597=\"ja\",A597,\"Volgepland\")))))))))))))))))))","v":"2022-07-30"},null,null,null,null,0,null,null,0,0,null,null,0]
["2022-07-31",{"$f":"WEEKNUM(Tabel_kalender[[#This Row],[Datum]],21)","v":30},"1900-01-07",null,"ja",{"$f":"IF(Tabel_kalender[[#This Row],[Werkdag]]=\"ja\",Tabel_kalender[[#This Row],[Datum]],IF(E581=\"ja\",A581,IF(E582=\"ja\",A582,IF(E583=\"ja\",A583,IF(E584=\"ja\",A584,IF(E585=\"ja\",A585,IF(E586=\"ja\",A586,IF(E587=\"ja\",A587,IF(E588=\"ja\",A588,IF(E589=\"ja\",A589,IF(E590=\"ja\",A590,IF(E591=\"ja\",A591,IF(E592=\"ja\",A592,IF(E593=\"ja\",A593,IF(E594=\"ja\",A594,IF(E595=\"ja\",A595,IF(E596=\"ja\",A596,IF(E597=\"ja\",A597,IF(A598=\"ja\",A598,\"Volgepland\")))))))))))))))))))","v":"2022-07-31"},null,null,null,null,0,null,null,{"$f":"IF(L580>0,L580-K580,)-M580","v":0},{"$f":"P579","v":0},null,null,{"$f":"IF(P580>0,P580-O580,)-Q580","v":0}]
["2022-08-01",{"$f":"WEEKNUM(Tabel_kalender[[#This Row],[Datum]],21)","v":31},{"$f":"WEEKDAY(A581,2)","v":"1900-01-01"},null,"ja",{"$f":"IF(Tabel_kalender[[#This Row],[Werkdag]]=\"ja\",Tabel_kalender[[#This Row],[Datum]],IF(E582=\"ja\",A582,IF(E583=\"ja\",A583,IF(E584=\"ja\",A584,IF(E585=\"ja\",A585,IF(E586=\"ja\",A586,IF(E587=\"ja\",A587,IF(E588=\"ja\",A588,IF(E589=\"ja\",A589,IF(E590=\"ja\",A590,IF(E591=\"ja\",A591,IF(E592=\"ja\",A592,IF(E593=\"ja\",A593,IF(E594=\"ja\",A594,IF(E595=\"ja\",A595,IF(E596=\"ja\",A596,IF(E597=\"ja\",A597,IF(E598=\"ja\",A598,IF(A599=\"ja\",A599,\"Volgepland\")))))))))))))))))))","v":"2022-08-01"},null,null,null,null,{"$f":"L580","v":0},null,null,0,0,null,null,0]
[{"$f":"A581+1","v":"2022-08-02"},{"$f":"WEEKNUM(Tabel_kalender[[#This Row],[Datum]],21)","v":31},"1900-01-02",null,"nee",{"$f":"IF(Tabel_kalender[[#This Row],[Werkdag]]=\"ja\",Tabel_kalender[[#This Row],[Datum]],IF(E583=\"ja\",A583,IF(E584=\"ja\",A584,IF(E585=\"ja\",A585,IF(E586=\"ja\",A586,IF(E587=\"ja\",A587,IF(E588=\"ja\",A588,IF(E589=\"ja\",A589,IF(E590=\"ja\",A590,IF(E591=\"ja\",A591,IF(E592=\"ja\",A592,IF(E593=\"ja\",A593,IF(E594=\"ja\",A594,IF(E595=\"ja\",A595,IF(E596=\"ja\",A596,IF(E597=\"ja\",A597,IF(E598=\"ja\",A598,IF(E599=\"ja\",A599,IF(A600=\"ja\",A600,\"Volgepland\")))))))))))))))))))","v":"2022-08-04"},null,null,null,null,0,null,null,0,0,null,null,0]
["2022-08-03",{"$f":"WEEKNUM(Tabel_kalender[[#This Row],[Datum]],21)","v":31},"1900-01-03",null,"nee",{"$f":"IF(Tabel_kalender[[#This Row],[Werkdag]]=\"ja\",Tabel_kalender[[#This Row],[Datum]],IF(E584=\"ja\",A584,IF(E585=\"ja\",A585,IF(E586=\"ja\",A586,IF(E587=\"ja\",A587,IF(E588=\"ja\",A588,IF(E589=\"ja\",A589,IF(E590=\"ja\",A590,IF(E591=\"ja\",A591,IF(E592=\"ja\",A592,IF(E593=\"ja\",A593,IF(E594=\"ja\",A594,IF(E595=\"ja\",A595,IF(E596=\"ja\",A596,IF(E597=\"ja\",A597,IF(E598=\"ja\",A598,IF(E599=\"ja\",A599,IF(E600=\"ja\",A600,IF(A601=\"ja\",A601,\"Volgepland\")))))))))))))))))))","v":"2022-08-04"},null,null,null,null,0,null,null,0,0,null,null,0]
["2022-08-04",{"$f":"WEEKNUM(Tabel_kalender[[#This Row],[Datum]],21)","v":31},"1900-01-04",null,"ja",{"$f":"IF(Tabel_kalender[[#This Row],[Werkdag]]=\"ja\",Tabel_kalender[[#This Row],[Datum]],IF(E585=\"ja\",A585,IF(E586=\"ja\",A586,IF(E587=\"ja\",A587,IF(E588=\"ja\",A588,IF(E589=\"ja\",A589,IF(E590=\"ja\",A590,IF(E591=\"ja\",A591,IF(E592=\"ja\",A592,IF(E593=\"ja\",A593,IF(E594=\"ja\",A594,IF(E595=\"ja\",A595,IF(E596=\"ja\",A596,IF(E597=\"ja\",A597,IF(E598=\"ja\",A598,IF(E599=\"ja\",A599,IF(E600=\"ja\",A600,IF(E601=\"ja\",A601,IF(A602=\"ja\",A602,\"Volgepland\")))))))))))))))))))","v":"2022-08-04"},null,null,null,null,0,null,null,0,0,null,null,0]
["2022-08-05",{"$f":"WEEKNUM(Tabel_kalender[[#This Row],[Datum]],21)","v":31},"1900-01-05",null,"ja",{"$f":"IF(Tabel_kalender[[#This Row],[Werkdag]]=\"ja\",Tabel_kalender[[#This Row],[Datum]],IF(E586=\"ja\",A586,IF(E587=\"ja\",A587,IF(E588=\"ja\",A588,IF(E589=\"ja\",A589,IF(E590=\"ja\",A590,IF(E591=\"ja\",A591,IF(E592=\"ja\",A592,IF(E593=\"ja\",A593,IF(E594=\"ja\",A594,IF(E595=\"ja\",A595,IF(E596=\"ja\",A596,IF(E597=\"ja\",A597,IF(E598=\"ja\",A598,IF(E599=\"ja\",A599,IF(E600=\"ja\",A600,IF(E601=\"ja\",A601,IF(E602=\"ja\",A602,IF(A603=\"ja\",A603,\"Volgepland\")))))))))))))))))))","v":"2022-08-05"},null,null,null,null,0,null,null,0,0,null,null,0]
["2022-08-06",{"$f":"WEEKNUM(Tabel_kalender[[#This Row],[Datum]],21)","v":31},"1900-01-06",null,"ja",{"$f":"IF(Tabel_kalender[[#This Row],[Werkdag]]=\"ja\",Tabel_kalender[[#This Row],[Datum]],IF(E587=\"ja\",A587,IF(E588=\"ja\",A588,IF(E589=\"ja\",A589,IF(E590=\"ja\",A590,IF(E591=\"ja\",A591,IF(E592=\"ja\",A592,IF(E593=\"ja\",A593,IF(E594=\"ja\",A594,IF(E595=\"ja\",A595,IF(E596=\"ja\",A596,IF(E597=\"ja\",A597,IF(E598=\"ja\",A598,IF(E599=\"ja\",A599,IF(E600=\"ja\",A600,IF(E601=\"ja\",A601,IF(E602=\"ja\",A602,IF(E603=\"ja\",A603,IF(A604=\"ja\",A604,\"Volgepland\")))))))))))))))))))","v":"2022-08-06"},null,null,null,null,0,null,null,0,0,null,null,0]
["2022-08-07",{"$f":"WEEKNUM(Tabel_kalender[[#This Row],[Datum]],21)","v":31},"1900-01-07",null,"ja",{"$f":"IF(Tabel_kalender[[#This Row],[Werkdag]]=\"ja\",Tabel_kalender[[#This Row],[Datum]],IF(E588=\"ja\",A588,IF(E589=\"ja\",A589,IF(E590=\"ja\",A590,IF(E591=\"ja\",A591,IF(E592=\"ja\",A592,IF(E593=\"ja\",A593,IF(E594=\"ja\",A594,IF(E595=\"ja\",A595,IF(E596=\"ja\",A596,IF(E597=\"ja\",A597,IF(E598=\"ja\",A598,IF(E599=\"ja\",A599,IF(E600=\"ja\",A600,IF(E601=\"ja\",A601,IF(E602=\"ja\",A602,IF(E603=\"ja\",A603,IF(E604=\"ja\",A604,IF(A605=\"ja\",A605,\"Volgepland\")))))))))))))))))))","v":"2022-08-07"},null,null,null,null,0,null,null,0,0,null,null,0]
["2022-08-08",{"$f":"WEEKNUM(Tabel_kalender[[#This Row],[Datum]],21)","v":32},"1900-01-01",null,"ja",{"$f":"IF(Tabel_kalender[[#This Row],[Werkdag]]=\"ja\",Tabel_kalender[[#This Row],[Datum]],IF(E589=\"ja\",A589,IF(E590=\"ja\",A590,IF(E591=\"ja\",A591,IF(E592=\"ja\",A592,IF(E593=\"ja\",A593,IF(E594=\"ja\",A594,IF(E595=\"ja\",A595,IF(E596=\"ja\",A596,IF(E597=\"ja\",A597,IF(E598=\"ja\",A598,IF(E599=\"ja\",A599,IF(E600=\"ja\",A600,IF(E601=\"ja\",A601,IF(E602=\"ja\",A602,IF(E603=\"ja\",A603,IF(E604=\"ja\",A604,IF(E605=\"ja\",A605,IF(A606=\"ja\",A606,\"Volgepland\")))))))))))))))))))","v":"2022-08-08"},null,null,null,null,0,null,null,0,0,null,null,0]
["2022-08-09",{"$f":"WEEKNUM(Tabel_kalender[[#This Row],[Datum]],21)","v":32},"1900-01-02",null,"nee",{"$f":"IF(Tabel_kalender[[#This Row],[Werkdag]]=\"ja\",Tabel_kalender[[#This Row],[Datum]],IF(E590=\"ja\",A590,IF(E591=\"ja\",A591,IF(E592=\"ja\",A592,IF(E593=\"ja\",A593,IF(E594=\"ja\",A594,IF(E595=\"ja\",A595,IF(E596=\"ja\",A596,IF(E597=\"ja\",A597,IF(E598=\"ja\",A598,IF(E599=\"ja\",A599,IF(E600=\"ja\",A600,IF(E601=\"ja\",A601,IF(E602=\"ja\",A602,IF(E603=\"ja\",A603,IF(E604=\"ja\",A604,IF(E605=\"ja\",A605,IF(E606=\"ja\",A606,IF(A607=\"ja\",A607,\"Volgepland\")))))))))))))))))))","v":"2022-08-11"},null,null,null,null,0,null,null,0,0,null,null,0]
["2022-08-10",{"$f":"WEEKNUM(Tabel_kalender[[#This Row],[Datum]],21)","v":32},"1900-01-03",null,"nee",{"$f":"IF(Tabel_kalender[[#This Row],[Werkdag]]=\"ja\",Tabel_kalender[[#This Row],[Datum]],IF(E591=\"ja\",A591,IF(E592=\"ja\",A592,IF(E593=\"ja\",A593,IF(E594=\"ja\",A594,IF(E595=\"ja\",A595,IF(E596=\"ja\",A596,IF(E597=\"ja\",A597,IF(E598=\"ja\",A598,IF(E599=\"ja\",A599,IF(E600=\"ja\",A600,IF(E601=\"ja\",A601,IF(E602=\"ja\",A602,IF(E603=\"ja\",A603,IF(E604=\"ja\",A604,IF(E605=\"ja\",A605,IF(E606=\"ja\",A606,IF(E607=\"ja\",A607,IF(A608=\"ja\",A608,\"Volgepland\")))))))))))))))))))","v":"2022-08-11"},null,null,null,null,0,null,null,0,0,null,null,0]
["2022-08-11",{"$f":"WEEKNUM(Tabel_kalender[[#This Row],[Datum]],21)","v":32},"1900-01-04",null,"ja",{"$f":"IF(Tabel_kalender[[#This Row],[Werkdag]]=\"ja\",Tabel_kalender[[#This Row],[Datum]],IF(E592=\"ja\",A592,IF(E593=\"ja\",A593,IF(E594=\"ja\",A594,IF(E595=\"ja\",A595,IF(E596=\"ja\",A596,IF(E597=\"ja\",A597,IF(E598=\"ja\",A598,IF(E599=\"ja\",A599,IF(E600=\"ja\",A600,IF(E601=\"ja\",A601,IF(E602=\"ja\",A602,IF(E603=\"ja\",A603,IF(E604=\"ja\",A604,IF(E605=\"ja\",A605,IF(E606=\"ja\",A606,IF(E607=\"ja\",A607,IF(E608=\"ja\",A608,IF(A609=\"ja\",A609,\"Volgepland\")))))))))))))))))))","v":"2022-08-11"},null,null,null,null,0,null,null,0,0,null,null,0]
["2022-08-12",{"$f":"WEEKNUM(Tabel_kalender[[#This Row],[Datum]],21)","v":32},"1900-01-05",null,"ja",{"$f":"IF(Tabel_kalender[[#This Row],[Werkdag]]=\"ja\",Tabel_kalender[[#This Row],[Datum]],IF(E593=\"ja\",A593,IF(E594=\"ja\",A594,IF(E595=\"ja\",A595,IF(E596=\"ja\",A596,IF(E597=\"ja\",A597,IF(E598=\"ja\",A598,IF(E599=\"ja\",A599,IF(E600=\"ja\",A600,IF(E601=\"ja\",A601,IF(E602=\"ja\",A602,IF(E603=\"ja\",A603,IF(E604=\"ja\",A604,IF(E605=\"ja\",A605,IF(E606=\"ja\",A606,IF(E607=\"ja\",A607,IF(E608=\"ja\",A608,IF(E609=\"ja\",A609,IF(A610=\"ja\",A610,\"Volgepland\")))))))))))))))))))","v":"2022-08-12"},null,null,null,null,0,null,null,0,0,null,null,0]
["2022-08-13",{"$f":"WEEKNUM(Tabel_kalender[[#This Row],[Datum]],21)","v":32},"1900-01-06",null,"ja",{"$f":"IF(Tabel_kalender[[#This Row],[Werkdag]]=\"ja\",Tabel_kalender[[#This Row],[Datum]],IF(E594=\"ja\",A594,IF(E595=\"ja\",A595,IF(E596=\"ja\",A596,IF(E597=\"ja\",A597,IF(E598=\"ja\",A598,IF(E599=\"ja\",A599,IF(E600=\"ja\",A600,IF(E601=\"ja\",A601,IF(E602=\"ja\",A602,IF(E603=\"ja\",A603,IF(E604=\"ja\",A604,IF(E605=\"ja\",A605,IF(E606=\"ja\",A606,IF(E607=\"ja\",A607,IF(E608=\"ja\",A608,IF(E609=\"ja\",A609,IF(E610=\"ja\",A610,IF(A611=\"ja\",A611,\"Volgepland\")))))))))))))))))))","v":"2022-08-13"},null,null,null,null,0,null,null,0,0,null,null,0]
["2022-08-14",{"$f":"WEEKNUM(Tabel_kalender[[#This Row],[Datum]],21)","v":32},"1900-01-07",null,"ja",{"$f":"IF(Tabel_kalender[[#This Row],[Werkdag]]=\"ja\",Tabel_kalender[[#This Row],[Datum]],IF(E595=\"ja\",A595,IF(E596=\"ja\",A596,IF(E597=\"ja\",A597,IF(E598=\"ja\",A598,IF(E599=\"ja\",A599,IF(E600=\"ja\",A600,IF(E601=\"ja\",A601,IF(E602=\"ja\",A602,IF(E603=\"ja\",A603,IF(E604=\"ja\",A604,IF(E605=\"ja\",A605,IF(E606=\"ja\",A606,IF(E607=\"ja\",A607,IF(E608=\"ja\",A608,IF(E609=\"ja\",A609,IF(E610=\"ja\",A610,IF(E611=\"ja\",A611,IF(A612=\"ja\",A612,\"Volgepland\")))))))))))))))))))","v":"2022-08-14"},null,null,null,null,0,null,null,0,0,null,null,0]
["2022-08-15",{"$f":"WEEKNUM(Tabel_kalender[[#This Row],[Datum]],21)","v":33},"1900-01-01",null,"ja",{"$f":"IF(Tabel_kalender[[#This Row],[Werkdag]]=\"ja\",Tabel_kalender[[#This Row],[Datum]],IF(E596=\"ja\",A596,IF(E597=\"ja\",A597,IF(E598=\"ja\",A598,IF(E599=\"ja\",A599,IF(E600=\"ja\",A600,IF(E601=\"ja\",A601,IF(E602=\"ja\",A602,IF(E603=\"ja\",A603,IF(E604=\"ja\",A604,IF(E605=\"ja\",A605,IF(E606=\"ja\",A606,IF(E607=\"ja\",A607,IF(E608=\"ja\",A608,IF(E609=\"ja\",A609,IF(E610=\"ja\",A610,IF(E611=\"ja\",A611,IF(E612=\"ja\",A612,IF(A613=\"ja\",A613,\"Volgepland\")))))))))))))))))))","v":"2022-08-15"},null,null,null,null,0,null,null,0,0,null,null,0]
["2022-08-16",{"$f":"WEEKNUM(Tabel_kalender[[#This Row],[Datum]],21)","v":33},"1900-01-02",null,"nee",{"$f":"IF(Tabel_kalender[[#This Row],[Werkdag]]=\"ja\",Tabel_kalender[[#This Row],[Datum]],IF(E597=\"ja\",A597,IF(E598=\"ja\",A598,IF(E599=\"ja\",A599,IF(E600=\"ja\",A600,IF(E601=\"ja\",A601,IF(E602=\"ja\",A602,IF(E603=\"ja\",A603,IF(E604=\"ja\",A604,IF(E605=\"ja\",A605,IF(E606=\"ja\",A606,IF(E607=\"ja\",A607,IF(E608=\"ja\",A608,IF(E609=\"ja\",A609,IF(E610=\"ja\",A610,IF(E611=\"ja\",A611,IF(E612=\"ja\",A612,IF(E613=\"ja\",A613,IF(A614=\"ja\",A614,\"Volgepland\")))))))))))))))))))","v":"2022-08-18"},null,null,null,null,0,null,null,0,0,null,null,0]
["2022-08-17",{"$f":"WEEKNUM(Tabel_kalender[[#This Row],[Datum]],21)","v":33},"1900-01-03",null,"nee",{"$f":"IF(Tabel_kalender[[#This Row],[Werkdag]]=\"ja\",Tabel_kalender[[#This Row],[Datum]],IF(E598=\"ja\",A598,IF(E599=\"ja\",A599,IF(E600=\"ja\",A600,IF(E601=\"ja\",A601,IF(E602=\"ja\",A602,IF(E603=\"ja\",A603,IF(E604=\"ja\",A604,IF(E605=\"ja\",A605,IF(E606=\"ja\",A606,IF(E607=\"ja\",A607,IF(E608=\"ja\",A608,IF(E609=\"ja\",A609,IF(E610=\"ja\",A610,IF(E611=\"ja\",A611,IF(E612=\"ja\",A612,IF(E613=\"ja\",A613,IF(E614=\"ja\",A614,IF(A615=\"ja\",A615,\"Volgepland\")))))))))))))))))))","v":"2022-08-18"},null,null,null,null,0,null,null,0,0,null,null,0]
["2022-08-18",{"$f":"WEEKNUM(Tabel_kalender[[#This Row],[Datum]],21)","v":33},"1900-01-04",null,"ja",{"$f":"IF(Tabel_kalender[[#This Row],[Werkdag]]=\"ja\",Tabel_kalender[[#This Row],[Datum]],IF(E599=\"ja\",A599,IF(E600=\"ja\",A600,IF(E601=\"ja\",A601,IF(E602=\"ja\",A602,IF(E603=\"ja\",A603,IF(E604=\"ja\",A604,IF(E605=\"ja\",A605,IF(E606=\"ja\",A606,IF(E607=\"ja\",A607,IF(E608=\"ja\",A608,IF(E609=\"ja\",A609,IF(E610=\"ja\",A610,IF(E611=\"ja\",A611,IF(E612=\"ja\",A612,IF(E613=\"ja\",A613,IF(E614=\"ja\",A614,IF(E615=\"ja\",A615,IF(A616=\"ja\",A616,\"Volgepland\")))))))))))))))))))","v":"2022-08-18"},null,null,null,null,0,null,null,0,0,null,null,0]
["2022-08-19",{"$f":"WEEKNUM(Tabel_kalender[[#This Row],[Datum]],21)","v":33},"1900-01-05",null,"ja",{"$f":"IF(Tabel_kalender[[#This Row],[Werkdag]]=\"ja\",Tabel_kalender[[#This Row],[Datum]],IF(E600=\"ja\",A600,IF(E601=\"ja\",A601,IF(E602=\"ja\",A602,IF(E603=\"ja\",A603,IF(E604=\"ja\",A604,IF(E605=\"ja\",A605,IF(E606=\"ja\",A606,IF(E607=\"ja\",A607,IF(E608=\"ja\",A608,IF(E609=\"ja\",A609,IF(E610=\"ja\",A610,IF(E611=\"ja\",A611,IF(E612=\"ja\",A612,IF(E613=\"ja\",A613,IF(E614=\"ja\",A614,IF(E615=\"ja\",A615,IF(E616=\"ja\",A616,IF(A617=\"ja\",A617,\"Volgepland\")))))))))))))))))))","v":"2022-08-19"},null,null,null,null,0,null,null,0,0,null,null,0]
["2022-08-20",{"$f":"WEEKNUM(Tabel_kalender[[#This Row],[Datum]],21)","v":33},"1900-01-06",null,"ja",{"$f":"IF(Tabel_kalender[[#This Row],[Werkdag]]=\"ja\",Tabel_kalender[[#This Row],[Datum]],IF(E601=\"ja\",A601,IF(E602=\"ja\",A602,IF(E603=\"ja\",A603,IF(E604=\"ja\",A604,IF(E605=\"ja\",A605,IF(E606=\"ja\",A606,IF(E607=\"ja\",A607,IF(E608=\"ja\",A608,IF(E609=\"ja\",A609,IF(E610=\"ja\",A610,IF(E611=\"ja\",A611,IF(E612=\"ja\",A612,IF(E613=\"ja\",A613,IF(E614=\"ja\",A614,IF(E615=\"ja\",A615,IF(E616=\"ja\",A616,IF(E617=\"ja\",A617,IF(A618=\"ja\",A618,\"Volgepland\")))))))))))))))))))","v":"2022-08-20"},null,null,null,null,0,null,null,0,0,null,null,0]
["2022-08-21",{"$f":"WEEKNUM(Tabel_kalender[[#This Row],[Datum]],21)","v":33},"1900-01-07",null,"ja",{"$f":"IF(Tabel_kalender[[#This Row],[Werkdag]]=\"ja\",Tabel_kalender[[#This Row],[Datum]],IF(E602=\"ja\",A602,IF(E603=\"ja\",A603,IF(E604=\"ja\",A604,IF(E605=\"ja\",A605,IF(E606=\"ja\",A606,IF(E607=\"ja\",A607,IF(E608=\"ja\",A608,IF(E609=\"ja\",A609,IF(E610=\"ja\",A610,IF(E611=\"ja\",A611,IF(E612=\"ja\",A612,IF(E613=\"ja\",A613,IF(E614=\"ja\",A614,IF(E615=\"ja\",A615,IF(E616=\"ja\",A616,IF(E617=\"ja\",A617,IF(E618=\"ja\",A618,IF(A619=\"ja\",A619,\"Volgepland\")))))))))))))))))))","v":"2022-08-21"},null,null,null,null,0,null,null,0,0,null,null,0]
["2022-08-22",{"$f":"WEEKNUM(Tabel_kalender[[#This Row],[Datum]],21)","v":34},"1900-01-01",null,"ja",{"$f":"IF(Tabel_kalender[[#This Row],[Werkdag]]=\"ja\",Tabel_kalender[[#This Row],[Datum]],IF(E603=\"ja\",A603,IF(E604=\"ja\",A604,IF(E605=\"ja\",A605,IF(E606=\"ja\",A606,IF(E607=\"ja\",A607,IF(E608=\"ja\",A608,IF(E609=\"ja\",A609,IF(E610=\"ja\",A610,IF(E611=\"ja\",A611,IF(E612=\"ja\",A612,IF(E613=\"ja\",A613,IF(E614=\"ja\",A614,IF(E615=\"ja\",A615,IF(E616=\"ja\",A616,IF(E617=\"ja\",A617,IF(E618=\"ja\",A618,IF(E619=\"ja\",A619,IF(A620=\"ja\",A620,\"Volgepland\")))))))))))))))))))","v":"2022-08-22"},null,null,null,null,0,null,null,0,0,null,null,0]
["2022-08-23",{"$f":"WEEKNUM(Tabel_kalender[[#This Row],[Datum]],21)","v":34},"1900-01-02",null,"nee",{"$f":"IF(Tabel_kalender[[#This Row],[Werkdag]]=\"ja\",Tabel_kalender[[#This Row],[Datum]],IF(E604=\"ja\",A604,IF(E605=\"ja\",A605,IF(E606=\"ja\",A606,IF(E607=\"ja\",A607,IF(E608=\"ja\",A608,IF(E609=\"ja\",A609,IF(E610=\"ja\",A610,IF(E611=\"ja\",A611,IF(E612=\"ja\",A612,IF(E613=\"ja\",A613,IF(E614=\"ja\",A614,IF(E615=\"ja\",A615,IF(E616=\"ja\",A616,IF(E617=\"ja\",A617,IF(E618=\"ja\",A618,IF(E619=\"ja\",A619,IF(E620=\"ja\",A620,IF(A621=\"ja\",A621,\"Volgepland\")))))))))))))))))))","v":"2022-08-25"},null,null,null,null,0,null,null,0,0,null,null,0]
["2022-08-24",{"$f":"WEEKNUM(Tabel_kalender[[#This Row],[Datum]],21)","v":34},"1900-01-03",null,"nee",{"$f":"IF(Tabel_kalender[[#This Row],[Werkdag]]=\"ja\",Tabel_kalender[[#This Row],[Datum]],IF(E605=\"ja\",A605,IF(E606=\"ja\",A606,IF(E607=\"ja\",A607,IF(E608=\"ja\",A608,IF(E609=\"ja\",A609,IF(E610=\"ja\",A610,IF(E611=\"ja\",A611,IF(E612=\"ja\",A612,IF(E613=\"ja\",A613,IF(E614=\"ja\",A614,IF(E615=\"ja\",A615,IF(E616=\"ja\",A616,IF(E617=\"ja\",A617,IF(E618=\"ja\",A618,IF(E619=\"ja\",A619,IF(E620=\"ja\",A620,IF(E621=\"ja\",A621,IF(A622=\"ja\",A622,\"Volgepland\")))))))))))))))))))","v":"2022-08-25"},null,null,null,null,0,null,null,0,0,null,null,0]
["2022-08-25",{"$f":"WEEKNUM(Tabel_kalender[[#This Row],[Datum]],21)","v":34},"1900-01-04",null,"ja",{"$f":"IF(Tabel_kalender[[#This Row],[Werkdag]]=\"ja\",Tabel_kalender[[#This Row],[Datum]],IF(E606=\"ja\",A606,IF(E607=\"ja\",A607,IF(E608=\"ja\",A608,IF(E609=\"ja\",A609,IF(E610=\"ja\",A610,IF(E611=\"ja\",A611,IF(E612=\"ja\",A612,IF(E613=\"ja\",A613,IF(E614=\"ja\",A614,IF(E615=\"ja\",A615,IF(E616=\"ja\",A616,IF(E617=\"ja\",A617,IF(E618=\"ja\",A618,IF(E619=\"ja\",A619,IF(E620=\"ja\",A620,IF(E621=\"ja\",A621,IF(E622=\"ja\",A622,IF(A623=\"ja\",A623,\"Volgepland\")))))))))))))))))))","v":"2022-08-25"},null,null,null,null,0,null,null,0,0,null,null,0]
["2022-08-26",{"$f":"WEEKNUM(Tabel_kalender[[#This Row],[Datum]],21)","v":34},"1900-01-05",null,"ja",{"$f":"IF(Tabel_kalender[[#This Row],[Werkdag]]=\"ja\",Tabel_kalender[[#This Row],[Datum]],IF(E607=\"ja\",A607,IF(E608=\"ja\",A608,IF(E609=\"ja\",A609,IF(E610=\"ja\",A610,IF(E611=\"ja\",A611,IF(E612=\"ja\",A612,IF(E613=\"ja\",A613,IF(E614=\"ja\",A614,IF(E615=\"ja\",A615,IF(E616=\"ja\",A616,IF(E617=\"ja\",A617,IF(E618=\"ja\",A618,IF(E619=\"ja\",A619,IF(E620=\"ja\",A620,IF(E621=\"ja\",A621,IF(E622=\"ja\",A622,IF(E623=\"ja\",A623,IF(A624=\"ja\",A624,\"Volgepland\")))))))))))))))))))","v":"2022-08-26"},null,null,null,null,0,null,null,0,0,null,null,0]
["2022-08-27",{"$f":"WEEKNUM(Tabel_kalender[[#This Row],[Datum]],21)","v":34},"1900-01-06",null,"ja",{"$f":"IF(Tabel_kalender[[#This Row],[Werkdag]]=\"ja\",Tabel_kalender[[#This Row],[Datum]],IF(E608=\"ja\",A608,IF(E609=\"ja\",A609,IF(E610=\"ja\",A610,IF(E611=\"ja\",A611,IF(E612=\"ja\",A612,IF(E613=\"ja\",A613,IF(E614=\"ja\",A614,IF(E615=\"ja\",A615,IF(E616=\"ja\",A616,IF(E617=\"ja\",A617,IF(E618=\"ja\",A618,IF(E619=\"ja\",A619,IF(E620=\"ja\",A620,IF(E621=\"ja\",A621,IF(E622=\"ja\",A622,IF(E623=\"ja\",A623,IF(E624=\"ja\",A624,IF(A625=\"ja\",A625,\"Volgepland\")))))))))))))))))))","v":"2022-08-27"},null,null,null,null,0,null,null,0,0,null,null,0]
["2022-08-28",{"$f":"WEEKNUM(Tabel_kalender[[#This Row],[Datum]],21)","v":34},"1900-01-07",null,"ja",{"$f":"IF(Tabel_kalender[[#This Row],[Werkdag]]=\"ja\",Tabel_kalender[[#This Row],[Datum]],IF(E609=\"ja\",A609,IF(E610=\"ja\",A610,IF(E611=\"ja\",A611,IF(E612=\"ja\",A612,IF(E613=\"ja\",A613,IF(E614=\"ja\",A614,IF(E615=\"ja\",A615,IF(E616=\"ja\",A616,IF(E617=\"ja\",A617,IF(E618=\"ja\",A618,IF(E619=\"ja\",A619,IF(E620=\"ja\",A620,IF(E621=\"ja\",A621,IF(E622=\"ja\",A622,IF(E623=\"ja\",A623,IF(E624=\"ja\",A624,IF(E625=\"ja\",A625,IF(A626=\"ja\",A626,\"Volgepland\")))))))))))))))))))","v":"2022-08-28"},null,null,null,null,0,null,null,0,0,null,null,0]
["2022-08-29",{"$f":"WEEKNUM(Tabel_kalender[[#This Row],[Datum]],21)","v":35},"1900-01-01",null,"ja",{"$f":"IF(Tabel_kalender[[#This Row],[Werkdag]]=\"ja\",Tabel_kalender[[#This Row],[Datum]],IF(E610=\"ja\",A610,IF(E611=\"ja\",A611,IF(E612=\"ja\",A612,IF(E613=\"ja\",A613,IF(E614=\"ja\",A614,IF(E615=\"ja\",A615,IF(E616=\"ja\",A616,IF(E617=\"ja\",A617,IF(E618=\"ja\",A618,IF(E619=\"ja\",A619,IF(E620=\"ja\",A620,IF(E621=\"ja\",A621,IF(E622=\"ja\",A622,IF(E623=\"ja\",A623,IF(E624=\"ja\",A624,IF(E625=\"ja\",A625,IF(E626=\"ja\",A626,IF(A627=\"ja\",A627,\"Volgepland\")))))))))))))))))))","v":"2022-08-29"},null,null,null,null,0,null,null,0,0,null,null,0]
["2022-08-30",{"$f":"WEEKNUM(Tabel_kalender[[#This Row],[Datum]],21)","v":35},"1900-01-02",null,"nee",{"$f":"IF(Tabel_kalender[[#This Row],[Werkdag]]=\"ja\",Tabel_kalender[[#This Row],[Datum]],IF(E611=\"ja\",A611,IF(E612=\"ja\",A612,IF(E613=\"ja\",A613,IF(E614=\"ja\",A614,IF(E615=\"ja\",A615,IF(E616=\"ja\",A616,IF(E617=\"ja\",A617,IF(E618=\"ja\",A618,IF(E619=\"ja\",A619,IF(E620=\"ja\",A620,IF(E621=\"ja\",A621,IF(E622=\"ja\",A622,IF(E623=\"ja\",A623,IF(E624=\"ja\",A624,IF(E625=\"ja\",A625,IF(E626=\"ja\",A626,IF(E627=\"ja\",A627,IF(A628=\"ja\",A628,\"Volgepland\")))))))))))))))))))","v":"2022-09-01"},null,null,null,null,0,null,null,0,0,null,null,0]
["2022-08-31",{"$f":"WEEKNUM(Tabel_kalender[[#This Row],[Datum]],21)","v":35},"1900-01-03",null,"nee",{"$f":"IF(Tabel_kalender[[#This Row],[Werkdag]]=\"ja\",Tabel_kalender[[#This Row],[Datum]],IF(E612=\"ja\",A612,IF(E613=\"ja\",A613,IF(E614=\"ja\",A614,IF(E615=\"ja\",A615,IF(E616=\"ja\",A616,IF(E617=\"ja\",A617,IF(E618=\"ja\",A618,IF(E619=\"ja\",A619,IF(E620=\"ja\",A620,IF(E621=\"ja\",A621,IF(E622=\"ja\",A622,IF(E623=\"ja\",A623,IF(E624=\"ja\",A624,IF(E625=\"ja\",A625,IF(E626=\"ja\",A626,IF(E627=\"ja\",A627,IF(E628=\"ja\",A628,IF(A629=\"ja\",A629,\"Volgepland\")))))))))))))))))))","v":"2022-09-01"},null,null,null,null,0,null,null,0,0,null,null,0]
["2022-09-01",{"$f":"WEEKNUM(Tabel_kalender[[#This Row],[Datum]],21)","v":35},"1900-01-04",null,"ja",{"$f":"IF(Tabel_kalender[[#This Row],[Werkdag]]=\"ja\",Tabel_kalender[[#This Row],[Datum]],IF(E613=\"ja\",A613,IF(E614=\"ja\",A614,IF(E615=\"ja\",A615,IF(E616=\"ja\",A616,IF(E617=\"ja\",A617,IF(E618=\"ja\",A618,IF(E619=\"ja\",A619,IF(E620=\"ja\",A620,IF(E621=\"ja\",A621,IF(E622=\"ja\",A622,IF(E623=\"ja\",A623,IF(E624=\"ja\",A624,IF(E625=\"ja\",A625,IF(E626=\"ja\",A626,IF(E627=\"ja\",A627,IF(E628=\"ja\",A628,IF(E629=\"ja\",A629,IF(A630=\"ja\",A630,\"Volgepland\")))))))))))))))))))","v":"2022-09-01"},null,null,null,null,0,null,null,0,0,null,null,0]
["2022-09-02",{"$f":"WEEKNUM(Tabel_kalender[[#This Row],[Datum]],21)","v":35},"1900-01-05",null,"ja",{"$f":"IF(Tabel_kalender[[#This Row],[Werkdag]]=\"ja\",Tabel_kalender[[#This Row],[Datum]],IF(E614=\"ja\",A614,IF(E615=\"ja\",A615,IF(E616=\"ja\",A616,IF(E617=\"ja\",A617,IF(E618=\"ja\",A618,IF(E619=\"ja\",A619,IF(E620=\"ja\",A620,IF(E621=\"ja\",A621,IF(E622=\"ja\",A622,IF(E623=\"ja\",A623,IF(E624=\"ja\",A624,IF(E625=\"ja\",A625,IF(E626=\"ja\",A626,IF(E627=\"ja\",A627,IF(E628=\"ja\",A628,IF(E629=\"ja\",A629,IF(E630=\"ja\",A630,IF(A631=\"ja\",A631,\"Volgepland\")))))))))))))))))))","v":"2022-09-02"},null,null,null,null,0,null,null,0,0,null,null,0]
["2022-09-03",{"$f":"WEEKNUM(Tabel_kalender[[#This Row],[Datum]],21)","v":35},"1900-01-06",null,"ja",{"$f":"IF(Tabel_kalender[[#This Row],[Werkdag]]=\"ja\",Tabel_kalender[[#This Row],[Datum]],IF(E615=\"ja\",A615,IF(E616=\"ja\",A616,IF(E617=\"ja\",A617,IF(E618=\"ja\",A618,IF(E619=\"ja\",A619,IF(E620=\"ja\",A620,IF(E621=\"ja\",A621,IF(E622=\"ja\",A622,IF(E623=\"ja\",A623,IF(E624=\"ja\",A624,IF(E625=\"ja\",A625,IF(E626=\"ja\",A626,IF(E627=\"ja\",A627,IF(E628=\"ja\",A628,IF(E629=\"ja\",A629,IF(E630=\"ja\",A630,IF(E631=\"ja\",A631,IF(A632=\"ja\",A632,\"Volgepland\")))))))))))))))))))","v":"2022-09-03"},null,null,null,null,0,null,null,0,0,null,null,0]
["2022-09-04",{"$f":"WEEKNUM(Tabel_kalender[[#This Row],[Datum]],21)","v":35},"1900-01-07",null,"ja",{"$f":"IF(Tabel_kalender[[#This Row],[Werkdag]]=\"ja\",Tabel_kalender[[#This Row],[Datum]],IF(E616=\"ja\",A616,IF(E617=\"ja\",A617,IF(E618=\"ja\",A618,IF(E619=\"ja\",A619,IF(E620=\"ja\",A620,IF(E621=\"ja\",A621,IF(E622=\"ja\",A622,IF(E623=\"ja\",A623,IF(E624=\"ja\",A624,IF(E625=\"ja\",A625,IF(E626=\"ja\",A626,IF(E627=\"ja\",A627,IF(E628=\"ja\",A628,IF(E629=\"ja\",A629,IF(E630=\"ja\",A630,IF(E631=\"ja\",A631,IF(E632=\"ja\",A632,IF(A633=\"ja\",A633,\"Volgepland\")))))))))))))))))))","v":"2022-09-04"},null,null,null,null,0,null,null,0,0,null,null,0]
["2022-09-05",{"$f":"WEEKNUM(Tabel_kalender[[#This Row],[Datum]],21)","v":36},"1900-01-01",null,"ja",{"$f":"IF(Tabel_kalender[[#This Row],[Werkdag]]=\"ja\",Tabel_kalender[[#This Row],[Datum]],IF(E617=\"ja\",A617,IF(E618=\"ja\",A618,IF(E619=\"ja\",A619,IF(E620=\"ja\",A620,IF(E621=\"ja\",A621,IF(E622=\"ja\",A622,IF(E623=\"ja\",A623,IF(E624=\"ja\",A624,IF(E625=\"ja\",A625,IF(E626=\"ja\",A626,IF(E627=\"ja\",A627,IF(E628=\"ja\",A628,IF(E629=\"ja\",A629,IF(E630=\"ja\",A630,IF(E631=\"ja\",A631,IF(E632=\"ja\",A632,IF(E633=\"ja\",A633,IF(A634=\"ja\",A634,\"Volgepland\")))))))))))))))))))","v":"2022-09-05"},null,null,null,null,0,null,null,0,0,null,null,0]
["2022-09-06",{"$f":"WEEKNUM(Tabel_kalender[[#This Row],[Datum]],21)","v":36},"1900-01-02",null,"nee",{"$f":"IF(Tabel_kalender[[#This Row],[Werkdag]]=\"ja\",Tabel_kalender[[#This Row],[Datum]],IF(E618=\"ja\",A618,IF(E619=\"ja\",A619,IF(E620=\"ja\",A620,IF(E621=\"ja\",A621,IF(E622=\"ja\",A622,IF(E623=\"ja\",A623,IF(E624=\"ja\",A624,IF(E625=\"ja\",A625,IF(E626=\"ja\",A626,IF(E627=\"ja\",A627,IF(E628=\"ja\",A628,IF(E629=\"ja\",A629,IF(E630=\"ja\",A630,IF(E631=\"ja\",A631,IF(E632=\"ja\",A632,IF(E633=\"ja\",A633,IF(E634=\"ja\",A634,IF(A635=\"ja\",A635,\"Volgepland\")))))))))))))))))))","v":"2022-09-08"},null,null,null,null,0,null,null,0,0,null,null,0]
["2022-09-07",{"$f":"WEEKNUM(Tabel_kalender[[#This Row],[Datum]],21)","v":36},"1900-01-03",null,"nee",{"$f":"IF(Tabel_kalender[[#This Row],[Werkdag]]=\"ja\",Tabel_kalender[[#This Row],[Datum]],IF(E619=\"ja\",A619,IF(E620=\"ja\",A620,IF(E621=\"ja\",A621,IF(E622=\"ja\",A622,IF(E623=\"ja\",A623,IF(E624=\"ja\",A624,IF(E625=\"ja\",A625,IF(E626=\"ja\",A626,IF(E627=\"ja\",A627,IF(E628=\"ja\",A628,IF(E629=\"ja\",A629,IF(E630=\"ja\",A630,IF(E631=\"ja\",A631,IF(E632=\"ja\",A632,IF(E633=\"ja\",A633,IF(E634=\"ja\",A634,IF(E635=\"ja\",A635,IF(A636=\"ja\",A636,\"Volgepland\")))))))))))))))))))","v":"2022-09-08"},null,null,null,null,0,null,null,0,0,null,null,0]
["2022-09-08",{"$f":"WEEKNUM(Tabel_kalender[[#This Row],[Datum]],21)","v":36},"1900-01-04",null,"ja",{"$f":"IF(Tabel_kalender[[#This Row],[Werkdag]]=\"ja\",Tabel_kalender[[#This Row],[Datum]],IF(E620=\"ja\",A620,IF(E621=\"ja\",A621,IF(E622=\"ja\",A622,IF(E623=\"ja\",A623,IF(E624=\"ja\",A624,IF(E625=\"ja\",A625,IF(E626=\"ja\",A626,IF(E627=\"ja\",A627,IF(E628=\"ja\",A628,IF(E629=\"ja\",A629,IF(E630=\"ja\",A630,IF(E631=\"ja\",A631,IF(E632=\"ja\",A632,IF(E633=\"ja\",A633,IF(E634=\"ja\",A634,IF(E635=\"ja\",A635,IF(E636=\"ja\",A636,IF(A637=\"ja\",A637,\"Volgepland\")))))))))))))))))))","v":"2022-09-08"},null,null,null,null,0,null,null,0,0,null,null,0]
["2022-09-09",{"$f":"WEEKNUM(Tabel_kalender[[#This Row],[Datum]],21)","v":36},"1900-01-05",null,"ja",{"$f":"IF(Tabel_kalender[[#This Row],[Werkdag]]=\"ja\",Tabel_kalender[[#This Row],[Datum]],IF(E621=\"ja\",A621,IF(E622=\"ja\",A622,IF(E623=\"ja\",A623,IF(E624=\"ja\",A624,IF(E625=\"ja\",A625,IF(E626=\"ja\",A626,IF(E627=\"ja\",A627,IF(E628=\"ja\",A628,IF(E629=\"ja\",A629,IF(E630=\"ja\",A630,IF(E631=\"ja\",A631,IF(E632=\"ja\",A632,IF(E633=\"ja\",A633,IF(E634=\"ja\",A634,IF(E635=\"ja\",A635,IF(E636=\"ja\",A636,IF(E637=\"ja\",A637,IF(A638=\"ja\",A638,\"Volgepland\")))))))))))))))))))","v":"2022-09-09"},null,null,null,null,0,null,null,0,0,null,null,0]
["2022-09-10",{"$f":"WEEKNUM(Tabel_kalender[[#This Row],[Datum]],21)","v":36},"1900-01-06",null,"ja",{"$f":"IF(Tabel_kalender[[#This Row],[Werkdag]]=\"ja\",Tabel_kalender[[#This Row],[Datum]],IF(E622=\"ja\",A622,IF(E623=\"ja\",A623,IF(E624=\"ja\",A624,IF(E625=\"ja\",A625,IF(E626=\"ja\",A626,IF(E627=\"ja\",A627,IF(E628=\"ja\",A628,IF(E629=\"ja\",A629,IF(E630=\"ja\",A630,IF(E631=\"ja\",A631,IF(E632=\"ja\",A632,IF(E633=\"ja\",A633,IF(E634=\"ja\",A634,IF(E635=\"ja\",A635,IF(E636=\"ja\",A636,IF(E637=\"ja\",A637,IF(E638=\"ja\",A638,IF(A639=\"ja\",A639,\"Volgepland\")))))))))))))))))))","v":"2022-09-10"},null,null,null,null,0,null,null,0,0,null,null,0]
["2022-09-11",{"$f":"WEEKNUM(Tabel_kalender[[#This Row],[Datum]],21)","v":36},"1900-01-07",null,"ja",{"$f":"IF(Tabel_kalender[[#This Row],[Werkdag]]=\"ja\",Tabel_kalender[[#This Row],[Datum]],IF(E623=\"ja\",A623,IF(E624=\"ja\",A624,IF(E625=\"ja\",A625,IF(E626=\"ja\",A626,IF(E627=\"ja\",A627,IF(E628=\"ja\",A628,IF(E629=\"ja\",A629,IF(E630=\"ja\",A630,IF(E631=\"ja\",A631,IF(E632=\"ja\",A632,IF(E633=\"ja\",A633,IF(E634=\"ja\",A634,IF(E635=\"ja\",A635,IF(E636=\"ja\",A636,IF(E637=\"ja\",A637,IF(E638=\"ja\",A638,IF(E639=\"ja\",A639,IF(A640=\"ja\",A640,\"Volgepland\")))))))))))))))))))","v":"2022-09-11"},null,null,null,null,0,null,null,0,0,null,null,0]
["2022-09-12",{"$f":"WEEKNUM(Tabel_kalender[[#This Row],[Datum]],21)","v":37},"1900-01-01",null,"ja",{"$f":"IF(Tabel_kalender[[#This Row],[Werkdag]]=\"ja\",Tabel_kalender[[#This Row],[Datum]],IF(E624=\"ja\",A624,IF(E625=\"ja\",A625,IF(E626=\"ja\",A626,IF(E627=\"ja\",A627,IF(E628=\"ja\",A628,IF(E629=\"ja\",A629,IF(E630=\"ja\",A630,IF(E631=\"ja\",A631,IF(E632=\"ja\",A632,IF(E633=\"ja\",A633,IF(E634=\"ja\",A634,IF(E635=\"ja\",A635,IF(E636=\"ja\",A636,IF(E637=\"ja\",A637,IF(E638=\"ja\",A638,IF(E639=\"ja\",A639,IF(E640=\"ja\",A640,IF(A641=\"ja\",A641,\"Volgepland\")))))))))))))))))))","v":"2022-09-12"},null,null,null,null,0,null,null,0,0,null,null,0]
["2022-09-13",{"$f":"WEEKNUM(Tabel_kalender[[#This Row],[Datum]],21)","v":37},"1900-01-02",null,"nee",{"$f":"IF(Tabel_kalender[[#This Row],[Werkdag]]=\"ja\",Tabel_kalender[[#This Row],[Datum]],IF(E625=\"ja\",A625,IF(E626=\"ja\",A626,IF(E627=\"ja\",A627,IF(E628=\"ja\",A628,IF(E629=\"ja\",A629,IF(E630=\"ja\",A630,IF(E631=\"ja\",A631,IF(E632=\"ja\",A632,IF(E633=\"ja\",A633,IF(E634=\"ja\",A634,IF(E635=\"ja\",A635,IF(E636=\"ja\",A636,IF(E637=\"ja\",A637,IF(E638=\"ja\",A638,IF(E639=\"ja\",A639,IF(E640=\"ja\",A640,IF(E641=\"ja\",A641,IF(A642=\"ja\",A642,\"Volgepland\")))))))))))))))))))","v":"2022-09-15"},null,null,null,null,0,null,null,0,0,null,null,0]
["2022-09-14",{"$f":"WEEKNUM(Tabel_kalender[[#This Row],[Datum]],21)","v":37},"1900-01-03",null,"nee",{"$f":"IF(Tabel_kalender[[#This Row],[Werkdag]]=\"ja\",Tabel_kalender[[#This Row],[Datum]],IF(E626=\"ja\",A626,IF(E627=\"ja\",A627,IF(E628=\"ja\",A628,IF(E629=\"ja\",A629,IF(E630=\"ja\",A630,IF(E631=\"ja\",A631,IF(E632=\"ja\",A632,IF(E633=\"ja\",A633,IF(E634=\"ja\",A634,IF(E635=\"ja\",A635,IF(E636=\"ja\",A636,IF(E637=\"ja\",A637,IF(E638=\"ja\",A638,IF(E639=\"ja\",A639,IF(E640=\"ja\",A640,IF(E641=\"ja\",A641,IF(E642=\"ja\",A642,IF(A643=\"ja\",A643,\"Volgepland\")))))))))))))))))))","v":"2022-09-15"},null,null,null,null,0,null,null,0,0,null,null,0]
["2022-09-15",{"$f":"WEEKNUM(Tabel_kalender[[#This Row],[Datum]],21)","v":37},"1900-01-04",null,"ja",{"$f":"IF(Tabel_kalender[[#This Row],[Werkdag]]=\"ja\",Tabel_kalender[[#This Row],[Datum]],IF(E627=\"ja\",A627,IF(E628=\"ja\",A628,IF(E629=\"ja\",A629,IF(E630=\"ja\",A630,IF(E631=\"ja\",A631,IF(E632=\"ja\",A632,IF(E633=\"ja\",A633,IF(E634=\"ja\",A634,IF(E635=\"ja\",A635,IF(E636=\"ja\",A636,IF(E637=\"ja\",A637,IF(E638=\"ja\",A638,IF(E639=\"ja\",A639,IF(E640=\"ja\",A640,IF(E641=\"ja\",A641,IF(E642=\"ja\",A642,IF(E643=\"ja\",A643,IF(A644=\"ja\",A644,\"Volgepland\")))))))))))))))))))","v":"2022-09-15"},null,null,null,null,0,null,null,0,0,null,null,0]
["2022-09-16",{"$f":"WEEKNUM(Tabel_kalender[[#This Row],[Datum]],21)","v":37},"1900-01-05",null,"ja",{"$f":"IF(Tabel_kalender[[#This Row],[Werkdag]]=\"ja\",Tabel_kalender[[#This Row],[Datum]],IF(E628=\"ja\",A628,IF(E629=\"ja\",A629,IF(E630=\"ja\",A630,IF(E631=\"ja\",A631,IF(E632=\"ja\",A632,IF(E633=\"ja\",A633,IF(E634=\"ja\",A634,IF(E635=\"ja\",A635,IF(E636=\"ja\",A636,IF(E637=\"ja\",A637,IF(E638=\"ja\",A638,IF(E639=\"ja\",A639,IF(E640=\"ja\",A640,IF(E641=\"ja\",A641,IF(E642=\"ja\",A642,IF(E643=\"ja\",A643,IF(E644=\"ja\",A644,IF(A645=\"ja\",A645,\"Volgepland\")))))))))))))))))))","v":"2022-09-16"},null,null,null,null,0,null,null,0,0,null,null,0]
["2022-09-17",{"$f":"WEEKNUM(Tabel_kalender[[#This Row],[Datum]],21)","v":37},"1900-01-06",null,"ja",{"$f":"IF(Tabel_kalender[[#This Row],[Werkdag]]=\"ja\",Tabel_kalender[[#This Row],[Datum]],IF(E629=\"ja\",A629,IF(E630=\"ja\",A630,IF(E631=\"ja\",A631,IF(E632=\"ja\",A632,IF(E633=\"ja\",A633,IF(E634=\"ja\",A634,IF(E635=\"ja\",A635,IF(E636=\"ja\",A636,IF(E637=\"ja\",A637,IF(E638=\"ja\",A638,IF(E639=\"ja\",A639,IF(E640=\"ja\",A640,IF(E641=\"ja\",A641,IF(E642=\"ja\",A642,IF(E643=\"ja\",A643,IF(E644=\"ja\",A644,IF(E645=\"ja\",A645,IF(A646=\"ja\",A646,\"Volgepland\")))))))))))))))))))","v":"2022-09-17"},null,null,null,null,0,null,null,0,0,null,null,0]
["2022-09-18",{"$f":"WEEKNUM(Tabel_kalender[[#This Row],[Datum]],21)","v":37},"1900-01-07",null,"ja",{"$f":"IF(Tabel_kalender[[#This Row],[Werkdag]]=\"ja\",Tabel_kalender[[#This Row],[Datum]],IF(E630=\"ja\",A630,IF(E631=\"ja\",A631,IF(E632=\"ja\",A632,IF(E633=\"ja\",A633,IF(E634=\"ja\",A634,IF(E635=\"ja\",A635,IF(E636=\"ja\",A636,IF(E637=\"ja\",A637,IF(E638=\"ja\",A638,IF(E639=\"ja\",A639,IF(E640=\"ja\",A640,IF(E641=\"ja\",A641,IF(E642=\"ja\",A642,IF(E643=\"ja\",A643,IF(E644=\"ja\",A644,IF(E645=\"ja\",A645,IF(E646=\"ja\",A646,IF(A647=\"ja\",A647,\"Volgepland\")))))))))))))))))))","v":"2022-09-18"},null,null,null,null,0,null,null,0,0,null,null,0]
["2022-09-19",{"$f":"WEEKNUM(Tabel_kalender[[#This Row],[Datum]],21)","v":38},"1900-01-01",null,"ja",{"$f":"IF(Tabel_kalender[[#This Row],[Werkdag]]=\"ja\",Tabel_kalender[[#This Row],[Datum]],IF(E631=\"ja\",A631,IF(E632=\"ja\",A632,IF(E633=\"ja\",A633,IF(E634=\"ja\",A634,IF(E635=\"ja\",A635,IF(E636=\"ja\",A636,IF(E637=\"ja\",A637,IF(E638=\"ja\",A638,IF(E639=\"ja\",A639,IF(E640=\"ja\",A640,IF(E641=\"ja\",A641,IF(E642=\"ja\",A642,IF(E643=\"ja\",A643,IF(E644=\"ja\",A644,IF(E645=\"ja\",A645,IF(E646=\"ja\",A646,IF(E647=\"ja\",A647,IF(A648=\"ja\",A648,\"Volgepland\")))))))))))))))))))","v":"2022-09-19"},null,null,null,null,0,null,null,0,0,null,null,0]
["2022-09-20",{"$f":"WEEKNUM(Tabel_kalender[[#This Row],[Datum]],21)","v":38},"1900-01-02",null,"nee",{"$f":"IF(Tabel_kalender[[#This Row],[Werkdag]]=\"ja\",Tabel_kalender[[#This Row],[Datum]],IF(E632=\"ja\",A632,IF(E633=\"ja\",A633,IF(E634=\"ja\",A634,IF(E635=\"ja\",A635,IF(E636=\"ja\",A636,IF(E637=\"ja\",A637,IF(E638=\"ja\",A638,IF(E639=\"ja\",A639,IF(E640=\"ja\",A640,IF(E641=\"ja\",A641,IF(E642=\"ja\",A642,IF(E643=\"ja\",A643,IF(E644=\"ja\",A644,IF(E645=\"ja\",A645,IF(E646=\"ja\",A646,IF(E647=\"ja\",A647,IF(E648=\"ja\",A648,IF(A649=\"ja\",A649,\"Volgepland\")))))))))))))))))))","v":"2022-09-22"},null,null,null,null,0,null,null,0,0,null,null,0]
["2022-09-21",{"$f":"WEEKNUM(Tabel_kalender[[#This Row],[Datum]],21)","v":38},"1900-01-03",null,"nee",{"$f":"IF(Tabel_kalender[[#This Row],[Werkdag]]=\"ja\",Tabel_kalender[[#This Row],[Datum]],IF(E633=\"ja\",A633,IF(E634=\"ja\",A634,IF(E635=\"ja\",A635,IF(E636=\"ja\",A636,IF(E637=\"ja\",A637,IF(E638=\"ja\",A638,IF(E639=\"ja\",A639,IF(E640=\"ja\",A640,IF(E641=\"ja\",A641,IF(E642=\"ja\",A642,IF(E643=\"ja\",A643,IF(E644=\"ja\",A644,IF(E645=\"ja\",A645,IF(E646=\"ja\",A646,IF(E647=\"ja\",A647,IF(E648=\"ja\",A648,IF(E649=\"ja\",A649,IF(A650=\"ja\",A650,\"Volgepland\")))))))))))))))))))","v":"2022-09-22"},null,null,null,null,0,null,null,0,0,null,null,0]
["2022-09-22",{"$f":"WEEKNUM(Tabel_kalender[[#This Row],[Datum]],21)","v":38},"1900-01-04",null,"ja",{"$f":"IF(Tabel_kalender[[#This Row],[Werkdag]]=\"ja\",Tabel_kalender[[#This Row],[Datum]],IF(E634=\"ja\",A634,IF(E635=\"ja\",A635,IF(E636=\"ja\",A636,IF(E637=\"ja\",A637,IF(E638=\"ja\",A638,IF(E639=\"ja\",A639,IF(E640=\"ja\",A640,IF(E641=\"ja\",A641,IF(E642=\"ja\",A642,IF(E643=\"ja\",A643,IF(E644=\"ja\",A644,IF(E645=\"ja\",A645,IF(E646=\"ja\",A646,IF(E647=\"ja\",A647,IF(E648=\"ja\",A648,IF(E649=\"ja\",A649,IF(E650=\"ja\",A650,IF(A651=\"ja\",A651,\"Volgepland\")))))))))))))))))))","v":"2022-09-22"},null,null,null,null,0,null,null,0,0,null,null,0]
["2022-09-23",{"$f":"WEEKNUM(Tabel_kalender[[#This Row],[Datum]],21)","v":38},"1900-01-05",null,"ja",{"$f":"IF(Tabel_kalender[[#This Row],[Werkdag]]=\"ja\",Tabel_kalender[[#This Row],[Datum]],IF(E635=\"ja\",A635,IF(E636=\"ja\",A636,IF(E637=\"ja\",A637,IF(E638=\"ja\",A638,IF(E639=\"ja\",A639,IF(E640=\"ja\",A640,IF(E641=\"ja\",A641,IF(E642=\"ja\",A642,IF(E643=\"ja\",A643,IF(E644=\"ja\",A644,IF(E645=\"ja\",A645,IF(E646=\"ja\",A646,IF(E647=\"ja\",A647,IF(E648=\"ja\",A648,IF(E649=\"ja\",A649,IF(E650=\"ja\",A650,IF(E651=\"ja\",A651,IF(A652=\"ja\",A652,\"Volgepland\")))))))))))))))))))","v":"2022-09-23"},null,null,null,null,0,null,null,0,0,null,null,0]
["2022-09-24",{"$f":"WEEKNUM(Tabel_kalender[[#This Row],[Datum]],21)","v":38},"1900-01-06",null,"ja",{"$f":"IF(Tabel_kalender[[#This Row],[Werkdag]]=\"ja\",Tabel_kalender[[#This Row],[Datum]],IF(E636=\"ja\",A636,IF(E637=\"ja\",A637,IF(E638=\"ja\",A638,IF(E639=\"ja\",A639,IF(E640=\"ja\",A640,IF(E641=\"ja\",A641,IF(E642=\"ja\",A642,IF(E643=\"ja\",A643,IF(E644=\"ja\",A644,IF(E645=\"ja\",A645,IF(E646=\"ja\",A646,IF(E647=\"ja\",A647,IF(E648=\"ja\",A648,IF(E649=\"ja\",A649,IF(E650=\"ja\",A650,IF(E651=\"ja\",A651,IF(E652=\"ja\",A652,IF(A653=\"ja\",A653,\"Volgepland\")))))))))))))))))))","v":"2022-09-24"},null,null,null,null,0,null,null,0,0,null,null,0]
["2022-09-25",{"$f":"WEEKNUM(Tabel_kalender[[#This Row],[Datum]],21)","v":38},"1900-01-07",null,"ja",{"$f":"IF(Tabel_kalender[[#This Row],[Werkdag]]=\"ja\",Tabel_kalender[[#This Row],[Datum]],IF(E637=\"ja\",A637,IF(E638=\"ja\",A638,IF(E639=\"ja\",A639,IF(E640=\"ja\",A640,IF(E641=\"ja\",A641,IF(E642=\"ja\",A642,IF(E643=\"ja\",A643,IF(E644=\"ja\",A644,IF(E645=\"ja\",A645,IF(E646=\"ja\",A646,IF(E647=\"ja\",A647,IF(E648=\"ja\",A648,IF(E649=\"ja\",A649,IF(E650=\"ja\",A650,IF(E651=\"ja\",A651,IF(E652=\"ja\",A652,IF(E653=\"ja\",A653,IF(A654=\"ja\",A654,\"Volgepland\")))))))))))))))))))","v":"2022-09-25"},null,null,null,null,0,null,null,0,0,null,null,0]
["2022-09-26",{"$f":"WEEKNUM(Tabel_kalender[[#This Row],[Datum]],21)","v":39},"1900-01-01",null,"ja",{"$f":"IF(Tabel_kalender[[#This Row],[Werkdag]]=\"ja\",Tabel_kalender[[#This Row],[Datum]],IF(E638=\"ja\",A638,IF(E639=\"ja\",A639,IF(E640=\"ja\",A640,IF(E641=\"ja\",A641,IF(E642=\"ja\",A642,IF(E643=\"ja\",A643,IF(E644=\"ja\",A644,IF(E645=\"ja\",A645,IF(E646=\"ja\",A646,IF(E647=\"ja\",A647,IF(E648=\"ja\",A648,IF(E649=\"ja\",A649,IF(E650=\"ja\",A650,IF(E651=\"ja\",A651,IF(E652=\"ja\",A652,IF(E653=\"ja\",A653,IF(E654=\"ja\",A654,IF(A655=\"ja\",A655,\"Volgepland\")))))))))))))))))))","v":"2022-09-26"},null,null,null,null,0,null,null,0,0,null,null,0]
["2022-09-27",{"$f":"WEEKNUM(Tabel_kalender[[#This Row],[Datum]],21)","v":39},"1900-01-02",null,"nee",{"$f":"IF(Tabel_kalender[[#This Row],[Werkdag]]=\"ja\",Tabel_kalender[[#This Row],[Datum]],IF(E639=\"ja\",A639,IF(E640=\"ja\",A640,IF(E641=\"ja\",A641,IF(E642=\"ja\",A642,IF(E643=\"ja\",A643,IF(E644=\"ja\",A644,IF(E645=\"ja\",A645,IF(E646=\"ja\",A646,IF(E647=\"ja\",A647,IF(E648=\"ja\",A648,IF(E649=\"ja\",A649,IF(E650=\"ja\",A650,IF(E651=\"ja\",A651,IF(E652=\"ja\",A652,IF(E653=\"ja\",A653,IF(E654=\"ja\",A654,IF(E655=\"ja\",A655,IF(A656=\"ja\",A656,\"Volgepland\")))))))))))))))))))","v":"2022-09-29"},null,null,null,null,0,null,null,0,0,null,null,0]
["2022-09-28",{"$f":"WEEKNUM(Tabel_kalender[[#This Row],[Datum]],21)","v":39},"1900-01-03",null,"nee",{"$f":"IF(Tabel_kalender[[#This Row],[Werkdag]]=\"ja\",Tabel_kalender[[#This Row],[Datum]],IF(E640=\"ja\",A640,IF(E641=\"ja\",A641,IF(E642=\"ja\",A642,IF(E643=\"ja\",A643,IF(E644=\"ja\",A644,IF(E645=\"ja\",A645,IF(E646=\"ja\",A646,IF(E647=\"ja\",A647,IF(E648=\"ja\",A648,IF(E649=\"ja\",A649,IF(E650=\"ja\",A650,IF(E651=\"ja\",A651,IF(E652=\"ja\",A652,IF(E653=\"ja\",A653,IF(E654=\"ja\",A654,IF(E655=\"ja\",A655,IF(E656=\"ja\",A656,IF(A657=\"ja\",A657,\"Volgepland\")))))))))))))))))))","v":"2022-09-29"},null,null,null,null,0,null,null,0,0,null,null,0]
["2022-09-29",{"$f":"WEEKNUM(Tabel_kalender[[#This Row],[Datum]],21)","v":39},"1900-01-04",null,"ja",{"$f":"IF(Tabel_kalender[[#This Row],[Werkdag]]=\"ja\",Tabel_kalender[[#This Row],[Datum]],IF(E641=\"ja\",A641,IF(E642=\"ja\",A642,IF(E643=\"ja\",A643,IF(E644=\"ja\",A644,IF(E645=\"ja\",A645,IF(E646=\"ja\",A646,IF(E647=\"ja\",A647,IF(E648=\"ja\",A648,IF(E649=\"ja\",A649,IF(E650=\"ja\",A650,IF(E651=\"ja\",A651,IF(E652=\"ja\",A652,IF(E653=\"ja\",A653,IF(E654=\"ja\",A654,IF(E655=\"ja\",A655,IF(E656=\"ja\",A656,IF(E657=\"ja\",A657,IF(A658=\"ja\",A658,\"Volgepland\")))))))))))))))))))","v":"2022-09-29"},null,null,null,null,0,null,null,0,0,null,null,0]
["2022-09-30",{"$f":"WEEKNUM(Tabel_kalender[[#This Row],[Datum]],21)","v":39},"1900-01-05",null,"ja",{"$f":"IF(Tabel_kalender[[#This Row],[Werkdag]]=\"ja\",Tabel_kalender[[#This Row],[Datum]],IF(E642=\"ja\",A642,IF(E643=\"ja\",A643,IF(E644=\"ja\",A644,IF(E645=\"ja\",A645,IF(E646=\"ja\",A646,IF(E647=\"ja\",A647,IF(E648=\"ja\",A648,IF(E649=\"ja\",A649,IF(E650=\"ja\",A650,IF(E651=\"ja\",A651,IF(E652=\"ja\",A652,IF(E653=\"ja\",A653,IF(E654=\"ja\",A654,IF(E655=\"ja\",A655,IF(E656=\"ja\",A656,IF(E657=\"ja\",A657,IF(E658=\"ja\",A658,IF(A659=\"ja\",A659,\"Volgepland\")))))))))))))))))))","v":"2022-09-30"},null,null,null,null,0,null,null,0,0,null,null,0]
["2022-10-01",{"$f":"WEEKNUM(Tabel_kalender[[#This Row],[Datum]],21)","v":39},"1900-01-06",null,"ja",{"$f":"IF(Tabel_kalender[[#This Row],[Werkdag]]=\"ja\",Tabel_kalender[[#This Row],[Datum]],IF(E643=\"ja\",A643,IF(E644=\"ja\",A644,IF(E645=\"ja\",A645,IF(E646=\"ja\",A646,IF(E647=\"ja\",A647,IF(E648=\"ja\",A648,IF(E649=\"ja\",A649,IF(E650=\"ja\",A650,IF(E651=\"ja\",A651,IF(E652=\"ja\",A652,IF(E653=\"ja\",A653,IF(E654=\"ja\",A654,IF(E655=\"ja\",A655,IF(E656=\"ja\",A656,IF(E657=\"ja\",A657,IF(E658=\"ja\",A658,IF(E659=\"ja\",A659,IF(A660=\"ja\",A660,\"Volgepland\")))))))))))))))))))","v":"2022-10-01"},null,null,null,null,0,null,null,0,0,null,null,0]
["2022-10-02",{"$f":"WEEKNUM(Tabel_kalender[[#This Row],[Datum]],21)","v":39},"1900-01-07",null,"ja",{"$f":"IF(Tabel_kalender[[#This Row],[Werkdag]]=\"ja\",Tabel_kalender[[#This Row],[Datum]],IF(E644=\"ja\",A644,IF(E645=\"ja\",A645,IF(E646=\"ja\",A646,IF(E647=\"ja\",A647,IF(E648=\"ja\",A648,IF(E649=\"ja\",A649,IF(E650=\"ja\",A650,IF(E651=\"ja\",A651,IF(E652=\"ja\",A652,IF(E653=\"ja\",A653,IF(E654=\"ja\",A654,IF(E655=\"ja\",A655,IF(E656=\"ja\",A656,IF(E657=\"ja\",A657,IF(E658=\"ja\",A658,IF(E659=\"ja\",A659,IF(E660=\"ja\",A660,IF(A661=\"ja\",A661,\"Volgepland\")))))))))))))))))))","v":"2022-10-02"},null,null,null,null,0,null,null,0,0,null,null,0]
["2022-10-03",{"$f":"WEEKNUM(Tabel_kalender[[#This Row],[Datum]],21)","v":40},"1900-01-01",null,"ja",{"$f":"IF(Tabel_kalender[[#This Row],[Werkdag]]=\"ja\",Tabel_kalender[[#This Row],[Datum]],IF(E645=\"ja\",A645,IF(E646=\"ja\",A646,IF(E647=\"ja\",A647,IF(E648=\"ja\",A648,IF(E649=\"ja\",A649,IF(E650=\"ja\",A650,IF(E651=\"ja\",A651,IF(E652=\"ja\",A652,IF(E653=\"ja\",A653,IF(E654=\"ja\",A654,IF(E655=\"ja\",A655,IF(E656=\"ja\",A656,IF(E657=\"ja\",A657,IF(E658=\"ja\",A658,IF(E659=\"ja\",A659,IF(E660=\"ja\",A660,IF(E661=\"ja\",A661,IF(A662=\"ja\",A662,\"Volgepland\")))))))))))))))))))","v":"2022-10-03"},null,null,null,null,0,null,null,{"$f":"IF(L644>0,L644-K644,)-M644","v":0},{"$f":"P643","v":0},null,null,{"$f":"IF(P644>0,P644-O644,)-Q644","v":0}]
["2022-10-04",{"$f":"WEEKNUM(Tabel_kalender[[#This Row],[Datum]],21)","v":40},{"$f":"WEEKDAY(A645,2)","v":"1900-01-02"},null,"nee",{"$f":"IF(Tabel_kalender[[#This Row],[Werkdag]]=\"ja\",Tabel_kalender[[#This Row],[Datum]],IF(E646=\"ja\",A646,IF(E647=\"ja\",A647,IF(E648=\"ja\",A648,IF(E649=\"ja\",A649,IF(E650=\"ja\",A650,IF(E651=\"ja\",A651,IF(E652=\"ja\",A652,IF(E653=\"ja\",A653,IF(E654=\"ja\",A654,IF(E655=\"ja\",A655,IF(E656=\"ja\",A656,IF(E657=\"ja\",A657,IF(E658=\"ja\",A658,IF(E659=\"ja\",A659,IF(E660=\"ja\",A660,IF(E661=\"ja\",A661,IF(E662=\"ja\",A662,IF(A663=\"ja\",A663,\"Volgepland\")))))))))))))))))))","v":"2022-10-06"},null,null,null,null,{"$f":"L644","v":0},null,null,0,0,null,null,0]
[{"$f":"A645+1","v":"2022-10-05"},{"$f":"WEEKNUM(Tabel_kalender[[#This Row],[Datum]],21)","v":40},"1900-01-03",null,"nee",{"$f":"IF(Tabel_kalender[[#This Row],[Werkdag]]=\"ja\",Tabel_kalender[[#This Row],[Datum]],IF(E647=\"ja\",A647,IF(E648=\"ja\",A648,IF(E649=\"ja\",A649,IF(E650=\"ja\",A650,IF(E651=\"ja\",A651,IF(E652=\"ja\",A652,IF(E653=\"ja\",A653,IF(E654=\"ja\",A654,IF(E655=\"ja\",A655,IF(E656=\"ja\",A656,IF(E657=\"ja\",A657,IF(E658=\"ja\",A658,IF(E659=\"ja\",A659,IF(E660=\"ja\",A660,IF(E661=\"ja\",A661,IF(E662=\"ja\",A662,IF(E663=\"ja\",A663,IF(A664=\"ja\",A664,\"Volgepland\")))))))))))))))))))","v":"2022-10-06"},null,null,null,null,0,null,null,0,0,null,null,0]
["2022-10-06",{"$f":"WEEKNUM(Tabel_kalender[[#This Row],[Datum]],21)","v":40},"1900-01-04",null,"ja",{"$f":"IF(Tabel_kalender[[#This Row],[Werkdag]]=\"ja\",Tabel_kalender[[#This Row],[Datum]],IF(E648=\"ja\",A648,IF(E649=\"ja\",A649,IF(E650=\"ja\",A650,IF(E651=\"ja\",A651,IF(E652=\"ja\",A652,IF(E653=\"ja\",A653,IF(E654=\"ja\",A654,IF(E655=\"ja\",A655,IF(E656=\"ja\",A656,IF(E657=\"ja\",A657,IF(E658=\"ja\",A658,IF(E659=\"ja\",A659,IF(E660=\"ja\",A660,IF(E661=\"ja\",A661,IF(E662=\"ja\",A662,IF(E663=\"ja\",A663,IF(E664=\"ja\",A664,IF(A665=\"ja\",A665,\"Volgepland\")))))))))))))))))))","v":"2022-10-06"},null,null,null,null,0,null,null,0,0,null,null,0]
["2022-10-07",{"$f":"WEEKNUM(Tabel_kalender[[#This Row],[Datum]],21)","v":40},"1900-01-05",null,"ja",{"$f":"IF(Tabel_kalender[[#This Row],[Werkdag]]=\"ja\",Tabel_kalender[[#This Row],[Datum]],IF(E649=\"ja\",A649,IF(E650=\"ja\",A650,IF(E651=\"ja\",A651,IF(E652=\"ja\",A652,IF(E653=\"ja\",A653,IF(E654=\"ja\",A654,IF(E655=\"ja\",A655,IF(E656=\"ja\",A656,IF(E657=\"ja\",A657,IF(E658=\"ja\",A658,IF(E659=\"ja\",A659,IF(E660=\"ja\",A660,IF(E661=\"ja\",A661,IF(E662=\"ja\",A662,IF(E663=\"ja\",A663,IF(E664=\"ja\",A664,IF(E665=\"ja\",A665,IF(A666=\"ja\",A666,\"Volgepland\")))))))))))))))))))","v":"2022-10-07"},null,null,null,null,0,null,null,0,0,null,null,0]
["2022-10-08",{"$f":"WEEKNUM(Tabel_kalender[[#This Row],[Datum]],21)","v":40},"1900-01-06",null,"ja",{"$f":"IF(Tabel_kalender[[#This Row],[Werkdag]]=\"ja\",Tabel_kalender[[#This Row],[Datum]],IF(E650=\"ja\",A650,IF(E651=\"ja\",A651,IF(E652=\"ja\",A652,IF(E653=\"ja\",A653,IF(E654=\"ja\",A654,IF(E655=\"ja\",A655,IF(E656=\"ja\",A656,IF(E657=\"ja\",A657,IF(E658=\"ja\",A658,IF(E659=\"ja\",A659,IF(E660=\"ja\",A660,IF(E661=\"ja\",A661,IF(E662=\"ja\",A662,IF(E663=\"ja\",A663,IF(E664=\"ja\",A664,IF(E665=\"ja\",A665,IF(E666=\"ja\",A666,IF(A667=\"ja\",A667,\"Volgepland\")))))))))))))))))))","v":"2022-10-08"},null,null,null,null,0,null,null,0,0,null,null,0]
["2022-10-09",{"$f":"WEEKNUM(Tabel_kalender[[#This Row],[Datum]],21)","v":40},"1900-01-07",null,"ja",{"$f":"IF(Tabel_kalender[[#This Row],[Werkdag]]=\"ja\",Tabel_kalender[[#This Row],[Datum]],IF(E651=\"ja\",A651,IF(E652=\"ja\",A652,IF(E653=\"ja\",A653,IF(E654=\"ja\",A654,IF(E655=\"ja\",A655,IF(E656=\"ja\",A656,IF(E657=\"ja\",A657,IF(E658=\"ja\",A658,IF(E659=\"ja\",A659,IF(E660=\"ja\",A660,IF(E661=\"ja\",A661,IF(E662=\"ja\",A662,IF(E663=\"ja\",A663,IF(E664=\"ja\",A664,IF(E665=\"ja\",A665,IF(E666=\"ja\",A666,IF(E667=\"ja\",A667,IF(A668=\"ja\",A668,\"Volgepland\")))))))))))))))))))","v":"2022-10-09"},null,null,null,null,0,null,null,0,0,null,null,0]
["2022-10-10",{"$f":"WEEKNUM(Tabel_kalender[[#This Row],[Datum]],21)","v":41},"1900-01-01",null,"ja",{"$f":"IF(Tabel_kalender[[#This Row],[Werkdag]]=\"ja\",Tabel_kalender[[#This Row],[Datum]],IF(E652=\"ja\",A652,IF(E653=\"ja\",A653,IF(E654=\"ja\",A654,IF(E655=\"ja\",A655,IF(E656=\"ja\",A656,IF(E657=\"ja\",A657,IF(E658=\"ja\",A658,IF(E659=\"ja\",A659,IF(E660=\"ja\",A660,IF(E661=\"ja\",A661,IF(E662=\"ja\",A662,IF(E663=\"ja\",A663,IF(E664=\"ja\",A664,IF(E665=\"ja\",A665,IF(E666=\"ja\",A666,IF(E667=\"ja\",A667,IF(E668=\"ja\",A668,IF(A669=\"ja\",A669,\"Volgepland\")))))))))))))))))))","v":"2022-10-10"},null,null,null,null,0,null,null,0,0,null,null,0]
["2022-10-11",{"$f":"WEEKNUM(Tabel_kalender[[#This Row],[Datum]],21)","v":41},"1900-01-02",null,"nee",{"$f":"IF(Tabel_kalender[[#This Row],[Werkdag]]=\"ja\",Tabel_kalender[[#This Row],[Datum]],IF(E653=\"ja\",A653,IF(E654=\"ja\",A654,IF(E655=\"ja\",A655,IF(E656=\"ja\",A656,IF(E657=\"ja\",A657,IF(E658=\"ja\",A658,IF(E659=\"ja\",A659,IF(E660=\"ja\",A660,IF(E661=\"ja\",A661,IF(E662=\"ja\",A662,IF(E663=\"ja\",A663,IF(E664=\"ja\",A664,IF(E665=\"ja\",A665,IF(E666=\"ja\",A666,IF(E667=\"ja\",A667,IF(E668=\"ja\",A668,IF(E669=\"ja\",A669,IF(A670=\"ja\",A670,\"Volgepland\")))))))))))))))))))","v":"2022-10-13"},null,null,null,null,0,null,null,0,0,null,null,0]
["2022-10-12",{"$f":"WEEKNUM(Tabel_kalender[[#This Row],[Datum]],21)","v":41},"1900-01-03",null,"nee",{"$f":"IF(Tabel_kalender[[#This Row],[Werkdag]]=\"ja\",Tabel_kalender[[#This Row],[Datum]],IF(E654=\"ja\",A654,IF(E655=\"ja\",A655,IF(E656=\"ja\",A656,IF(E657=\"ja\",A657,IF(E658=\"ja\",A658,IF(E659=\"ja\",A659,IF(E660=\"ja\",A660,IF(E661=\"ja\",A661,IF(E662=\"ja\",A662,IF(E663=\"ja\",A663,IF(E664=\"ja\",A664,IF(E665=\"ja\",A665,IF(E666=\"ja\",A666,IF(E667=\"ja\",A667,IF(E668=\"ja\",A668,IF(E669=\"ja\",A669,IF(E670=\"ja\",A670,IF(A671=\"ja\",A671,\"Volgepland\")))))))))))))))))))","v":"2022-10-13"},null,null,null,null,0,null,null,0,0,null,null,0]
["2022-10-13",{"$f":"WEEKNUM(Tabel_kalender[[#This Row],[Datum]],21)","v":41},"1900-01-04",null,"ja",{"$f":"IF(Tabel_kalender[[#This Row],[Werkdag]]=\"ja\",Tabel_kalender[[#This Row],[Datum]],IF(E655=\"ja\",A655,IF(E656=\"ja\",A656,IF(E657=\"ja\",A657,IF(E658=\"ja\",A658,IF(E659=\"ja\",A659,IF(E660=\"ja\",A660,IF(E661=\"ja\",A661,IF(E662=\"ja\",A662,IF(E663=\"ja\",A663,IF(E664=\"ja\",A664,IF(E665=\"ja\",A665,IF(E666=\"ja\",A666,IF(E667=\"ja\",A667,IF(E668=\"ja\",A668,IF(E669=\"ja\",A669,IF(E670=\"ja\",A670,IF(E671=\"ja\",A671,IF(A672=\"ja\",A672,\"Volgepland\")))))))))))))))))))","v":"2022-10-13"},null,null,null,null,0,null,null,0,0,null,null,0]
["2022-10-14",{"$f":"WEEKNUM(Tabel_kalender[[#This Row],[Datum]],21)","v":41},"1900-01-05",null,"ja",{"$f":"IF(Tabel_kalender[[#This Row],[Werkdag]]=\"ja\",Tabel_kalender[[#This Row],[Datum]],IF(E656=\"ja\",A656,IF(E657=\"ja\",A657,IF(E658=\"ja\",A658,IF(E659=\"ja\",A659,IF(E660=\"ja\",A660,IF(E661=\"ja\",A661,IF(E662=\"ja\",A662,IF(E663=\"ja\",A663,IF(E664=\"ja\",A664,IF(E665=\"ja\",A665,IF(E666=\"ja\",A666,IF(E667=\"ja\",A667,IF(E668=\"ja\",A668,IF(E669=\"ja\",A669,IF(E670=\"ja\",A670,IF(E671=\"ja\",A671,IF(E672=\"ja\",A672,IF(A673=\"ja\",A673,\"Volgepland\")))))))))))))))))))","v":"2022-10-14"},null,null,null,null,0,null,null,0,0,null,null,0]
["2022-10-15",{"$f":"WEEKNUM(Tabel_kalender[[#This Row],[Datum]],21)","v":41},"1900-01-06",null,"ja",{"$f":"IF(Tabel_kalender[[#This Row],[Werkdag]]=\"ja\",Tabel_kalender[[#This Row],[Datum]],IF(E657=\"ja\",A657,IF(E658=\"ja\",A658,IF(E659=\"ja\",A659,IF(E660=\"ja\",A660,IF(E661=\"ja\",A661,IF(E662=\"ja\",A662,IF(E663=\"ja\",A663,IF(E664=\"ja\",A664,IF(E665=\"ja\",A665,IF(E666=\"ja\",A666,IF(E667=\"ja\",A667,IF(E668=\"ja\",A668,IF(E669=\"ja\",A669,IF(E670=\"ja\",A670,IF(E671=\"ja\",A671,IF(E672=\"ja\",A672,IF(E673=\"ja\",A673,IF(A674=\"ja\",A674,\"Volgepland\")))))))))))))))))))","v":"2022-10-15"},null,null,null,null,0,null,null,0,0,null,null,0]
["2022-10-16",{"$f":"WEEKNUM(Tabel_kalender[[#This Row],[Datum]],21)","v":41},"1900-01-07",null,"ja",{"$f":"IF(Tabel_kalender[[#This Row],[Werkdag]]=\"ja\",Tabel_kalender[[#This Row],[Datum]],IF(E658=\"ja\",A658,IF(E659=\"ja\",A659,IF(E660=\"ja\",A660,IF(E661=\"ja\",A661,IF(E662=\"ja\",A662,IF(E663=\"ja\",A663,IF(E664=\"ja\",A664,IF(E665=\"ja\",A665,IF(E666=\"ja\",A666,IF(E667=\"ja\",A667,IF(E668=\"ja\",A668,IF(E669=\"ja\",A669,IF(E670=\"ja\",A670,IF(E671=\"ja\",A671,IF(E672=\"ja\",A672,IF(E673=\"ja\",A673,IF(E674=\"ja\",A674,IF(A675=\"ja\",A675,\"Volgepland\")))))))))))))))))))","v":"2022-10-16"},null,null,null,null,0,null,null,0,0,null,null,0]
["2022-10-17",{"$f":"WEEKNUM(Tabel_kalender[[#This Row],[Datum]],21)","v":42},"1900-01-01",null,"ja",{"$f":"IF(Tabel_kalender[[#This Row],[Werkdag]]=\"ja\",Tabel_kalender[[#This Row],[Datum]],IF(E659=\"ja\",A659,IF(E660=\"ja\",A660,IF(E661=\"ja\",A661,IF(E662=\"ja\",A662,IF(E663=\"ja\",A663,IF(E664=\"ja\",A664,IF(E665=\"ja\",A665,IF(E666=\"ja\",A666,IF(E667=\"ja\",A667,IF(E668=\"ja\",A668,IF(E669=\"ja\",A669,IF(E670=\"ja\",A670,IF(E671=\"ja\",A671,IF(E672=\"ja\",A672,IF(E673=\"ja\",A673,IF(E674=\"ja\",A674,IF(E675=\"ja\",A675,IF(A676=\"ja\",A676,\"Volgepland\")))))))))))))))))))","v":"2022-10-17"},null,null,null,null,0,null,null,0,0,null,null,0]
["2022-10-18",{"$f":"WEEKNUM(Tabel_kalender[[#This Row],[Datum]],21)","v":42},"1900-01-02",null,"nee",{"$f":"IF(Tabel_kalender[[#This Row],[Werkdag]]=\"ja\",Tabel_kalender[[#This Row],[Datum]],IF(E660=\"ja\",A660,IF(E661=\"ja\",A661,IF(E662=\"ja\",A662,IF(E663=\"ja\",A663,IF(E664=\"ja\",A664,IF(E665=\"ja\",A665,IF(E666=\"ja\",A666,IF(E667=\"ja\",A667,IF(E668=\"ja\",A668,IF(E669=\"ja\",A669,IF(E670=\"ja\",A670,IF(E671=\"ja\",A671,IF(E672=\"ja\",A672,IF(E673=\"ja\",A673,IF(E674=\"ja\",A674,IF(E675=\"ja\",A675,IF(E676=\"ja\",A676,IF(A677=\"ja\",A677,\"Volgepland\")))))))))))))))))))","v":"2022-10-20"},null,null,null,null,0,null,null,0,0,null,null,0]
["2022-10-19",{"$f":"WEEKNUM(Tabel_kalender[[#This Row],[Datum]],21)","v":42},"1900-01-03",null,"nee",{"$f":"IF(Tabel_kalender[[#This Row],[Werkdag]]=\"ja\",Tabel_kalender[[#This Row],[Datum]],IF(E661=\"ja\",A661,IF(E662=\"ja\",A662,IF(E663=\"ja\",A663,IF(E664=\"ja\",A664,IF(E665=\"ja\",A665,IF(E666=\"ja\",A666,IF(E667=\"ja\",A667,IF(E668=\"ja\",A668,IF(E669=\"ja\",A669,IF(E670=\"ja\",A670,IF(E671=\"ja\",A671,IF(E672=\"ja\",A672,IF(E673=\"ja\",A673,IF(E674=\"ja\",A674,IF(E675=\"ja\",A675,IF(E676=\"ja\",A676,IF(E677=\"ja\",A677,IF(A678=\"ja\",A678,\"Volgepland\")))))))))))))))))))","v":"2022-10-20"},null,null,null,null,0,null,null,0,0,null,null,0]
["2022-10-20",{"$f":"WEEKNUM(Tabel_kalender[[#This Row],[Datum]],21)","v":42},"1900-01-04",null,"ja",{"$f":"IF(Tabel_kalender[[#This Row],[Werkdag]]=\"ja\",Tabel_kalender[[#This Row],[Datum]],IF(E662=\"ja\",A662,IF(E663=\"ja\",A663,IF(E664=\"ja\",A664,IF(E665=\"ja\",A665,IF(E666=\"ja\",A666,IF(E667=\"ja\",A667,IF(E668=\"ja\",A668,IF(E669=\"ja\",A669,IF(E670=\"ja\",A670,IF(E671=\"ja\",A671,IF(E672=\"ja\",A672,IF(E673=\"ja\",A673,IF(E674=\"ja\",A674,IF(E675=\"ja\",A675,IF(E676=\"ja\",A676,IF(E677=\"ja\",A677,IF(E678=\"ja\",A678,IF(A679=\"ja\",A679,\"Volgepland\")))))))))))))))))))","v":"2022-10-20"},null,null,null,null,0,null,null,0,0,null,null,0]
["2022-10-21",{"$f":"WEEKNUM(Tabel_kalender[[#This Row],[Datum]],21)","v":42},"1900-01-05",null,"ja",{"$f":"IF(Tabel_kalender[[#This Row],[Werkdag]]=\"ja\",Tabel_kalender[[#This Row],[Datum]],IF(E663=\"ja\",A663,IF(E664=\"ja\",A664,IF(E665=\"ja\",A665,IF(E666=\"ja\",A666,IF(E667=\"ja\",A667,IF(E668=\"ja\",A668,IF(E669=\"ja\",A669,IF(E670=\"ja\",A670,IF(E671=\"ja\",A671,IF(E672=\"ja\",A672,IF(E673=\"ja\",A673,IF(E674=\"ja\",A674,IF(E675=\"ja\",A675,IF(E676=\"ja\",A676,IF(E677=\"ja\",A677,IF(E678=\"ja\",A678,IF(E679=\"ja\",A679,IF(A680=\"ja\",A680,\"Volgepland\")))))))))))))))))))","v":"2022-10-21"},null,null,null,null,0,null,null,0,0,null,null,0]
["2022-10-22",{"$f":"WEEKNUM(Tabel_kalender[[#This Row],[Datum]],21)","v":42},"1900-01-06",null,"ja",{"$f":"IF(Tabel_kalender[[#This Row],[Werkdag]]=\"ja\",Tabel_kalender[[#This Row],[Datum]],IF(E664=\"ja\",A664,IF(E665=\"ja\",A665,IF(E666=\"ja\",A666,IF(E667=\"ja\",A667,IF(E668=\"ja\",A668,IF(E669=\"ja\",A669,IF(E670=\"ja\",A670,IF(E671=\"ja\",A671,IF(E672=\"ja\",A672,IF(E673=\"ja\",A673,IF(E674=\"ja\",A674,IF(E675=\"ja\",A675,IF(E676=\"ja\",A676,IF(E677=\"ja\",A677,IF(E678=\"ja\",A678,IF(E679=\"ja\",A679,IF(E680=\"ja\",A680,IF(A681=\"ja\",A681,\"Volgepland\")))))))))))))))))))","v":"2022-10-22"},null,null,null,null,0,null,null,0,0,null,null,0]
["2022-10-23",{"$f":"WEEKNUM(Tabel_kalender[[#This Row],[Datum]],21)","v":42},"1900-01-07",null,"ja",{"$f":"IF(Tabel_kalender[[#This Row],[Werkdag]]=\"ja\",Tabel_kalender[[#This Row],[Datum]],IF(E665=\"ja\",A665,IF(E666=\"ja\",A666,IF(E667=\"ja\",A667,IF(E668=\"ja\",A668,IF(E669=\"ja\",A669,IF(E670=\"ja\",A670,IF(E671=\"ja\",A671,IF(E672=\"ja\",A672,IF(E673=\"ja\",A673,IF(E674=\"ja\",A674,IF(E675=\"ja\",A675,IF(E676=\"ja\",A676,IF(E677=\"ja\",A677,IF(E678=\"ja\",A678,IF(E679=\"ja\",A679,IF(E680=\"ja\",A680,IF(E681=\"ja\",A681,IF(A682=\"ja\",A682,\"Volgepland\")))))))))))))))))))","v":"2022-10-23"},null,null,null,null,0,null,null,0,0,null,null,0]
["2022-10-24",{"$f":"WEEKNUM(Tabel_kalender[[#This Row],[Datum]],21)","v":43},"1900-01-01",null,"ja",{"$f":"IF(Tabel_kalender[[#This Row],[Werkdag]]=\"ja\",Tabel_kalender[[#This Row],[Datum]],IF(E666=\"ja\",A666,IF(E667=\"ja\",A667,IF(E668=\"ja\",A668,IF(E669=\"ja\",A669,IF(E670=\"ja\",A670,IF(E671=\"ja\",A671,IF(E672=\"ja\",A672,IF(E673=\"ja\",A673,IF(E674=\"ja\",A674,IF(E675=\"ja\",A675,IF(E676=\"ja\",A676,IF(E677=\"ja\",A677,IF(E678=\"ja\",A678,IF(E679=\"ja\",A679,IF(E680=\"ja\",A680,IF(E681=\"ja\",A681,IF(E682=\"ja\",A682,IF(A683=\"ja\",A683,\"Volgepland\")))))))))))))))))))","v":"2022-10-24"},null,null,null,null,0,null,null,0,0,null,null,0]
["2022-10-25",{"$f":"WEEKNUM(Tabel_kalender[[#This Row],[Datum]],21)","v":43},"1900-01-02",null,"nee",{"$f":"IF(Tabel_kalender[[#This Row],[Werkdag]]=\"ja\",Tabel_kalender[[#This Row],[Datum]],IF(E667=\"ja\",A667,IF(E668=\"ja\",A668,IF(E669=\"ja\",A669,IF(E670=\"ja\",A670,IF(E671=\"ja\",A671,IF(E672=\"ja\",A672,IF(E673=\"ja\",A673,IF(E674=\"ja\",A674,IF(E675=\"ja\",A675,IF(E676=\"ja\",A676,IF(E677=\"ja\",A677,IF(E678=\"ja\",A678,IF(E679=\"ja\",A679,IF(E680=\"ja\",A680,IF(E681=\"ja\",A681,IF(E682=\"ja\",A682,IF(E683=\"ja\",A683,IF(A684=\"ja\",A684,\"Volgepland\")))))))))))))))))))","v":"2022-10-27"},null,null,null,null,0,null,null,0,0,null,null,0]
["2022-10-26",{"$f":"WEEKNUM(Tabel_kalender[[#This Row],[Datum]],21)","v":43},"1900-01-03",null,"nee",{"$f":"IF(Tabel_kalender[[#This Row],[Werkdag]]=\"ja\",Tabel_kalender[[#This Row],[Datum]],IF(E668=\"ja\",A668,IF(E669=\"ja\",A669,IF(E670=\"ja\",A670,IF(E671=\"ja\",A671,IF(E672=\"ja\",A672,IF(E673=\"ja\",A673,IF(E674=\"ja\",A674,IF(E675=\"ja\",A675,IF(E676=\"ja\",A676,IF(E677=\"ja\",A677,IF(E678=\"ja\",A678,IF(E679=\"ja\",A679,IF(E680=\"ja\",A680,IF(E681=\"ja\",A681,IF(E682=\"ja\",A682,IF(E683=\"ja\",A683,IF(E684=\"ja\",A684,IF(A685=\"ja\",A685,\"Volgepland\")))))))))))))))))))","v":"2022-10-27"},null,null,null,null,0,null,null,0,0,null,null,0]
["2022-10-27",{"$f":"WEEKNUM(Tabel_kalender[[#This Row],[Datum]],21)","v":43},"1900-01-04",null,"ja",{"$f":"IF(Tabel_kalender[[#This Row],[Werkdag]]=\"ja\",Tabel_kalender[[#This Row],[Datum]],IF(E669=\"ja\",A669,IF(E670=\"ja\",A670,IF(E671=\"ja\",A671,IF(E672=\"ja\",A672,IF(E673=\"ja\",A673,IF(E674=\"ja\",A674,IF(E675=\"ja\",A675,IF(E676=\"ja\",A676,IF(E677=\"ja\",A677,IF(E678=\"ja\",A678,IF(E679=\"ja\",A679,IF(E680=\"ja\",A680,IF(E681=\"ja\",A681,IF(E682=\"ja\",A682,IF(E683=\"ja\",A683,IF(E684=\"ja\",A684,IF(E685=\"ja\",A685,IF(A686=\"ja\",A686,\"Volgepland\")))))))))))))))))))","v":"2022-10-27"},null,null,null,null,0,null,null,0,0,null,null,0]
["2022-10-28",{"$f":"WEEKNUM(Tabel_kalender[[#This Row],[Datum]],21)","v":43},"1900-01-05",null,"ja",{"$f":"IF(Tabel_kalender[[#This Row],[Werkdag]]=\"ja\",Tabel_kalender[[#This Row],[Datum]],IF(E670=\"ja\",A670,IF(E671=\"ja\",A671,IF(E672=\"ja\",A672,IF(E673=\"ja\",A673,IF(E674=\"ja\",A674,IF(E675=\"ja\",A675,IF(E676=\"ja\",A676,IF(E677=\"ja\",A677,IF(E678=\"ja\",A678,IF(E679=\"ja\",A679,IF(E680=\"ja\",A680,IF(E681=\"ja\",A681,IF(E682=\"ja\",A682,IF(E683=\"ja\",A683,IF(E684=\"ja\",A684,IF(E685=\"ja\",A685,IF(E686=\"ja\",A686,IF(A687=\"ja\",A687,\"Volgepland\")))))))))))))))))))","v":"2022-10-28"},null,null,null,null,0,null,null,0,0,null,null,0]
["2022-10-29",{"$f":"WEEKNUM(Tabel_kalender[[#This Row],[Datum]],21)","v":43},"1900-01-06",null,"ja",{"$f":"IF(Tabel_kalender[[#This Row],[Werkdag]]=\"ja\",Tabel_kalender[[#This Row],[Datum]],IF(E671=\"ja\",A671,IF(E672=\"ja\",A672,IF(E673=\"ja\",A673,IF(E674=\"ja\",A674,IF(E675=\"ja\",A675,IF(E676=\"ja\",A676,IF(E677=\"ja\",A677,IF(E678=\"ja\",A678,IF(E679=\"ja\",A679,IF(E680=\"ja\",A680,IF(E681=\"ja\",A681,IF(E682=\"ja\",A682,IF(E683=\"ja\",A683,IF(E684=\"ja\",A684,IF(E685=\"ja\",A685,IF(E686=\"ja\",A686,IF(E687=\"ja\",A687,IF(A688=\"ja\",A688,\"Volgepland\")))))))))))))))))))","v":"2022-10-29"},null,null,null,null,0,null,null,0,0,null,null,0]
["2022-10-30",{"$f":"WEEKNUM(Tabel_kalender[[#This Row],[Datum]],21)","v":43},"1900-01-07",null,"ja",{"$f":"IF(Tabel_kalender[[#This Row],[Werkdag]]=\"ja\",Tabel_kalender[[#This Row],[Datum]],IF(E672=\"ja\",A672,IF(E673=\"ja\",A673,IF(E674=\"ja\",A674,IF(E675=\"ja\",A675,IF(E676=\"ja\",A676,IF(E677=\"ja\",A677,IF(E678=\"ja\",A678,IF(E679=\"ja\",A679,IF(E680=\"ja\",A680,IF(E681=\"ja\",A681,IF(E682=\"ja\",A682,IF(E683=\"ja\",A683,IF(E684=\"ja\",A684,IF(E685=\"ja\",A685,IF(E686=\"ja\",A686,IF(E687=\"ja\",A687,IF(E688=\"ja\",A688,IF(A689=\"ja\",A689,\"Volgepland\")))))))))))))))))))","v":"2022-10-30"},null,null,null,null,0,null,null,0,0,null,null,0]
["2022-10-31",{"$f":"WEEKNUM(Tabel_kalender[[#This Row],[Datum]],21)","v":44},"1900-01-01",null,"ja",{"$f":"IF(Tabel_kalender[[#This Row],[Werkdag]]=\"ja\",Tabel_kalender[[#This Row],[Datum]],IF(E673=\"ja\",A673,IF(E674=\"ja\",A674,IF(E675=\"ja\",A675,IF(E676=\"ja\",A676,IF(E677=\"ja\",A677,IF(E678=\"ja\",A678,IF(E679=\"ja\",A679,IF(E680=\"ja\",A680,IF(E681=\"ja\",A681,IF(E682=\"ja\",A682,IF(E683=\"ja\",A683,IF(E684=\"ja\",A684,IF(E685=\"ja\",A685,IF(E686=\"ja\",A686,IF(E687=\"ja\",A687,IF(E688=\"ja\",A688,IF(E689=\"ja\",A689,IF(A690=\"ja\",A690,\"Volgepland\")))))))))))))))))))","v":"2022-10-31"},null,null,null,null,0,null,null,0,0,null,null,0]
["2022-11-01",{"$f":"WEEKNUM(Tabel_kalender[[#This Row],[Datum]],21)","v":44},"1900-01-02",null,"nee",{"$f":"IF(Tabel_kalender[[#This Row],[Werkdag]]=\"ja\",Tabel_kalender[[#This Row],[Datum]],IF(E674=\"ja\",A674,IF(E675=\"ja\",A675,IF(E676=\"ja\",A676,IF(E677=\"ja\",A677,IF(E678=\"ja\",A678,IF(E679=\"ja\",A679,IF(E680=\"ja\",A680,IF(E681=\"ja\",A681,IF(E682=\"ja\",A682,IF(E683=\"ja\",A683,IF(E684=\"ja\",A684,IF(E685=\"ja\",A685,IF(E686=\"ja\",A686,IF(E687=\"ja\",A687,IF(E688=\"ja\",A688,IF(E689=\"ja\",A689,IF(E690=\"ja\",A690,IF(A691=\"ja\",A691,\"Volgepland\")))))))))))))))))))","v":"2022-11-03"},null,null,null,null,0,null,null,0,0,null,null,0]
["2022-11-02",{"$f":"WEEKNUM(Tabel_kalender[[#This Row],[Datum]],21)","v":44},"1900-01-03",null,"nee",{"$f":"IF(Tabel_kalender[[#This Row],[Werkdag]]=\"ja\",Tabel_kalender[[#This Row],[Datum]],IF(E675=\"ja\",A675,IF(E676=\"ja\",A676,IF(E677=\"ja\",A677,IF(E678=\"ja\",A678,IF(E679=\"ja\",A679,IF(E680=\"ja\",A680,IF(E681=\"ja\",A681,IF(E682=\"ja\",A682,IF(E683=\"ja\",A683,IF(E684=\"ja\",A684,IF(E685=\"ja\",A685,IF(E686=\"ja\",A686,IF(E687=\"ja\",A687,IF(E688=\"ja\",A688,IF(E689=\"ja\",A689,IF(E690=\"ja\",A690,IF(E691=\"ja\",A691,IF(A692=\"ja\",A692,\"Volgepland\")))))))))))))))))))","v":"2022-11-03"},null,null,null,null,0,null,null,0,0,null,null,0]
["2022-11-03",{"$f":"WEEKNUM(Tabel_kalender[[#This Row],[Datum]],21)","v":44},"1900-01-04",null,"ja",{"$f":"IF(Tabel_kalender[[#This Row],[Werkdag]]=\"ja\",Tabel_kalender[[#This Row],[Datum]],IF(E676=\"ja\",A676,IF(E677=\"ja\",A677,IF(E678=\"ja\",A678,IF(E679=\"ja\",A679,IF(E680=\"ja\",A680,IF(E681=\"ja\",A681,IF(E682=\"ja\",A682,IF(E683=\"ja\",A683,IF(E684=\"ja\",A684,IF(E685=\"ja\",A685,IF(E686=\"ja\",A686,IF(E687=\"ja\",A687,IF(E688=\"ja\",A688,IF(E689=\"ja\",A689,IF(E690=\"ja\",A690,IF(E691=\"ja\",A691,IF(E692=\"ja\",A692,IF(A693=\"ja\",A693,\"Volgepland\")))))))))))))))))))","v":"2022-11-03"},null,null,null,null,0,null,null,0,0,null,null,0]
["2022-11-04",{"$f":"WEEKNUM(Tabel_kalender[[#This Row],[Datum]],21)","v":44},"1900-01-05",null,"ja",{"$f":"IF(Tabel_kalender[[#This Row],[Werkdag]]=\"ja\",Tabel_kalender[[#This Row],[Datum]],IF(E677=\"ja\",A677,IF(E678=\"ja\",A678,IF(E679=\"ja\",A679,IF(E680=\"ja\",A680,IF(E681=\"ja\",A681,IF(E682=\"ja\",A682,IF(E683=\"ja\",A683,IF(E684=\"ja\",A684,IF(E685=\"ja\",A685,IF(E686=\"ja\",A686,IF(E687=\"ja\",A687,IF(E688=\"ja\",A688,IF(E689=\"ja\",A689,IF(E690=\"ja\",A690,IF(E691=\"ja\",A691,IF(E692=\"ja\",A692,IF(E693=\"ja\",A693,IF(A694=\"ja\",A694,\"Volgepland\")))))))))))))))))))","v":"2022-11-04"},null,null,null,null,0,null,null,0,0,null,null,0]
["2022-11-05",{"$f":"WEEKNUM(Tabel_kalender[[#This Row],[Datum]],21)","v":44},"1900-01-06",null,"ja",{"$f":"IF(Tabel_kalender[[#This Row],[Werkdag]]=\"ja\",Tabel_kalender[[#This Row],[Datum]],IF(E678=\"ja\",A678,IF(E679=\"ja\",A679,IF(E680=\"ja\",A680,IF(E681=\"ja\",A681,IF(E682=\"ja\",A682,IF(E683=\"ja\",A683,IF(E684=\"ja\",A684,IF(E685=\"ja\",A685,IF(E686=\"ja\",A686,IF(E687=\"ja\",A687,IF(E688=\"ja\",A688,IF(E689=\"ja\",A689,IF(E690=\"ja\",A690,IF(E691=\"ja\",A691,IF(E692=\"ja\",A692,IF(E693=\"ja\",A693,IF(E694=\"ja\",A694,IF(A695=\"ja\",A695,\"Volgepland\")))))))))))))))))))","v":"2022-11-05"},null,null,null,null,0,null,null,0,0,null,null,0]
["2022-11-06",{"$f":"WEEKNUM(Tabel_kalender[[#This Row],[Datum]],21)","v":44},"1900-01-07",null,"ja",{"$f":"IF(Tabel_kalender[[#This Row],[Werkdag]]=\"ja\",Tabel_kalender[[#This Row],[Datum]],IF(E679=\"ja\",A679,IF(E680=\"ja\",A680,IF(E681=\"ja\",A681,IF(E682=\"ja\",A682,IF(E683=\"ja\",A683,IF(E684=\"ja\",A684,IF(E685=\"ja\",A685,IF(E686=\"ja\",A686,IF(E687=\"ja\",A687,IF(E688=\"ja\",A688,IF(E689=\"ja\",A689,IF(E690=\"ja\",A690,IF(E691=\"ja\",A691,IF(E692=\"ja\",A692,IF(E693=\"ja\",A693,IF(E694=\"ja\",A694,IF(E695=\"ja\",A695,IF(A696=\"ja\",A696,\"Volgepland\")))))))))))))))))))","v":"2022-11-06"},null,null,null,null,0,null,null,0,0,null,null,0]
["2022-11-07",{"$f":"WEEKNUM(Tabel_kalender[[#This Row],[Datum]],21)","v":45},"1900-01-01",null,"ja",{"$f":"IF(Tabel_kalender[[#This Row],[Werkdag]]=\"ja\",Tabel_kalender[[#This Row],[Datum]],IF(E680=\"ja\",A680,IF(E681=\"ja\",A681,IF(E682=\"ja\",A682,IF(E683=\"ja\",A683,IF(E684=\"ja\",A684,IF(E685=\"ja\",A685,IF(E686=\"ja\",A686,IF(E687=\"ja\",A687,IF(E688=\"ja\",A688,IF(E689=\"ja\",A689,IF(E690=\"ja\",A690,IF(E691=\"ja\",A691,IF(E692=\"ja\",A692,IF(E693=\"ja\",A693,IF(E694=\"ja\",A694,IF(E695=\"ja\",A695,IF(E696=\"ja\",A696,IF(A697=\"ja\",A697,\"Volgepland\")))))))))))))))))))","v":"2022-11-07"},null,null,null,null,0,null,null,0,0,null,null,0]
["2022-11-08",{"$f":"WEEKNUM(Tabel_kalender[[#This Row],[Datum]],21)","v":45},"1900-01-02",null,"nee",{"$f":"IF(Tabel_kalender[[#This Row],[Werkdag]]=\"ja\",Tabel_kalender[[#This Row],[Datum]],IF(E681=\"ja\",A681,IF(E682=\"ja\",A682,IF(E683=\"ja\",A683,IF(E684=\"ja\",A684,IF(E685=\"ja\",A685,IF(E686=\"ja\",A686,IF(E687=\"ja\",A687,IF(E688=\"ja\",A688,IF(E689=\"ja\",A689,IF(E690=\"ja\",A690,IF(E691=\"ja\",A691,IF(E692=\"ja\",A692,IF(E693=\"ja\",A693,IF(E694=\"ja\",A694,IF(E695=\"ja\",A695,IF(E696=\"ja\",A696,IF(E697=\"ja\",A697,IF(A698=\"ja\",A698,\"Volgepland\")))))))))))))))))))","v":"2022-11-10"},null,null,null,null,0,null,null,0,0,null,null,0]
["2022-11-09",{"$f":"WEEKNUM(Tabel_kalender[[#This Row],[Datum]],21)","v":45},"1900-01-03",null,"nee",{"$f":"IF(Tabel_kalender[[#This Row],[Werkdag]]=\"ja\",Tabel_kalender[[#This Row],[Datum]],IF(E682=\"ja\",A682,IF(E683=\"ja\",A683,IF(E684=\"ja\",A684,IF(E685=\"ja\",A685,IF(E686=\"ja\",A686,IF(E687=\"ja\",A687,IF(E688=\"ja\",A688,IF(E689=\"ja\",A689,IF(E690=\"ja\",A690,IF(E691=\"ja\",A691,IF(E692=\"ja\",A692,IF(E693=\"ja\",A693,IF(E694=\"ja\",A694,IF(E695=\"ja\",A695,IF(E696=\"ja\",A696,IF(E697=\"ja\",A697,IF(E698=\"ja\",A698,IF(A699=\"ja\",A699,\"Volgepland\")))))))))))))))))))","v":"2022-11-10"},null,null,null,null,0,null,null,0,0,null,null,0]
["2022-11-10",{"$f":"WEEKNUM(Tabel_kalender[[#This Row],[Datum]],21)","v":45},"1900-01-04",null,"ja",{"$f":"IF(Tabel_kalender[[#This Row],[Werkdag]]=\"ja\",Tabel_kalender[[#This Row],[Datum]],IF(E683=\"ja\",A683,IF(E684=\"ja\",A684,IF(E685=\"ja\",A685,IF(E686=\"ja\",A686,IF(E687=\"ja\",A687,IF(E688=\"ja\",A688,IF(E689=\"ja\",A689,IF(E690=\"ja\",A690,IF(E691=\"ja\",A691,IF(E692=\"ja\",A692,IF(E693=\"ja\",A693,IF(E694=\"ja\",A694,IF(E695=\"ja\",A695,IF(E696=\"ja\",A696,IF(E697=\"ja\",A697,IF(E698=\"ja\",A698,IF(E699=\"ja\",A699,IF(A700=\"ja\",A700,\"Volgepland\")))))))))))))))))))","v":"2022-11-10"},null,null,null,null,0,null,null,0,0,null,null,0]
["2022-11-11",{"$f":"WEEKNUM(Tabel_kalender[[#This Row],[Datum]],21)","v":45},"1900-01-05",null,"ja",{"$f":"IF(Tabel_kalender[[#This Row],[Werkdag]]=\"ja\",Tabel_kalender[[#This Row],[Datum]],IF(E684=\"ja\",A684,IF(E685=\"ja\",A685,IF(E686=\"ja\",A686,IF(E687=\"ja\",A687,IF(E688=\"ja\",A688,IF(E689=\"ja\",A689,IF(E690=\"ja\",A690,IF(E691=\"ja\",A691,IF(E692=\"ja\",A692,IF(E693=\"ja\",A693,IF(E694=\"ja\",A694,IF(E695=\"ja\",A695,IF(E696=\"ja\",A696,IF(E697=\"ja\",A697,IF(E698=\"ja\",A698,IF(E699=\"ja\",A699,IF(E700=\"ja\",A700,IF(A701=\"ja\",A701,\"Volgepland\")))))))))))))))))))","v":"2022-11-11"},null,null,null,null,0,null,null,0,0,null,null,0]
["2022-11-12",{"$f":"WEEKNUM(Tabel_kalender[[#This Row],[Datum]],21)","v":45},"1900-01-06",null,"ja",{"$f":"IF(Tabel_kalender[[#This Row],[Werkdag]]=\"ja\",Tabel_kalender[[#This Row],[Datum]],IF(E685=\"ja\",A685,IF(E686=\"ja\",A686,IF(E687=\"ja\",A687,IF(E688=\"ja\",A688,IF(E689=\"ja\",A689,IF(E690=\"ja\",A690,IF(E691=\"ja\",A691,IF(E692=\"ja\",A692,IF(E693=\"ja\",A693,IF(E694=\"ja\",A694,IF(E695=\"ja\",A695,IF(E696=\"ja\",A696,IF(E697=\"ja\",A697,IF(E698=\"ja\",A698,IF(E699=\"ja\",A699,IF(E700=\"ja\",A700,IF(E701=\"ja\",A701,IF(A702=\"ja\",A702,\"Volgepland\")))))))))))))))))))","v":"2022-11-12"},null,null,null,null,0,null,null,0,0,null,null,0]
["2022-11-13",{"$f":"WEEKNUM(Tabel_kalender[[#This Row],[Datum]],21)","v":45},"1900-01-07",null,"ja",{"$f":"IF(Tabel_kalender[[#This Row],[Werkdag]]=\"ja\",Tabel_kalender[[#This Row],[Datum]],IF(E686=\"ja\",A686,IF(E687=\"ja\",A687,IF(E688=\"ja\",A688,IF(E689=\"ja\",A689,IF(E690=\"ja\",A690,IF(E691=\"ja\",A691,IF(E692=\"ja\",A692,IF(E693=\"ja\",A693,IF(E694=\"ja\",A694,IF(E695=\"ja\",A695,IF(E696=\"ja\",A696,IF(E697=\"ja\",A697,IF(E698=\"ja\",A698,IF(E699=\"ja\",A699,IF(E700=\"ja\",A700,IF(E701=\"ja\",A701,IF(E702=\"ja\",A702,IF(A703=\"ja\",A703,\"Volgepland\")))))))))))))))))))","v":"2022-11-13"},null,null,null,null,0,null,null,0,0,null,null,0]
["2022-11-14",{"$f":"WEEKNUM(Tabel_kalender[[#This Row],[Datum]],21)","v":46},"1900-01-01",null,"ja",{"$f":"IF(Tabel_kalender[[#This Row],[Werkdag]]=\"ja\",Tabel_kalender[[#This Row],[Datum]],IF(E687=\"ja\",A687,IF(E688=\"ja\",A688,IF(E689=\"ja\",A689,IF(E690=\"ja\",A690,IF(E691=\"ja\",A691,IF(E692=\"ja\",A692,IF(E693=\"ja\",A693,IF(E694=\"ja\",A694,IF(E695=\"ja\",A695,IF(E696=\"ja\",A696,IF(E697=\"ja\",A697,IF(E698=\"ja\",A698,IF(E699=\"ja\",A699,IF(E700=\"ja\",A700,IF(E701=\"ja\",A701,IF(E702=\"ja\",A702,IF(E703=\"ja\",A703,IF(A704=\"ja\",A704,\"Volgepland\")))))))))))))))))))","v":"2022-11-14"},null,null,null,null,0,null,null,0,0,null,null,0]
["2022-11-15",{"$f":"WEEKNUM(Tabel_kalender[[#This Row],[Datum]],21)","v":46},"1900-01-02",null,"nee",{"$f":"IF(Tabel_kalender[[#This Row],[Werkdag]]=\"ja\",Tabel_kalender[[#This Row],[Datum]],IF(E688=\"ja\",A688,IF(E689=\"ja\",A689,IF(E690=\"ja\",A690,IF(E691=\"ja\",A691,IF(E692=\"ja\",A692,IF(E693=\"ja\",A693,IF(E694=\"ja\",A694,IF(E695=\"ja\",A695,IF(E696=\"ja\",A696,IF(E697=\"ja\",A697,IF(E698=\"ja\",A698,IF(E699=\"ja\",A699,IF(E700=\"ja\",A700,IF(E701=\"ja\",A701,IF(E702=\"ja\",A702,IF(E703=\"ja\",A703,IF(E704=\"ja\",A704,IF(A705=\"ja\",A705,\"Volgepland\")))))))))))))))))))","v":"2022-11-17"},null,null,null,null,0,null,null,0,0,null,null,0]
["2022-11-16",{"$f":"WEEKNUM(Tabel_kalender[[#This Row],[Datum]],21)","v":46},"1900-01-03",null,"nee",{"$f":"IF(Tabel_kalender[[#This Row],[Werkdag]]=\"ja\",Tabel_kalender[[#This Row],[Datum]],IF(E689=\"ja\",A689,IF(E690=\"ja\",A690,IF(E691=\"ja\",A691,IF(E692=\"ja\",A692,IF(E693=\"ja\",A693,IF(E694=\"ja\",A694,IF(E695=\"ja\",A695,IF(E696=\"ja\",A696,IF(E697=\"ja\",A697,IF(E698=\"ja\",A698,IF(E699=\"ja\",A699,IF(E700=\"ja\",A700,IF(E701=\"ja\",A701,IF(E702=\"ja\",A702,IF(E703=\"ja\",A703,IF(E704=\"ja\",A704,IF(E705=\"ja\",A705,IF(A706=\"ja\",A706,\"Volgepland\")))))))))))))))))))","v":"2022-11-17"},null,null,null,null,0,null,null,0,0,null,null,0]
["2022-11-17",{"$f":"WEEKNUM(Tabel_kalender[[#This Row],[Datum]],21)","v":46},"1900-01-04",null,"ja",{"$f":"IF(Tabel_kalender[[#This Row],[Werkdag]]=\"ja\",Tabel_kalender[[#This Row],[Datum]],IF(E690=\"ja\",A690,IF(E691=\"ja\",A691,IF(E692=\"ja\",A692,IF(E693=\"ja\",A693,IF(E694=\"ja\",A694,IF(E695=\"ja\",A695,IF(E696=\"ja\",A696,IF(E697=\"ja\",A697,IF(E698=\"ja\",A698,IF(E699=\"ja\",A699,IF(E700=\"ja\",A700,IF(E701=\"ja\",A701,IF(E702=\"ja\",A702,IF(E703=\"ja\",A703,IF(E704=\"ja\",A704,IF(E705=\"ja\",A705,IF(E706=\"ja\",A706,IF(A707=\"ja\",A707,\"Volgepland\")))))))))))))))))))","v":"2022-11-17"},null,null,null,null,0,null,null,0,0,null,null,0]
["2022-11-18",{"$f":"WEEKNUM(Tabel_kalender[[#This Row],[Datum]],21)","v":46},"1900-01-05",null,"ja",{"$f":"IF(Tabel_kalender[[#This Row],[Werkdag]]=\"ja\",Tabel_kalender[[#This Row],[Datum]],IF(E691=\"ja\",A691,IF(E692=\"ja\",A692,IF(E693=\"ja\",A693,IF(E694=\"ja\",A694,IF(E695=\"ja\",A695,IF(E696=\"ja\",A696,IF(E697=\"ja\",A697,IF(E698=\"ja\",A698,IF(E699=\"ja\",A699,IF(E700=\"ja\",A700,IF(E701=\"ja\",A701,IF(E702=\"ja\",A702,IF(E703=\"ja\",A703,IF(E704=\"ja\",A704,IF(E705=\"ja\",A705,IF(E706=\"ja\",A706,IF(E707=\"ja\",A707,IF(A708=\"ja\",A708,\"Volgepland\")))))))))))))))))))","v":"2022-11-18"},null,null,null,null,0,null,null,0,0,null,null,0]
["2022-11-19",{"$f":"WEEKNUM(Tabel_kalender[[#This Row],[Datum]],21)","v":46},"1900-01-06",null,"ja",{"$f":"IF(Tabel_kalender[[#This Row],[Werkdag]]=\"ja\",Tabel_kalender[[#This Row],[Datum]],IF(E692=\"ja\",A692,IF(E693=\"ja\",A693,IF(E694=\"ja\",A694,IF(E695=\"ja\",A695,IF(E696=\"ja\",A696,IF(E697=\"ja\",A697,IF(E698=\"ja\",A698,IF(E699=\"ja\",A699,IF(E700=\"ja\",A700,IF(E701=\"ja\",A701,IF(E702=\"ja\",A702,IF(E703=\"ja\",A703,IF(E704=\"ja\",A704,IF(E705=\"ja\",A705,IF(E706=\"ja\",A706,IF(E707=\"ja\",A707,IF(E708=\"ja\",A708,IF(A709=\"ja\",A709,\"Volgepland\")))))))))))))))))))","v":"2022-11-19"},null,null,null,null,0,null,null,0,0,null,null,0]
["2022-11-20",{"$f":"WEEKNUM(Tabel_kalender[[#This Row],[Datum]],21)","v":46},"1900-01-07",null,"ja",{"$f":"IF(Tabel_kalender[[#This Row],[Werkdag]]=\"ja\",Tabel_kalender[[#This Row],[Datum]],IF(E693=\"ja\",A693,IF(E694=\"ja\",A694,IF(E695=\"ja\",A695,IF(E696=\"ja\",A696,IF(E697=\"ja\",A697,IF(E698=\"ja\",A698,IF(E699=\"ja\",A699,IF(E700=\"ja\",A700,IF(E701=\"ja\",A701,IF(E702=\"ja\",A702,IF(E703=\"ja\",A703,IF(E704=\"ja\",A704,IF(E705=\"ja\",A705,IF(E706=\"ja\",A706,IF(E707=\"ja\",A707,IF(E708=\"ja\",A708,IF(E709=\"ja\",A709,IF(A710=\"ja\",A710,\"Volgepland\")))))))))))))))))))","v":"2022-11-20"},null,null,null,null,0,null,null,0,0,null,null,0]
["2022-11-21",{"$f":"WEEKNUM(Tabel_kalender[[#This Row],[Datum]],21)","v":47},"1900-01-01",null,"ja",{"$f":"IF(Tabel_kalender[[#This Row],[Werkdag]]=\"ja\",Tabel_kalender[[#This Row],[Datum]],IF(E694=\"ja\",A694,IF(E695=\"ja\",A695,IF(E696=\"ja\",A696,IF(E697=\"ja\",A697,IF(E698=\"ja\",A698,IF(E699=\"ja\",A699,IF(E700=\"ja\",A700,IF(E701=\"ja\",A701,IF(E702=\"ja\",A702,IF(E703=\"ja\",A703,IF(E704=\"ja\",A704,IF(E705=\"ja\",A705,IF(E706=\"ja\",A706,IF(E707=\"ja\",A707,IF(E708=\"ja\",A708,IF(E709=\"ja\",A709,IF(E710=\"ja\",A710,IF(A711=\"ja\",A711,\"Volgepland\")))))))))))))))))))","v":"2022-11-21"},null,null,null,null,0,null,null,0,0,null,null,0]
["2022-11-22",{"$f":"WEEKNUM(Tabel_kalender[[#This Row],[Datum]],21)","v":47},"1900-01-02",null,"nee",{"$f":"IF(Tabel_kalender[[#This Row],[Werkdag]]=\"ja\",Tabel_kalender[[#This Row],[Datum]],IF(E695=\"ja\",A695,IF(E696=\"ja\",A696,IF(E697=\"ja\",A697,IF(E698=\"ja\",A698,IF(E699=\"ja\",A699,IF(E700=\"ja\",A700,IF(E701=\"ja\",A701,IF(E702=\"ja\",A702,IF(E703=\"ja\",A703,IF(E704=\"ja\",A704,IF(E705=\"ja\",A705,IF(E706=\"ja\",A706,IF(E707=\"ja\",A707,IF(E708=\"ja\",A708,IF(E709=\"ja\",A709,IF(E710=\"ja\",A710,IF(E711=\"ja\",A711,IF(A712=\"ja\",A712,\"Volgepland\")))))))))))))))))))","v":"2022-11-24"},null,null,null,null,0,null,null,0,0,null,null,0]
["2022-11-23",{"$f":"WEEKNUM(Tabel_kalender[[#This Row],[Datum]],21)","v":47},"1900-01-03",null,"nee",{"$f":"IF(Tabel_kalender[[#This Row],[Werkdag]]=\"ja\",Tabel_kalender[[#This Row],[Datum]],IF(E696=\"ja\",A696,IF(E697=\"ja\",A697,IF(E698=\"ja\",A698,IF(E699=\"ja\",A699,IF(E700=\"ja\",A700,IF(E701=\"ja\",A701,IF(E702=\"ja\",A702,IF(E703=\"ja\",A703,IF(E704=\"ja\",A704,IF(E705=\"ja\",A705,IF(E706=\"ja\",A706,IF(E707=\"ja\",A707,IF(E708=\"ja\",A708,IF(E709=\"ja\",A709,IF(E710=\"ja\",A710,IF(E711=\"ja\",A711,IF(E712=\"ja\",A712,IF(A713=\"ja\",A713,\"Volgepland\")))))))))))))))))))","v":"2022-11-24"},null,null,null,null,0,null,null,0,0,null,null,0]
["2022-11-24",{"$f":"WEEKNUM(Tabel_kalender[[#This Row],[Datum]],21)","v":47},"1900-01-04",null,"ja",{"$f":"IF(Tabel_kalender[[#This Row],[Werkdag]]=\"ja\",Tabel_kalender[[#This Row],[Datum]],IF(E697=\"ja\",A697,IF(E698=\"ja\",A698,IF(E699=\"ja\",A699,IF(E700=\"ja\",A700,IF(E701=\"ja\",A701,IF(E702=\"ja\",A702,IF(E703=\"ja\",A703,IF(E704=\"ja\",A704,IF(E705=\"ja\",A705,IF(E706=\"ja\",A706,IF(E707=\"ja\",A707,IF(E708=\"ja\",A708,IF(E709=\"ja\",A709,IF(E710=\"ja\",A710,IF(E711=\"ja\",A711,IF(E712=\"ja\",A712,IF(E713=\"ja\",A713,IF(A714=\"ja\",A714,\"Volgepland\")))))))))))))))))))","v":"2022-11-24"},null,null,null,null,0,null,null,0,0,null,null,0]
["2022-11-25",{"$f":"WEEKNUM(Tabel_kalender[[#This Row],[Datum]],21)","v":47},"1900-01-05",null,"ja",{"$f":"IF(Tabel_kalender[[#This Row],[Werkdag]]=\"ja\",Tabel_kalender[[#This Row],[Datum]],IF(E698=\"ja\",A698,IF(E699=\"ja\",A699,IF(E700=\"ja\",A700,IF(E701=\"ja\",A701,IF(E702=\"ja\",A702,IF(E703=\"ja\",A703,IF(E704=\"ja\",A704,IF(E705=\"ja\",A705,IF(E706=\"ja\",A706,IF(E707=\"ja\",A707,IF(E708=\"ja\",A708,IF(E709=\"ja\",A709,IF(E710=\"ja\",A710,IF(E711=\"ja\",A711,IF(E712=\"ja\",A712,IF(E713=\"ja\",A713,IF(E714=\"ja\",A714,IF(A715=\"ja\",A715,\"Volgepland\")))))))))))))))))))","v":"2022-11-25"},null,null,null,null,0,null,null,0,0,null,null,0]
["2022-11-26",{"$f":"WEEKNUM(Tabel_kalender[[#This Row],[Datum]],21)","v":47},"1900-01-06",null,"ja",{"$f":"IF(Tabel_kalender[[#This Row],[Werkdag]]=\"ja\",Tabel_kalender[[#This Row],[Datum]],IF(E699=\"ja\",A699,IF(E700=\"ja\",A700,IF(E701=\"ja\",A701,IF(E702=\"ja\",A702,IF(E703=\"ja\",A703,IF(E704=\"ja\",A704,IF(E705=\"ja\",A705,IF(E706=\"ja\",A706,IF(E707=\"ja\",A707,IF(E708=\"ja\",A708,IF(E709=\"ja\",A709,IF(E710=\"ja\",A710,IF(E711=\"ja\",A711,IF(E712=\"ja\",A712,IF(E713=\"ja\",A713,IF(E714=\"ja\",A714,IF(E715=\"ja\",A715,IF(A716=\"ja\",A716,\"Volgepland\")))))))))))))))))))","v":"2022-11-26"},null,null,null,null,0,null,null,0,0,null,null,0]
["2022-11-27",{"$f":"WEEKNUM(Tabel_kalender[[#This Row],[Datum]],21)","v":47},"1900-01-07",null,"ja",{"$f":"IF(Tabel_kalender[[#This Row],[Werkdag]]=\"ja\",Tabel_kalender[[#This Row],[Datum]],IF(E700=\"ja\",A700,IF(E701=\"ja\",A701,IF(E702=\"ja\",A702,IF(E703=\"ja\",A703,IF(E704=\"ja\",A704,IF(E705=\"ja\",A705,IF(E706=\"ja\",A706,IF(E707=\"ja\",A707,IF(E708=\"ja\",A708,IF(E709=\"ja\",A709,IF(E710=\"ja\",A710,IF(E711=\"ja\",A711,IF(E712=\"ja\",A712,IF(E713=\"ja\",A713,IF(E714=\"ja\",A714,IF(E715=\"ja\",A715,IF(E716=\"ja\",A716,IF(A717=\"ja\",A717,\"Volgepland\")))))))))))))))))))","v":"2022-11-27"},null,null,null,null,0,null,null,0,0,null,null,0]
["2022-11-28",{"$f":"WEEKNUM(Tabel_kalender[[#This Row],[Datum]],21)","v":48},"1900-01-01",null,"ja",{"$f":"IF(Tabel_kalender[[#This Row],[Werkdag]]=\"ja\",Tabel_kalender[[#This Row],[Datum]],IF(E701=\"ja\",A701,IF(E702=\"ja\",A702,IF(E703=\"ja\",A703,IF(E704=\"ja\",A704,IF(E705=\"ja\",A705,IF(E706=\"ja\",A706,IF(E707=\"ja\",A707,IF(E708=\"ja\",A708,IF(E709=\"ja\",A709,IF(E710=\"ja\",A710,IF(E711=\"ja\",A711,IF(E712=\"ja\",A712,IF(E713=\"ja\",A713,IF(E714=\"ja\",A714,IF(E715=\"ja\",A715,IF(E716=\"ja\",A716,IF(E717=\"ja\",A717,IF(A718=\"ja\",A718,\"Volgepland\")))))))))))))))))))","v":"2022-11-28"},null,null,null,null,0,null,null,0,0,null,null,0]
["2022-11-29",{"$f":"WEEKNUM(Tabel_kalender[[#This Row],[Datum]],21)","v":48},"1900-01-02",null,"nee",{"$f":"IF(Tabel_kalender[[#This Row],[Werkdag]]=\"ja\",Tabel_kalender[[#This Row],[Datum]],IF(E702=\"ja\",A702,IF(E703=\"ja\",A703,IF(E704=\"ja\",A704,IF(E705=\"ja\",A705,IF(E706=\"ja\",A706,IF(E707=\"ja\",A707,IF(E708=\"ja\",A708,IF(E709=\"ja\",A709,IF(E710=\"ja\",A710,IF(E711=\"ja\",A711,IF(E712=\"ja\",A712,IF(E713=\"ja\",A713,IF(E714=\"ja\",A714,IF(E715=\"ja\",A715,IF(E716=\"ja\",A716,IF(E717=\"ja\",A717,IF(E718=\"ja\",A718,IF(A719=\"ja\",A719,\"Volgepland\")))))))))))))))))))","v":"2022-12-01"},null,null,null,null,0,null,null,0,0,null,null,0]
["2022-11-30",{"$f":"WEEKNUM(Tabel_kalender[[#This Row],[Datum]],21)","v":48},"1900-01-03",null,"nee",{"$f":"IF(Tabel_kalender[[#This Row],[Werkdag]]=\"ja\",Tabel_kalender[[#This Row],[Datum]],IF(E703=\"ja\",A703,IF(E704=\"ja\",A704,IF(E705=\"ja\",A705,IF(E706=\"ja\",A706,IF(E707=\"ja\",A707,IF(E708=\"ja\",A708,IF(E709=\"ja\",A709,IF(E710=\"ja\",A710,IF(E711=\"ja\",A711,IF(E712=\"ja\",A712,IF(E713=\"ja\",A713,IF(E714=\"ja\",A714,IF(E715=\"ja\",A715,IF(E716=\"ja\",A716,IF(E717=\"ja\",A717,IF(E718=\"ja\",A718,IF(E719=\"ja\",A719,IF(A720=\"ja\",A720,\"Volgepland\")))))))))))))))))))","v":"2022-12-01"},null,null,null,null,0,null,null,0,0,null,null,0]
["2022-12-01",{"$f":"WEEKNUM(Tabel_kalender[[#This Row],[Datum]],21)","v":48},"1900-01-04",null,"ja",{"$f":"IF(Tabel_kalender[[#This Row],[Werkdag]]=\"ja\",Tabel_kalender[[#This Row],[Datum]],IF(E704=\"ja\",A704,IF(E705=\"ja\",A705,IF(E706=\"ja\",A706,IF(E707=\"ja\",A707,IF(E708=\"ja\",A708,IF(E709=\"ja\",A709,IF(E710=\"ja\",A710,IF(E711=\"ja\",A711,IF(E712=\"ja\",A712,IF(E713=\"ja\",A713,IF(E714=\"ja\",A714,IF(E715=\"ja\",A715,IF(E716=\"ja\",A716,IF(E717=\"ja\",A717,IF(E718=\"ja\",A718,IF(E719=\"ja\",A719,IF(E720=\"ja\",A720,IF(A721=\"ja\",A721,\"Volgepland\")))))))))))))))))))","v":"2022-12-01"},null,null,null,null,0,null,null,0,0,null,null,0]
["2022-12-02",{"$f":"WEEKNUM(Tabel_kalender[[#This Row],[Datum]],21)","v":48},"1900-01-05",null,"ja",{"$f":"IF(Tabel_kalender[[#This Row],[Werkdag]]=\"ja\",Tabel_kalender[[#This Row],[Datum]],IF(E705=\"ja\",A705,IF(E706=\"ja\",A706,IF(E707=\"ja\",A707,IF(E708=\"ja\",A708,IF(E709=\"ja\",A709,IF(E710=\"ja\",A710,IF(E711=\"ja\",A711,IF(E712=\"ja\",A712,IF(E713=\"ja\",A713,IF(E714=\"ja\",A714,IF(E715=\"ja\",A715,IF(E716=\"ja\",A716,IF(E717=\"ja\",A717,IF(E718=\"ja\",A718,IF(E719=\"ja\",A719,IF(E720=\"ja\",A720,IF(E721=\"ja\",A721,IF(A722=\"ja\",A722,\"Volgepland\")))))))))))))))))))","v":"2022-12-02"},null,null,null,null,0,null,null,0,0,null,null,0]
["2022-12-03",{"$f":"WEEKNUM(Tabel_kalender[[#This Row],[Datum]],21)","v":48},"1900-01-06",null,"ja",{"$f":"IF(Tabel_kalender[[#This Row],[Werkdag]]=\"ja\",Tabel_kalender[[#This Row],[Datum]],IF(E706=\"ja\",A706,IF(E707=\"ja\",A707,IF(E708=\"ja\",A708,IF(E709=\"ja\",A709,IF(E710=\"ja\",A710,IF(E711=\"ja\",A711,IF(E712=\"ja\",A712,IF(E713=\"ja\",A713,IF(E714=\"ja\",A714,IF(E715=\"ja\",A715,IF(E716=\"ja\",A716,IF(E717=\"ja\",A717,IF(E718=\"ja\",A718,IF(E719=\"ja\",A719,IF(E720=\"ja\",A720,IF(E721=\"ja\",A721,IF(E722=\"ja\",A722,IF(A723=\"ja\",A723,\"Volgepland\")))))))))))))))))))","v":"2022-12-03"},null,null,null,null,0,null,null,0,0,null,null,0]
["2022-12-04",{"$f":"WEEKNUM(Tabel_kalender[[#This Row],[Datum]],21)","v":48},"1900-01-07",null,"ja",{"$f":"IF(Tabel_kalender[[#This Row],[Werkdag]]=\"ja\",Tabel_kalender[[#This Row],[Datum]],IF(E707=\"ja\",A707,IF(E708=\"ja\",A708,IF(E709=\"ja\",A709,IF(E710=\"ja\",A710,IF(E711=\"ja\",A711,IF(E712=\"ja\",A712,IF(E713=\"ja\",A713,IF(E714=\"ja\",A714,IF(E715=\"ja\",A715,IF(E716=\"ja\",A716,IF(E717=\"ja\",A717,IF(E718=\"ja\",A718,IF(E719=\"ja\",A719,IF(E720=\"ja\",A720,IF(E721=\"ja\",A721,IF(E722=\"ja\",A722,IF(E723=\"ja\",A723,IF(A724=\"ja\",A724,\"Volgepland\")))))))))))))))))))","v":"2022-12-04"},null,null,null,null,0,null,null,0,0,null,null,0]
["2022-12-05",{"$f":"WEEKNUM(Tabel_kalender[[#This Row],[Datum]],21)","v":49},"1900-01-01",null,"ja",{"$f":"IF(Tabel_kalender[[#This Row],[Werkdag]]=\"ja\",Tabel_kalender[[#This Row],[Datum]],IF(E708=\"ja\",A708,IF(E709=\"ja\",A709,IF(E710=\"ja\",A710,IF(E711=\"ja\",A711,IF(E712=\"ja\",A712,IF(E713=\"ja\",A713,IF(E714=\"ja\",A714,IF(E715=\"ja\",A715,IF(E716=\"ja\",A716,IF(E717=\"ja\",A717,IF(E718=\"ja\",A718,IF(E719=\"ja\",A719,IF(E720=\"ja\",A720,IF(E721=\"ja\",A721,IF(E722=\"ja\",A722,IF(E723=\"ja\",A723,IF(E724=\"ja\",A724,IF(A725=\"ja\",A725,\"Volgepland\")))))))))))))))))))","v":"2022-12-05"},null,null,null,null,0,null,null,0,0,null,null,0]
["2022-12-06",{"$f":"WEEKNUM(Tabel_kalender[[#This Row],[Datum]],21)","v":49},"1900-01-02",null,"nee",{"$f":"IF(Tabel_kalender[[#This Row],[Werkdag]]=\"ja\",Tabel_kalender[[#This Row],[Datum]],IF(E709=\"ja\",A709,IF(E710=\"ja\",A710,IF(E711=\"ja\",A711,IF(E712=\"ja\",A712,IF(E713=\"ja\",A713,IF(E714=\"ja\",A714,IF(E715=\"ja\",A715,IF(E716=\"ja\",A716,IF(E717=\"ja\",A717,IF(E718=\"ja\",A718,IF(E719=\"ja\",A719,IF(E720=\"ja\",A720,IF(E721=\"ja\",A721,IF(E722=\"ja\",A722,IF(E723=\"ja\",A723,IF(E724=\"ja\",A724,IF(E725=\"ja\",A725,IF(A726=\"ja\",A726,\"Volgepland\")))))))))))))))))))","v":"2022-12-08"},null,null,null,null,0,null,null,{"$f":"IF(L708>0,L708-K708,)-M708","v":0},{"$f":"P707","v":0},null,null,{"$f":"IF(P708>0,P708-O708,)-Q708","v":0}]
["2022-12-07",{"$f":"WEEKNUM(Tabel_kalender[[#This Row],[Datum]],21)","v":49},{"$f":"WEEKDAY(A709,2)","v":"1900-01-03"},null,"nee",{"$f":"IF(Tabel_kalender[[#This Row],[Werkdag]]=\"ja\",Tabel_kalender[[#This Row],[Datum]],IF(E710=\"ja\",A710,IF(E711=\"ja\",A711,IF(E712=\"ja\",A712,IF(E713=\"ja\",A713,IF(E714=\"ja\",A714,IF(E715=\"ja\",A715,IF(E716=\"ja\",A716,IF(E717=\"ja\",A717,IF(E718=\"ja\",A718,IF(E719=\"ja\",A719,IF(E720=\"ja\",A720,IF(E721=\"ja\",A721,IF(E722=\"ja\",A722,IF(E723=\"ja\",A723,IF(E724=\"ja\",A724,IF(E725=\"ja\",A725,IF(E726=\"ja\",A726,IF(A727=\"ja\",A727,\"Volgepland\")))))))))))))))))))","v":"2022-12-08"},null,null,null,null,{"$f":"L708","v":0},null,null,0,0,null,null,0]
[{"$f":"A709+1","v":"2022-12-08"},{"$f":"WEEKNUM(Tabel_kalender[[#This Row],[Datum]],21)","v":49},"1900-01-04",null,"ja",{"$f":"IF(Tabel_kalender[[#This Row],[Werkdag]]=\"ja\",Tabel_kalender[[#This Row],[Datum]],IF(E711=\"ja\",A711,IF(E712=\"ja\",A712,IF(E713=\"ja\",A713,IF(E714=\"ja\",A714,IF(E715=\"ja\",A715,IF(E716=\"ja\",A716,IF(E717=\"ja\",A717,IF(E718=\"ja\",A718,IF(E719=\"ja\",A719,IF(E720=\"ja\",A720,IF(E721=\"ja\",A721,IF(E722=\"ja\",A722,IF(E723=\"ja\",A723,IF(E724=\"ja\",A724,IF(E725=\"ja\",A725,IF(E726=\"ja\",A726,IF(E727=\"ja\",A727,IF(A728=\"ja\",A728,\"Volgepland\")))))))))))))))))))","v":"2022-12-08"},null,null,null,null,0,null,null,0,0,null,null,0]
["2022-12-09",{"$f":"WEEKNUM(Tabel_kalender[[#This Row],[Datum]],21)","v":49},"1900-01-05",null,"ja",{"$f":"IF(Tabel_kalender[[#This Row],[Werkdag]]=\"ja\",Tabel_kalender[[#This Row],[Datum]],IF(E712=\"ja\",A712,IF(E713=\"ja\",A713,IF(E714=\"ja\",A714,IF(E715=\"ja\",A715,IF(E716=\"ja\",A716,IF(E717=\"ja\",A717,IF(E718=\"ja\",A718,IF(E719=\"ja\",A719,IF(E720=\"ja\",A720,IF(E721=\"ja\",A721,IF(E722=\"ja\",A722,IF(E723=\"ja\",A723,IF(E724=\"ja\",A724,IF(E725=\"ja\",A725,IF(E726=\"ja\",A726,IF(E727=\"ja\",A727,IF(E728=\"ja\",A728,IF(A729=\"ja\",A729,\"Volgepland\")))))))))))))))))))","v":"2022-12-09"},null,null,null,null,0,null,null,0,0,null,null,0]
["2022-12-10",{"$f":"WEEKNUM(Tabel_kalender[[#This Row],[Datum]],21)","v":49},"1900-01-06",null,"ja",{"$f":"IF(Tabel_kalender[[#This Row],[Werkdag]]=\"ja\",Tabel_kalender[[#This Row],[Datum]],IF(E713=\"ja\",A713,IF(E714=\"ja\",A714,IF(E715=\"ja\",A715,IF(E716=\"ja\",A716,IF(E717=\"ja\",A717,IF(E718=\"ja\",A718,IF(E719=\"ja\",A719,IF(E720=\"ja\",A720,IF(E721=\"ja\",A721,IF(E722=\"ja\",A722,IF(E723=\"ja\",A723,IF(E724=\"ja\",A724,IF(E725=\"ja\",A725,IF(E726=\"ja\",A726,IF(E727=\"ja\",A727,IF(E728=\"ja\",A728,IF(E729=\"ja\",A729,IF(A730=\"ja\",A730,\"Volgepland\")))))))))))))))))))","v":"2022-12-10"},null,null,null,null,0,null,null,0,0,null,null,0]
["2022-12-11",{"$f":"WEEKNUM(Tabel_kalender[[#This Row],[Datum]],21)","v":49},"1900-01-07",null,"ja",{"$f":"IF(Tabel_kalender[[#This Row],[Werkdag]]=\"ja\",Tabel_kalender[[#This Row],[Datum]],IF(E714=\"ja\",A714,IF(E715=\"ja\",A715,IF(E716=\"ja\",A716,IF(E717=\"ja\",A717,IF(E718=\"ja\",A718,IF(E719=\"ja\",A719,IF(E720=\"ja\",A720,IF(E721=\"ja\",A721,IF(E722=\"ja\",A722,IF(E723=\"ja\",A723,IF(E724=\"ja\",A724,IF(E725=\"ja\",A725,IF(E726=\"ja\",A726,IF(E727=\"ja\",A727,IF(E728=\"ja\",A728,IF(E729=\"ja\",A729,IF(E730=\"ja\",A730,IF(A731=\"ja\",A731,\"Volgepland\")))))))))))))))))))","v":"2022-12-11"},null,null,null,null,0,null,null,0,0,null,null,0]
["2022-12-12",{"$f":"WEEKNUM(Tabel_kalender[[#This Row],[Datum]],21)","v":50},"1900-01-01",null,"ja",{"$f":"IF(Tabel_kalender[[#This Row],[Werkdag]]=\"ja\",Tabel_kalender[[#This Row],[Datum]],IF(E715=\"ja\",A715,IF(E716=\"ja\",A716,IF(E717=\"ja\",A717,IF(E718=\"ja\",A718,IF(E719=\"ja\",A719,IF(E720=\"ja\",A720,IF(E721=\"ja\",A721,IF(E722=\"ja\",A722,IF(E723=\"ja\",A723,IF(E724=\"ja\",A724,IF(E725=\"ja\",A725,IF(E726=\"ja\",A726,IF(E727=\"ja\",A727,IF(E728=\"ja\",A728,IF(E729=\"ja\",A729,IF(E730=\"ja\",A730,IF(E731=\"ja\",A731,IF(A732=\"ja\",A732,\"Volgepland\")))))))))))))))))))","v":"2022-12-12"},null,null,null,null,0,null,null,0,0,null,null,0]
["2022-12-13",{"$f":"WEEKNUM(Tabel_kalender[[#This Row],[Datum]],21)","v":50},"1900-01-02",null,"nee",{"$f":"IF(Tabel_kalender[[#This Row],[Werkdag]]=\"ja\",Tabel_kalender[[#This Row],[Datum]],IF(E716=\"ja\",A716,IF(E717=\"ja\",A717,IF(E718=\"ja\",A718,IF(E719=\"ja\",A719,IF(E720=\"ja\",A720,IF(E721=\"ja\",A721,IF(E722=\"ja\",A722,IF(E723=\"ja\",A723,IF(E724=\"ja\",A724,IF(E725=\"ja\",A725,IF(E726=\"ja\",A726,IF(E727=\"ja\",A727,IF(E728=\"ja\",A728,IF(E729=\"ja\",A729,IF(E730=\"ja\",A730,IF(E731=\"ja\",A731,IF(E732=\"ja\",A732,IF(A733=\"ja\",A733,\"Volgepland\")))))))))))))))))))","v":"2022-12-15"},null,null,null,null,0,null,null,0,0,null,null,0]
["2022-12-14",{"$f":"WEEKNUM(Tabel_kalender[[#This Row],[Datum]],21)","v":50},"1900-01-03",null,"nee",{"$f":"IF(Tabel_kalender[[#This Row],[Werkdag]]=\"ja\",Tabel_kalender[[#This Row],[Datum]],IF(E717=\"ja\",A717,IF(E718=\"ja\",A718,IF(E719=\"ja\",A719,IF(E720=\"ja\",A720,IF(E721=\"ja\",A721,IF(E722=\"ja\",A722,IF(E723=\"ja\",A723,IF(E724=\"ja\",A724,IF(E725=\"ja\",A725,IF(E726=\"ja\",A726,IF(E727=\"ja\",A727,IF(E728=\"ja\",A728,IF(E729=\"ja\",A729,IF(E730=\"ja\",A730,IF(E731=\"ja\",A731,IF(E732=\"ja\",A732,IF(E733=\"ja\",A733,IF(#REF!=\"ja\",#REF!,\"Volgepland\")))))))))))))))))))","v":"2022-12-15"},null,null,null,null,0,null,null,0,0,null,null,0]
["2022-12-15",{"$f":"WEEKNUM(Tabel_kalender[[#This Row],[Datum]],21)","v":50},"1900-01-04",null,"ja",{"$f":"IF(Tabel_kalender[[#This Row],[Werkdag]]=\"ja\",Tabel_kalender[[#This Row],[Datum]],IF(E718=\"ja\",A718,IF(E719=\"ja\",A719,IF(E720=\"ja\",A720,IF(E721=\"ja\",A721,IF(E722=\"ja\",A722,IF(E723=\"ja\",A723,IF(E724=\"ja\",A724,IF(E725=\"ja\",A725,IF(E726=\"ja\",A726,IF(E727=\"ja\",A727,IF(E728=\"ja\",A728,IF(E729=\"ja\",A729,IF(E730=\"ja\",A730,IF(E731=\"ja\",A731,IF(E732=\"ja\",A732,IF(E733=\"ja\",A733,IF(#REF!=\"ja\",#REF!,IF(#REF!=\"ja\",#REF!,\"Volgepland\")))))))))))))))))))","v":"2022-12-15"},null,null,null,null,0,null,null,0,0,null,null,0]
["2022-12-16",{"$f":"WEEKNUM(Tabel_kalender[[#This Row],[Datum]],21)","v":50},"1900-01-05",null,"ja",{"$f":"IF(Tabel_kalender[[#This Row],[Werkdag]]=\"ja\",Tabel_kalender[[#This Row],[Datum]],IF(E719=\"ja\",A719,IF(E720=\"ja\",A720,IF(E721=\"ja\",A721,IF(E722=\"ja\",A722,IF(E723=\"ja\",A723,IF(E724=\"ja\",A724,IF(E725=\"ja\",A725,IF(E726=\"ja\",A726,IF(E727=\"ja\",A727,IF(E728=\"ja\",A728,IF(E729=\"ja\",A729,IF(E730=\"ja\",A730,IF(E731=\"ja\",A731,IF(E732=\"ja\",A732,IF(E733=\"ja\",A733,IF(#REF!=\"ja\",#REF!,IF(#REF!=\"ja\",#REF!,IF(A734=\"ja\",A734,\"Volgepland\")))))))))))))))))))","v":"2022-12-16"},null,null,null,null,0,null,null,0,0,null,null,0]
["2022-12-17",{"$f":"WEEKNUM(Tabel_kalender[[#This Row],[Datum]],21)","v":50},"1900-01-06",null,"ja",{"$f":"IF(Tabel_kalender[[#This Row],[Werkdag]]=\"ja\",Tabel_kalender[[#This Row],[Datum]],IF(E720=\"ja\",A720,IF(E721=\"ja\",A721,IF(E722=\"ja\",A722,IF(E723=\"ja\",A723,IF(E724=\"ja\",A724,IF(E725=\"ja\",A725,IF(E726=\"ja\",A726,IF(E727=\"ja\",A727,IF(E728=\"ja\",A728,IF(E729=\"ja\",A729,IF(E730=\"ja\",A730,IF(E731=\"ja\",A731,IF(E732=\"ja\",A732,IF(E733=\"ja\",A733,IF(#REF!=\"ja\",#REF!,IF(#REF!=\"ja\",#REF!,IF(E734=\"ja\",A734,IF(A735=\"ja\",A735,\"Volgepland\")))))))))))))))))))","v":"2022-12-17"},null,null,null,null,0,null,null,0,0,null,null,0]
["2022-12-18",{"$f":"WEEKNUM(Tabel_kalender[[#This Row],[Datum]],21)","v":50},"1900-01-07",null,"ja",{"$f":"IF(Tabel_kalender[[#This Row],[Werkdag]]=\"ja\",Tabel_kalender[[#This Row],[Datum]],IF(E721=\"ja\",A721,IF(E722=\"ja\",A722,IF(E723=\"ja\",A723,IF(E724=\"ja\",A724,IF(E725=\"ja\",A725,IF(E726=\"ja\",A726,IF(E727=\"ja\",A727,IF(E728=\"ja\",A728,IF(E729=\"ja\",A729,IF(E730=\"ja\",A730,IF(E731=\"ja\",A731,IF(E732=\"ja\",A732,IF(E733=\"ja\",A733,IF(#REF!=\"ja\",#REF!,IF(#REF!=\"ja\",#REF!,IF(E734=\"ja\",A734,IF(E735=\"ja\",A735,IF(A736=\"ja\",A736,\"Volgepland\")))))))))))))))))))","v":"2022-12-18"},null,null,null,null,0,null,null,0,0,null,null,0]
["2022-12-19",{"$f":"WEEKNUM(Tabel_kalender[[#This Row],[Datum]],21)","v":51},"1900-01-01",null,"ja",{"$f":"IF(Tabel_kalender[[#This Row],[Werkdag]]=\"ja\",Tabel_kalender[[#This Row],[Datum]],IF(E722=\"ja\",A722,IF(E723=\"ja\",A723,IF(E724=\"ja\",A724,IF(E725=\"ja\",A725,IF(E726=\"ja\",A726,IF(E727=\"ja\",A727,IF(E728=\"ja\",A728,IF(E729=\"ja\",A729,IF(E730=\"ja\",A730,IF(E731=\"ja\",A731,IF(E732=\"ja\",A732,IF(E733=\"ja\",A733,IF(#REF!=\"ja\",#REF!,IF(#REF!=\"ja\",#REF!,IF(E734=\"ja\",A734,IF(E735=\"ja\",A735,IF(E736=\"ja\",A736,IF(A737=\"ja\",A737,\"Volgepland\")))))))))))))))))))","v":"2022-12-19"},null,null,null,null,0,null,null,0,0,null,null,0]
["2022-12-20",{"$f":"WEEKNUM(Tabel_kalender[[#This Row],[Datum]],21)","v":51},"1900-01-02",null,"nee",{"$f":"IF(Tabel_kalender[[#This Row],[Werkdag]]=\"ja\",Tabel_kalender[[#This Row],[Datum]],IF(E723=\"ja\",A723,IF(E724=\"ja\",A724,IF(E725=\"ja\",A725,IF(E726=\"ja\",A726,IF(E727=\"ja\",A727,IF(E728=\"ja\",A728,IF(E729=\"ja\",A729,IF(E730=\"ja\",A730,IF(E731=\"ja\",A731,IF(E732=\"ja\",A732,IF(E733=\"ja\",A733,IF(#REF!=\"ja\",#REF!,IF(#REF!=\"ja\",#REF!,IF(E734=\"ja\",A734,IF(E735=\"ja\",A735,IF(E736=\"ja\",A736,IF(E737=\"ja\",A737,IF(A738=\"ja\",A738,\"Volgepland\")))))))))))))))))))","v":"2022-12-22"},null,null,null,null,0,null,null,0,0,null,null,0]
["2022-12-21",{"$f":"WEEKNUM(Tabel_kalender[[#This Row],[Datum]],21)","v":51},"1900-01-03",null,"nee",{"$f":"IF(Tabel_kalender[[#This Row],[Werkdag]]=\"ja\",Tabel_kalender[[#This Row],[Datum]],IF(E724=\"ja\",A724,IF(E725=\"ja\",A725,IF(E726=\"ja\",A726,IF(E727=\"ja\",A727,IF(E728=\"ja\",A728,IF(E729=\"ja\",A729,IF(E730=\"ja\",A730,IF(E731=\"ja\",A731,IF(E732=\"ja\",A732,IF(E733=\"ja\",A733,IF(#REF!=\"ja\",#REF!,IF(#REF!=\"ja\",#REF!,IF(E734=\"ja\",A734,IF(E735=\"ja\",A735,IF(E736=\"ja\",A736,IF(E737=\"ja\",A737,IF(E738=\"ja\",A738,IF(A739=\"ja\",A739,\"Volgepland\")))))))))))))))))))","v":"2022-12-22"},null,null,null,null,0,null,null,0,0,null,null,0]
["2022-12-22",{"$f":"WEEKNUM(Tabel_kalender[[#This Row],[Datum]],21)","v":51},"1900-01-04",null,"ja",{"$f":"IF(Tabel_kalender[[#This Row],[Werkdag]]=\"ja\",Tabel_kalender[[#This Row],[Datum]],IF(E725=\"ja\",A725,IF(E726=\"ja\",A726,IF(E727=\"ja\",A727,IF(E728=\"ja\",A728,IF(E729=\"ja\",A729,IF(E730=\"ja\",A730,IF(E731=\"ja\",A731,IF(E732=\"ja\",A732,IF(E733=\"ja\",A733,IF(#REF!=\"ja\",#REF!,IF(#REF!=\"ja\",#REF!,IF(E734=\"ja\",A734,IF(E735=\"ja\",A735,IF(E736=\"ja\",A736,IF(E737=\"ja\",A737,IF(E738=\"ja\",A738,IF(E739=\"ja\",A739,IF(A740=\"ja\",A740,\"Volgepland\")))))))))))))))))))","v":"2022-12-22"},null,null,null,null,0,null,null,0,0,null,null,0]
["2022-12-23",{"$f":"WEEKNUM(Tabel_kalender[[#This Row],[Datum]],21)","v":51},"1900-01-05",null,"ja",{"$f":"IF(Tabel_kalender[[#This Row],[Werkdag]]=\"ja\",Tabel_kalender[[#This Row],[Datum]],IF(E726=\"ja\",A726,IF(E727=\"ja\",A727,IF(E728=\"ja\",A728,IF(E729=\"ja\",A729,IF(E730=\"ja\",A730,IF(E731=\"ja\",A731,IF(E732=\"ja\",A732,IF(E733=\"ja\",A733,IF(#REF!=\"ja\",#REF!,IF(#REF!=\"ja\",#REF!,IF(E734=\"ja\",A734,IF(E735=\"ja\",A735,IF(E736=\"ja\",A736,IF(E737=\"ja\",A737,IF(E738=\"ja\",A738,IF(E739=\"ja\",A739,IF(E740=\"ja\",A740,IF(A741=\"ja\",A741,\"Volgepland\")))))))))))))))))))","v":"2022-12-23"},null,null,null,null,0,null,null,0,0,null,null,0]
["2022-12-24",{"$f":"WEEKNUM(Tabel_kalender[[#This Row],[Datum]],21)","v":51},"1900-01-06",null,"ja",{"$f":"IF(Tabel_kalender[[#This Row],[Werkdag]]=\"ja\",Tabel_kalender[[#This Row],[Datum]],IF(E727=\"ja\",A727,IF(E728=\"ja\",A728,IF(E729=\"ja\",A729,IF(E730=\"ja\",A730,IF(E731=\"ja\",A731,IF(E732=\"ja\",A732,IF(E733=\"ja\",A733,IF(#REF!=\"ja\",#REF!,IF(#REF!=\"ja\",#REF!,IF(E734=\"ja\",A734,IF(E735=\"ja\",A735,IF(E736=\"ja\",A736,IF(E737=\"ja\",A737,IF(E738=\"ja\",A738,IF(E739=\"ja\",A739,IF(E740=\"ja\",A740,IF(E741=\"ja\",A741,IF(A742=\"ja\",A742,\"Volgepland\")))))))))))))))))))","v":"2022-12-24"},null,null,null,null,0,null,null,0,0,null,null,0]
["2022-12-25",{"$f":"WEEKNUM(Tabel_kalender[[#This Row],[Datum]],21)","v":51},"1900-01-07",null,"ja",{"$f":"IF(Tabel_kalender[[#This Row],[Werkdag]]=\"ja\",Tabel_kalender[[#This Row],[Datum]],IF(E728=\"ja\",A728,IF(E729=\"ja\",A729,IF(E730=\"ja\",A730,IF(E731=\"ja\",A731,IF(E732=\"ja\",A732,IF(E733=\"ja\",A733,IF(#REF!=\"ja\",#REF!,IF(#REF!=\"ja\",#REF!,IF(E734=\"ja\",A734,IF(E735=\"ja\",A735,IF(E736=\"ja\",A736,IF(E737=\"ja\",A737,IF(E738=\"ja\",A738,IF(E739=\"ja\",A739,IF(E740=\"ja\",A740,IF(E741=\"ja\",A741,IF(E742=\"ja\",A742,IF(A743=\"ja\",A743,\"Volgepland\")))))))))))))))))))","v":"2022-12-25"},null,null,null,null,0,null,null,0,0,null,null,0]
["2022-12-26",{"$f":"WEEKNUM(Tabel_kalender[[#This Row],[Datum]],21)","v":52},"1900-01-01","Kerst","nee",{"$f":"IF(Tabel_kalender[[#This Row],[Werkdag]]=\"ja\",Tabel_kalender[[#This Row],[Datum]],IF(E729=\"ja\",A729,IF(E730=\"ja\",A730,IF(E731=\"ja\",A731,IF(E732=\"ja\",A732,IF(E733=\"ja\",A733,IF(#REF!=\"ja\",#REF!,IF(#REF!=\"ja\",#REF!,IF(E734=\"ja\",A734,IF(E735=\"ja\",A735,IF(E736=\"ja\",A736,IF(E737=\"ja\",A737,IF(E738=\"ja\",A738,IF(E739=\"ja\",A739,IF(E740=\"ja\",A740,IF(E741=\"ja\",A741,IF(E742=\"ja\",A742,IF(E743=\"ja\",A743,IF(A744=\"ja\",A744,\"Volgepland\")))))))))))))))))))","v":{"$error":"#REF!"}},null,null,null,null,0,null,null,0,0,null,null,0]
["2022-12-27",{"$f":"WEEKNUM(Tabel_kalender[[#This Row],[Datum]],21)","v":52},"1900-01-02","Kerst","nee",{"$f":"IF(Tabel_kalender[[#This Row],[Werkdag]]=\"ja\",Tabel_kalender[[#This Row],[Datum]],IF(E730=\"ja\",A730,IF(E731=\"ja\",A731,IF(E732=\"ja\",A732,IF(E733=\"ja\",A733,IF(#REF!=\"ja\",#REF!,IF(#REF!=\"ja\",#REF!,IF(E734=\"ja\",A734,IF(E735=\"ja\",A735,IF(E736=\"ja\",A736,IF(E737=\"ja\",A737,IF(E738=\"ja\",A738,IF(E739=\"ja\",A739,IF(E740=\"ja\",A740,IF(E741=\"ja\",A741,IF(E742=\"ja\",A742,IF(E743=\"ja\",A743,IF(E744=\"ja\",A744,IF(A745=\"ja\",A745,\"Volgepland\")))))))))))))))))))","v":{"$error":"#REF!"}},null,null,null,null,0,null,null,0,0,null,null,0]
["2022-12-28",{"$f":"WEEKNUM(Tabel_kalender[[#This Row],[Datum]],21)","v":52},"1900-01-03",null,"nee",{"$f":"IF(Tabel_kalender[[#This Row],[Werkdag]]=\"ja\",Tabel_kalender[[#This Row],[Datum]],IF(E731=\"ja\",A731,IF(E732=\"ja\",A732,IF(E733=\"ja\",A733,IF(#REF!=\"ja\",#REF!,IF(#REF!=\"ja\",#REF!,IF(E734=\"ja\",A734,IF(E735=\"ja\",A735,IF(E736=\"ja\",A736,IF(E737=\"ja\",A737,IF(E738=\"ja\",A738,IF(E739=\"ja\",A739,IF(E740=\"ja\",A740,IF(E741=\"ja\",A741,IF(E742=\"ja\",A742,IF(E743=\"ja\",A743,IF(E744=\"ja\",A744,IF(E745=\"ja\",A745,IF(A746=\"ja\",A746,\"Volgepland\")))))))))))))))))))","v":{"$error":"#REF!"}},null,null,null,null,0,null,null,0,0,null,null,0]
["2022-12-29",{"$f":"WEEKNUM(Tabel_kalender[[#This Row],[Datum]],21)","v":52},"1900-01-04",null,"nee",{"$f":"IF(Tabel_kalender[[#This Row],[Werkdag]]=\"ja\",Tabel_kalender[[#This Row],[Datum]],IF(E732=\"ja\",A732,IF(E733=\"ja\",A733,IF(#REF!=\"ja\",#REF!,IF(#REF!=\"ja\",#REF!,IF(E734=\"ja\",A734,IF(E735=\"ja\",A735,IF(E736=\"ja\",A736,IF(E737=\"ja\",A737,IF(E738=\"ja\",A738,IF(E739=\"ja\",A739,IF(E740=\"ja\",A740,IF(E741=\"ja\",A741,IF(E742=\"ja\",A742,IF(E743=\"ja\",A743,IF(E744=\"ja\",A744,IF(E745=\"ja\",A745,IF(E746=\"ja\",A746,IF(A747=\"ja\",A747,\"Volgepland\")))))))))))))))))))","v":{"$error":"#REF!"}},null,null,null,null,0,null,null,0,0,null,null,0]
["2022-12-30",{"$f":"WEEKNUM(Tabel_kalender[[#This Row],[Datum]],21)","v":52},"1900-01-05",null,"nee",{"$f":"IF(Tabel_kalender[[#This Row],[Werkdag]]=\"ja\",Tabel_kalender[[#This Row],[Datum]],IF(E733=\"ja\",A733,IF(#REF!=\"ja\",#REF!,IF(#REF!=\"ja\",#REF!,IF(E734=\"ja\",A734,IF(E735=\"ja\",A735,IF(E736=\"ja\",A736,IF(E737=\"ja\",A737,IF(E738=\"ja\",A738,IF(E739=\"ja\",A739,IF(E740=\"ja\",A740,IF(E741=\"ja\",A741,IF(E742=\"ja\",A742,IF(E743=\"ja\",A743,IF(E744=\"ja\",A744,IF(E745=\"ja\",A745,IF(E746=\"ja\",A746,IF(E747=\"ja\",A747,IF(A748=\"ja\",A748,\"Volgepland\")))))))))))))))))))","v":{"$error":"#REF!"}},null,null,null,null,0,null,null,0,0,null,null,0]
["2022-12-31",{"$f":"WEEKNUM(Tabel_kalender[[#This Row],[Datum]],21)","v":52},"1900-01-06",null,"nee",{"$f":"IF(Tabel_kalender[[#This Row],[Werkdag]]=\"ja\",Tabel_kalender[[#This Row],[Datum]],IF(#REF!=\"ja\",#REF!,IF(#REF!=\"ja\",#REF!,IF(E734=\"ja\",A734,IF(E735=\"ja\",A735,IF(E736=\"ja\",A736,IF(E737=\"ja\",A737,IF(E738=\"ja\",A738,IF(E739=\"ja\",A739,IF(E740=\"ja\",A740,IF(E741=\"ja\",A741,IF(E742=\"ja\",A742,IF(E743=\"ja\",A743,IF(E744=\"ja\",A744,IF(E745=\"ja\",A745,IF(E746=\"ja\",A746,IF(E747=\"ja\",A747,IF(E748=\"ja\",A748,IF(A749=\"ja\",A749,\"Volgepland\")))))))))))))))))))","v":{"$error":"#REF!"}},null,null,null,null,0,null,null,0,0,null,null,0]

{"sheet":"Relaties","index":2,"n_rows":3,"n_cols":26,"rows_kept":3,"cut":false,"hidden":false,"merged":[[0,20,0,25],[0,2,0,7],[0,8,0,13]]}
["Relaties",null,null,null,null,null,null,null,null,null,null,null,null,null,null,null,null,null,null,""]
["Klantnr","Taak","Titel","Aanhef","Naam","Tussenv","Voorletter","Bedrijfsnaam","Adres","Postcode","Woonplaats","Telefoon-1","Telefoon-2","E-mailadres","Opmerkingen","Freq wk","Stuksprijs","BTW","Burenkorting","Planning","Wknr","Dgnr","Combinr","Offertenr","Opdrachtbev.nr","Factuurnr"]
["0002","0","dhr.",{"$f":"IF(C3=\"mevr.\",\"mevrouw\",IF(C3=\"dhr.\",\"heer\",IF(C3=\"fam.\",\"familie\",\"\")))","v":"heer"},"Vries","de","R.",null,"Distelpad 18","XXXXGL","Assen",null,null,null,null,null,null,null,null,null,{"$f":"IF(OR(T3=\"nvt\",T3=0),0,_xlfn.ISOWEEKNUM(Relaties!T3))","v":0},{"$f":"IF(OR(T3=\"nvt\",T3=0),0,WEEKDAY(T3,2))","v":0},{"$f":"IF(B3=0,A3&\"0\",A3&B3)","v":"00020"}]

{"sheet":"Factuur","index":3,"n_rows":54,"n_cols":14,"rows_kept":54,"cut":false,"hidden":false,"merged":[[24,4,24,5],[22,4,22,6],[6,0,6,1],[23,0,23,1],[6,2,6,3],[7,2,7,3],[8,2,8,3],[9,2,9,3],[10,2,10,3],[11,2,11,3],[12,2,12,3],[16,0,16,1],[23,4,23,5]]}
[null,null,null,null,"Combinummer(5 cijfers)","00020",null,null,null,null,null,null,null,{"$f":"IF(C39=\"BTW \"&Instellingen!A14&\"%\",\"Laag\",\"Hoog\")","v":"Hoog"}]
[null,null,null,null,"Totaal aant. relaties",{"$f":"COUNTA(Relaties!A:A)-1","v":2},null,null,null,null,null,null,null,{"$f":"IF(B41=\"voldaan contant\",\"Kas\",\"Verkoop\")","v":"Verkoop"}]
[null,null,null,null,null,null,null,null,null,null,null,null,null,"Omzet"]
["FACTUUR",null,null,null,null,null,null,null,null,null,null,null,null,{"$f":"IF(B41=\"voldaan met pinautomaat\",\"SumUp pid\",\"\")","v":""}]
[]
[]
[{"$f":"IF(INDEX(Relaties!H:H,MATCH(F1,Relaties!W:W,0))=0,\" \",INDEX(Relaties!H:H,MATCH(F1,Relaties!W:W,0)))","v":" "},null,{"$f":"Instellingen!A4","v":0},null,"1) Zijn de persoons- en adresgegevens in cel A7 t/m A11 juist? (cel A7 is de evt. bedrijfsnaam)"]
["Ter attentie van:",{"$f":"IF(INDEX(Relaties!F:F,MATCH(F1,Relaties!W:W,0))=0,INDEX(Relaties!C:C,MATCH(F1,Relaties!W:W,0))&\" \"&INDEX(Relaties!G:G,MATCH(F1,Relaties!W:W,0))&\" \"&INDEX(Relaties!E:E,MATCH(F1,Relaties!W:W,0)),INDEX(Relaties!G:G,MATCH(F1,Relaties!W:W,0))&\" \"&INDEX(Relaties!F:F,MATCH(F1,Relaties!W:W,0))&\" \"&INDEX(Relaties!E:E,MATCH(F1,Relaties!W:W,0)))","v":"R. de Vries"},{"$f":"Instellingen!A5&\" \"&Instellingen!A6","v":" "},null,"2) Is de dag van de uitgevoerde werkzaamheden juist? (Cel D23)"]
["Straat en Huisnr:",{"$f":"INDEX(Relaties!I:I,MATCH(F1,Relaties!W:W,0))","v":"Distelpad 18"},{"$f":"Instellingen!A7","v":0},null,"2) Is de tekst in de cel Opmerkingen juist? (cel B23)"]
["Postcode en Plaats:",{"$f":"INDEX(Relaties!J:J,MATCH(F1,Relaties!W:W,0))&\" \"&INDEX(Relaties!K:K,MATCH(F1,Relaties!W:W,0))","v":"XXXXGL Assen"},{"$f":"Instellingen!A8","v":0},null,"3) Is het Totaalbedrag juist? (cel D41)"]
["E-mailadres: ",{"$f":"INDEX(Relaties!N:N,MATCH(F1,Relaties!W:W,0))","v":0},{"$f":"Instellingen!A9","v":0},null,"4) Is de juiste Betaalwijze geselecteerd? (cel B41)"]
["Relatienummer: ",{"$f":"LEFT(F1,4)","v":"0002"},{"$f":"Instellingen!A10","v":0},null,"5) Klik dan op de blauwe knop Factuur, Boeking en e-mail genereren"]
["Factuurnummer:",20210241,"BTW nummer: NL078991717B01",null,"    Een nieuw factuurnummer wordt aangemaakt, uitgeprint en in het werkblad Boekingen in het grootboek \"Verkoop\" geplaatst"]
[null,null,null,null,"    Ook wordt een e-mail aangemaakt, in de map \"Postvak Uit\" van Outlook gezet en verzonden"]
[{"$f":"Instellingen!A6&\", \"&TEXT(TODAY(),\"DD-MM-JJJJ\")","v":", 05-05-2021"}]
[null," "]
[{"$f":"IF(INDEX(Relaties!F:F,MATCH(F1,Relaties!W:W,0))=0,\"Geachte \"&INDEX(Relaties!D:D,MATCH(F1,Relaties!W:W,0))&\" \"&INDEX(Relaties!E:E,MATCH(F1,Relaties!W:W,0))&\",\",\"Geachte \"&INDEX(Relaties!D:D,MATCH(F1,Relaties!W:W,0))&\" \"&INDEX(Relaties!F:F,MATCH(F1,Relaties!W:W,0))&\" \"&INDEX(Relaties!E:E,MATCH(F1,Relaties!W:W,0))&\",\")","v":"Geachte heer de Vries,"}]
[]
["Voor het verrichten van de ondergenoemde werkzaamheden verzoeken wij u het betreffende "]
["totaalbedrag binnen 15 dagen aan ons over te maken. Vermeld daarbij a.u.b. uw factuurnummer."]
[]
["Informatie:"]
["Opmerkingen:",{"$f":"IF(INDEX(Relaties!O:O,MATCH(F1,Relaties!W:W,0))=0,\" \",INDEX(Relaties!O:O,MATCH(F1,Relaties!W:W,0)))","v":" "},"Uitgevoerd op:","2021-02-09","Volgende reinigingsdatum wijzigen?!"]
[{"$f":"\"Door u gewenste frequentie in weken:\"&\" \"&INDEX(Relaties!P:P,MATCH($F$1,Relaties!W:W,0))","v":"Door u gewenste frequentie in weken: "},null,"Volgende reiniging op:",{"$f":"IF(G25<>0,G25,E25)","v":"nvt"},"Geplande reinigingsdatum ",null,"Nieuwe reinigingsdatum"]
[null,null,null,null,{"$f":"IFERROR(INDEX(Kalender!F:F,MATCH(IF(INDEX(Relaties!P:P*7,MATCH($F$1,Relaties!W:W,0))=0,0,(INDEX(Relaties!P:P*7,MATCH($F$1,Relaties!W:W,0))+D23)),Kalender!A:A,0)),\"nvt\")","v":"nvt"}]
["Aantal","Omschrijving",{"$f":"\"Stuksprijs \"&INDEX(Relaties!R:R,MATCH(F1,Relaties!W:W,0))","v":"Stuksprijs "},"Totaal"]
[null,"Reinigingswerkzaamheden volgens afspraak",{"$f":"IF(B27=Instellingen!A27,\"\",INDEX(Relaties!Q:Q,MATCH(F1,Relaties!W:W,0)))","v":0},{"$f":"C27","v":0}]
[null,null,null,{"$f":"IF(A28>=1,A28*C28,C28)","v":0}]
[null,null,null,60]
[null,null,null,0]
[null,null,null,0]
[null,null,null,0]
[null,null,null,0]
[null,null,null,{"$f":"IF(A34>=1,A34*C34,C34)","v":0}]
[null,null,null,0]
[null,null,null,0]
[null,{"$f":"IF(INDEX(Relaties!S:S,MATCH(F1,Relaties!W:W,0))=0,\" \",INDEX(Relaties!S:S,MATCH(F1,Relaties!W:W,0)))","v":" "},{"$f":"IF(B37=Instellingen!A48,SUM(D27:D36)*-0.05,IF(B37=Instellingen!A49,SUM(D27:D36)*-0.1,IF(B37=Instellingen!A50,SUM(D27:D36)*-0.15,IF(B37=Instellingen!A51,SUM(D27:D36)*-0.2,\" \"))))","v":" "},{"$f":"IF(A37>=1,A37*C37,C37)","v":" "}]
[null,null," Subtotaal ",{"$f":"SUM(D27:D37)","v":60}]
[null,null,{"$f":"IF(AND(RIGHT(F1,1)=\"9\"),\"BTW \"&Instellingen!A14&\"%\",\"BTW \"&Instellingen!A13&\"%\")","v":"BTW 21%"},{"$f":"IF(AND(C39=\"BTW \"&Instellingen!A13&\"%\",C26=\"Stuksprijs incl BTW\"),D38/(100+Instellingen!A13)*Instellingen!A13,IF(AND(C39=\"BTW \"&Instellingen!A14&\"%\",C26=\"Stuksprijs incl BTW\"),D38/(100+Instellingen!A14)*Instellingen!A14,IF(AND(C39=\"BTW \"&Instellingen!A13&\"%\",C26=\"Stuksprijs excl BTW\"),D38*(Instellingen!A13/100),IF(AND(C39=\"BTW \"&Instellingen!A14&\"%\",C26=\"Stuksprijs excl BTW\"),D38*(Instellingen!A14/100)))))","v":false}]
[]
["Betaalwijze:","betalen met bankoverschrijving"," Totaalbedrag",{"$f":"IF(C26=\"Stuksprijs \"&Instellingen!A24,D38+D39,D38)","v":60}]
[]
[null,null,null,"Bedankt voor uw opdracht en het vertrouwen in ons."]
[]
["Zijn uw gegevens niet correct of onvolledig? Neem dan a.u.b. even contact met ons op."]
["Laat ons per omgaande weten als u het oneens bent met de factuur. E-mailadres: debiteuren@dsrcleaning.nl"]
[]
["Heeft u gekozen voor een vaste frequentie en komt de volgende reinigingsdatum u niet uit? Zie informatiekader."]
["Geen probleem, maar meldt dit a.u.b. 48 uur van te voren om onnodige kosten te voorkomen."]
[]
["Op alle diensten en producten zijn onze Algemene Voorwaarden van toepassing. "]
["Deze kunt u downloaden vanaf onze website www.dsrcleaning.nl/Algemene-voorwaarden-DSRCleaning.pdf"]
[]
["Bezoek ook eens onze website. "]