{"text_format":"1","workbook":"xlsx","n_sheets":4,"sheets":["Instellingen","Kalender","Relaties","Factuur"],"not_rendered":{"charts":0,"images":1,"macros":1,"external_links":0,"defined_names":36,"comments":1,"pivot_tables":0},"unopened":[],"bounds":{"document_bytes":16777216,"sheet_cells":100000,"rows_first":2000,"rows_last":500,"rows_between":2000,"halvings":0,"cell_chars":16384,"cell_head_chars":4096},"cells_cut":0,"cells_raw":0,"read":"whole","date_system":"1900"}

{"sheet":"Instellingen","index":0,"n_rows":106,"n_cols":10,"rows_kept":106,"cut":false,"hidden":false,"merged":[[0,8,0,9],[9,8,9,9]]}
[null,null,"Locaties in werkblad(en)",null,"Boekjaar: >>>",{"$f":"J4","v":2021},null,null,"Nieuw boekjaar"]
[null,null,null,null,null,null,null,null,"Pad: ","D:\\DSR Cleaning"]
["Adresgegevens",null,"Cel C7 t/m C13 in werkbladen Offerte, Opdrachtbevestiging, Factuur, Herinnering, Incasso en Credit ",null,null,null,null,null,"Bestandsnaam:","Bedrijfsadministratie"]
[null,null,null,null,null,null,null,null,"Boekjaar:",2021]
[null,null,null,null,null,null,null,null,"Eerste factuurnr:",{"$f":"J4&\"0000\"","v":"20210000"}]
[]
[]
[]
[]
[null,null,null,null,null,null,null,null,"Bestand voor administratiekantoor "]
[null,null,null,null,null,null,null,null,"Bestandsnaam:","Administratiekantoor"]
["BTW instellingen (procenten)",null,null,null,null,null,null,null,"Boekjaar:",2020]
[21,null,"Cel C39 in werkbladen Offerte, Opdrachtbevestiging, Factuur, Herinnering, Incasso en Credit "]
[9,null,"Cel C39 in werkbladen Offerte, Opdrachtbevestiging, Factuur, Herinnering, Incasso en Credit "]
[null,null,"Cel C39 in werkbladen Offerte, Opdrachtbevestiging, Factuur, Herinnering, Incasso en Credit "]
["Hoog",null,"Keuzeveld kolom R in werkblad Boekingen"]
["Laag",null,"Keuzeveld kolom R in werkblad Boekingen"]
["Geen",null,"Keuzeveld kolom R in werkblad Boekingen"]
[]
["Uurloon excl. BTW"]
[null,null,"Geheugensteun voor prijzen in cel G9 werkblad Factuur"]
[]
["Gegevens op offerte en factuur"]
["excl BTW",null,"Keuzeveld kolom Q in werkblad Boekingen"]
["incl BTW",null,"Keuzeveld kolom Q in werkblad Boekingen"]
["Reinigingswerkzaamheden volgens afspraak",null,"Keuzeveld cel B27 werkbladen Offerte, Opdrachtbevestiging, Factuur, Herinnering en Incasso"]
["Reinigingswerkzaamheden bestaande uit:",null,"Keuzeveld cel B27 werkbladen Offerte, Opdrachtbevestiging, Factuur, Herinnering en Incasso"]
[]
["Afdrukmarges"]
["Links = 2,0"]
{"$rows_left_out":77}
{"sheet":"Kalender","index":1,"n_rows":733,"n_cols":20,"rows_kept":733,"cut":false,"hidden":false,"merged":[[0,16,0,17],[0,12,0,13],[0,10,0,11],[0,6,0,9],[0,14,0,15]]}
["KALENDER",null,null,null,null,null," WERKUREN",null,null,null,"BEDRIJFSAUTO A",null,"TOTAAL AANTAL KM AUTO A",null,"BEDRIJFSAUTO B",null,"TOTAAL AANTAL KM AUTO B"]
["Boekjaar >",2021,null,null,null,null,"Totaal uren Administratie >",{"$f":"SUM(H4:H733)","v":0},"Totaal uren Praktijk >",{"$f":"SUM(J4:J733)","v":0},"KM stand bij aanschaf A:",0,{"$f":"SUM(M4:M733)","v":0},{"$f":"SUM(N4:N733)","v":0},"KM stand bij aanschaf B:",80000,{"$f":"SUM(Q4:Q733)","v":0},{"$f":"SUM(R4:R733)","v":0}]
["Datum","Weeknr.","Dagnr.","Feestdag","Werkdag","Eerstvolgende werkdag","Omschrijving administratie-uren","Tijd in uren Adm.","Omschrijving praktijk uren","Tijd in uren Prakt.","KM stand begin vh jaar A:","0","Waarvan KM Privé A:","KM Zakelijk A:","KM stand begin vh jaar B:","123000","Waarvan KM Privé B:","KM Zakelijk B:"]
["2021-01-01",{"$f":"WEEKNUM(Tabel_kalender[[#This Row],[Datum]],21)","v":53},{"$f":"WEEKDAY(A4,2)","v":"1900-01-05"},null,"ja",{"$f":"IF(Tabel_kalender[[#This Row],[Werkdag]]=\"ja\",Tabel_kalender[[#This Row],[Datum]],IF(E5=\"ja\",A5,IF(E6=\"ja\",A6,IF(E7=\"ja\",A7,IF(E8=\"ja\",A8,IF(E9=\"ja\",A9,IF(E10=\"ja\",A10,IF(E11=\"ja\",A11,IF(E12=\"ja\",A12,IF(E13=\"ja\",A13,IF(E14=\"ja\",A14,IF(E15=\"ja\",A15,IF(E16=\"ja\",A16,IF(E17=\"ja\",A17,IF(E18=\"ja\",A18,IF(E19=\"ja\",A19,IF(E20=\"ja\",A20,IF(E21=\"ja\",A21,IF(A22=\"ja\",A22,\"Volgepland\")))))))))))))))))))","v":"2021-01-01"},null,null,null,null,{"$f":"L3","v":"0"},null,null,{"$f":"IF(L4>0,L4-K4,)-M4","v":0},{"$f":"P3","v":"123000"},null,null,{"$f":"IF(P4>0,P4-O4,)-Q4","v":0}]
[{"$f":"A4+1","v":"2021-01-02"},{"$f":"WEEKNUM(Tabel_kalender[[#This Row],[Datum]],21)","v":53},{"$f":"WEEKDAY(A5,2)","v":"1900-01-06"},null,"nee",{"$f":"IF(Tabel_kalender[[#This Row],[Werkdag]]=\"ja\",Tabel_kalender[[#This Row],[Datum]],IF(E6=\"ja\",A6,IF(E7=\"ja\",A7,IF(E8=\"ja\",A8,IF(E9=\"ja\",A9,IF(E10=\"ja\",A10,IF(E11=\"ja\",A11,IF(E12=\"ja\",A12,IF(E13=\"ja\",A13,IF(E14=\"ja\",A14,IF(E15=\"ja\",A15,IF(E16=\"ja\",A16,IF(E17=\"ja\",A17,IF(E18=\"ja\",A18,IF(E19=\"ja\",A19,IF(E20=\"ja\",A20,IF(E21=\"ja\",A21,IF(E22=\"ja\",A22,IF(A23=\"ja\",A23,\"Volgepland\")))))))))))))))))))","v":"2021-01-04"},null,null,null,null,0,null,null,0,0,null,null,0,null,"   "]
["2021-01-03",{"$f":"WEEKNUM(Tabel_kalender[[#This Row],[Datum]],21)","v":53},"1900-01-07",null,"nee",{"$f":"IF(Tabel_kalender[[#This Row],[Werkdag]]=\"ja\",Tabel_kalender[[#This Row],[Datum]],IF(E7=\"ja\",A7,IF(E8=\"ja\",A8,IF(E9=\"ja\",A9,IF(E10=\"ja\",A10,IF(E11=\"ja\",A11,IF(E12=\"ja\",A12,IF(E13=\"ja\",A13,IF(E14=\"ja\",A14,IF(E15=\"ja\",A15,IF(E16=\"ja\",A16,IF(E17=\"ja\",A17,IF(E18=\"ja\",A18,IF(E19=\"ja\",A19,IF(E20=\"ja\",A20,IF(E21=\"ja\",A21,IF(E22=\"ja\",A22,IF(E23=\"ja\",A23,IF(A24=\"ja\",A24,\"Volgepland\")))))))))))))))))))","v":"2021-01-04"},null,null,null,null,0,null,null,0,0,null,null,0]
["2021-01-04",{"$f":"WEEKNUM(Tabel_kalender[[#This Row],[Datum]],21)","v":1},"1900-01-01",null,"ja",{"$f":"IF(Tabel_kalender[[#This Row],[Werkdag]]=\"ja\",Tabel_kalender[[#This Row],[Datum]],IF(E8=\"ja\",A8,IF(E9=\"ja\",A9,IF(E10=\"ja\",A10,IF(E11=\"ja\",A11,IF(E12=\"ja\",A12,IF(E13=\"ja\",A13,IF(E14=\"ja\",A14,IF(E15=\"ja\",A15,IF(E16=\"ja\",A16,IF(E17=\"ja\",A17,IF(E18=\"ja\",A18,IF(E19=\"ja\",A19,IF(E20=\"ja\",A20,IF(E21=\"ja\",A21,IF(E22=\"ja\",A22,IF(E23=\"ja\",A23,IF(E24=\"ja\",A24,IF(A25=\"ja\",A25,\"Volgepland\")))))))))))))))))))","v":"2021-01-04"},null,null,null,null,0,null,null,0,0,null,null,0]
["2021-01-05",{"$f":"WEEKNUM(Tabel_kalender[[#This Row],[Datum]],21)","v":1},"1900-01-02",null,"ja",{"$f":"IF(Tabel_kalender[[#This Row],[Werkdag]]=\"ja\",Tabel_kalender[[#This Row],[Datum]],IF(E9=\"ja\",A9,IF(E10=\"ja\",A10,IF(E11=\"ja\",A11,IF(E12=\"ja\",A12,IF(E13=\"ja\",A13,IF(E14=\"ja\",A14,IF(E15=\"ja\",A15,IF(E16=\"ja\",A16,IF(E17=\"ja\",A17,IF(E18=\"ja\",A18,IF(E19=\"ja\",A19,IF(E20=\"ja\",A20,IF(E21=\"ja\",A21,IF(E22=\"ja\",A22,IF(E23=\"ja\",A23,IF(E24=\"ja\",A24,IF(E25=\"ja\",A25,IF(A26=\"ja\",A26,\"Volgepland\")))))))))))))))))))","v":"2021-01-05"},null,null,null,null,0,null,null,0,0,null,null,0]
["2021-01-06",{"$f":"WEEKNUM(Tabel_kalender[[#This Row],[Datum]],21)","v":1},"1900-01-03",null,"ja",{"$f":"IF(Tabel_kalender[[#This Row],[Werkdag]]=\"ja\",Tabel_kalender[[#This Row],[Datum]],IF(E10=\"ja\",A10,IF(E11=\"ja\",A11,IF(E12=\"ja\",A12,IF(E13=\"ja\",A13,IF(E14=\"ja\",A14,IF(E15=\"ja\",A15,IF(E16=\"ja\",A16,IF(E17=\"ja\",A17,IF(E18=\"ja\",A18,IF(E19=\"ja\",A19,IF(E20=\"ja\",A20,IF(E21=\"ja\",A21,IF(E22=\"ja\",A22,IF(E23=\"ja\",A23,IF(E24=\"ja\",A24,IF(E25=\"ja\",A25,IF(E26=\"ja\",A26,IF(A27=\"ja\",A27,\"Volgepland\")))))))))))))))))))","v":"2021-01-06"},null,null,null,null,0,null,null,0,0,null,null,0]
["2021-01-07",{"$f":"WEEKNUM(Tabel_kalender[[#This Row],[Datum]],21)","v":1},"1900-01-04",null,"ja",{"$f":"IF(Tabel_kalender[[#This Row],[Werkdag]]=\"ja\",Tabel_kalender[[#This Row],[Datum]],IF(E11=\"ja\",A11,IF(E12=\"ja\",A12,IF(E13=\"ja\",A13,IF(E14=\"ja\",A14,IF(E15=\"ja\",A15,IF(E16=\"ja\",A16,IF(E17=\"ja\",A17,IF(E18=\"ja\",A18,IF(E19=\"ja\",A19,IF(E20=\"ja\",A20,IF(E21=\"ja\",A21,IF(E22=\"ja\",A22,IF(E23=\"ja\",A23,IF(E24=\"ja\",A24,IF(E25=\"ja\",A25,IF(E26=\"ja\",A26,IF(E27=\"ja\",A27,IF(A28=\"ja\",A28,\"Volgepland\")))))))))))))))))))","v":"2021-01-07"},null,null,null,null,0,null,null,0,0,null,null,0]
["2021-01-08",{"$f":"WEEKNUM(Tabel_kalender[[#This Row],[Datum]],21)","v":1},"1900-01-05",null,"ja",{"$f":"IF(Tabel_kalender[[#This Row],[Werkdag]]=\"ja\",Tabel_kalender[[#This Row],[Datum]],IF(E12=\"ja\",A12,IF(E13=\"ja\",A13,IF(E14=\"ja\",A14,IF(E15=\"ja\",A15,IF(E16=\"ja\",A16,IF(E17=\"ja\",A17,IF(E18=\"ja\",A18,IF(E19=\"ja\",A19,IF(E20=\"ja\",A20,IF(E21=\"ja\",A21,IF(E22=\"ja\",A22,IF(E23=\"ja\",A23,IF(E24=\"ja\",A24,IF(E25=\"ja\",A25,IF(E26=\"ja\",A26,IF(E27=\"ja\",A27,IF(E28=\"ja\",A28,IF(A29=\"ja\",A29,\"Volgepland\")))))))))))))))))))","v":"2021-01-08"},null,null,null,null,0,null,null,0,0,null,null,0]
["2021-01-09",{"$f":"WEEKNUM(Tabel_kalender[[#This Row],[Datum]],21)","v":1},"1900-01-06",null,"nee",{"$f":"IF(Tabel_kalender[[#This Row],[Werkdag]]=\"ja\",Tabel_kalender[[#This Row],[Datum]],IF(E13=\"ja\",A13,IF(E14=\"ja\",A14,IF(E15=\"ja\",A15,IF(E16=\"ja\",A16,IF(E17=\"ja\",A17,IF(E18=\"ja\",A18,IF(E19=\"ja\",A19,IF(E20=\"ja\",A20,IF(E21=\"ja\",A21,IF(E22=\"ja\",A22,IF(E23=\"ja\",A23,IF(E24=\"ja\",A24,IF(E25=\"ja\",A25,IF(E26=\"ja\",A26,IF(E27=\"ja\",A27,IF(E28=\"ja\",A28,IF(E29=\"ja\",A29,IF(A30=\"ja\",A30,\"Volgepland\")))))))))))))))))))","v":"2021-01-11"},null,null,null,null,0,null,null,0,0,null,null,0]
["2021-01-10",{"$f":"WEEKNUM(Tabel_kalender[[#This Row],[Datum]],21)","v":1},"1900-01-07",null,"nee",{"$f":"IF(Tabel_kalender[[#This Row],[Werkdag]]=\"ja\",Tabel_kalender[[#This Row],[Datum]],IF(E14=\"ja\",A14,IF(E15=\"ja\",A15,IF(E16=\"ja\",A16,IF(E17=\"ja\",A17,IF(E18=\"ja\",A18,IF(E19=\"ja\",A19,IF(E20=\"ja\",A20,IF(E21=\"ja\",A21,IF(E22=\"ja\",A22,IF(E23=\"ja\",A23,IF(E24=\"ja\",A24,IF(E25=\"ja\",A25,IF(E26=\"ja\",A26,IF(E27=\"ja\",A27,IF(E28=\"ja\",A28,IF(E29=\"ja\",A29,IF(E30=\"ja\",A30,IF(A31=\"ja\",A31,\"Volgepland\")))))))))))))))))))","v":"2021-01-11"},null,null,null,null,0,null,null,0,0,null,null,0]
["2021-01-11",{"$f":"WEEKNUM(Tabel_kalender[[#This Row],[Datum]],21)","v":2},"1900-01-01",null,"ja",{"$f":"IF(Tabel_kalender[[#This Row],[Werkdag]]=\"ja\",Tabel_kalender[[#This Row],[Datum]],IF(E15=\"ja\",A15,IF(E16=\"ja\",A16,IF(E17=\"ja\",A17,IF(E18=\"ja\",A18,IF(E19=\"ja\",A19,IF(E20=\"ja\",A20,IF(E21=\"ja\",A21,IF(E22=\"ja\",A22,IF(E23=\"ja\",A23,IF(E24=\"ja\",A24,IF(E25=\"ja\",A25,IF(E26=\"ja\",A26,IF(E27=\"ja\",A27,IF(E28=\"ja\",A28,IF(E29=\"ja\",A29,IF(E30=\"ja\",A30,IF(E31=\"ja\",A31,IF(A32=\"ja\",A32,\"Volgepland\")))))))))))))))))))","v":"2021-01-11"},null,null,null,null,0,null,null,0,0,null,null,0]
["2021-01-12",{"$f":"WEEKNUM(Tabel_kalender[[#This Row],[Datum]],21)","v":2},"1900-01-02",null,"ja",{"$f":"IF(Tabel_kalender[[#This Row],[Werkdag]]=\"ja\",Tabel_kalender[[#This Row],[Datum]],IF(E16=\"ja\",A16,IF(E17=\"ja\",A17,IF(E18=\"ja\",A18,IF(E19=\"ja\",A19,IF(E20=\"ja\",A20,IF(E21=\"ja\",A21,IF(E22=\"ja\",A22,IF(E23=\"ja\",A23,IF(E24=\"ja\",A24,IF(E25=\"ja\",A25,IF(E26=\"ja\",A26,IF(E27=\"ja\",A27,IF(E28=\"ja\",A28,IF(E29=\"ja\",A29,IF(E30=\"ja\",A30,IF(E31=\"ja\",A31,IF(E32=\"ja\",A32,IF(A33=\"ja\",A33,\"Volgepland\")))))))))))))))))))","v":"2021-01-12"},null,null,null,null,0,null,null,0,0,null,null,0]
["2021-01-13",{"$f":"WEEKNUM(Tabel_kalender[[#This Row],[Datum]],21)","v":2},"1900-01-03",null,"ja",{"$f":"IF(Tabel_kalender[[#This Row],[Werkdag]]=\"ja\",Tabel_kalender[[#This Row],[Datum]],IF(E17=\"ja\",A17,IF(E18=\"ja\",A18,IF(E19=\"ja\",A19,IF(E20=\"ja\",A20,IF(E21=\"ja\",A21,IF(E22=\"ja\",A22,IF(E23=\"ja\",A23,IF(E24=\"ja\",A24,IF(E25=\"ja\",A25,IF(E26=\"ja\",A26,IF(E27=\"ja\",A27,IF(E28=\"ja\",A28,IF(E29=\"ja\",A29,IF(E30=\"ja\",A30,IF(E31=\"ja\",A31,IF(E32=\"ja\",A32,IF(E33=\"ja\",A33,IF(A34=\"ja\",A34,\"Volgepland\")))))))))))))))))))","v":"2021-01-13"},null,null,null,null,0,null,null,0,0,null,null,0]
["2021-01-14",{"$f":"WEEKNUM(Tabel_kalender[[#This Row],[Datum]],21)","v":2},"1900-01-04",null,"ja",{"$f":"IF(Tabel_kalender[[#This Row],[Werkdag]]=\"ja\",Tabel_kalender[[#This Row],[Datum]],IF(E18=\"ja\",A18,IF(E19=\"ja\",A19,IF(E20=\"ja\",A20,IF(E21=\"ja\",A21,IF(E22=\"ja\",A22,IF(E23=\"ja\",A23,IF(E24=\"ja\",A24,IF(E25=\"ja\",A25,IF(E26=\"ja\",A26,IF(E27=\"ja\",A27,IF(E28=\"ja\",A28,IF(E29=\"ja\",A29,IF(E30=\"ja\",A30,IF(E31=\"ja\",A31,IF(E32=\"ja\",A32,IF(E33=\"ja\",A33,IF(E34=\"ja\",A34,IF(A35=\"ja\",A35,\"Volgepland\")))))))))))))))))))","v":"2021-01-14"},null,null,null,null,0,null,null,0,0,null,null,0]
["2021-01-15",{"$f":"WEEKNUM(Tabel_kalender[[#This Row],[Datum]],21)","v":2},"1900-01-05",null,"ja",{"$f":"IF(Tabel_kalender[[#This Row],[Werkdag]]=\"ja\",Tabel_kalender[[#This Row],[Datum]],IF(E19=\"ja\",A19,IF(E20=\"ja\",A20,IF(E21=\"ja\",A21,IF(E22=\"ja\",A22,IF(E23=\"ja\",A23,IF(E24=\"ja\",A24,IF(E25=\"ja\",A25,IF(E26=\"ja\",A26,IF(E27=\"ja\",A27,IF(E28=\"ja\",A28,IF(E29=\"ja\",A29,IF(E30=\"ja\",A30,IF(E31=\"ja\",A31,IF(E32=\"ja\",A32,IF(E33=\"ja\",A33,IF(E34=\"ja\",A34,IF(E35=\"ja\",A35,IF(A36=\"ja\",A36,\"Volgepland\")))))))))))))))))))","v":"2021-01-15"},null,null,null,null,0,null,null,0,0,null,null,0]
["2021-01-16",{"$f":"WEEKNUM(Tabel_kalender[[#This Row],[Datum]],21)","v":2},"1900-01-06",null,"nee",{"$f":"IF(Tabel_kalender[[#This Row],[Werkdag]]=\"ja\",Tabel_kalender[[#This Row],[Datum]],IF(E20=\"ja\",A20,IF(E21=\"ja\",A21,IF(E22=\"ja\",A22,IF(E23=\"ja\",A23,IF(E24=\"ja\",A24,IF(E25=\"ja\",A25,IF(E26=\"ja\",A26,IF(E27=\"ja\",A27,IF(E28=\"ja\",A28,IF(E29=\"ja\",A29,IF(E30=\"ja\",A30,IF(E31=\"ja\",A31,IF(E32=\"ja\",A32,IF(E33=\"ja\",A33,IF(E34=\"ja\",A34,IF(E35=\"ja\",A35,IF(E36=\"ja\",A36,IF(A37=\"ja\",A37,\"Volgepland\")))))))))))))))))))","v":"2021-01-18"},null,null,null,null,0,null,null,0,0,null,null,0]
["2021-01-17",{"$f":"WEEKNUM(Tabel_kalender[[#This Row],[Datum]],21)","v":2},"1900-01-07",null,"nee",{"$f":"IF(Tabel_kalender[[#This Row],[Werkdag]]=\"ja\",Tabel_kalender[[#This Row],[Datum]],IF(E21=\"ja\",A21,IF(E22=\"ja\",A22,IF(E23=\"ja\",A23,IF(E24=\"ja\",A24,IF(E25=\"ja\",A25,IF(E26=\"ja\",A26,IF(E27=\"ja\",A27,IF(E28=\"ja\",A28,IF(E29=\"ja\",A29,IF(E30=\"ja\",A30,IF(E31=\"ja\",A31,IF(E32=\"ja\",A32,IF(E33=\"ja\",A33,IF(E34=\"ja\",A34,IF(E35=\"ja\",A35,IF(E36=\"ja\",A36,IF(E37=\"ja\",A37,IF(A38=\"ja\",A38,\"Volgepland\")))))))))))))))))))","v":"2021-01-18"},null,null,null,null,0,null,null,0,0,null,null,0]
["2021-01-18",{"$f":"WEEKNUM(Tabel_kalender[[#This Row],[Datum]],21)","v":3},"1900-01-01",null,"ja",{"$f":"IF(Tabel_kalender[[#This Row],[Werkdag]]=\"ja\",Tabel_kalender[[#This Row],[Datum]],IF(E22=\"ja\",A22,IF(E23=\"ja\",A23,IF(E24=\"ja\",A24,IF(E25=\"ja\",A25,IF(E26=\"ja\",A26,IF(E27=\"ja\",A27,IF(E28=\"ja\",A28,IF(E29=\"ja\",A29,IF(E30=\"ja\",A30,IF(E31=\"ja\",A31,IF(E32=\"ja\",A32,IF(E33=\"ja\",A33,IF(E34=\"ja\",A34,IF(E35=\"ja\",A35,IF(E36=\"ja\",A36,IF(E37=\"ja\",A37,IF(E38=\"ja\",A38,IF(A39=\"ja\",A39,\"Volgepland\")))))))))))))))))))","v":"2021-01-18"},null,null,null,null,0,null,null,0,0,null,null,0]
["2021-01-19",{"$f":"WEEKNUM(Tabel_kalender[[#This Row],[Datum]],21)","v":3},"1900-01-02",null,"ja",{"$f":"IF(Tabel_kalender[[#This Row],[Werkdag]]=\"ja\",Tabel_kalender[[#This Row],[Datum]],IF(E23=\"ja\",A23,IF(E24=\"ja\",A24,IF(E25=\"ja\",A25,IF(E26=\"ja\",A26,IF(E27=\"ja\",A27,IF(E28=\"ja\",A28,IF(E29=\"ja\",A29,IF(E30=\"ja\",A30,IF(E31=\"ja\",A31,IF(E32=\"ja\",A32,IF(E33=\"ja\",A33,IF(E34=\"ja\",A34,IF(E35=\"ja\",A35,IF(E36=\"ja\",A36,IF(E37=\"ja\",A37,IF(E38=\"ja\",A38,IF(E39=\"ja\",A39,IF(A40=\"ja\",A40,\"Volgepland\")))))))))))))))))))","v":"2021-01-19"},null,null,null,null,0,null,null,0,0,null,null,0]
["2021-01-20",{"$f":"WEEKNUM(Tabel_kalender[[#This Row],[Datum]],21)","v":3},"1900-01-03",null,"ja",{"$f":"IF(Tabel_kalender[[#This Row],[Werkdag]]=\"ja\",Tabel_kalender[[#This Row],[Datum]],IF(E24=\"ja\",A24,IF(E25=\"ja\",A25,IF(E26=\"ja\",A26,IF(E27=\"ja\",A27,IF(E28=\"ja\",A28,IF(E29=\"ja\",A29,IF(E30=\"ja\",A30,IF(E31=\"ja\",A31,IF(E32=\"ja\",A32,IF(E33=\"ja\",A33,IF(E34=\"ja\",A34,IF(E35=\"ja\",A35,IF(E36=\"ja\",A36,IF(E37=\"ja\",A37,IF(E38=\"ja\",A38,IF(E39=\"ja\",A39,IF(E40=\"ja\",A40,IF(A41=\"ja\",A41,\"Volgepland\")))))))))))))))))))","v":"2021-01-20"},null,null,null,null,0,null,null,0,0,null,null,0]
["2021-01-21",{"$f":"WEEKNUM(Tabel_kalender[[#This Row],[Datum]],21)","v":3},"1900-01-04",null,"ja",{"$f":"IF(Tabel_kalender[[#This Row],[Werkdag]]=\"ja\",Tabel_kalender[[#This Row],[Datum]],IF(E25=\"ja\",A25,IF(E26=\"ja\",A26,IF(E27=\"ja\",A27,IF(E28=\"ja\",A28,IF(E29=\"ja\",A29,IF(E30=\"ja\",A30,IF(E31=\"ja\",A31,IF(E32=\"ja\",A32,IF(E33=\"ja\",A33,IF(E34=\"ja\",A34,IF(E35=\"ja\",A35,IF(E36=\"ja\",A36,IF(E37=\"ja\",A37,IF(E38=\"ja\",A38,IF(E39=\"ja\",A39,IF(E40=\"ja\",A40,IF(E41=\"ja\",A41,IF(A42=\"ja\",A42,\"Volgepland\")))))))))))))))))))","v":"2021-01-21"},null,null,null,null,0,null,null,0,0,null,null,0]
["2021-01-22",{"$f":"WEEKNUM(Tabel_kalender[[#This Row],[Datum]],21)","v":3},"1900-01-05",null,"ja",{"$f":"IF(Tabel_kalender[[#This Row],[Werkdag]]=\"ja\",Tabel_kalender[[#This Row],[Datum]],IF(E26=\"ja\",A26,IF(E27=\"ja\",A27,IF(E28=\"ja\",A28,IF(E29=\"ja\",A29,IF(E30=\"ja\",A30,IF(E31=\"ja\",A31,IF(E32=\"ja\",A32,IF(E33=\"ja\",A33,IF(E34=\"ja\",A34,IF(E35=\"ja\",A35,IF(E36=\"ja\",A36,IF(E37=\"ja\",A37,IF(E38=\"ja\",A38,IF(E39=\"ja\",A39,IF(E40=\"ja\",A40,IF(E41=\"ja\",A41,IF(E42=\"ja\",A42,IF(A43=\"ja\",A43,\"Volgepland\")))))))))))))))))))","v":"2021-01-22"},null,null,null,null,0,null,null,0,0,null,null,0]
["2021-01-23",{"$f":"WEEKNUM(Tabel_kalender[[#This Row],[Datum]],21)","v":3},"1900-01-06",null,"nee",{"$f":"IF(Tabel_kalender[[#This Row],[Werkdag]]=\"ja\",Tabel_kalender[[#This Row],[Datum]],IF(E27=\"ja\",A27,IF(E28=\"ja\",A28,IF(E29=\"ja\",A29,IF(E30=\"ja\",A30,IF(E31=\"ja\",A31,IF(E32=\"ja\",A32,IF(E33=\"ja\",A33,IF(E34=\"ja\",A34,IF(E35=\"ja\",A35,IF(E36=\"ja\",A36,IF(E37=\"ja\",A37,IF(E38=\"ja\",A38,IF(E39=\"ja\",A39,IF(E40=\"ja\",A40,IF(E41=\"ja\",A41,IF(E42=\"ja\",A42,IF(E43=\"ja\",A43,IF(A44=\"ja\",A44,\"Volgepland\")))))))))))))))))))","v":"2021-01-25"},null,null,null,null,0,null,null,0,0,null,null,0]
["2021-01-24",{"$f":"WEEKNUM(Tabel_kalender[[#This Row],[Datum]],21)","v":3},"1900-01-07",null,"nee",{"$f":"IF(Tabel_kalender[[#This Row],[Werkdag]]=\"ja\",Tabel_kalender[[#This Row],[Datum]],IF(E28=\"ja\",A28,IF(E29=\"ja\",A29,IF(E30=\"ja\",A30,IF(E31=\"ja\",A31,IF(E32=\"ja\",A32,IF(E33=\"ja\",A33,IF(E34=\"ja\",A34,IF(E35=\"ja\",A35,IF(E36=\"ja\",A36,IF(E37=\"ja\",A37,IF(E38=\"ja\",A38,IF(E39=\"ja\",A39,IF(E40=\"ja\",A40,IF(E41=\"ja\",A41,IF(E42=\"ja\",A42,IF(E43=\"ja\",A43,IF(E44=\"ja\",A44,IF(A45=\"ja\",A45,\"Volgepland\")))))))))))))))))))","v":"2021-01-25"},null,null,null,null,0,null,null,0,0,null,null,0]
["2021-01-25",{"$f":"WEEKNUM(Tabel_kalender[[#This Row],[Datum]],21)","v":4},"1900-01-01",null,"ja",{"$f":"IF(Tabel_kalender[[#This Row],[Werkdag]]=\"ja\",Tabel_kalender[[#This Row],[Datum]],IF(E29=\"ja\",A29,IF(E30=\"ja\",A30,IF(E31=\"ja\",A31,IF(E32=\"ja\",A32,IF(E33=\"ja\",A33,IF(E34=\"ja\",A34,IF(E35=\"ja\",A35,IF(E36=\"ja\",A36,IF(E37=\"ja\",A37,IF(E38=\"ja\",A38,IF(E39=\"ja\",A39,IF(E40=\"ja\",A40,IF(E41=\"ja\",A41,IF(E42=\"ja\",A42,IF(E43=\"ja\",A43,IF(E44=\"ja\",A44,IF(E45=\"ja\",A45,IF(A46=\"ja\",A46,\"Volgepland\")))))))))))))))))))","v":"2021-01-25"},null,null,null,null,0,null,null,0,0,null,null,0]
["2021-01-26",{"$f":"WEEKNUM(Tabel_kalender[[#This Row],[Datum]],21)","v":4},"1900-01-02",null,"ja",{"$f":"IF(Tabel_kalender[[#This Row],[Werkdag]]=\"ja\",Tabel_kalender[[#This Row],[Datum]],IF(E30=\"ja\",A30,IF(E31=\"ja\",A31,IF(E32=\"ja\",A32,IF(E33=\"ja\",A33,IF(E34=\"ja\",A34,IF(E35=\"ja\",A35,IF(E36=\"ja\",A36,IF(E37=\"ja\",A37,IF(E38=\"ja\",A38,IF(E39=\"ja\",A39,IF(E40=\"ja\",A40,IF(E41=\"ja\",A41,IF(E42=\"ja\",A42,IF(E43=\"ja\",A43,IF(E44=\"ja\",A44,IF(E45=\"ja\",A45,IF(E46=\"ja\",A46,IF(A47=\"ja\",A47,\"Volgepland\")))))))))))))))))))","v":"2021-01-26"},null,null,null,null,0,null,null,0,0,null,null,0]
["2021-01-27",{"$f":"WEEKNUM(Tabel_kalender[[#This Row],[Datum]],21)","v":4},"1900-01-03",null,"ja",{"$f":"IF(Tabel_kalender[[#This Row],[Werkdag]]=\"ja\",Tabel_kalender[[#This Row],[Datum]],IF(E31=\"ja\",A31,IF(E32=\"ja\",A32,IF(E33=\"ja\",A33,IF(E34=\"ja\",A34,IF(E35=\"ja\",A35,IF(E36=\"ja\",A36,IF(E37=\"ja\",A37,IF(E38=\"ja\",A38,IF(E39=\"ja\",A39,IF(E40=\"ja\",A40,IF(E41=\"ja\",A41,IF(E42=\"ja\",A42,IF(E43=\"ja\",A43,IF(E44=\"ja\",A44,IF(E45=\"ja\",A45,IF(E46=\"ja\",A46,IF(E47=\"ja\",A47,IF(A48=\"ja\",A48,\"Volgepland\")))))))))))))))))))","v":"2021-01-27"},null,null,null,null,0,null,null,0,0,null,null,0]
{"$rows_left_out":704}
{"sheet":"Relaties","index":2,"n_rows":3,"n_cols":26,"rows_kept":3,"cut":false,"hidden":false,"merged":[[0,20,0,25],[0,2,0,7],[0,8,0,13]]}
["Relaties",null,null,null,null,null,null,null,null,null,null,null,null,null,null,null,null,null,null,""]
["Klantnr","Taak","Titel","Aanhef","Naam","Tussenv","Voorletter","Bedrijfsnaam","Adres","Postcode","Woonplaats","Telefoon-1","Telefoon-2","E-mailadres","Opmerkingen","Freq wk","Stuksprijs","BTW","Burenkorting","Planning","Wknr","Dgnr","Combinr","Offertenr","Opdrachtbev.nr","Factuurnr"]
["0002","0","dhr.",{"$f":"IF(C3=\"mevr.\",\"mevrouw\",IF(C3=\"dhr.\",\"heer\",IF(C3=\"fam.\",\"familie\",\"\")))","v":"heer"},"Vries","de","R.",null,"Distelpad 18","XXXXGL","Assen",null,null,null,null,null,null,null,null,null,{"$f":"IF(OR(T3=\"nvt\",T3=0),0,_xlfn.ISOWEEKNUM(Relaties!T3))","v":0},{"$f":"IF(OR(T3=\"nvt\",T3=0),0,WEEKDAY(T3,2))","v":0},{"$f":"IF(B3=0,A3&\"0\",A3&B3)","v":"00020"}]

{"sheet":"Factuur","index":3,"n_rows":54,"n_cols":14,"rows_kept":54,"cut":false,"hidden":false,"merged":[[24,4,24,5],[22,4,22,6],[6,0,6,1],[23,0,23,1],[6,2,6,3],[7,2,7,3],[8,2,8,3],[9,2,9,3],[10,2,10,3],[11,2,11,3],[12,2,12,3],[16,0,16,1],[23,4,23,5]]}
[null,null,null,null,"Combinummer(5 cijfers)","00020",null,null,null,null,null,null,null,{"$f":"IF(C39=\"BTW \"&Instellingen!A14&\"%\",\"Laag\",\"Hoog\")","v":"Hoog"}]
[null,null,null,null,"Totaal aant. relaties",{"$f":"COUNTA(Relaties!A:A)-1","v":2},null,null,null,null,null,null,null,{"$f":"IF(B41=\"voldaan contant\",\"Kas\",\"Verkoop\")","v":"Verkoop"}]
[null,null,null,null,null,null,null,null,null,null,null,null,null,"Omzet"]
["FACTUUR",null,null,null,null,null,null,null,null,null,null,null,null,{"$f":"IF(B41=\"voldaan met pinautomaat\",\"SumUp pid\",\"\")","v":""}]
[]
[]
[{"$f":"IF(INDEX(Relaties!H:H,MATCH(F1,Relaties!W:W,0))=0,\" \",INDEX(Relaties!H:H,MATCH(F1,Relaties!W:W,0)))","v":" "},null,{"$f":"Instellingen!A4","v":0},null,"1) Zijn de persoons- en adresgegevens in cel A7 t/m A11 juist? (cel A7 is de evt. bedrijfsnaam)"]
["Ter attentie van:",{"$f":"IF(INDEX(Relaties!F:F,MATCH(F1,Relaties!W:W,0))=0,INDEX(Relaties!C:C,MATCH(F1,Relaties!W:W,0))&\" \"&INDEX(Relaties!G:G,MATCH(F1,Relaties!W:W,0))&\" \"&INDEX(Relaties!E:E,MATCH(F1,Relaties!W:W,0)),INDEX(Relaties!G:G,MATCH(F1,Relaties!W:W,0))&\" \"&INDEX(Relaties!F:F,MATCH(F1,Relaties!W:W,0))&\" \"&INDEX(Relaties!E:E,MATCH(F1,Relaties!W:W,0)))","v":"R. de Vries"},{"$f":"Instellingen!A5&\" \"&Instellingen!A6","v":" "},null,"2) Is de dag van de uitgevoerde werkzaamheden juist? (Cel D23)"]
["Straat en Huisnr:",{"$f":"INDEX(Relaties!I:I,MATCH(F1,Relaties!W:W,0))","v":"Distelpad 18"},{"$f":"Instellingen!A7","v":0},null,"2) Is de tekst in de cel Opmerkingen juist? (cel B23)"]
["Postcode en Plaats:",{"$f":"INDEX(Relaties!J:J,MATCH(F1,Relaties!W:W,0))&\" \"&INDEX(Relaties!K:K,MATCH(F1,Relaties!W:W,0))","v":"XXXXGL Assen"},{"$f":"Instellingen!A8","v":0},null,"3) Is het Totaalbedrag juist? (cel D41)"]
["E-mailadres: ",{"$f":"INDEX(Relaties!N:N,MATCH(F1,Relaties!W:W,0))","v":0},{"$f":"Instellingen!A9","v":0},null,"4) Is de juiste Betaalwijze geselecteerd? (cel B41)"]
["Relatienummer: ",{"$f":"LEFT(F1,4)","v":"0002"},{"$f":"Instellingen!A10","v":0},null,"5) Klik dan op de blauwe knop Factuur, Boeking en e-mail genereren"]
["Factuurnummer:",20210241,"BTW nummer: NL078991717B01",null,"    Een nieuw factuurnummer wordt aangemaakt, uitgeprint en in het werkblad Boekingen in het grootboek \"Verkoop\" geplaatst"]
[null,null,null,null,"    Ook wordt een e-mail aangemaakt, in de map \"Postvak Uit\" van Outlook gezet en verzonden"]
[{"$f":"Instellingen!A6&\", \"&TEXT(TODAY(),\"DD-MM-JJJJ\")","v":", 05-05-2021"}]
[null," "]
[{"$f":"IF(INDEX(Relaties!F:F,MATCH(F1,Relaties!W:W,0))=0,\"Geachte \"&INDEX(Relaties!D:D,MATCH(F1,Relaties!W:W,0))&\" \"&INDEX(Relaties!E:E,MATCH(F1,Relaties!W:W,0))&\",\",\"Geachte \"&INDEX(Relaties!D:D,MATCH(F1,Relaties!W:W,0))&\" \"&INDEX(Relaties!F:F,MATCH(F1,Relaties!W:W,0))&\" \"&INDEX(Relaties!E:E,MATCH(F1,Relaties!W:W,0))&\",\")","v":"Geachte heer de Vries,"}]
[]
["Voor het verrichten van de ondergenoemde werkzaamheden verzoeken wij u het betreffende "]
["totaalbedrag binnen 15 dagen aan ons over te maken. Vermeld daarbij a.u.b. uw factuurnummer."]
[]
["Informatie:"]
["Opmerkingen:",{"$f":"IF(INDEX(Relaties!O:O,MATCH(F1,Relaties!W:W,0))=0,\" \",INDEX(Relaties!O:O,MATCH(F1,Relaties!W:W,0)))","v":" "},"Uitgevoerd op:","2021-02-09","Volgende reinigingsdatum wijzigen?!"]
[{"$f":"\"Door u gewenste frequentie in weken:\"&\" \"&INDEX(Relaties!P:P,MATCH($F$1,Relaties!W:W,0))","v":"Door u gewenste frequentie in weken: "},null,"Volgende reiniging op:",{"$f":"IF(G25<>0,G25,E25)","v":"nvt"},"Geplande reinigingsdatum ",null,"Nieuwe reinigingsdatum"]
[null,null,null,null,{"$f":"IFERROR(INDEX(Kalender!F:F,MATCH(IF(INDEX(Relaties!P:P*7,MATCH($F$1,Relaties!W:W,0))=0,0,(INDEX(Relaties!P:P*7,MATCH($F$1,Relaties!W:W,0))+D23)),Kalender!A:A,0)),\"nvt\")","v":"nvt"}]
["Aantal","Omschrijving",{"$f":"\"Stuksprijs \"&INDEX(Relaties!R:R,MATCH(F1,Relaties!W:W,0))","v":"Stuksprijs "},"Totaal"]
[null,"Reinigingswerkzaamheden volgens afspraak",{"$f":"IF(B27=Instellingen!A27,\"\",INDEX(Relaties!Q:Q,MATCH(F1,Relaties!W:W,0)))","v":0},{"$f":"C27","v":0}]
[null,null,null,{"$f":"IF(A28>=1,A28*C28,C28)","v":0}]
[null,null,null,60]
[null,null,null,0]
{"$rows_left_out":24}