{"text_format":"1","workbook":"xlsx","n_sheets":3,"sheets":["Blad1","Blad2","Blad3"],"not_rendered":{"charts":0,"images":2,"macros":1,"external_links":0,"defined_names":1,"comments":0,"pivot_tables":0},"unopened":[],"bounds":{"document_bytes":16777216,"sheet_cells":100000,"rows_first":2000,"rows_last":500,"rows_between":2000,"halvings":0,"cell_chars":16384,"cell_head_chars":4096},"cells_cut":0,"cells_raw":0,"read":"whole","date_system":"1900"}

{"sheet":"Blad1","index":0,"n_rows":61,"n_cols":13,"rows_kept":61,"cut":false,"hidden":false,"merged":[]}
["naam","aanwezig",null,null,"Reeks 1",null,null,null,"reeks 2",null,null,null,"Reeks 3"]
[1,"x",null,"Baan 1",null,null,null,"Baan 1",null,null,null,"Baan 1"]
[2,"x"]
[3,"x",11,"Baan 2",null,null,null,"Baan 2",null,null,null,"Baan 2"]
[4,"x"]
[5,"x",null,"Baan 3",null,null,null,"Baan 3",null,null,null,"Baan 3"]
[6,"x"]
[7,"x",null,"Baan 4",null,null,null,"Baan 4",null,null,null,"Baan 4"]
[8,"x"]
[9,"x",null,"Baan 5",null,null,null,"Baan 5",null,null,null,"Baan 5"]
[10,"x"]
[11,null,null,"Baan 6",null,null,null,"Baan 6",null,null,null,"Baan 6"]
[12]
[13,null,null,"Baan 7",null,null,null,"Baan 7",null,null,null,"Baan 7"]
[14,"x"]
[15,"x",null,"Baan 8",null,null,null,"Baan 8",null,null,null,"Baan 8"]
[16]
[17,null,null,"Baan 9",null,null,null,"Baan 9",null,null,null,"Baan 9"]
[18]
[19,null,null,"Baan 10",null,null,null,"Baan 10",null,null,null,"Baan 10"]
[20,"x"]
[21,"x"]
[22,"x"]
[23,"x"]
[24,"x"]
[25,"x"]
[26,"x"]
[27,"x"]
[28,"x"]
[29,"x"]
[30]
[31]
[32]
[33]
[34]
[35]
[36]
[37]
[38]
[39]
[40]
[41,"x"]
[42,"x"]
[43,"x"]
[44,"x"]
[45,"x"]
[46,"x"]
[47,"x"]
[48,"x"]
[49,"x"]
[50,"x"]
[51]
[52]
[53]
[54]
[55]
[56]
[57]
[58]
[59]
[60]

{"sheet":"Blad2","index":1,"n_rows":61,"n_cols":12,"rows_kept":61,"cut":false,"hidden":false,"merged":[]}
["naam","aanwezig",null,null,null,null,27,"x",0.99623468935024384,{"$f":"IF(H1<>\"\",RANK(I1,$I$1:$I$61),\"\")","v":1},null,32]
[1,{"$f":"IF(Blad1!B2<>\"\",Blad1!B2,\"\")","v":"x"},{"$f":"RAND()","v":0.8990230801020076},null,null,null,45,"x",0.94121779893616553,{"$f":"IF(H2<>\"\",RANK(I2,$I$1:$I$61),\"\")","v":2}]
[2,{"$f":"IF(Blad1!B3<>\"\",Blad1!B3,\"\")","v":"x"},{"$f":"RAND()","v":0.2520400560292998},null,null,null,14,"x",0.82757834062101598,{"$f":"IF(H3<>\"\",RANK(I3,$I$1:$I$61),\"\")","v":3}]
[3,{"$f":"IF(Blad1!B4<>\"\",Blad1!B4,\"\")","v":"x"},0.97547199495123471,null,null,null,48,"x",0.80680823207908359,{"$f":"IF(H4<>\"\",RANK(I4,$I$1:$I$61),\"\")","v":4}]
[4,{"$f":"IF(Blad1!B5<>\"\",Blad1!B5,\"\")","v":"x"},0.55796678569039404,null,null,null,24,"x",0.78039549850211398,{"$f":"IF(H5<>\"\",RANK(I5,$I$1:$I$61),\"\")","v":5}]
[5,{"$f":"IF(Blad1!B6<>\"\",Blad1!B6,\"\")","v":"x"},0.59657128243003421,null,null,null,1,"x",0.58091184826456677,{"$f":"IF(H6<>\"\",RANK(I6,$I$1:$I$61),\"\")","v":6}]
[6,{"$f":"IF(Blad1!B7<>\"\",Blad1!B7,\"\")","v":"x"},0.98184356957146579,null,null,null,4,"x",0.57148813803486342,{"$f":"IF(H7<>\"\",RANK(I7,$I$1:$I$61),\"\")","v":7}]
[7,{"$f":"IF(Blad1!B8<>\"\",Blad1!B8,\"\")","v":"x"},5.1136621393060855E-3,null,null,null,50,"x",0.54273422864155307,{"$f":"IF(H8<>\"\",RANK(I8,$I$1:$I$61),\"\")","v":8}]
[8,{"$f":"IF(Blad1!B9<>\"\",Blad1!B9,\"\")","v":"x"},0.35229825141369675,null,null,null,15,"x",0.51278085091771763,{"$f":"IF(H9<>\"\",RANK(I9,$I$1:$I$61),\"\")","v":9}]
[9,{"$f":"IF(Blad1!B10<>\"\",Blad1!B10,\"\")","v":"x"},0.16004643445153088,null,null,null,23,"x",0.50311485568703562,{"$f":"IF(H10<>\"\",RANK(I10,$I$1:$I$61),\"\")","v":10}]
[10,{"$f":"IF(Blad1!B11<>\"\",Blad1!B11,\"\")","v":"x"},0.36605977500922715,null,null,null,25,"x",0.44724162744654095,{"$f":"IF(H11<>\"\",RANK(I11,$I$1:$I$61),\"\")","v":11}]
[11,{"$f":"IF(Blad1!B12<>\"\",Blad1!B12,\"\")","v":""},0.84779131205156544,null,null,null,7,"x",0.40817364172662807,{"$f":"IF(H12<>\"\",RANK(I12,$I$1:$I$61),\"\")","v":12}]
[12,{"$f":"IF(Blad1!B13<>\"\",Blad1!B13,\"\")","v":""},6.6295305007443295E-2,null,null,null,20,"x",0.40119047447996359,{"$f":"IF(H13<>\"\",RANK(I13,$I$1:$I$61),\"\")","v":13}]
[13,{"$f":"IF(Blad1!B14<>\"\",Blad1!B14,\"\")","v":""},0.34032085437690429,null,null,null,22,"x",0.33833749526322399,{"$f":"IF(H14<>\"\",RANK(I14,$I$1:$I$61),\"\")","v":14}]
[14,{"$f":"IF(Blad1!B15<>\"\",Blad1!B15,\"\")","v":"x"},0.53481619011516657,null,null,null,29,"x",0.31074504037284278,{"$f":"IF(H15<>\"\",RANK(I15,$I$1:$I$61),\"\")","v":15}]
[15,{"$f":"IF(Blad1!B16<>\"\",Blad1!B16,\"\")","v":"x"},0.37584364798088998,null,null,null,21,"x",0.30349358785947023,{"$f":"IF(H16<>\"\",RANK(I16,$I$1:$I$61),\"\")","v":16}]
[16,{"$f":"IF(Blad1!B17<>\"\",Blad1!B17,\"\")","v":""},0.65184731678384411,null,null,null,8,"x",0.28167356363460638,{"$f":"IF(H17<>\"\",RANK(I17,$I$1:$I$61),\"\")","v":17}]
[17,{"$f":"IF(Blad1!B18<>\"\",Blad1!B18,\"\")","v":""},0.86392684770113348,null,null,null,49,"x",0.24645712133895048,{"$f":"IF(H18<>\"\",RANK(I18,$I$1:$I$61),\"\")","v":18}]
[18,{"$f":"IF(Blad1!B19<>\"\",Blad1!B19,\"\")","v":""},0.40256154660322463,null,null,null,46,"x",0.2030685944400924,{"$f":"IF(H19<>\"\",RANK(I19,$I$1:$I$61),\"\")","v":19}]
[19,{"$f":"IF(Blad1!B20<>\"\",Blad1!B20,\"\")","v":""},2.2137997774947071E-2,null,null,null,47,"x",0.20140130474788553,{"$f":"IF(H20<>\"\",RANK(I20,$I$1:$I$61),\"\")","v":20}]
[20,{"$f":"IF(Blad1!B21<>\"\",Blad1!B21,\"\")","v":"x"},0.78339856417173337,null,null,null,10,"x",0.19576018935782113,{"$f":"IF(H21<>\"\",RANK(I21,$I$1:$I$61),\"\")","v":21}]
[21,{"$f":"IF(Blad1!B22<>\"\",Blad1!B22,\"\")","v":"x"},0.19063207164472173,null,null,null,9,"x",0.18033677852626739,{"$f":"IF(H22<>\"\",RANK(I22,$I$1:$I$61),\"\")","v":22}]
[22,{"$f":"IF(Blad1!B23<>\"\",Blad1!B23,\"\")","v":"x"},0.35395362948499187,null,null,null,28,"x",0.17671577566090058,{"$f":"IF(H23<>\"\",RANK(I23,$I$1:$I$61),\"\")","v":23}]
[23,{"$f":"IF(Blad1!B24<>\"\",Blad1!B24,\"\")","v":"x"},0.96831847994943532,null,null,null,2,"x",0.16454341594959077,{"$f":"IF(H24<>\"\",RANK(I24,$I$1:$I$61),\"\")","v":24}]
[24,{"$f":"IF(Blad1!B25<>\"\",Blad1!B25,\"\")","v":"x"},0.73796878946812694,null,null,null,44,"x",0.16141813685784889,{"$f":"IF(H25<>\"\",RANK(I25,$I$1:$I$61),\"\")","v":25}]
[25,{"$f":"IF(Blad1!B26<>\"\",Blad1!B26,\"\")","v":"x"},4.8073222265144433E-2,null,null,null,43,"x",0.15498859184144487,{"$f":"IF(H26<>\"\",RANK(I26,$I$1:$I$61),\"\")","v":26}]
[26,{"$f":"IF(Blad1!B27<>\"\",Blad1!B27,\"\")","v":"x"},0.4694052013166059,null,null,null,5,"x",0.12073498126716542,{"$f":"IF(H27<>\"\",RANK(I27,$I$1:$I$61),\"\")","v":27}]
[27,{"$f":"IF(Blad1!B28<>\"\",Blad1!B28,\"\")","v":"x"},0.27360163671668802,null,null,null,26,"x",0.11882965335017237,{"$f":"IF(H28<>\"\",RANK(I28,$I$1:$I$61),\"\")","v":28}]
[28,{"$f":"IF(Blad1!B29<>\"\",Blad1!B29,\"\")","v":"x"},0.60003698674680583,null,null,null,6,"x",7.2048530407013089E-2,{"$f":"IF(H29<>\"\",RANK(I29,$I$1:$I$61),\"\")","v":29}]
[29,{"$f":"IF(Blad1!B30<>\"\",Blad1!B30,\"\")","v":"x"},0.79704567845424656,null,null,null,3,"x",4.9013330458572812E-2,{"$f":"IF(H30<>\"\",RANK(I30,$I$1:$I$61),\"\")","v":30}]
[30,{"$f":"IF(Blad1!B31<>\"\",Blad1!B31,\"\")","v":""},0.85981302588761799,null,null,null,41,"x",8.0303780755539567E-3,{"$f":"IF(H31<>\"\",RANK(I31,$I$1:$I$61),\"\")","v":31}]
[31,{"$f":"IF(Blad1!B32<>\"\",Blad1!B32,\"\")","v":""},0.67099716856730052,null,null,null,42,"x",7.8182957403387654E-3,{"$f":"IF(H32<>\"\",RANK(I32,$I$1:$I$61),\"\")","v":32}]
[32,{"$f":"IF(Blad1!B33<>\"\",Blad1!B33,\"\")","v":""},0.91634637838320665,null,null,null,null,null,null,{"$f":"IF(H33<>\"\",RANK(I33,$I$1:$I$61),\"\")","v":""}]
[33,{"$f":"IF(Blad1!B34<>\"\",Blad1!B34,\"\")","v":""},0.2296861653809148,null,null,null,null,null,null,{"$f":"IF(H34<>\"\",RANK(I34,$I$1:$I$61),\"\")","v":""}]
[34,{"$f":"IF(Blad1!B35<>\"\",Blad1!B35,\"\")","v":""},0.24678109912476798,null,null,null,null,null,null,{"$f":"IF(H35<>\"\",RANK(I35,$I$1:$I$61),\"\")","v":""}]
[35,{"$f":"IF(Blad1!B36<>\"\",Blad1!B36,\"\")","v":""},0.67169478999026044,null,null,null,null,null,null,{"$f":"IF(H36<>\"\",RANK(I36,$I$1:$I$61),\"\")","v":""}]
[36,{"$f":"IF(Blad1!B37<>\"\",Blad1!B37,\"\")","v":""},0.63573315639318506,null,null,null,null,null,null,{"$f":"IF(H37<>\"\",RANK(I37,$I$1:$I$61),\"\")","v":""}]
[37,{"$f":"IF(Blad1!B38<>\"\",Blad1!B38,\"\")","v":""},0.8424131460709976,null,null,null,null,null,null,{"$f":"IF(H38<>\"\",RANK(I38,$I$1:$I$61),\"\")","v":""}]
[38,{"$f":"IF(Blad1!B39<>\"\",Blad1!B39,\"\")","v":""},0.43313520089641722,null,null,null,null,null,null,{"$f":"IF(H39<>\"\",RANK(I39,$I$1:$I$61),\"\")","v":""}]
[39,{"$f":"IF(Blad1!B40<>\"\",Blad1!B40,\"\")","v":""},0.32329593813550361,null,null,null,null,null,null,{"$f":"IF(H40<>\"\",RANK(I40,$I$1:$I$61),\"\")","v":""}]
[40,{"$f":"IF(Blad1!B41<>\"\",Blad1!B41,\"\")","v":""},0.97679430042230286,null,null,null,null,null,null,{"$f":"IF(H41<>\"\",RANK(I41,$I$1:$I$61),\"\")","v":""}]
[41,{"$f":"IF(Blad1!B42<>\"\",Blad1!B42,\"\")","v":"x"},0.92284351166900569,null,null,null,null,null,null,{"$f":"IF(H42<>\"\",RANK(I42,$I$1:$I$61),\"\")","v":""}]
[42,{"$f":"IF(Blad1!B43<>\"\",Blad1!B43,\"\")","v":"x"},0.93530671491901551,null,null,null,null,null,null,{"$f":"IF(H43<>\"\",RANK(I43,$I$1:$I$61),\"\")","v":""}]
[43,{"$f":"IF(Blad1!B44<>\"\",Blad1!B44,\"\")","v":"x"},0.68018852493443072,null,null,null,null,null,null,{"$f":"IF(H44<>\"\",RANK(I44,$I$1:$I$61),\"\")","v":""}]
[44,{"$f":"IF(Blad1!B45<>\"\",Blad1!B45,\"\")","v":"x"},0.9714553557530945,null,null,null,null,null,null,{"$f":"IF(H45<>\"\",RANK(I45,$I$1:$I$61),\"\")","v":""}]
[45,{"$f":"IF(Blad1!B46<>\"\",Blad1!B46,\"\")","v":"x"},0.92981320127801848,null,null,null,null,null,null,{"$f":"IF(H46<>\"\",RANK(I46,$I$1:$I$61),\"\")","v":""}]
[46,{"$f":"IF(Blad1!B47<>\"\",Blad1!B47,\"\")","v":"x"},0.64405817595513615,null,null,null,null,null,null,{"$f":"IF(H47<>\"\",RANK(I47,$I$1:$I$61),\"\")","v":""}]
[47,{"$f":"IF(Blad1!B48<>\"\",Blad1!B48,\"\")","v":"x"},7.4495689158499911E-2,null,null,null,null,null,null,{"$f":"IF(H48<>\"\",RANK(I48,$I$1:$I$61),\"\")","v":""}]
[48,{"$f":"IF(Blad1!B49<>\"\",Blad1!B49,\"\")","v":"x"},0.62376071943312827,null,null,null,null,null,null,{"$f":"IF(H49<>\"\",RANK(I49,$I$1:$I$61),\"\")","v":""}]
[49,{"$f":"IF(Blad1!B50<>\"\",Blad1!B50,\"\")","v":"x"},0.15847956075085057,null,null,null,null,null,null,{"$f":"IF(H50<>\"\",RANK(I50,$I$1:$I$61),\"\")","v":""}]
[50,{"$f":"IF(Blad1!B51<>\"\",Blad1!B51,\"\")","v":"x"},0.65569908621231832,null,null,null,null,null,null,{"$f":"IF(H51<>\"\",RANK(I51,$I$1:$I$61),\"\")","v":""}]
[51,{"$f":"IF(Blad1!B52<>\"\",Blad1!B52,\"\")","v":""},1.0558632114671007E-2,null,null,null,null,null,null,{"$f":"IF(H52<>\"\",RANK(I52,$I$1:$I$61),\"\")","v":""}]
[52,{"$f":"IF(Blad1!B53<>\"\",Blad1!B53,\"\")","v":""},0.63598538925723014,null,null,null,null,null,null,{"$f":"IF(H53<>\"\",RANK(I53,$I$1:$I$61),\"\")","v":""}]
[53,{"$f":"IF(Blad1!B54<>\"\",Blad1!B54,\"\")","v":""},0.54232670210153655,null,null,null,null,null,null,{"$f":"IF(H54<>\"\",RANK(I54,$I$1:$I$61),\"\")","v":""}]
[54,{"$f":"IF(Blad1!B55<>\"\",Blad1!B55,\"\")","v":""},0.1813807844572447,null,null,null,null,null,null,{"$f":"IF(H55<>\"\",RANK(I55,$I$1:$I$61),\"\")","v":""}]
[55,{"$f":"IF(Blad1!B56<>\"\",Blad1!B56,\"\")","v":""},0.65090295949290955,null,null,null,null,null,null,{"$f":"IF(H56<>\"\",RANK(I56,$I$1:$I$61),\"\")","v":""}]
[56,{"$f":"IF(Blad1!B57<>\"\",Blad1!B57,\"\")","v":""},0.88693329007335331,null,null,null,null,null,null,{"$f":"IF(H57<>\"\",RANK(I57,$I$1:$I$61),\"\")","v":""}]
[57,{"$f":"IF(Blad1!B58<>\"\",Blad1!B58,\"\")","v":""},0.20134761569848869,null,null,null,null,null,null,{"$f":"IF(H58<>\"\",RANK(I58,$I$1:$I$61),\"\")","v":""}]
[58,{"$f":"IF(Blad1!B59<>\"\",Blad1!B59,\"\")","v":""},0.26404992300369556,null,null,null,null,null,null,{"$f":"IF(H59<>\"\",RANK(I59,$I$1:$I$61),\"\")","v":""}]
[59,{"$f":"IF(Blad1!B60<>\"\",Blad1!B60,\"\")","v":""},0.84593426854152742,null,null,null,null,null,null,{"$f":"IF(H60<>\"\",RANK(I60,$I$1:$I$61),\"\")","v":""}]
[60,{"$f":"IF(Blad1!B61<>\"\",Blad1!B61,\"\")","v":""},0.76620000085969631,null,null,null,null,null,null,{"$f":"IF(H61<>\"\",RANK(I61,$I$1:$I$61),\"\")","v":""}]

{"sheet":"Blad3","index":2,"n_rows":0,"n_cols":0,"rows_kept":0,"cut":false,"hidden":false,"merged":[]}