{"text_format":"1","workbook":"xlsx","n_sheets":4,"sheets":["2 poules","4 poules","8 poules","deelnemers"],"not_rendered":{"charts":0,"images":1,"macros":1,"external_links":0,"defined_names":1,"comments":0,"pivot_tables":0},"unopened":[],"bounds":{"document_bytes":16777216,"sheet_cells":100000,"rows_first":2000,"rows_last":500,"rows_between":2000,"halvings":0,"cell_chars":16384,"cell_head_chars":4096},"cells_cut":0,"cells_raw":0,"read":"whole","date_system":"1900"}

{"sheet":"2 poules","index":0,"n_rows":54,"n_cols":16,"rows_kept":54,"cut":false,"hidden":false,"merged":[[52,3,52,5],[1,1,1,3],[1,5,1,7],[2,2,2,3],[2,6,2,7],[50,3,50,5],[5,2,5,3],[5,6,5,7],[3,2,3,3],[3,6,3,7],[4,2,4,3],[4,6,4,7]]}
[]
[null,"Poule 1",null,null,null,"Poule 2",null,null,null,null,"Vul namen in op blad deelnemers."]
[null,"A","Linda",null,null,"A","Lutgarde"]
[null,"B","Sonja",null,null,"B","Ronny"]
[null,"C","Frederik",null,null,"C","Ludo"]
[null,"D","Emiel",null,null,"D","Robin"]
[]
[null,"Wedstrijd 1",null,null,null,"Wedstrijd 1"]
[null,"A",{"$f":"C3","v":"Linda"},null,null,"A",{"$f":"G3","v":"Lutgarde"},null,{"$f":"IF(H9=3,2,0)","v":0}]
[null,"B",{"$f":"C4","v":"Sonja"},null,null,"B",{"$f":"G4","v":"Ronny"},null,{"$f":"IF(H10=3,2,0)","v":0}]
[null,"C",{"$f":"C5","v":"Frederik"},null,null,"C",{"$f":"G5","v":"Ludo"},null,0]
[null,"D",{"$f":"C6","v":"Emiel"},null,null,"D",{"$f":"G6","v":"Robin"},null,0]
[null,"Wedstrijd 2",null,null,null,"Wedstrijd 2",null,null,0]
[null,"A",{"$f":"C3","v":"Linda"},null,null,"A",{"$f":"G3","v":"Lutgarde"},null,0]
[null,"C",{"$f":"C5","v":"Frederik"},null,null,"C",{"$f":"G5","v":"Ludo"},null,{"$f":"IF(H15=3,2,0)","v":0}]
[null,"B",{"$f":"C4","v":"Sonja"},null,null,"B",{"$f":"G4","v":"Ronny"},null,0]
[null,"D",{"$f":"C6","v":"Emiel"},null,null,"D",{"$f":"G6","v":"Robin"},null,0]
[null,"Wedstrijd 3",null,null,null,"Wedstrijd 3",null,null,0]
[null,"A",{"$f":"C3","v":"Linda"},null,null,"A",{"$f":"G3","v":"Lutgarde"},null,0]
[null,"D",{"$f":"C6","v":"Emiel"},null,null,"D",{"$f":"G6","v":"Robin"},null,0]
[null,"B",{"$f":"C4","v":"Sonja"},null,null,"B",{"$f":"G4","v":"Ronny"},null,0,null,"de rangschikking en het invullen van de halve finalses zal gebeuren na het invullen van de blauwe cel"]
[null,"C",{"$f":"C5","v":"Frederik"},null,null,"C",{"$f":"G5","v":"Ludo"},null,0]
[]
[null,"Legs","Naam","Punten",null,"Legs","Naam","Punten"]
[null,{"$f":"SUMIF($C$9:$C$22,C25,$D$9:$D$22)","v":0},"Linda",{"$f":"COUNTIFS($C$9:$C$22,C25,$D$9:$D$22,3)*2","v":0},null,{"$f":"SUMIF($G$9:$G$22,G25,$H$9:$H$22)","v":0},"Lutgarde",{"$f":"SUMIF($G$9:$G$22,G25,$I$9:$I$22)","v":0}]
[null,{"$f":"SUMIF($C$9:$C$22,C26,$D$9:$D$22)","v":0},"Sonja",{"$f":"COUNTIFS($C$9:$C$22,C26,$D$9:$D$22,3)*2","v":0},null,{"$f":"SUMIF($G$9:$G$22,G26,$H$9:$H$22)","v":0},"Ronny",{"$f":"SUMIF($G$9:$G$22,G26,$I$9:$I$22)","v":0}]
[null,{"$f":"SUMIF($C$9:$C$22,C27,$D$9:$D$22)","v":0},"Frederik",{"$f":"COUNTIFS($C$9:$C$22,C27,$D$9:$D$22,3)*2","v":0},null,{"$f":"SUMIF($G$9:$G$22,G27,$H$9:$H$22)","v":0},"Ludo",{"$f":"SUMIF($G$9:$G$22,G27,$I$9:$I$22)","v":0}]
[null,{"$f":"SUMIF($C$9:$C$22,C28,$D$9:$D$22)","v":0},"Emiel",{"$f":"COUNTIFS($C$9:$C$22,C28,$D$9:$D$22,3)*2","v":0},null,{"$f":"SUMIF($G$9:$G$22,G28,$H$9:$H$22)","v":0},"Robin",{"$f":"SUMIF($G$9:$G$22,G28,$I$9:$I$22)","v":0}]
[]
[null,"Halve finales"]
[]
[null,"A ronde",null,null,null,"B ronde"]
[null,"A1"]
[null,"B2"]
[]
[null,"B1"]
[null,"A2"]
[]
[]
[null,"Finales"]
[]
[null,"A ronde",null,null,null,"B ronde"]
[null,"WA1",{"$f":"IF(OR(D33=3,D34=3),IF(D33>D34,C33,C34),\"\")","v":""},null,null,"WC1",{"$f":"IF(OR(H33=3,H34=3),IF(H33>H34,G33,G34),\"\")","v":""}]
[null,"WB1",{"$f":"IF(OR(D36=3,D37=3),IF(D36>D37,C36,C37),\"\")","v":""},null,null,"WC2",{"$f":"IF(OR(H36=3,H37=3),IF(H36>H37,G36,G37),\"\")","v":""}]
[]
[]
[]
[]
[null,null,null,null,null,null,null,null,null,null,"Is het mogelijk te controleren: 1) mag nooit meer dan 3 zijn",null,null,null,null,"via validatie"]
[null,null,null,null,null,null,null,null,null,null,null,null,"2) en de volgende kan geen 3 ingeven",null,null,"via macro"]
[null,null,null,{"$f":"IF(G51<>\"\",\"Winnaar A\",\"\")","v":""},null,null,{"$f":"IF(OR(D43=3,D44=3),IF(D43>D44,C43,C44),\"\")","v":""}]
[]
[null,null,null,{"$f":"IF(G53<>\"\",\"Winnaar B\",\"\")","v":""},null,null,{"$f":"IF(OR(H43=3,H44=3),IF(H43>H44,G43,G44),\"\")","v":""}]
[null,null,null,null,null,null,null,null,null,null,"\"=ALS(D43>D44;C43;C44)\"",null,null,"De formule aangepast zo blijft de cel leeg tot er een winnar is"]

{"sheet":"4 poules","index":1,"n_rows":68,"n_cols":16,"rows_kept":68,"cut":false,"hidden":false,"merged":[[1,1,1,3],[1,5,1,7],[1,9,1,11],[1,13,1,15],[2,2,2,3],[2,6,2,7],[2,10,2,11],[2,14,2,15],[5,14,5,15],[3,2,3,3],[3,6,3,7],[3,10,3,11],[3,14,3,15],[4,2,4,3],[4,6,4,7],[4,10,4,11],[4,14,4,15],[65,3,65,5],[67,3,67,5],[5,2,5,3],[5,6,5,7],[5,10,5,11]]}
[]
[null,"Poule 1",null,null,null,"Poule 2",null,null,null,"Poule 3",null,null,null,"Poule 4"]
[null,"A","deelnemer 21",null,null,"A","deelnemer 22",null,null,"A","deelnemer 20",null,null,"A","deelnemer 26"]
[null,"B","deelnemer 25",null,null,"B","deelnemer 22",null,null,"B","deelnemer 19",null,null,"B","deelnemer 24"]
[null,"C","deelnemer 18",null,null,"C","deelnemer 4",null,null,"C","deelnemer 24",null,null,"C","deelnemer 9"]
[null,"D","deelnemer 17",null,null,"D","deelnemer 15",null,null,"D","deelnemer 23",null,null,"D","deelnemer 25"]
[]
[null,"Wedstrijd 1",null,null,null,"Wedstrijd 1",null,null,null,"Wedstrijd 1",null,null,null,"Wedstrijd 1"]
[null,"A",{"$f":"IF(B9=B3,C3,IF(B9=B4,C4,IF(B9=B5,C5,IF(B9=B6,C6))))","v":"deelnemer 21"},null,null,"A",{"$f":"IF(F9=F3,G3,IF(F9=F4,G4,IF(F9=F5,G5,IF(F9=F6,G6))))","v":"deelnemer 22"},null,null,"A",{"$f":"IF(J9=J3,K3,IF(J9=J4,K4,IF(J9=J5,K5,IF(J9=J6,K6))))","v":"deelnemer 20"},null,null,"A",{"$f":"IF(N9=N3,O3,IF(N9=N4,O4,IF(N9=N5,O5,IF(N9=N6,O6))))","v":"deelnemer 26"}]
[null,"B",{"$f":"IF(B10=B3,C3,IF(B10=B4,C4,IF(B10=B5,C5,IF(B10=B6,C6))))","v":"deelnemer 25"},null,null,"B",{"$f":"IF(F10=F3,G3,IF(F10=F4,G4,IF(F10=F5,G5,IF(F10=F6,G6))))","v":"deelnemer 22"},null,null,"B",{"$f":"IF(J10=J3,K3,IF(J10=J4,K4,IF(J10=J5,K5,IF(J10=J6,K6))))","v":"deelnemer 19"},null,null,"B",{"$f":"IF(N10=N3,O3,IF(N10=N4,O4,IF(N10=N5,O5,IF(N10=N6,O6))))","v":"deelnemer 24"}]
[null,"C",{"$f":"IF(B11=B3,C3,IF(B11=B4,C4,IF(B11=B5,C5,IF(B11=B6,C6))))","v":"deelnemer 18"},null,null,"C",{"$f":"IF(F11=F3,G3,IF(F11=F4,G4,IF(F11=F5,G5,IF(F11=F6,G6))))","v":"deelnemer 4"},null,null,"C",{"$f":"IF(J11=J3,K3,IF(J11=J4,K4,IF(J11=J5,K5,IF(J11=J6,K6))))","v":"deelnemer 24"},null,null,"C",{"$f":"IF(N11=N3,O3,IF(N11=N4,O4,IF(N11=N5,O5,IF(N11=N6,O6))))","v":"deelnemer 9"}]
[null,"D",{"$f":"IF(B12=B3,C3,IF(B12=B4,C4,IF(B12=B5,C5,IF(B12=B6,C6))))","v":"deelnemer 17"},null,null,"D",{"$f":"IF(F12=F3,G3,IF(F12=F4,G4,IF(F12=F5,G5,IF(F12=F6,G6))))","v":"deelnemer 15"},null,null,"D",{"$f":"IF(J12=J3,K3,IF(J12=J4,K4,IF(J12=J5,K5,IF(J12=J6,K6))))","v":"deelnemer 23"},null,null,"D",{"$f":"IF(N12=N3,O3,IF(N12=N4,O4,IF(N12=N5,O5,IF(N12=N6,O6))))","v":"deelnemer 25"}]
[null,"Wedstrijd 2",null,null,null,"Wedstrijd 2",null,null,null,"Wedstrijd 2",null,null,null,"Wedstrijd 2"]
[null,"A",{"$f":"IF(B14=B3,C3,IF(B14=B4,C4,IF(B14=B5,C5,IF(B14=B6,C6))))","v":"deelnemer 21"},null,null,"A",{"$f":"IF(F14=F3,G3,IF(F14=F4,G4,IF(F14=F5,G5,IF(F14=F6,G6))))","v":"deelnemer 22"},null,null,"A",{"$f":"IF(J14=J3,K3,IF(J14=J4,K4,IF(J14=J5,K5,IF(J14=J6,K6))))","v":"deelnemer 20"},null,null,"A",{"$f":"IF(N14=N3,O3,IF(N14=N4,O4,IF(N14=N5,O5,IF(N14=N6,O6))))","v":"deelnemer 26"}]
[null,"C",{"$f":"IF(B15=B3,C3,IF(B15=B4,C4,IF(B15=B5,C5,IF(B15=B6,C6))))","v":"deelnemer 18"},null,null,"C",{"$f":"IF(F15=F3,G3,IF(F15=F4,G4,IF(F15=F5,G5,IF(F15=F6,G6))))","v":"deelnemer 4"},null,null,"C",{"$f":"IF(J15=J3,K3,IF(J15=J4,K4,IF(J15=J5,K5,IF(J15=J6,K6))))","v":"deelnemer 24"},null,null,"C",{"$f":"IF(N15=N3,O3,IF(N15=N4,O4,IF(N15=N5,O5,IF(N15=N6,O6))))","v":"deelnemer 9"}]
[null,"B",{"$f":"IF(B16=B3,C3,IF(B16=B4,C4,IF(B16=B5,C5,IF(B16=B6,C6))))","v":"deelnemer 25"},null,null,"B",{"$f":"IF(F16=F3,G3,IF(F16=F4,G4,IF(F16=F5,G5,IF(F16=F6,G6))))","v":"deelnemer 22"},null,null,"B",{"$f":"IF(J16=J3,K3,IF(J16=J4,K4,IF(J16=J5,K5,IF(J16=J6,K6))))","v":"deelnemer 19"},null,null,"B",{"$f":"IF(N16=N3,O3,IF(N16=N4,O4,IF(N16=N5,O5,IF(N16=N6,O6))))","v":"deelnemer 24"}]
[null,"D",{"$f":"IF(B17=B3,C3,IF(B17=B4,C4,IF(B17=B5,C5,IF(B17=B6,C6))))","v":"deelnemer 17"},null,null,"D",{"$f":"IF(F17=F3,G3,IF(F17=F4,G4,IF(F17=F5,G5,IF(F17=F6,G6))))","v":"deelnemer 15"},null,null,"D",{"$f":"IF(J17=J3,K3,IF(J17=J4,K4,IF(J17=J5,K5,IF(J17=J6,K6))))","v":"deelnemer 23"},null,null,"D",{"$f":"IF(N17=N3,O3,IF(N17=N4,O4,IF(N17=N5,O5,IF(N17=N6,O6))))","v":"deelnemer 25"}]
[null,"Wedstrijd 3",null,null,null,"Wedstrijd 3",null,null,null,"Wedstrijd 3",null,null,null,"Wedstrijd 3"]
[null,"A",{"$f":"IF(B19=B3,C3,IF(B19=B4,C4,IF(B19=B5,C5,IF(B19=B6,C6))))","v":"deelnemer 21"},null,null,"A",{"$f":"IF(F19=F3,G3,IF(F19=F4,G4,IF(F19=F5,G5,IF(F19=F6,G6))))","v":"deelnemer 22"},null,null,"A",{"$f":"IF(J19=J3,K3,IF(J19=J4,K4,IF(J19=J5,K5,IF(J19=J6,K6))))","v":"deelnemer 20"},null,null,"A",{"$f":"IF(N19=N3,O3,IF(N19=N4,O4,IF(N19=N5,O5,IF(N19=N6,O6))))","v":"deelnemer 26"}]
[null,"D",{"$f":"IF(B20=B3,C3,IF(B20=B4,C4,IF(B20=B5,C5,IF(B20=B6,C6))))","v":"deelnemer 17"},null,null,"D",{"$f":"IF(F20=F3,G3,IF(F20=F4,G4,IF(F20=F5,G5,IF(F20=F6,G6))))","v":"deelnemer 15"},null,null,"D",{"$f":"IF(J20=J3,K3,IF(J20=J4,K4,IF(J20=J5,K5,IF(J20=J6,K6))))","v":"deelnemer 23"},null,null,"D",{"$f":"IF(N20=N3,O3,IF(N20=N4,O4,IF(N20=N5,O5,IF(N20=N6,O6))))","v":"deelnemer 25"}]
[null,"B",{"$f":"IF(B21=B3,C3,IF(B21=B4,C4,IF(B21=B5,C5,IF(B21=B6,C6))))","v":"deelnemer 25"},null,null,"B",{"$f":"IF(F21=F3,G3,IF(F21=F4,G4,IF(F21=F5,G5,IF(F21=F6,G6))))","v":"deelnemer 22"},null,null,"B",{"$f":"IF(J21=J3,K3,IF(J21=J4,K4,IF(J21=J5,K5,IF(J21=J6,K6))))","v":"deelnemer 19"},null,null,"B",{"$f":"IF(N21=N3,O3,IF(N21=N4,O4,IF(N21=N5,O5,IF(N21=N6,O6))))","v":"deelnemer 24"}]
[null,"C",{"$f":"IF(B22=B3,C3,IF(B22=B4,C4,IF(B22=B5,C5,IF(B22=B6,C6))))","v":"deelnemer 18"},null,null,"C",{"$f":"IF(F22=F3,G3,IF(F22=F4,G4,IF(F22=F5,G5,IF(F22=F6,G6))))","v":"deelnemer 4"},null,null,"C",{"$f":"IF(J22=J3,K3,IF(J22=J4,K4,IF(J22=J5,K5,IF(J22=J6,K6))))","v":"deelnemer 24"},null,null,"C",{"$f":"IF(N22=N3,O3,IF(N22=N4,O4,IF(N22=N5,O5,IF(N22=N6,O6))))","v":"deelnemer 9"}]
[]
[null,"Legs","Naam","Punten",null,"Legs","Naam","Punten",null,"Legs","Naam","Punten",null,"Legs","Naam","Punten"]
[null,{"$f":"SUMIF($C$9:$C$22,C25,$D$9:$D$22)","v":0},"deelnemer 21",{"$f":"COUNTIFS($C$9:$C$22,C25,$D$9:$D$22,3)*2","v":0},null,{"$f":"SUMIF($G$9:$G$22,G25,$H$9:$H$22)","v":0},"deelnemer 22",{"$f":"COUNTIFS($G$9:$G$22,G25,$H$9:$H$22,3)*2","v":0},null,{"$f":"SUMIF($K$9:$K$22,K25,$L$9:$L$22)","v":0},"deelnemer 20",{"$f":"COUNTIFS($K$9:$K$22,K25,$L$9:$L$22,3)*2","v":0},null,{"$f":"SUMIF($O$9:$O$22,O25,$P$9:$P$22)","v":0},"deelnemer 9",{"$f":"COUNTIFS($O$9:$O$22,O25,$P$9:$P$22,3)*2","v":0}]
[null,{"$f":"SUMIF($C$9:$C$22,C26,$D$9:$D$22)","v":0},"deelnemer 25",{"$f":"COUNTIFS($C$9:$C$22,C26,$D$9:$D$22,3)*2","v":0},null,{"$f":"SUMIF($G$9:$G$22,G26,$H$9:$H$22)","v":0},"deelnemer 22",{"$f":"COUNTIFS($G$9:$G$22,G26,$H$9:$H$22,3)*2","v":0},null,{"$f":"SUMIF($K$9:$K$22,K26,$L$9:$L$22)","v":0},"deelnemer 19",{"$f":"COUNTIFS($K$9:$K$22,K26,$L$9:$L$22,3)*2","v":0},null,{"$f":"SUMIF($O$9:$O$22,O26,$P$9:$P$22)","v":0},"deelnemer 26",{"$f":"COUNTIFS($O$9:$O$22,O26,$P$9:$P$22,3)*2","v":0}]
[null,{"$f":"SUMIF($C$9:$C$22,C27,$D$9:$D$22)","v":0},"deelnemer 18",{"$f":"COUNTIFS($C$9:$C$22,C27,$D$9:$D$22,3)*2","v":0},null,{"$f":"SUMIF($G$9:$G$22,G27,$H$9:$H$22)","v":0},"deelnemer 4",{"$f":"COUNTIFS($G$9:$G$22,G27,$H$9:$H$22,3)*2","v":0},null,{"$f":"SUMIF($K$9:$K$22,K27,$L$9:$L$22)","v":0},"deelnemer 24",{"$f":"COUNTIFS($K$9:$K$22,K27,$L$9:$L$22,3)*2","v":0},null,{"$f":"SUMIF($O$9:$O$22,O27,$P$9:$P$22)","v":0},"deelnemer 24",{"$f":"COUNTIFS($O$9:$O$22,O27,$P$9:$P$22,3)*2","v":0}]
[null,{"$f":"SUMIF($C$9:$C$22,C28,$D$9:$D$22)","v":0},"deelnemer 17",{"$f":"COUNTIFS($C$9:$C$22,C28,$D$9:$D$22,3)*2","v":0},null,{"$f":"SUMIF($G$9:$G$22,G28,$H$9:$H$22)","v":0},"deelnemer 15",{"$f":"COUNTIFS($G$9:$G$22,G28,$H$9:$H$22,3)*2","v":0},null,{"$f":"SUMIF($K$9:$K$22,K28,$L$9:$L$22)","v":0},"deelnemer 23",{"$f":"COUNTIFS($K$9:$K$22,K28,$L$9:$L$22,3)*2","v":0},null,{"$f":"SUMIF($O$9:$O$22,O28,$P$9:$P$22)","v":0},"deelnemer 25",{"$f":"COUNTIFS($O$9:$O$22,O28,$P$9:$P$22,3)*2","v":0}]
[]
[null,"Kwart finales",null,null,null,null,null,null,null,null,null,null,null,null,"best of",7]
[]
[null,null,"A ronde",null,null,null,null,null,null,null,"A ronde"]
[null,"A1","deelnemer 21",null,null,null,null,null,null,"C1","deelnemer 20"]
[null,"B2","deelnemer 22",null,null,null,null,null,null,"D2","deelnemer 26"]
[null,null," ",null,null,null,null,null,null,null," "]
[null,"B1","deelnemer 22",null,null,null,null,null,null,"D1","deelnemer 9"]
[null,"A2","deelnemer 25",null,null,null,null,null,null,"C2","deelnemer 19"]
[]
[null,null,"B ronde",null,null,null,null,null,null,null,"B ronde"]
[null,"A3","deelnemer 18",null,null,null,null,null,null,"C3","deelnemer 24"]
[null,"B4","deelnemer 15",null,null,null,null,null,null,"D4","deelnemer 25"]
[null,null," ",null,null,null,null,null,null,null," "]
[null,"B3","deelnemer 4",null,null,null,null,null,null,"C4","deelnemer 24"]
[null,"A4","deelnemer 17",null,null,null,null,null,null,"D3","deelnemer 23"]
[]
[null,"Halve finales",null,null,null,null,null,null,null,null,null,null,null,null,"best of",7]
[]
[null,null,"A ronde",null,null,null,null,null,null,null,"A ronde"]
[null,"WA1",{"$f":"IF(OR(D33>P30/2,D34>P30/2),IF(D33>D34,C33,C34),\"\")","v":""},null,null,null,null,null,null,"WA3",{"$f":"IF(OR(L33>P30/2,L34>P30/2),IF(L33>L34,K33,K34),\"\")","v":""}]
[null,"WB1",{"$f":"IF(OR(D36>P30/2,D37>P30/2),IF(D36>D37,C36,C37),\"\")","v":""},null,null,null,null,null,null,"WB3"]
[]
[null,null,"B ronde",null,null,null,null,null,null,null,"B ronde"]
[null,"WC1",{"$f":"IF(OR(D40>P30/2,D41>P30/2),IF(D40>D41,C40,C41),\"\")","v":""},null,null,null,null,null,null,"WC3",{"$f":"IF(OR(L40>P30/2,L41>P30/2),IF(L40>L41,K40,K41),\"\")","v":""}]
[null,"WC2",{"$f":"IF(OR(D43>P30/2,D44>P30/2),IF(D43>D44,C43,C44),\"\")","v":""},null,null,null,null,null,null,"WC4",{"$f":"IF(OR(L43>P30/2,L44>P30/2),IF(L43>L44,K43,K44),\"\")","v":""}]
[]
[null,"Finales met 4 poules",null,null,null,null,null,null,null,null,null,null,null,null,"best of",7]
[]
[null,null,null,null,null,null,"A ronde"]
[null,null,null,null,null,"WA1",{"$f":"IF(OR(D49>P46/2,D50>P46/2),IF(D49>D50,C49,C50),\"\")","v":""}]
[null,null,null,null,null,"WA3",{"$f":"IF(OR(L49>P46/2,L50>P46/2),IF(L49>L50,K49,K50),\"\")","v":""}]
[]
[null,null,null,null,null,null,"B ronde"]
[null,null,null,null,null,"WC1",{"$f":"IF(OR(D53>P46/2,D54>P46/2),IF(D53>D54,C53,C54),\"\")","v":""}]
[null,null,null,null,null,"WC3",{"$f":"+IF(OR(L53>P46/2,L54>P46/2),IF(L53>L54,K53,K54),\"\")","v":""}]
[]
[null,null,null,{"$f":"IF(G66<>\"\",\"Winnaar A\",\"\")","v":""},null,null,{"$f":"IF(OR(H59>P56/2,H60>P56/2),IF(H59>H60,G59,G60),\"\")","v":""}]
[]
[null,null,null,{"$f":"IF(G68<>\"\",\"Winnaar B\",\"\")","v":""},null,null,{"$f":"IF(OR(H63>P56/2,H64>P56/2),IF(H63>H64,G63,G64),\"\")","v":""}]

{"sheet":"8 poules","index":2,"n_rows":75,"n_cols":32,"rows_kept":75,"cut":false,"hidden":false,"merged":[[1,29,1,31],[2,30,2,31],[3,30,3,31],[4,30,4,31],[5,30,5,31],[1,25,1,27],[2,26,2,27],[3,26,3,27],[4,26,4,27],[5,26,5,27],[1,21,1,23],[2,22,2,23],[3,22,3,23],[4,22,4,23],[5,22,5,23],[1,17,1,19],[2,18,2,19],[3,18,3,19],[4,18,4,19],[5,18,5,19],[1,13,1,15],[2,14,2,15],[3,14,3,15],[4,14,4,15],[5,14,5,15],[1,5,1,7],[2,6,2,7],[3,6,3,7],[4,6,4,7],[5,6,5,7],[1,9,1,11],[2,10,2,11],[3,10,3,11],[4,10,4,11],[5,10,5,11],[1,1,1,3],[2,2,2,3],[3,2,3,3],[4,2,4,3],[5,2,5,3],[7,17,7,19],[72,10,72,12],[72,13,72,15],[74,10,74,12],[74,13,74,15]]}
[]
[null,"Poule 1",null,null,null,"Poule 2",null,null,null,"Poule 3",null,null,null,"Poule 4",null,null,null,"Poule 5",null,null,null,"Poule 6",null,null,null,"Poule 7",null,null,null,"Poule 8"]
[null,"A","deelnemer 16",null,null,"A","deelnemer 14",null,null,"A","deelnemer 7",null,null,"A","deelnemer 8",null,null,"A","deelnemer 6",null,null,"A","deelnemer 9",null,null,"A","deelnemer 26",null,null,"A","deelnemer 22"]
[null,"B","deelnemer 20",null,null,"B","deelnemer 13",null,null,"B","deelnemer 21",null,null,"B","deelnemer 17",null,null,"B","deelnemer 19",null,null,"B","deelnemer 5",null,null,"B","deelnemer 12",null,null,"B","deelnemer 18"]
[null,"C","deelnemer 25",null,null,"C","deelnemer 27",null,null,"C","deelnemer 1",null,null,"C","deelnemer 24",null,null,"C","deelnemer 28",null,null,"C","deelnemer 10",null,null,"C","deelnemer 32",null,null,"C","deelnemer 3"]
[null,"D","deelnemer 11",null,null,"D","deelnemer 4",null,null,"D","deelnemer 29",null,null,"D","deelnemer 30",null,null,"D","deelnemer 15",null,null,"D","deelnemer 31",null,null,"D","deelnemer 23",null,null,"D","deelnemer 2"]
[]
[null,"Wedstrijd 1",null,null,null,"Wedstrijd 1",null,null,null,"Wedstrijd 1",null,null,null,"Wedstrijd 1",null,null,null,"Wedstrijd 1",null,null,null,"Wedstrijd 1",null,null,null,"Wedstrijd 1",null,null,null,"Wedstrijd 1"]
[null,"A",{"$f":"C3","v":"deelnemer 16"},null,null,"A",{"$f":"G3","v":"deelnemer 14"},null,null,"A",{"$f":"K3","v":"deelnemer 7"},null,null,"A",{"$f":"O3","v":"deelnemer 8"},null,null,"A",{"$f":"S3","v":"deelnemer 6"},null,null,"A",{"$f":"W3","v":"deelnemer 9"},null,null,"A",{"$f":"AA3","v":"deelnemer 26"},null,null,"A",{"$f":"AE3","v":"deelnemer 22"}]
[null,"B",{"$f":"C4","v":"deelnemer 20"},null,null,"B",{"$f":"G4","v":"deelnemer 13"},null,null,"B",{"$f":"K4","v":"deelnemer 21"},null,null,"B",{"$f":"O4","v":"deelnemer 17"},null,null,"B",{"$f":"S4","v":"deelnemer 19"},null,null,"B",{"$f":"W4","v":"deelnemer 5"},null,null,"B",{"$f":"AA4","v":"deelnemer 12"},null,null,"B",{"$f":"AE4","v":"deelnemer 18"}]
[null,"C",{"$f":"C5","v":"deelnemer 25"},null,null,"C",{"$f":"G5","v":"deelnemer 27"},null,null,"C",{"$f":"K5","v":"deelnemer 1"},null,null,"C",{"$f":"O5","v":"deelnemer 24"},null,null,"C",{"$f":"S5","v":"deelnemer 28"},null,null,"C",{"$f":"W5","v":"deelnemer 10"},null,null,"C",{"$f":"AA5","v":"deelnemer 32"},null,null,"C",{"$f":"AE5","v":"deelnemer 3"}]
[null,"D",{"$f":"C6","v":"deelnemer 11"},null,null,"D",{"$f":"G6","v":"deelnemer 4"},null,null,"D",{"$f":"K6","v":"deelnemer 29"},null,null,"D",{"$f":"O6","v":"deelnemer 30"},null,null,"D",{"$f":"S6","v":"deelnemer 15"},null,null,"D",{"$f":"W6","v":"deelnemer 31"},null,null,"D",{"$f":"AA6","v":"deelnemer 23"},null,null,"D",{"$f":"AE6","v":"deelnemer 2"}]
[null,"Wedstrijd 2",null,null,null,"Wedstrijd 2",null,null,null,"Wedstrijd 2",null,null,null,"Wedstrijd 2",null,null,null,"Wedstrijd 2",null,null,null,"Wedstrijd 2",null,null,null,"Wedstrijd 2",null,null,null,"Wedstrijd 2"]
[null,"A",{"$f":"C3","v":"deelnemer 16"},null,null,"A",{"$f":"G3","v":"deelnemer 14"},null,null,"A",{"$f":"K3","v":"deelnemer 7"},null,null,"A",{"$f":"O3","v":"deelnemer 8"},null,null,"A",{"$f":"S3","v":"deelnemer 6"},null,null,"A",{"$f":"W3","v":"deelnemer 9"},null,null,"A",{"$f":"AA3","v":"deelnemer 26"},null,null,"A",{"$f":"AE3","v":"deelnemer 22"}]
[null,"C",{"$f":"C5","v":"deelnemer 25"},null,null,"C",{"$f":"G5","v":"deelnemer 27"},null,null,"C",{"$f":"K5","v":"deelnemer 1"},null,null,"C",{"$f":"O5","v":"deelnemer 24"},null,null,"C",{"$f":"S5","v":"deelnemer 28"},null,null,"C",{"$f":"W5","v":"deelnemer 10"},null,null,"C",{"$f":"AA5","v":"deelnemer 32"},null,null,"C",{"$f":"AE5","v":"deelnemer 3"}]
[null,"B",{"$f":"C4","v":"deelnemer 20"},null,null,"B",{"$f":"G4","v":"deelnemer 13"},null,null,"B",{"$f":"K4","v":"deelnemer 21"},null,null,"B",{"$f":"O4","v":"deelnemer 17"},null,null,"B",{"$f":"S4","v":"deelnemer 19"},null,null,"B",{"$f":"W4","v":"deelnemer 5"},null,null,"B",{"$f":"AA4","v":"deelnemer 12"},null,null,"B",{"$f":"AE4","v":"deelnemer 18"}]
[null,"D",{"$f":"C6","v":"deelnemer 11"},null,null,"D",{"$f":"G6","v":"deelnemer 4"},null,null,"D",{"$f":"K6","v":"deelnemer 29"},null,null,"D",{"$f":"O6","v":"deelnemer 30"},null,null,"D",{"$f":"S6","v":"deelnemer 15"},null,null,"D",{"$f":"W6","v":"deelnemer 31"},null,null,"D",{"$f":"AA6","v":"deelnemer 23"},null,null,"D",{"$f":"AE6","v":"deelnemer 2"}]
[null,"Wedstrijd 3",null,null,null,"Wedstrijd 3",null,null,null,"Wedstrijd 3",null,null,null,"Wedstrijd 3",null,null,null,"Wedstrijd 3",null,null,null,"Wedstrijd 3",null,null,null,"Wedstrijd 3",null,null,null,"Wedstrijd 3"]
[null,"A",{"$f":"C3","v":"deelnemer 16"},null,null,"A",{"$f":"G3","v":"deelnemer 14"},null,null,"A",{"$f":"K3","v":"deelnemer 7"},null,null,"A",{"$f":"O3","v":"deelnemer 8"},null,null,"A",{"$f":"S3","v":"deelnemer 6"},null,null,"A",{"$f":"W3","v":"deelnemer 9"},null,null,"A",{"$f":"AA3","v":"deelnemer 26"},null,null,"A",{"$f":"AE3","v":"deelnemer 22"}]
[null,"D",{"$f":"C6","v":"deelnemer 11"},null,null,"D",{"$f":"G6","v":"deelnemer 4"},null,null,"D",{"$f":"K6","v":"deelnemer 29"},null,null,"D",{"$f":"O6","v":"deelnemer 30"},null,null,"D",{"$f":"S6","v":"deelnemer 15"},null,null,"D",{"$f":"W6","v":"deelnemer 31"},null,null,"D",{"$f":"AA6","v":"deelnemer 23"},null,null,"D",{"$f":"AE6","v":"deelnemer 2"}]
[null,"B",{"$f":"C4","v":"deelnemer 20"},null,null,"B",{"$f":"G4","v":"deelnemer 13"},null,null,"B",{"$f":"K4","v":"deelnemer 21"},null,null,"B",{"$f":"O4","v":"deelnemer 17"},null,null,"B",{"$f":"S4","v":"deelnemer 19"},null,null,"B",{"$f":"W4","v":"deelnemer 5"},null,null,"B",{"$f":"AA4","v":"deelnemer 12"},null,null,"B",{"$f":"AE4","v":"deelnemer 18"}]
[null,"C",{"$f":"C5","v":"deelnemer 25"},null,null,"C",{"$f":"G5","v":"deelnemer 27"},null,null,"C",{"$f":"K5","v":"deelnemer 1"},null,null,"C",{"$f":"O5","v":"deelnemer 24"},null,null,"C",{"$f":"S5","v":"deelnemer 28"},null,null,"C",{"$f":"W5","v":"deelnemer 10"},null,null,"C",{"$f":"AA5","v":"deelnemer 32"},null,null,"C",{"$f":"AE5","v":"deelnemer 3"}]
[]
[null,"Legs","Naam","Punten",null,"Legs","Naam","Punten",null,"Legs","Naam","Punten",null,"Legs","Naam","Punten",null,"Legs","Naam","Punten",null,"Legs","Naam","Punten",null,"Legs","Naam","Punten",null,"Legs","Naam","Punten"]
[null,{"$f":"D9+D20+D15","v":0},"deelnemer 16",{"$f":"COUNTIFS(C$9:C$22,C25,D$9:D$22,3)*2","v":0},null,{"$f":"H9+H20+H15","v":0},"deelnemer 14",{"$f":"COUNTIFS(G$9:G$22,G25,H$9:H$22,3)*2","v":0},null,{"$f":"L9+L20+L15","v":0},"deelnemer 7",{"$f":"COUNTIFS(K$9:K$22,K25,L$9:L$22,3)*2","v":0},null,{"$f":"P9+P14+P17","v":0},"deelnemer 8",{"$f":"COUNTIFS(O$9:O$22,O25,P$9:P$22,3)*2","v":0},null,{"$f":"T9+T20+T15","v":0},"deelnemer 6",{"$f":"COUNTIFS(S$9:S$22,S25,T$9:T$22,3)*2","v":0},null,{"$f":"X9+X13+X20","v":0},"deelnemer 9",{"$f":"COUNTIFS(W$9:W$22,W25,X$9:X$22,3)*2","v":0},null,{"$f":"AB9+AB20+AB15","v":0},"deelnemer 26",{"$f":"COUNTIFS(AA$9:AA$22,AA25,AB$9:AB$22,3)*2","v":0},null,{"$f":"AF9+AF14+AF17","v":0},"deelnemer 22",{"$f":"COUNTIFS(AE$9:AE$22,AE25,AF$9:AF$22,3)*2","v":0}]
[null,{"$f":"D10+D14+D21","v":0},"deelnemer 20",{"$f":"COUNTIFS(C$9:C$22,C26,D$9:D$22,3)*2","v":0},null,{"$f":"H10+H14+H21","v":0},"deelnemer 13",{"$f":"COUNTIFS(G$9:G$22,G26,H$9:H$22,3)*2","v":0},null,{"$f":"L10+L15+L20","v":0},"deelnemer 21",{"$f":"COUNTIFS(K$9:K$22,K26,L$9:L$22,3)*2","v":0},null,{"$f":"P10+P15+P20","v":0},"deelnemer 17",{"$f":"COUNTIFS(O$9:O$22,O26,P$9:P$22,3)*2","v":0},null,{"$f":"T10+T14+T21","v":0},"deelnemer 19",{"$f":"COUNTIFS(S$9:S$22,S26,T$9:T$22,3)*2","v":0},null,{"$f":"X10+X15+X20","v":0},"deelnemer 5",{"$f":"COUNTIFS(W$9:W$22,W26,X$9:X$22,3)*2","v":0},null,{"$f":"AB10+AB15+AB20","v":0},"deelnemer 12",{"$f":"COUNTIFS(AA$9:AA$22,AA26,AB$9:AB$22,3)*2","v":0},null,{"$f":"AF10+AF21+AF16","v":0},"deelnemer 18",{"$f":"COUNTIFS(AE$9:AE$22,AE26,AF$9:AF$22,3)*2","v":0}]
[null,{"$f":"D11+D16+D21","v":0},"deelnemer 25",{"$f":"COUNTIFS(C$9:C$22,C27,D$9:D$22,3)*2","v":0},null,{"$f":"H11+H16+H21","v":0},"deelnemer 27",{"$f":"COUNTIFS(G$9:G$22,G27,H$9:H$22,3)*2","v":0},null,{"$f":"L11+L15+L22","v":0},"deelnemer 1",{"$f":"COUNTIFS(K$9:K$22,K27,L$9:L$22,3)*2","v":0},null,{"$f":"P11+P15+P22","v":0},"deelnemer 24",{"$f":"COUNTIFS(O$9:O$22,O27,P$9:P$22,3)*2","v":0},null,{"$f":"T11+T16+T21","v":0},"deelnemer 28",{"$f":"COUNTIFS(S$9:S$22,S27,T$9:T$22,3)*2","v":0},null,{"$f":"X11+X22+X17","v":0},"deelnemer 10",{"$f":"COUNTIFS(W$9:W$22,W27,X$9:X$22,3)*2","v":0},null,{"$f":"AB11+AB15+AB22","v":0},"deelnemer 32",{"$f":"COUNTIFS(AA$9:AA$22,AA27,AB$9:AB$22,3)*2","v":0},null,{"$f":"AF11+AF16+AF21","v":0},"deelnemer 3",{"$f":"COUNTIFS(AE$9:AE$22,AE27,AF$9:AF$22,3)*2","v":0}]
[null,{"$f":"D12+D17+D20","v":0},"deelnemer 11",{"$f":"COUNTIFS(C$9:C$22,C28,D$9:D$22,3)*2","v":0},null,{"$f":"H12+H17+H20","v":0},"deelnemer 4",{"$f":"COUNTIFS(G$9:G$22,G28,H$9:H$22,3)*2","v":0},null,{"$f":"L12+L17+L20","v":0},"deelnemer 29",{"$f":"COUNTIFS(K$9:K$22,K28,L$9:L$22,3)*2","v":0},null,{"$f":"P12+P23+P18","v":0},"deelnemer 30",{"$f":"COUNTIFS(O$9:O$22,O28,P$9:P$22,3)*2","v":0},null,{"$f":"T12+T17+T20","v":0},"deelnemer 15",{"$f":"COUNTIFS(S$9:S$22,S28,T$9:T$22,3)*2","v":0},null,{"$f":"X12+X17+X20","v":0},"deelnemer 31",{"$f":"COUNTIFS(W$9:W$22,W28,X$9:X$22,3)*2","v":0},null,{"$f":"AB12+AB17+AB20","v":0},"deelnemer 23",{"$f":"COUNTIFS(AA$9:AA$22,AA28,AB$9:AB$22,3)*2","v":0},null,{"$f":"AF12+AF16+AF23","v":0},"deelnemer 2",{"$f":"COUNTIFS(AE$9:AE$22,AE28,AF$9:AF$22,3)*2","v":0}]
[]
[null,"Kwart finales"]
[null,null,"A ronde",null,null,null,null,null,null,null,"A ronde",null,null,null,null,null,null,null,"A ronde",null,null,null,null,null,null,null,"A ronde"]
[null,"A1",null,null,null,null,null,null,null,"A3",null,null,null,null,null,null,null,"A5",null,null,null,null,null,null,null,"A7",null,null,null,null,"Best of",9]
[null,"B2",null,null,null,null,null,null,null,"B4",null,null,null,null,null,null,null,"B6",null,null,null,null,null,null,null,"B8"]
[]
[null,"B1",null,null,null,null,null,null,null,"B3",null,null,null,null,null,null,null,"B5",null,null,null,null,null,null,null,"B7"]
[null,"A2",null,null,null,null,null,null,null,"A4",null,null,null,null,null,null,null,"A6",null,null,null,null,null,null,null,"A8"]
[]
[null,null,"B ronde",null,null,null,null,null,null,null,"B ronde",null,null,null,null,null,null,null,"B ronde",null,null,null,null,null,null,null,"B ronde"]
[null,"C1",null,null,null,null,null,null,null,"C3",null,null,null,null,null,null,null,"C5",null,null,null,null,null,null,null,"C7"]
[null,"D2",null,null,null,null,null,null,null,"D4",null,null,null,null,null,null,null,"D6",null,null,null,null,null,null,null,"D8"]
[]
[null,"C2",null,null,null,null,null,null,null,"C4",null,null,null,null,null,null,null,"C6",null,null,null,null,null,null,null,"C8"]
[null,"D1",null,null,null,null,null,null,null,"D3",null,null,null,null,null,null,null,"D5",null,null,null,null,null,null,null,"D7"]
[]
[null,"Halve finales",null,null,null,null,null,null,null,null,null,null,null,null,null,null,null,null,null,null,null,null,null,null,null,null,null,null,null,null,"Best of",9]
[null,null,"A ronde",null,null,null,null,null,null,null,"A ronde",null,null,null,null,null,null,null,"A ronde",null,null,null,null,null,null,null,"A ronde"]
[null,"WA1",{"$f":"IF(OR(D32>$AF$32/2,D33>$AF$32/2),IF(D32>D33,C32,C33),\"\")","v":""},null,null,null,null,null,null,"WA3",{"$f":"IF(OR(L32>$AF$32/2,L33>$AF$32/2),IF(L32>L33,K32,K33),\"\")","v":""},null,null,null,null,null,null,"WA5",{"$f":"IF(OR(T32>$AF$32/2,T33>$AF$32/2),IF(T32>T33,S32,S33),\"\")","v":""},null,null,null,null,null,null,"WA7",{"$f":"IF(OR(AB32>$AF$32/2,AB33>$AF$32/2),IF(AB32>AB33,AA32,AA33),\"\")","v":""}]
[null,"WB1",{"$f":"IF(OR(D35>$AF$32/2,D36>$AF$32/2),IF(D35>D36,C35,C36),\"\")","v":""},null,null,null,null,null,null,"WB3",{"$f":"IF(OR(L35>$AF$32/2,L36>$AF$32/2),IF(L35>L36,K35,K36),\"\")","v":""},null,null,null,null,null,null,"WB5",{"$f":"IF(OR(T35>$AF$32/2,T36>$AF$32/2),IF(T35>T36,S35,S36),\"\")","v":""},null,null,null,null,null,null,"WB7",{"$f":"IF(OR(AB35>$AF$32/2,AB36>$AF$32/2),IF(AB35>AB36,AA35,AA36),\"\")","v":""}]
[]
[null,null,"B ronde",null,null,null,null,null,null,null,"B ronde",null,null,null,null,null,null,null,"B ronde",null,null,null,null,null,null,null,"B ronde"]
[null,"WC1",{"$f":"IF(OR(D39>$AF$32/2,D40>$AF$32/2),IF(D39>D40,C39,C40),\"\")","v":""},null,null,null,null,null,null,"WC3",{"$f":"IF(OR(L39>$AF$32/2,L40>$AF$32/2),IF(L39>L40,K39,K40),\"\")","v":""},null,null,null,null,null,null,"WC5",{"$f":"IF(OR(T39>$AF$32/2,T40>$AF$32/2),IF(T39>T40,S39,S40),\"\")","v":""},null,null,null,null,null,null,"WC7",{"$f":"IF(OR(AB39>$AF$32/2,AB40>$AF$32/2),IF(AB39>AB40,AA39,AA40),\"\")","v":""}]
[null,"WC2",{"$f":"IF(OR(D42>$AF$32/2,D43>$AF$32/2),IF(D42>D43,C42,C43),\"\")","v":""},null,null,null,null,null,null,"WC4",{"$f":"IF(OR(L42>$AF$32/2,L43>$AF$32/2),IF(L42>L43,K42,K43),\"\")","v":""},null,null,null,null,null,null,"WC6",{"$f":"IF(OR(T42>$AF$32/2,T43>$AF$32/2),IF(T42>T43,S42,S43),\"\")","v":""},null,null,null,null,null,null,"WC8",{"$f":"IF(OR(AB42>$AF$32/2,AB43>$AF$32/2),IF(AB42>AB43,AA42,AA43),\"\")","v":""}]
[]
[null,"Finales met 2 poules",null,null,null,null,null,null,null,null,null,null,null,null,null,null,null,null,null,null,null,null,null,null,null,null,null,null,null,null,"Best of",9]
[null,null,null,null,null,null,"A ronde"]
[null,null,null,null,null,"WA1",{"$f":"IF(D47>D48,C47,C48)","v":""},null,null,null,null,null,null,null,null,null,null,null,null,null,null,null,"A ronde"]
[null,null,null,null,null,"WA3",{"$f":"IF(L47>L48,K47,K48)","v":""},null,null,null,null,null,null,null,null,null,null,null,null,null,null,"WA5",{"$f":"IF(T47>T48,S47,S48)","v":""}]
[null,null,null,null,null,null,null,null,null,null,null,null,null,null,null,null,null,null,null,null,null,"WA7",{"$f":"IF(AB47>AB48,AA47,AA48)","v":""}]
[null,null,null,null,null,null,"B ronde"]
[null,null,null,null,null,"WC1",{"$f":"IF(D51>D52,C51,C52)","v":""},null,null,null,null,null,null,null,null,null,null,null,null,null,null,null,"B ronde"]
[null,null,null,null,null,"WC3",{"$f":"IF(L51>L52,K51,K52)","v":""},null,null,null,null,null,null,null,null,null,null,null,null,null,null,"WC5",{"$f":"IF(T51>T52,S51,S52)","v":""}]
[null,null,null,null,null,null,null,null,null,null,null,null,null,null,null,null,null,null,null,null,null,"WC7",{"$f":"IF(AB51>AB52,AA51,AA52)","v":""}]
[]
[null,"Finales met 4 poules",null,null,null,null,null,null,null,null,null,null,null,null,null,null,null,null,null,null,null,null,null,null,null,null,null,null,null,null,"Best of",9]
[null,null,null,null,null,null,null,null,null,null,null,null,null,null,"A ronde"]
[null,null,null,null,null,null,null,null,null,null,null,null,null,"WA1",{"$f":"IF(OR(H56>AF54/2,H57>AF54/2),IF(H56>H57,G56,G57),\"\")","v":""}]
[null,null,null,null,null,null,null,null,null,null,null,null,null,"WA5",{"$f":"IF(OR(X57>AF54/2,X58>AF54/2),IF(X57>X58,W57,W58),\"\")","v":""}]
[]
[null,null,null,null,null,null,null,null,null,null,null,null,null,null,"B ronde"]
[null,null,null,null,null,null,null,null,null,null,null,null,null,"WC1",{"$f":"IF(OR(H60>AF54/2,H61>AF54/2),IF(H60>H61,G60,G61),\"\")","v":""}]
[null,null,null,null,null,null,null,null,null,null,null,null,null,"WC5",{"$f":"IF(OR(X61>AF54/2,X62>AF54/2),IF(X61>X62,W61,W62),\"\")","v":""}]
[]
[null,null,null,null,null,null,null,null,null,null,{"$f":"IF(N73<>\"\",\"WINNAAR A ronde\",\"\")","v":""},null,null,{"$f":"IF(OR(P66>AF64/2,P67>AF64/2),IF(P66>P67,O66,O67),\"\")","v":""}]
[]
[null,null,null,null,null,null,null,null,null,null,{"$f":"IF(N75<>\"\",\"WINNAAR B ronde\",\"\")","v":""},null,null,{"$f":"IF(OR(P70>AF64/2,P71>AF64/2),IF(P70>P71,O70,O71),\"\")","v":""}]

{"sheet":"deelnemers","index":3,"n_rows":33,"n_cols":10,"rows_kept":33,"cut":false,"hidden":false,"merged":[]}
["nr.","naam",null,null,"Linda"]
[1,"Linda",{"$f":"IF(B2<>\"\",RAND(),\"\")","v":0.40918914223501279},null,"Sonja",null,"Vul hier de namen in."]
[2,"Sonja",{"$f":"IF(B3<>\"\",RAND(),\"\")","v":0.7916789841719164},null,"Frederik"]
[3,"Frederik",{"$f":"IF(B4<>\"\",RAND(),\"\")","v":0.54794975231445198},null,"Emiel"]
[4,"Emiel",{"$f":"IF(B5<>\"\",RAND(),\"\")","v":0.90118717529748604},null,"Lutgarde"]
[5,"Lutgarde",{"$f":"IF(B6<>\"\",RAND(),\"\")","v":0.72798394112014175},null,"Ronny"]
[6,"Ronny",{"$f":"IF(B7<>\"\",RAND(),\"\")","v":0.63151063771411686},null,"Ludo"]
[7,"Ludo",{"$f":"IF(B8<>\"\",RAND(),\"\")","v":0.96438248765932966},null,"Robin",null,null,null,null,"kolommen C- E zijn verborgen dienen enkel voor de loting van de spelers"]
[8,"Robin",{"$f":"IF(B9<>\"\",RAND(),\"\")","v":0.74061520833730954}]
[9,null,{"$f":"IF(B10<>\"\",RAND(),\"\")","v":""},null,null,null,null,null,null,"klik op de knop \"naar poules\""]
[10,null,{"$f":"IF(B11<>\"\",RAND(),\"\")","v":""},null,null,null,null,null,null,"automatisch gebeurd de loting en het invullen van het blad aan de hand van het aantal spelers."]
[11,null,{"$f":"IF(B12<>\"\",RAND(),\"\")","v":""},null,null,null,null,null,null,"Ik weet niet wat er gebeurd als er toevallig 12 of 31 spelers zijn."]
[12,null,{"$f":"IF(B13<>\"\",RAND(),\"\")","v":""}]
[13,null,{"$f":"IF(B14<>\"\",RAND(),\"\")","v":""}]
[14,null,{"$f":"IF(B15<>\"\",RAND(),\"\")","v":""}]
[15,null,{"$f":"IF(B16<>\"\",RAND(),\"\")","v":""}]
[16,null,{"$f":"IF(B17<>\"\",RAND(),\"\")","v":""}]
[17,null,{"$f":"IF(B18<>\"\",RAND(),\"\")","v":""}]
[18,null,{"$f":"IF(B19<>\"\",RAND(),\"\")","v":""}]
[19,null,{"$f":"IF(B20<>\"\",RAND(),\"\")","v":""},null,null,null,null,null,null,"de spelbladen zijn beveiligd(zonder paswoord) en daar kunnen enkel de punten ingevuld worden"]
[20,null,{"$f":"IF(B21<>\"\",RAND(),\"\")","v":""},null,null,null,null,null,null,"dit is om te vermijden dat er per ongeluk formules verwijderd worden"]
[21,null,{"$f":"IF(B22<>\"\",RAND(),\"\")","v":""}]
[22,null,{"$f":"IF(B23<>\"\",RAND(),\"\")","v":""}]
[23,null,{"$f":"IF(B24<>\"\",RAND(),\"\")","v":""}]
[24,null,{"$f":"IF(B25<>\"\",RAND(),\"\")","v":""}]
[25,null,{"$f":"IF(B26<>\"\",RAND(),\"\")","v":""},null,null,null,null,null," "]
[26,null,{"$f":"IF(B27<>\"\",RAND(),\"\")","v":""}]
[27,null,{"$f":"IF(B28<>\"\",RAND(),\"\")","v":""}]
[28,null,{"$f":"IF(B29<>\"\",RAND(),\"\")","v":""}]
[29,null,{"$f":"IF(B30<>\"\",RAND(),\"\")","v":""}]
[30,null,{"$f":"IF(B31<>\"\",RAND(),\"\")","v":""}]
[31,null,{"$f":"IF(B32<>\"\",RAND(),\"\")","v":""}]
[32,null,{"$f":"IF(B33<>\"\",RAND(),\"\")","v":""}]